Update intermediate.v

6 jobs for martin in 2 minutes and 8 seconds
Status Job ID Name Coverage
  Build
passed #40033
1.8.0-coq-8.8

00:02:08

failed #40035
1.9.0-coq-8.9

00:00:25

failed #40034
allowed to fail
1.9.0-coq-dev

00:00:14

 
  Process
skipped #40037
doc
skipped #40038
proof-length
skipped #40036
validate
 
Name Stage Failure
failed
1.9.0-coq-8.9 Build There is an unknown failure, please try again
Error:
In nested Ltac calls to "have (ssrhavefwdwbinders)" and
"done", last call failed.
No applicable tactic.

make[1]: *** [Makefile:663: restructuring/analysis/fpp_implicit_deadline/workload_bound_fp.vo] Error 1
make[1]: *** Waiting for unfinished jobs....
make: *** [Makefile:327: all] Error 2
ERROR: Job failed: exit code 1
failed
1.9.0-coq-dev Build There is an unknown failure, please try again
COQC util/powerset.v
COQC util/seqset.v
File "./util/seqset.v", line 19, characters 42-52:
Error: The reference mkPredType was not found in the current environment.

make[1]: *** [Makefile:659: util/seqset.vo] Error 1
make[1]: *** Waiting for unfinished jobs....
make: *** [Makefile:321: all] Error 2
ERROR: Job failed: exit code 1