bump Iris

5 jobs for master in 14 minutes and 17 seconds (queued for 1 second)
Status Job ID Name Coverage
  Build
failed #11372
fp
build-coq.8.7.0

00:02:46

failed #11371
fp
build-coq.8.7.1

00:02:24

failed #11370
fp-timing
build-coq.8.7.2

00:02:22

failed #11369
fp
build-coq.8.8.0

00:02:24

failed #11368
fp
build-coq.dev

00:11:54

 
Name Stage Failure
failed
build-coq.8.7.2 Build
[coq-iris-builddep] /builds/FP/iris-coq/build-dep/ already up-to-date
Install ? [Y/n] y
[WARNING] coq-iris-builddep is not installed.
Sorry, no solution found: there seems to be a problem with your request.

No solution found, exiting
Makefile:29: recipe for target 'build-dep' failed
make: *** [build-dep] Error 3
ERROR: Job failed: exit code 1
failed
build-coq.dev Build
[coq-iris-builddep] /builds/FP/iris-coq/build-dep/ already up-to-date
Install ? [Y/n] y
[WARNING] coq-iris-builddep is not installed.
Sorry, no solution found: there seems to be a problem with your request.

No solution found, exiting
Makefile:29: recipe for target 'build-dep' failed
make: *** [build-dep] Error 3
ERROR: Job failed: exit code 1
failed
build-coq.8.7.0 Build
[coq-iris-builddep] /builds/FP/iris-coq/build-dep/ already up-to-date
Install ? [Y/n] y
[WARNING] coq-iris-builddep is not installed.
Sorry, no solution found: there seems to be a problem with your request.

No solution found, exiting
Makefile:29: recipe for target 'build-dep' failed
make: *** [build-dep] Error 3
ERROR: Job failed: exit code 1
failed
build-coq.8.8.0 Build
[coq-iris-builddep] /builds/FP/iris-coq/build-dep/ already up-to-date
Install ? [Y/n] y
[WARNING] coq-iris-builddep is not installed.
Sorry, no solution found: there seems to be a problem with your request.

No solution found, exiting
Makefile:29: recipe for target 'build-dep' failed
make: *** [build-dep] Error 3
ERROR: Job failed: exit code 1
failed
build-coq.8.7.1 Build
[coq-iris-builddep] /builds/FP/iris-coq/build-dep/ already up-to-date
Install ? [Y/n] y
[WARNING] coq-iris-builddep is not installed.
Sorry, no solution found: there seems to be a problem with your request.

No solution found, exiting
Makefile:29: recipe for target 'build-dep' failed
make: *** [build-dep] Error 3
ERROR: Job failed: exit code 1