[
  {
    "id": "5F1F66A39EC39BF6",
    "reports": [
      {
        "Cycles": 0,
        "Agent": "Execution-CPU",
        "ProcessName": "Read",
        "TaskID": "5F1F66A39EC39BF6",
        "ParentEventID": [
          "105FD58CA85300E5"
        ],
        "Label": "unset",
        "Title": "X-Trace Task",
        "Host": "pinky19.mpi-sws.org",
        "Duration": "25593130",
        "HRT": 26966750069761916,
        "Operation": "unset",
        "Timestamp": "1557750390009.754883",
        "TenantClass": 0,
        "Source": "Client.java:1027",
        "ThreadID": 1,
        "ThreadName": "",
        "EventID": "0E8A0C29E119154F",
        "ProcessID": 2801
      },
      {
        "Cycles": 0,
        "Agent": "edu.brown.cs.systems.retro.benchmarks.hdfs_client.Reader",
        "ProcessName": "Read",
        "TaskID": "5F1F66A39EC39BF6",
        "ParentEventID": [
          "129A3720EBA6741C"
        ],
        "Label": "Reading file",
        "Title": "X-Trace Task",
        "Host": "pinky19.mpi-sws.org",
        "HRT": 26966750069722407,
        "Timestamp": "1557750390009.715332",
        "TenantClass": 0,
        "ThreadID": 1,
        "ThreadName": "",
        "EventID": "8DE5E7979272A22F",
        "ProcessID": 2801
      },
      {
        "Cycles": 0,
        "Agent": "org.apache.hadoop.ipc.ProtobufRpcEngine",
        "ProcessName": "Read",
        "TaskID": "5F1F66A39EC39BF6",
        "ParentEventID": [
          "8DE5E7979272A22F"
        ],
        "Label": "Invoking org.apache.hadoop.hdfs.protocol.ClientProtocol.getBlockLocations",
        "Title": "X-Trace Task",
        "Host": "pinky19.mpi-sws.org",
        "HRT": 26966750069747405,
        "Timestamp": "1557750390009.740479",
        "TenantClass": 0,
        "Source": "ProtobufRpcEngine.java:228",
        "ThreadID": 1,
        "ThreadName": "",
        "EventID": "105FD58CA85300E5",
        "ProcessID": 2801
      },
      {
        "Cycles": 0,
        "Agent": "Execution-CPU",
        "ProcessName": "Read",
        "TaskID": "5F1F66A39EC39BF6",
        "ParentEventID": [
          "0E8A0C29E119154F"
        ],
        "Label": "set",
        "Title": "X-Trace Task",
        "Host": "pinky19.mpi-sws.org",
        "HRT": 26966750069803698,
        "Operation": "set",
        "Timestamp": "1557750390009.796631",
        "TenantClass": 0,
        "Source": "Client.java:1032",
        "ThreadID": 41,
        "ThreadName": "",
        "EventID": "F45F967889113DCD",
        "ProcessID": 2801
      },
      {
        "Cycles": 0,
        "Agent": "edu.brown.cs.systems.xtrace.logging.BaggageWrappers",
        "ProcessName": "Read",
        "TaskID": "5F1F66A39EC39BF6",
        "ParentEventID": [
          "F45F967889113DCD"
        ],
        "Label": "Forking current baggage with Baggage.fork()",
        "Title": "X-Trace Task",
        "Host": "pinky19.mpi-sws.org",
        "HRT": 26966750069821423,
        "Operation": "fork",
        "Timestamp": "1557750390009.814453",
        "TenantClass": 0,
        "Source": "Client.java:1043",
        "ThreadID": 41,
        "ThreadName": "",
        "EventID": "3F5CEBD45A6BA716",
        "ProcessID": 2801
      },
      {
        "Cycles": 0,
        "Agent": "Execution-CPU",
        "ProcessName": "Read",
        "TaskID": "5F1F66A39EC39BF6",
        "ParentEventID": [
          "9ACC5DCA9B46FE91"
        ],
        "Label": "set",
        "Title": "X-Trace Task",
        "Host": "pinky19.mpi-sws.org",
        "HRT": 26966750069906536,
        "Operation": "set",
        "Timestamp": "1557750390009.899658",
        "TenantClass": 0,
        "Source": "Client.java:1104",
        "ThreadID": 1,
        "ThreadName": "",
        "EventID": "7966814A1B571E8D",
        "ProcessID": 2801
      },
      {
        "Cycles": 0,
        "Agent": "Execution-CPU",
        "ProcessName": "Name",
        "TaskID": "5F1F66A39EC39BF6",
        "ParentEventID": [
          "3F5CEBD45A6BA716"
        ],
        "Label": "set",
        "Title": "X-Trace Task",
        "Host": "pinky19.mpi-sws.org",
        "HRT": 26966750069960304,
        "Operation": "set",
        "Timestamp": "1557750390009.964111",
        "TenantClass": 0,
        "Source": "Server.java:1840",
        "ThreadID": 48,
        "ThreadName": "",
        "EventID": "B5D8FD10167DE34E",
        "BaggageBytes": "[[248 5] [240 0] [0 95 31 102 163 158 195 155 246] [240 1] [0 63 92 235 212 90 107 167 22] [240 3] [0 2]]",
        "ProcessID": 2171
      },
      {
        "Cycles": 0,
        "Agent": "edu.brown.cs.systems.xtrace.logging.BaggageWrappers",
        "ProcessName": "Name",
        "TaskID": "5F1F66A39EC39BF6",
        "ParentEventID": [
          "B5D8FD10167DE34E"
        ],
        "Label": "Forking current baggage with Baggage.fork()",
        "Title": "X-Trace Task",
        "Host": "pinky19.mpi-sws.org",
        "HRT": 26966750070007046,
        "Operation": "fork",
        "Timestamp": "1557750390010.010742",
        "TenantClass": 0,
        "Source": "Server.java:550",
        "ThreadID": 48,
        "ThreadName": "",
        "EventID": "92F03D11B6CF8F5F",
        "BaggageBytes": "[[248 5] [240 0] [0 95 31 102 163 158 195 155 246] [240 1] [0 181 216 253 16 22 125 227 78] [240 3] [0 2]]",
        "ProcessID": 2171
      },
      {
        "Cycles": 0,
        "Agent": "Execution-CPU",
        "ProcessName": "Read",
        "TaskID": "5F1F66A39EC39BF6",
        "ParentEventID": [
          "3F5CEBD45A6BA716"
        ],
        "Label": "unset",
        "Title": "X-Trace Task",
        "Host": "pinky19.mpi-sws.org",
        "Duration": "62754",
        "HRT": 26966750069884126,
        "Operation": "unset",
        "Timestamp": "1557750390009.877197",
        "TenantClass": 0,
        "Source": "Client.java:1062",
        "ThreadID": 41,
        "ThreadName": "",
        "EventID": "9ACC5DCA9B46FE91",
        "ProcessID": 2801
      },
      {
        "Cycles": 0,
        "Agent": "Execution-CPU",
        "ProcessName": "Name",
        "TaskID": "5F1F66A39EC39BF6",
        "ParentEventID": [
          "92F03D11B6CF8F5F"
        ],
        "Label": "set",
        "Title": "X-Trace Task",
        "Host": "pinky19.mpi-sws.org",
        "HRT": 26966750070039185,
        "Operation": "set",
        "Timestamp": "1557750390010.042969",
        "TenantClass": 0,
        "Source": "Server.java:2071",
        "ThreadID": 63,
        "ThreadName": "",
        "EventID": "D4743CE2C23D8843",
        "BaggageBytes": "[[248 5] [240 0] [0 95 31 102 163 158 195 155 246] [240 1] [0 146 240 61 17 182 207 143 95] [240 3] [0 2]]",
        "ProcessID": 2171
      },
      {
        "Cycles": 0,
        "Agent": "org.apache.hadoop.ipc.Server",
        "ProcessName": "Name",
        "TaskID": "5F1F66A39EC39BF6",
        "ParentEventID": [
          "D4743CE2C23D8843"
        ],
        "Label": "getBlockLocations in org.apache.hadoop.hdfs.protocol.ClientProtocol",
        "Title": "X-Trace Task",
        "Host": "pinky19.mpi-sws.org",
        "HRT": 26966750070068686,
        "Timestamp": "1557750390010.072510",
        "TenantClass": 0,
        "Source": "ProtobufRpcEngine.java:601",
        "ThreadID": 63,
        "ThreadName": "",
        "EventID": "0B1224EBB8237774",
        "BaggageBytes": "[[248 5] [240 0] [0 95 31 102 163 158 195 155 246] [240 1] [0 212 116 60 226 194 61 136 67] [240 3] [0 2]]",
        "ProcessID": 2171
      },
      {
        "Cycles": 0,
        "Agent": "org.apache.hadoop.hdfs.server.namenode.FSNamesystem.audit",
        "ProcessName": "Name",
        "TaskID": "5F1F66A39EC39BF6",
        "ParentEventID": [
          "0B1224EBB8237774"
        ],
        "Label": "allowed=true\tugi=plascas (auth:SIMPLE)\tip=/139.19.171.63\tcmd=open\tsrc=/ds/XdH2kk7zNOsE0kZV\tdst=null\tperm=null\tproto=rpc",
        "Title": "X-Trace Task",
        "Host": "pinky19.mpi-sws.org",
        "HRT": 26966750070114969,
        "Timestamp": "1557750390010.118652",
        "TenantClass": 0,
        "Source": "FSNamesystem.java:8313",
        "ThreadID": 63,
        "ThreadName": "",
        "EventID": "8614185C7AEFDBE3",
        "BaggageBytes": "[[248 5] [240 0] [0 95 31 102 163 158 195 155 246] [240 1] [0 11 18 36 235 184 35 119 116] [240 3] [0 2]]",
        "ProcessID": 2171
      },
      {
        "Cycles": 0,
        "Agent": "Execution-CPU",
        "ProcessName": "Name",
        "TaskID": "5F1F66A39EC39BF6",
        "ParentEventID": [
          "92F03D11B6CF8F5F"
        ],
        "Label": "unset",
        "Title": "X-Trace Task",
        "Host": "pinky19.mpi-sws.org",
        "Duration": "28672",
        "HRT": 26966750070031331,
        "Operation": "unset",
        "Timestamp": "1557750390010.035156",
        "TenantClass": 0,
        "Source": "Server.java:1828",
        "ThreadID": 48,
        "ThreadName": "",
        "EventID": "2E0AC2859B3FDD11",
        "BaggageBytes": "[[248 5] [240 0] [0 95 31 102 163 158 195 155 246] [240 1] [0 146 240 61 17 182 207 143 95] [240 3] [0 2]]",
        "ProcessID": 2171
      },
      {
        "Cycles": 0,
        "Agent": "edu.brown.cs.systems.xtrace.logging.BaggageWrappers",
        "ProcessName": "Name",
        "TaskID": "5F1F66A39EC39BF6",
        "ParentEventID": [
          "8614185C7AEFDBE3"
        ],
        "Label": "Forking current baggage with Baggage.fork()",
        "Title": "X-Trace Task",
        "Host": "pinky19.mpi-sws.org",
        "HRT": 26966750070155762,
        "Operation": "fork",
        "Timestamp": "1557750390010.159424",
        "TenantClass": 0,
        "Source": "Server.java:2398",
        "ThreadID": 63,
        "ThreadName": "",
        "EventID": "DF39FDE2F5CD9595",
        "BaggageBytes": "[[248 5] [240 0] [0 95 31 102 163 158 195 155 246] [240 1] [0 134 20 24 92 122 239 219 227] [240 3] [0 2]]",
        "ProcessID": 2171
      },
      {
        "Cycles": 0,
        "Agent": "Execution-CPU",
        "ProcessName": "Read",
        "TaskID": "5F1F66A39EC39BF6",
        "ParentEventID": [
          "DF39FDE2F5CD9595"
        ],
        "Label": "set",
        "Title": "X-Trace Task",
        "Host": "pinky19.mpi-sws.org",
        "HRT": 26966750070315922,
        "Operation": "set",
        "Timestamp": "1557750390010.308838",
        "TenantClass": 0,
        "Source": "Client.java:302",
        "ThreadID": 40,
        "ThreadName": "",
        "EventID": "049488CE1727D81E",
        "ProcessID": 2801
      },
      {
        "Cycles": 0,
        "Agent": "Execution-CPU",
        "ProcessName": "Read",
        "TaskID": "5F1F66A39EC39BF6",
        "ParentEventID": [
          "049488CE1727D81E"
        ],
        "Label": "unset",
        "Title": "X-Trace Task",
        "Host": "pinky19.mpi-sws.org",
        "Duration": "5014",
        "HRT": 26966750070336366,
        "Operation": "unset",
        "Timestamp": "1557750390010.329346",
        "TenantClass": 0,
        "Source": "Client.java:1168",
        "ThreadID": 40,
        "ThreadName": "",
        "EventID": "7BE97BDE837057A2",
        "ProcessID": 2801
      },
      {
        "Cycles": 0,
        "Agent": "Execution-CPU",
        "ProcessName": "Name",
        "TaskID": "5F1F66A39EC39BF6",
        "ParentEventID": [
          "DF39FDE2F5CD9595"
        ],
        "Label": "unset",
        "Title": "X-Trace Task",
        "Host": "pinky19.mpi-sws.org",
        "Duration": "199054",
        "HRT": 26966750070254798,
        "Operation": "unset",
        "Timestamp": "1557750390010.258545",
        "TenantClass": 0,
        "Source": "Server.java:1058",
        "ThreadID": 63,
        "ThreadName": "",
        "EventID": "06BCCFAB72626245",
        "BaggageBytes": "[[248 5] [240 0] [0 95 31 102 163 158 195 155 246] [240 1] [0 223 57 253 226 245 205 149 149] [240 3] [0 2]]",
        "ProcessID": 2171
      },
      {
        "Cycles": 0,
        "Agent": "Execution-Sleep",
        "ProcessName": "Read",
        "TaskID": "5F1F66A39EC39BF6",
        "ParentEventID": [
          "7966814A1B571E8D"
        ],
        "Label": "waited",
        "Title": "X-Trace Task",
        "Host": "pinky19.mpi-sws.org",
        "Duration": "429035",
        "HRT": 26966750070354217,
        "Operation": "waited",
        "Timestamp": "1557750390010.347168",
        "TenantClass": 0,
        "Source": "Client.java:1537",
        "ThreadID": 1,
        "ThreadName": "",
        "EventID": "6C20B8355220BC45",
        "ProcessID": 2801
      },
      {
        "Cycles": 0,
        "Agent": "edu.brown.cs.systems.xtrace.logging.BaggageWrappers",
        "ProcessName": "Read",
        "TaskID": "5F1F66A39EC39BF6",
        "ParentEventID": [
          "7BE97BDE837057A2",
          "6C20B8355220BC45"
        ],
        "Label": "Merged current baggage with other baggage",
        "Title": "X-Trace Task",
        "Host": "pinky19.mpi-sws.org",
        "HRT": 26966750070369370,
        "Operation": "join",
        "Timestamp": "1557750390010.362305",
        "TenantClass": 0,
        "Source": "Client.java:1545",
        "ThreadID": 1,
        "ThreadName": "",
        "EventID": "F4084327CAAC27F7",
        "ProcessID": 2801
      },
      {
        "Cycles": 0,
        "Agent": "org.apache.hadoop.ipc.ProtobufRpcEngine",
        "ProcessName": "Read",
        "TaskID": "5F1F66A39EC39BF6",
        "ParentEventID": [
          "F4084327CAAC27F7"
        ],
        "Label": "org.apache.hadoop.hdfs.protocol.ClientProtocol.getBlockLocations completed",
        "Title": "X-Trace Task",
        "Host": "pinky19.mpi-sws.org",
        "HRT": 26966750070406266,
        "Timestamp": "1557750390010.399170",
        "TenantClass": 0,
        "Source": "ProtobufRpcEngine.java:275",
        "ThreadID": 1,
        "ThreadName": "",
        "EventID": "07A6B65F35B51CAE",
        "ProcessID": 2801
      },
      {
        "Cycles": 0,
        "Agent": "edu.brown.cs.systems.xtrace.logging.BaggageWrappers",
        "ProcessName": "Read",
        "TaskID": "5F1F66A39EC39BF6",
        "ParentEventID": [
          "974410DE10F03CF6"
        ],
        "Label": "Forking current baggage with Baggage.fork()",
        "Title": "X-Trace Task",
        "Host": "pinky19.mpi-sws.org",
        "HRT": 26966750070736295,
        "Operation": "fork",
        "Timestamp": "1557750390010.729248",
        "TenantClass": 0,
        "Source": "DataTransferProtoUtil.java:94",
        "ThreadID": 1,
        "ThreadName": "",
        "EventID": "E3CDFDDBA216C90D",
        "ProcessID": 2801
      },
      {
        "Cycles": 0,
        "Agent": "Execution-Sleep",
        "ProcessName": "Read",
        "TaskID": "5F1F66A39EC39BF6",
        "ParentEventID": [
          "07A6B65F35B51CAE"
        ],
        "Label": "waited",
        "Title": "X-Trace Task",
        "Host": "pinky19.mpi-sws.org",
        "Duration": "199446",
        "HRT": 26966750070689996,
        "Operation": "waited",
        "Timestamp": "1557750390010.683105",
        "TenantClass": 0,
        "Source": "SocketIOWithTimeout.java:335",
        "ThreadID": 1,
        "ThreadName": "",
        "EventID": "974410DE10F03CF6",
        "ProcessID": 2801
      },
      {
        "Cycles": 0,
        "Agent": "Execution-CPU",
        "ProcessName": "Data",
        "TaskID": "5F1F66A39EC39BF6",
        "ParentEventID": [
          "E3CDFDDBA216C90D"
        ],
        "Label": "set",
        "Title": "X-Trace Task",
        "Host": "pinky23.mpi-sws.org",
        "HRT": 12368246044784113,
        "Operation": "set",
        "Timestamp": "1557750390011.158936",
        "TenantClass": 0,
        "Source": "Receiver.java:117",
        "ThreadID": 16150,
        "ThreadName": "",
        "EventID": "13431AD7E8D226A3",
        "BaggageBytes": "[[248 5] [240 0] [0 95 31 102 163 158 195 155 246] [240 1] [0 227 205 253 219 162 22 201 13] [240 3] [0 2]]",
        "ProcessID": 24612
      },
      {
        "Cycles": 0,
        "Agent": "edu.brown.cs.systems.xtrace.logging.BaggageWrappers",
        "ProcessName": "Data",
        "TaskID": "5F1F66A39EC39BF6",
        "ParentEventID": [
          "1B5DD7E957CA53C9"
        ],
        "Label": "Forking current baggage with Baggage.fork()",
        "Title": "X-Trace Task",
        "Host": "pinky23.mpi-sws.org",
        "HRT": 12368246045108004,
        "Operation": "fork",
        "Timestamp": "1557750390011.482910",
        "TenantClass": 0,
        "Source": "DataXceiver.java:1257",
        "ThreadID": 16150,
        "ThreadName": "",
        "EventID": "62F30F7DFC0A9235",
        "BaggageBytes": "[[248 5] [240 0] [0 95 31 102 163 158 195 155 246] [240 1] [0 27 93 215 233 87 202 83 201] [240 3] [0 2]]",
        "ProcessID": 24612
      },
      {
        "Cycles": 0,
        "Agent": "edu.brown.cs.systems.xtrace.logging.XTraceInit",
        "ProcessName": "Data",
        "TaskID": "5F1F66A39EC39BF6",
        "ParentEventID": [
          "13431AD7E8D226A3"
        ],
        "Label": "Thread.setName: DataXceiver for client DFSClient_NONMAPREDUCE_310321604_1 at /139.19.171.63:52500 [Sending block BP-1633380353-139.19.171.63-1554193446451:blk_1073770206_29382]",
        "Title": "X-Trace Task",
        "Host": "pinky23.mpi-sws.org",
        "HRT": 12368246044887680,
        "Timestamp": "1557750390011.262451",
        "TenantClass": 0,
        "Source": "DataXceiver.java:168",
        "ThreadID": 16150,
        "ThreadName": "",
        "EventID": "1B5DD7E957CA53C9",
        "BaggageBytes": "[[248 5] [240 0] [0 95 31 102 163 158 195 155 246] [240 1] [0 19 67 26 215 232 210 38 163] [240 3] [0 2]]",
        "ProcessID": 24612
      },
      {
        "Cycles": 0,
        "Agent": "Execution-Sleep",
        "ProcessName": "Read",
        "TaskID": "5F1F66A39EC39BF6",
        "ParentEventID": [
          "E3CDFDDBA216C90D"
        ],
        "Label": "waited",
        "Title": "X-Trace Task",
        "Host": "pinky19.mpi-sws.org",
        "Duration": "942737",
        "HRT": 26966750071750189,
        "Operation": "waited",
        "Timestamp": "1557750390011.743164",
        "TenantClass": 0,
        "Source": "SocketIOWithTimeout.java:335",
        "ThreadID": 1,
        "ThreadName": "",
        "EventID": "7FB94507A08B4728",
        "ProcessID": 2801
      },
      {
        "Cycles": 0,
        "Agent": "edu.brown.cs.systems.xtrace.logging.BaggageWrappers",
        "ProcessName": "Data",
        "TaskID": "5F1F66A39EC39BF6",
        "ParentEventID": [
          "62F30F7DFC0A9235"
        ],
        "Label": "Forking current baggage with Baggage.fork()",
        "Title": "X-Trace Task",
        "Host": "pinky23.mpi-sws.org",
        "HRT": 12368246045274688,
        "Operation": "fork",
        "Timestamp": "1557750390011.649658",
        "TenantClass": 0,
        "Source": "PacketHeader.java:95",
        "ThreadID": 16150,
        "ThreadName": "",
        "EventID": "3297EBD3C263A67F",
        "BaggageBytes": "[[248 5] [240 0] [0 95 31 102 163 158 195 155 246] [240 1] [0 98 243 15 125 252 10 146 53] [240 3] [0 2]]",
        "ProcessID": 24612
      },
      {
        "Cycles": 0,
        "Agent": "edu.brown.cs.systems.xtrace.logging.BaggageWrappers",
        "ProcessName": "Read",
        "TaskID": "5F1F66A39EC39BF6",
        "ParentEventID": [
          "62F30F7DFC0A9235",
          "7FB94507A08B4728"
        ],
        "Label": "Merged current baggage with other baggage",
        "Title": "X-Trace Task",
        "Host": "pinky19.mpi-sws.org",
        "HRT": 26966750071821281,
        "Operation": "join",
        "Timestamp": "1557750390011.814209",
        "TenantClass": 0,
        "Source": "RemoteBlockReader2.java:429",
        "ThreadID": 1,
        "ThreadName": "",
        "EventID": "F137A42EB2A0FC94",
        "ProcessID": 2801
      },
      {
        "Cycles": 0,
        "Agent": "Execution-Sleep",
        "ProcessName": "Data",
        "TaskID": "5F1F66A39EC39BF6",
        "ParentEventID": [
          "3297EBD3C263A67F"
        ],
        "Label": "waited",
        "Title": "X-Trace Task",
        "Host": "pinky23.mpi-sws.org",
        "Duration": "15167",
        "HRT": 12368246045429504,
        "Operation": "waited",
        "Timestamp": "1557750390011.804443",
        "TenantClass": 0,
        "Source": "SocketIOWithTimeout.java:335",
        "ThreadID": 16150,
        "ThreadName": "",
        "EventID": "BD63040C1FD7445F",
        "BaggageBytes": "[[248 5] [240 0] [0 95 31 102 163 158 195 155 246] [240 1] [0 50 151 235 211 194 99 166 127] [240 3] [0 2]]",
        "ProcessID": 24612
      },
      {
        "Cycles": 0,
        "Agent": "Execution-Sleep",
        "ProcessName": "Read",
        "TaskID": "5F1F66A39EC39BF6",
        "ParentEventID": [
          "F137A42EB2A0FC94"
        ],
        "Label": "waited",
        "Title": "X-Trace Task",
        "Host": "pinky19.mpi-sws.org",
        "Duration": "17831",
        "HRT": 26966750071886016,
        "Operation": "waited",
        "Timestamp": "1557750390011.879150",
        "TenantClass": 0,
        "Source": "SocketIOWithTimeout.java:335",
        "ThreadID": 1,
        "ThreadName": "",
        "EventID": "E18A58596EB406C7",
        "ProcessID": 2801
      },
      {
        "Cycles": 0,
        "Agent": "edu.brown.cs.systems.xtrace.logging.BaggageWrappers",
        "ProcessName": "Data",
        "TaskID": "5F1F66A39EC39BF6",
        "ParentEventID": [
          "BD63040C1FD7445F"
        ],
        "Label": "Forking current baggage with Baggage.fork()",
        "Title": "X-Trace Task",
        "Host": "pinky23.mpi-sws.org",
        "HRT": 12368246045617761,
        "Operation": "fork",
        "Timestamp": "1557750390011.992676",
        "TenantClass": 0,
        "Source": "PacketHeader.java:95",
        "ThreadID": 16150,
        "ThreadName": "",
        "EventID": "B1EB18620F7C126E",
        "BaggageBytes": "[[248 5] [240 0] [0 95 31 102 163 158 195 155 246] [240 1] [0 189 99 4 12 31 215 68 95] [240 3] [0 2]]",
        "ProcessID": 24612
      },
      {
        "Cycles": 0,
        "Agent": "Execution-Sleep",
        "ProcessName": "Read",
        "TaskID": "5F1F66A39EC39BF6",
        "ParentEventID": [
          "D053ACD52FF24EA8"
        ],
        "Label": "waited",
        "Title": "X-Trace Task",
        "Host": "pinky19.mpi-sws.org",
        "Duration": "242557",
        "HRT": 26966750072577381,
        "Operation": "waited",
        "Timestamp": "1557750390012.570312",
        "TenantClass": 0,
        "Source": "SocketIOWithTimeout.java:335",
        "ThreadID": 1,
        "ThreadName": "",
        "EventID": "EC1D10D5BF140D91",
        "ProcessID": 2801
      },
      {
        "Cycles": 0,
        "Agent": "Execution-Sleep",
        "ProcessName": "Read",
        "TaskID": "5F1F66A39EC39BF6",
        "ParentEventID": [
          "E18A58596EB406C7"
        ],
        "Label": "waited",
        "Title": "X-Trace Task",
        "Host": "pinky19.mpi-sws.org",
        "Duration": "329132",
        "HRT": 26966750072284672,
        "Operation": "waited",
        "Timestamp": "1557750390012.277588",
        "TenantClass": 0,
        "Source": "SocketIOWithTimeout.java:335",
        "ThreadID": 1,
        "ThreadName": "",
        "EventID": "D053ACD52FF24EA8",
        "ProcessID": 2801
      },
      {
        "Cycles": 0,
        "Agent": "Execution-Sleep",
        "ProcessName": "Read",
        "TaskID": "5F1F66A39EC39BF6",
        "ParentEventID": [
          "EC1D10D5BF140D91"
        ],
        "Label": "waited",
        "Title": "X-Trace Task",
        "Host": "pinky19.mpi-sws.org",
        "Duration": "132730",
        "HRT": 26966750072774834,
        "Operation": "waited",
        "Timestamp": "1557750390012.767822",
        "TenantClass": 0,
        "Source": "SocketIOWithTimeout.java:335",
        "ThreadID": 1,
        "ThreadName": "",
        "EventID": "A50A0885CEE87AD6",
        "ProcessID": 2801
      },
      {
        "Cycles": 0,
        "Agent": "Execution-Sleep",
        "ProcessName": "Read",
        "TaskID": "5F1F66A39EC39BF6",
        "ParentEventID": [
          "A50A0885CEE87AD6"
        ],
        "Label": "waited",
        "Title": "X-Trace Task",
        "Host": "pinky19.mpi-sws.org",
        "Duration": "24810",
        "HRT": 26966750072840133,
        "Operation": "waited",
        "Timestamp": "1557750390012.833252",
        "TenantClass": 0,
        "Source": "SocketIOWithTimeout.java:335",
        "ThreadID": 1,
        "ThreadName": "",
        "EventID": "BDE3DCBB5A5C49DE",
        "ProcessID": 2801
      },
      {
        "Cycles": 0,
        "Agent": "edu.brown.cs.systems.xtrace.logging.BaggageWrappers",
        "ProcessName": "Read",
        "TaskID": "5F1F66A39EC39BF6",
        "ParentEventID": [
          "3297EBD3C263A67F",
          "BDE3DCBB5A5C49DE"
        ],
        "Label": "Merged current baggage with other baggage",
        "Title": "X-Trace Task",
        "Host": "pinky19.mpi-sws.org",
        "HRT": 26966750072877544,
        "Operation": "join",
        "Timestamp": "1557750390012.870605",
        "TenantClass": 0,
        "Source": "PacketHeader.java:168",
        "ThreadID": 1,
        "ThreadName": "",
        "EventID": "575DC4B9987C3408",
        "ProcessID": 2801
      },
      {
        "Cycles": 0,
        "Agent": "edu.brown.cs.systems.xtrace.logging.BaggageWrappers",
        "ProcessName": "Read",
        "TaskID": "5F1F66A39EC39BF6",
        "ParentEventID": [
          "E8A7779E812EAEF4"
        ],
        "Label": "Forking current baggage with Baggage.fork()",
        "Title": "X-Trace Task",
        "Host": "pinky19.mpi-sws.org",
        "HRT": 26966750073006365,
        "Operation": "fork",
        "Timestamp": "1557750390012.999268",
        "TenantClass": 0,
        "Source": "RemoteBlockReader2.java:361",
        "ThreadID": 1,
        "ThreadName": "",
        "EventID": "F3952F6DDBAA76F3",
        "ProcessID": 2801
      },
      {
        "Cycles": 0,
        "Agent": "edu.brown.cs.systems.xtrace.logging.BaggageWrappers",
        "ProcessName": "Read",
        "TaskID": "5F1F66A39EC39BF6",
        "ParentEventID": [
          "575DC4B9987C3408",
          "B1EB18620F7C126E"
        ],
        "Label": "Merged current baggage with other baggage",
        "Title": "X-Trace Task",
        "Host": "pinky19.mpi-sws.org",
        "HRT": 26966750072996709,
        "Operation": "join",
        "Timestamp": "1557750390012.989746",
        "TenantClass": 0,
        "Source": "PacketHeader.java:168",
        "ThreadID": 1,
        "ThreadName": "",
        "EventID": "E8A7779E812EAEF4",
        "ProcessID": 2801
      },
      {
        "Cycles": 0,
        "Agent": "edu.brown.cs.systems.xtrace.logging.BaggageWrappers",
        "ProcessName": "Read",
        "TaskID": "5F1F66A39EC39BF6",
        "ParentEventID": [
          "F3952F6DDBAA76F3"
        ],
        "Label": "Forking current baggage with Baggage.fork()",
        "Title": "X-Trace Task",
        "Host": "pinky19.mpi-sws.org",
        "HRT": 26966750073064457,
        "Operation": "fork",
        "Timestamp": "1557750390013.057373",
        "TenantClass": 0,
        "Source": "DataTransferProtoUtil.java:94",
        "ThreadID": 1,
        "ThreadName": "",
        "EventID": "ACE33DD5BD898E9A",
        "ProcessID": 2801
      },
      {
        "Cycles": 0,
        "Agent": "Execution-Sleep",
        "ProcessName": "Data",
        "TaskID": "5F1F66A39EC39BF6",
        "ParentEventID": [
          "B1EB18620F7C126E"
        ],
        "Label": "waited",
        "Title": "X-Trace Task",
        "Host": "pinky23.mpi-sws.org",
        "Duration": "853675",
        "HRT": 12368246046660936,
        "Operation": "waited",
        "Timestamp": "1557750390013.035889",
        "TenantClass": 0,
        "Source": "SocketIOWithTimeout.java:335",
        "ThreadID": 16150,
        "ThreadName": "",
        "EventID": "85F8479915D48121",
        "BaggageBytes": "[[248 5] [240 0] [0 95 31 102 163 158 195 155 246] [240 1] [0 177 235 24 98 15 124 18 110] [240 3] [0 2]]",
        "ProcessID": 24612
      },
      {
        "Cycles": 0,
        "Agent": "Execution-CPU",
        "ProcessName": "Data",
        "TaskID": "5F1F66A39EC39BF6",
        "ParentEventID": [
          "D78536C6BA5EFB19"
        ],
        "Label": "unset",
        "Title": "X-Trace Task",
        "Host": "pinky23.mpi-sws.org",
        "Duration": "2124733",
        "HRT": 12368246046981017,
        "Operation": "unset",
        "Timestamp": "1557750390013.355957",
        "TenantClass": 0,
        "Source": "DataXceiver.java:261",
        "ThreadID": 16150,
        "ThreadName": "",
        "EventID": "C3626CEC5D08B806",
        "BaggageBytes": "[[248 5] [240 0] [0 95 31 102 163 158 195 155 246] [240 1] [0 215 133 54 198 186 94 251 25] [240 3] [0 2]]",
        "ProcessID": 24612
      },
      {
        "Cycles": 0,
        "Agent": "edu.brown.cs.systems.xtrace.logging.BaggageWrappers",
        "ProcessName": "Data",
        "TaskID": "5F1F66A39EC39BF6",
        "ParentEventID": [
          "85F8479915D48121",
          "F3952F6DDBAA76F3"
        ],
        "Label": "Merged current baggage with other baggage",
        "Title": "X-Trace Task",
        "Host": "pinky23.mpi-sws.org",
        "HRT": 12368246046919197,
        "Operation": "join",
        "Timestamp": "1557750390013.294189",
        "TenantClass": 0,
        "Source": "DataXceiver.java:574",
        "ThreadID": 16150,
        "ThreadName": "",
        "EventID": "D78536C6BA5EFB19",
        "BaggageBytes": "[[248 5] [240 0] [0 95 31 102 163 158 195 155 246] [240 1] [0 133 248 71 153 21 212 129 33] [0 243 149 47 109 219 170 118 243] [240 3] [0 2]]",
        "ProcessID": 24612
      },
      {
        "Cycles": 0,
        "Agent": "Execution-CPU",
        "ProcessName": "Data",
        "TaskID": "5F1F66A39EC39BF6",
        "ParentEventID": [
          "ACE33DD5BD898E9A"
        ],
        "Label": "set",
        "Title": "X-Trace Task",
        "Host": "pinky23.mpi-sws.org",
        "HRT": 12368246047066507,
        "Operation": "set",
        "Timestamp": "1557750390013.441406",
        "TenantClass": 0,
        "Source": "Receiver.java:117",
        "ThreadID": 16150,
        "ThreadName": "",
        "EventID": "10C6C5FD51CF10A1",
        "BaggageBytes": "[[248 5] [240 0] [0 95 31 102 163 158 195 155 246] [240 1] [0 172 227 61 213 189 137 142 154] [240 3] [0 2]]",
        "ProcessID": 24612
      },
      {
        "Cycles": 0,
        "Agent": "edu.brown.cs.systems.xtrace.logging.BaggageWrappers",
        "ProcessName": "Data",
        "TaskID": "5F1F66A39EC39BF6",
        "ParentEventID": [
          "3368ED41655EE998"
        ],
        "Label": "Forking current baggage with Baggage.fork()",
        "Title": "X-Trace Task",
        "Host": "pinky23.mpi-sws.org",
        "HRT": 12368246047398328,
        "Operation": "fork",
        "Timestamp": "1557750390013.773193",
        "TenantClass": 0,
        "Source": "DataXceiver.java:1257",
        "ThreadID": 16150,
        "ThreadName": "",
        "EventID": "FB765532F8B07457",
        "BaggageBytes": "[[248 5] [240 0] [0 95 31 102 163 158 195 155 246] [240 1] [0 51 104 237 65 101 94 233 152] [240 3] [0 2]]",
        "ProcessID": 24612
      },
      {
        "Cycles": 0,
        "Agent": "edu.brown.cs.systems.xtrace.logging.XTraceInit",
        "ProcessName": "Data",
        "TaskID": "5F1F66A39EC39BF6",
        "ParentEventID": [
          "10C6C5FD51CF10A1"
        ],
        "Label": "Thread.setName: DataXceiver for client DFSClient_NONMAPREDUCE_310321604_1 at /139.19.171.63:52500 [Sending block BP-1633380353-139.19.171.63-1554193446451:blk_1073770206_29382]",
        "Title": "X-Trace Task",
        "Host": "pinky23.mpi-sws.org",
        "HRT": 12368246047155194,
        "Timestamp": "1557750390013.530029",
        "TenantClass": 0,
        "Source": "DataXceiver.java:168",
        "ThreadID": 16150,
        "ThreadName": "",
        "EventID": "3368ED41655EE998",
        "BaggageBytes": "[[248 5] [240 0] [0 95 31 102 163 158 195 155 246] [240 1] [0 16 198 197 253 81 207 16 161] [240 3] [0 2]]",
        "ProcessID": 24612
      },
      {
        "Cycles": 0,
        "Agent": "Execution-Sleep",
        "ProcessName": "Read",
        "TaskID": "5F1F66A39EC39BF6",
        "ParentEventID": [
          "ACE33DD5BD898E9A"
        ],
        "Label": "waited",
        "Title": "X-Trace Task",
        "Host": "pinky19.mpi-sws.org",
        "Duration": "895033",
        "HRT": 26966750074022570,
        "Operation": "waited",
        "Timestamp": "1557750390014.015625",
        "TenantClass": 0,
        "Source": "SocketIOWithTimeout.java:335",
        "ThreadID": 1,
        "ThreadName": "",
        "EventID": "33D9F326EB7C0FD3",
        "ProcessID": 2801
      },
      {
        "Cycles": 0,
        "Agent": "edu.brown.cs.systems.xtrace.logging.BaggageWrappers",
        "ProcessName": "Data",
        "TaskID": "5F1F66A39EC39BF6",
        "ParentEventID": [
          "FB765532F8B07457"
        ],
        "Label": "Forking current baggage with Baggage.fork()",
        "Title": "X-Trace Task",
        "Host": "pinky23.mpi-sws.org",
        "HRT": 12368246047580585,
        "Operation": "fork",
        "Timestamp": "1557750390013.955566",
        "TenantClass": 0,
        "Source": "PacketHeader.java:95",
        "ThreadID": 16150,
        "ThreadName": "",
        "EventID": "00A9B34BC25D7015",
        "BaggageBytes": "[[248 5] [240 0] [0 95 31 102 163 158 195 155 246] [240 1] [0 251 118 85 50 248 176 116 87] [240 3] [0 2]]",
        "ProcessID": 24612
      },
      {
        "Cycles": 0,
        "Agent": "Execution-Sleep",
        "ProcessName": "Read",
        "TaskID": "5F1F66A39EC39BF6",
        "ParentEventID": [
          "FF08D215D29677EA"
        ],
        "Label": "waited",
        "Title": "X-Trace Task",
        "Host": "pinky19.mpi-sws.org",
        "Duration": "72338",
        "HRT": 26966750074184495,
        "Operation": "waited",
        "Timestamp": "1557750390014.177490",
        "TenantClass": 0,
        "Source": "SocketIOWithTimeout.java:335",
        "ThreadID": 1,
        "ThreadName": "",
        "EventID": "BAF06F372F13475A",
        "ProcessID": 2801
      },
      {
        "Cycles": 0,
        "Agent": "Execution-Sleep",
        "ProcessName": "Data",
        "TaskID": "5F1F66A39EC39BF6",
        "ParentEventID": [
          "00A9B34BC25D7015"
        ],
        "Label": "waited",
        "Title": "X-Trace Task",
        "Host": "pinky23.mpi-sws.org",
        "Duration": "11627",
        "HRT": 12368246047737062,
        "Operation": "waited",
        "Timestamp": "1557750390014.112061",
        "TenantClass": 0,
        "Source": "SocketIOWithTimeout.java:335",
        "ThreadID": 16150,
        "ThreadName": "",
        "EventID": "53D5B0642A581291",
        "BaggageBytes": "[[248 5] [240 0] [0 95 31 102 163 158 195 155 246] [240 1] [0 0 169 179 75 194 93 112 21] [240 3] [0 2]]",
        "ProcessID": 24612
      },
      {
        "Cycles": 0,
        "Agent": "edu.brown.cs.systems.xtrace.logging.BaggageWrappers",
        "ProcessName": "Read",
        "TaskID": "5F1F66A39EC39BF6",
        "ParentEventID": [
          "33D9F326EB7C0FD3",
          "FB765532F8B07457"
        ],
        "Label": "Merged current baggage with other baggage",
        "Title": "X-Trace Task",
        "Host": "pinky19.mpi-sws.org",
        "HRT": 26966750074075171,
        "Operation": "join",
        "Timestamp": "1557750390014.068115",
        "TenantClass": 0,
        "Source": "RemoteBlockReader2.java:429",
        "ThreadID": 1,
        "ThreadName": "",
        "EventID": "FF08D215D29677EA",
        "ProcessID": 2801
      },
      {
        "Cycles": 0,
        "Agent": "Execution-Sleep",
        "ProcessName": "Read",
        "TaskID": "5F1F66A39EC39BF6",
        "ParentEventID": [
          "BAF06F372F13475A"
        ],
        "Label": "waited",
        "Title": "X-Trace Task",
        "Host": "pinky19.mpi-sws.org",
        "Duration": "379321",
        "HRT": 26966750074624594,
        "Operation": "waited",
        "Timestamp": "1557750390014.617676",
        "TenantClass": 0,
        "Source": "SocketIOWithTimeout.java:335",
        "ThreadID": 1,
        "ThreadName": "",
        "EventID": "AFA5F95C4687AF6B",
        "ProcessID": 2801
      },
      {
        "Cycles": 0,
        "Agent": "edu.brown.cs.systems.xtrace.logging.BaggageWrappers",
        "ProcessName": "Data",
        "TaskID": "5F1F66A39EC39BF6",
        "ParentEventID": [
          "53D5B0642A581291"
        ],
        "Label": "Forking current baggage with Baggage.fork()",
        "Title": "X-Trace Task",
        "Host": "pinky23.mpi-sws.org",
        "HRT": 12368246047948255,
        "Operation": "fork",
        "Timestamp": "1557750390014.323242",
        "TenantClass": 0,
        "Source": "PacketHeader.java:95",
        "ThreadID": 16150,
        "ThreadName": "",
        "EventID": "4A86D27D88B41F61",
        "BaggageBytes": "[[248 5] [240 0] [0 95 31 102 163 158 195 155 246] [240 1] [0 83 213 176 100 42 88 18 145] [240 3] [0 2]]",
        "ProcessID": 24612
      },
      {
        "Cycles": 0,
        "Agent": "Execution-Sleep",
        "ProcessName": "Read",
        "TaskID": "5F1F66A39EC39BF6",
        "ParentEventID": [
          "AFA5F95C4687AF6B"
        ],
        "Label": "waited",
        "Title": "X-Trace Task",
        "Host": "pinky19.mpi-sws.org",
        "Duration": "187597",
        "HRT": 26966750074859911,
        "Operation": "waited",
        "Timestamp": "1557750390014.853027",
        "TenantClass": 0,
        "Source": "SocketIOWithTimeout.java:335",
        "ThreadID": 1,
        "ThreadName": "",
        "EventID": "CBD5D03E6BB2EAE5",
        "ProcessID": 2801
      },
      {
        "Cycles": 0,
        "Agent": "Execution-Sleep",
        "ProcessName": "Data",
        "TaskID": "5F1F66A39EC39BF6",
        "ParentEventID": [
          "4A86D27D88B41F61"
        ],
        "Label": "waited",
        "Title": "X-Trace Task",
        "Host": "pinky23.mpi-sws.org",
        "Duration": "188947",
        "HRT": 12368246048256549,
        "Operation": "waited",
        "Timestamp": "1557750390014.631348",
        "TenantClass": 0,
        "Source": "SocketIOWithTimeout.java:335",
        "ThreadID": 16150,
        "ThreadName": "",
        "EventID": "87CAB345329645C1",
        "BaggageBytes": "[[248 5] [240 0] [0 95 31 102 163 158 195 155 246] [240 1] [0 74 134 210 125 136 180 31 97] [240 3] [0 2]]",
        "ProcessID": 24612
      },
      {
        "Cycles": 0,
        "Agent": "Execution-Sleep",
        "ProcessName": "Read",
        "TaskID": "5F1F66A39EC39BF6",
        "ParentEventID": [
          "CBD5D03E6BB2EAE5"
        ],
        "Label": "waited",
        "Title": "X-Trace Task",
        "Host": "pinky19.mpi-sws.org",
        "Duration": "81901",
        "HRT": 26966750075007159,
        "Operation": "waited",
        "Timestamp": "1557750390015.000244",
        "TenantClass": 0,
        "Source": "SocketIOWithTimeout.java:335",
        "ThreadID": 1,
        "ThreadName": "",
        "EventID": "E9B1D10FA94C945E",
        "ProcessID": 2801
      },
      {
        "Cycles": 0,
        "Agent": "edu.brown.cs.systems.xtrace.logging.BaggageWrappers",
        "ProcessName": "Read",
        "TaskID": "5F1F66A39EC39BF6",
        "ParentEventID": [
          "00A9B34BC25D7015",
          "E9B1D10FA94C945E"
        ],
        "Label": "Merged current baggage with other baggage",
        "Title": "X-Trace Task",
        "Host": "pinky19.mpi-sws.org",
        "HRT": 26966750075059241,
        "Operation": "join",
        "Timestamp": "1557750390015.052246",
        "TenantClass": 0,
        "Source": "PacketHeader.java:168",
        "ThreadID": 1,
        "ThreadName": "",
        "EventID": "B908ACF2E03123F0",
        "ProcessID": 2801
      },
      {
        "Cycles": 0,
        "Agent": "edu.brown.cs.systems.xtrace.logging.BaggageWrappers",
        "ProcessName": "Data",
        "TaskID": "5F1F66A39EC39BF6",
        "ParentEventID": [
          "87CAB345329645C1"
        ],
        "Label": "Forking current baggage with Baggage.fork()",
        "Title": "X-Trace Task",
        "Host": "pinky23.mpi-sws.org",
        "HRT": 12368246048453069,
        "Operation": "fork",
        "Timestamp": "1557750390014.827881",
        "TenantClass": 0,
        "Source": "PacketHeader.java:95",
        "ThreadID": 16150,
        "ThreadName": "",
        "EventID": "7EA1EE862C77F03F",
        "BaggageBytes": "[[248 5] [240 0] [0 95 31 102 163 158 195 155 246] [240 1] [0 135 202 179 69 50 150 69 193] [240 3] [0 2]]",
        "ProcessID": 24612
      },
      {
        "Cycles": 0,
        "Agent": "Execution-Sleep",
        "ProcessName": "Data",
        "TaskID": "5F1F66A39EC39BF6",
        "ParentEventID": [
          "7EA1EE862C77F03F"
        ],
        "Label": "waited",
        "Title": "X-Trace Task",
        "Host": "pinky23.mpi-sws.org",
        "Duration": "9810",
        "HRT": 12368246048627716,
        "Operation": "waited",
        "Timestamp": "1557750390015.002686",
        "TenantClass": 0,
        "Source": "SocketIOWithTimeout.java:335",
        "ThreadID": 16150,
        "ThreadName": "",
        "EventID": "DE07E6636C6016C3",
        "BaggageBytes": "[[248 5] [240 0] [0 95 31 102 163 158 195 155 246] [240 1] [0 126 161 238 134 44 119 240 63] [240 3] [0 2]]",
        "ProcessID": 24612
      },
      {
        "Cycles": 0,
        "Agent": "Execution-CPU",
        "ProcessName": "Data",
        "TaskID": "5F1F66A39EC39BF6",
        "ParentEventID": [
          "DE07E6636C6016C3"
        ],
        "Label": "unset",
        "Title": "X-Trace Task",
        "Host": "pinky23.mpi-sws.org",
        "Duration": "1867390",
        "HRT": 12368246048996180,
        "Operation": "unset",
        "Timestamp": "1557750390015.371094",
        "TenantClass": 0,
        "Source": "DataXceiver.java:261",
        "ThreadID": 16150,
        "ThreadName": "",
        "EventID": "3C28171A0091AABB",
        "BaggageBytes": "[[248 5] [240 0] [0 95 31 102 163 158 195 155 246] [240 1] [0 222 7 230 99 108 96 22 195] [240 3] [0 2]]",
        "ProcessID": 24612
      },
      {
        "Cycles": 0,
        "Agent": "edu.brown.cs.systems.retro.benchmarks.hdfs_client.Reader",
        "ProcessName": "Read",
        "TaskID": "5F1F66A39EC39BF6",
        "ParentEventID": [
          "0"
        ],
        "Label": "Reading file",
        "Title": "X-Trace Task",
        "Host": "pinky19.mpi-sws.org",
        "HRT": 26966750069707122,
        "Timestamp": "1557750390009.700195",
        "TenantClass": 0,
        "ThreadID": 1,
        "ThreadName": "",
        "EventID": "129A3720EBA6741C",
        "ProcessID": 2801,
        "Tag": [
          "reader_100kb",
          "Read Size: 102400"
        ]
      }
    ]
  }
]