[
  {
    "id": "39E8B75304B3A618",
    "reports": [
      {
        "Cycles": 0,
        "Agent": "edu.brown.cs.systems.retro.benchmarks.hdfs_client.Reader",
        "ProcessName": "Read",
        "TaskID": "39E8B75304B3A618",
        "ParentEventID": [
          "238C60F8E35CD132"
        ],
        "Label": "Reading file",
        "Title": "X-Trace Task",
        "Host": "pinky19.mpi-sws.org",
        "HRT": 26962446955802295,
        "Timestamp": "1557746086895.685547",
        "TenantClass": 0,
        "ThreadID": 1,
        "ThreadName": "",
        "EventID": "4D96FE960A671C17",
        "ProcessID": 36430
      },
      {
        "Cycles": 0,
        "Agent": "Execution-CPU",
        "ProcessName": "Read",
        "TaskID": "39E8B75304B3A618",
        "ParentEventID": [
          "D4AF2D6D8746E197"
        ],
        "Label": "unset",
        "Title": "X-Trace Task",
        "Host": "pinky19.mpi-sws.org",
        "Duration": "53490085",
        "HRT": 26962446955894638,
        "Operation": "unset",
        "Timestamp": "1557746086895.778076",
        "TenantClass": 0,
        "Source": "Client.java:1027",
        "ThreadID": 1,
        "ThreadName": "",
        "EventID": "98CE4A52181BF1EC",
        "ProcessID": 36430
      },
      {
        "Cycles": 0,
        "Agent": "org.apache.hadoop.ipc.ProtobufRpcEngine",
        "ProcessName": "Read",
        "TaskID": "39E8B75304B3A618",
        "ParentEventID": [
          "4D96FE960A671C17"
        ],
        "Label": "Invoking org.apache.hadoop.hdfs.protocol.ClientProtocol.getBlockLocations",
        "Title": "X-Trace Task",
        "Host": "pinky19.mpi-sws.org",
        "HRT": 26962446955863529,
        "Timestamp": "1557746086895.746826",
        "TenantClass": 0,
        "Source": "ProtobufRpcEngine.java:228",
        "ThreadID": 1,
        "ThreadName": "",
        "EventID": "D4AF2D6D8746E197",
        "ProcessID": 36430
      },
      {
        "Cycles": 0,
        "Agent": "Execution-CPU",
        "ProcessName": "Read",
        "TaskID": "39E8B75304B3A618",
        "ParentEventID": [
          "98CE4A52181BF1EC"
        ],
        "Label": "set",
        "Title": "X-Trace Task",
        "Host": "pinky19.mpi-sws.org",
        "HRT": 26962446955961292,
        "Operation": "set",
        "Timestamp": "1557746086895.844727",
        "TenantClass": 0,
        "Source": "Client.java:1032",
        "ThreadID": 41,
        "ThreadName": "",
        "EventID": "BB7D3C9ACD0CEB41",
        "ProcessID": 36430
      },
      {
        "Cycles": 0,
        "Agent": "edu.brown.cs.systems.xtrace.logging.BaggageWrappers",
        "ProcessName": "Read",
        "TaskID": "39E8B75304B3A618",
        "ParentEventID": [
          "BB7D3C9ACD0CEB41"
        ],
        "Label": "Forking current baggage with Baggage.fork()",
        "Title": "X-Trace Task",
        "Host": "pinky19.mpi-sws.org",
        "HRT": 26962446955985595,
        "Operation": "fork",
        "Timestamp": "1557746086895.868896",
        "TenantClass": 0,
        "Source": "Client.java:1043",
        "ThreadID": 41,
        "ThreadName": "",
        "EventID": "E01D9B3EA32FCB29",
        "ProcessID": 36430
      },
      {
        "Cycles": 0,
        "Agent": "Execution-CPU",
        "ProcessName": "Read",
        "TaskID": "39E8B75304B3A618",
        "ParentEventID": [
          "0AA8967DCCF844F1"
        ],
        "Label": "set",
        "Title": "X-Trace Task",
        "Host": "pinky19.mpi-sws.org",
        "HRT": 26962446956109179,
        "Operation": "set",
        "Timestamp": "1557746086895.992432",
        "TenantClass": 0,
        "Source": "Client.java:1104",
        "ThreadID": 1,
        "ThreadName": "",
        "EventID": "3549A7F6C5944EF0",
        "ProcessID": 36430
      },
      {
        "Cycles": 0,
        "Agent": "Execution-CPU",
        "ProcessName": "Read",
        "TaskID": "39E8B75304B3A618",
        "ParentEventID": [
          "E01D9B3EA32FCB29"
        ],
        "Label": "unset",
        "Title": "X-Trace Task",
        "Host": "pinky19.mpi-sws.org",
        "Duration": "81718",
        "HRT": 26962446956065745,
        "Operation": "unset",
        "Timestamp": "1557746086895.948975",
        "TenantClass": 0,
        "Source": "Client.java:1062",
        "ThreadID": 41,
        "ThreadName": "",
        "EventID": "0AA8967DCCF844F1",
        "ProcessID": 36430
      },
      {
        "Cycles": 0,
        "Agent": "Execution-CPU",
        "ProcessName": "Name",
        "TaskID": "39E8B75304B3A618",
        "ParentEventID": [
          "E01D9B3EA32FCB29"
        ],
        "Label": "set",
        "Title": "X-Trace Task",
        "Host": "pinky19.mpi-sws.org",
        "HRT": 26962446956160098,
        "Operation": "set",
        "Timestamp": "1557746086896.062988",
        "TenantClass": 0,
        "Source": "Server.java:1840",
        "ThreadID": 48,
        "ThreadName": "",
        "EventID": "304FE7F5ED69C6E8",
        "BaggageBytes": "[[248 5] [240 0] [0 57 232 183 83 4 179 166 24] [240 1] [0 224 29 155 62 163 47 203 41] [240 3] [0 2]]",
        "ProcessID": 2171
      },
      {
        "Cycles": 0,
        "Agent": "Execution-CPU",
        "ProcessName": "Name",
        "TaskID": "39E8B75304B3A618",
        "ParentEventID": [
          "C83967A646B74484"
        ],
        "Label": "unset",
        "Title": "X-Trace Task",
        "Host": "pinky19.mpi-sws.org",
        "Duration": "24932",
        "HRT": 26962446956211285,
        "Operation": "unset",
        "Timestamp": "1557746086896.114014",
        "TenantClass": 0,
        "Source": "Server.java:1828",
        "ThreadID": 48,
        "ThreadName": "",
        "EventID": "AF4D03C79D474906",
        "BaggageBytes": "[[248 5] [240 0] [0 57 232 183 83 4 179 166 24] [240 1] [0 200 57 103 166 70 183 68 132] [240 3] [0 2]]",
        "ProcessID": 2171
      },
      {
        "Cycles": 0,
        "Agent": "edu.brown.cs.systems.xtrace.logging.BaggageWrappers",
        "ProcessName": "Name",
        "TaskID": "39E8B75304B3A618",
        "ParentEventID": [
          "304FE7F5ED69C6E8"
        ],
        "Label": "Forking current baggage with Baggage.fork()",
        "Title": "X-Trace Task",
        "Host": "pinky19.mpi-sws.org",
        "HRT": 26962446956190443,
        "Operation": "fork",
        "Timestamp": "1557746086896.093262",
        "TenantClass": 0,
        "Source": "Server.java:550",
        "ThreadID": 48,
        "ThreadName": "",
        "EventID": "C83967A646B74484",
        "BaggageBytes": "[[248 5] [240 0] [0 57 232 183 83 4 179 166 24] [240 1] [0 48 79 231 245 237 105 198 232] [240 3] [0 2]]",
        "ProcessID": 2171
      },
      {
        "Cycles": 0,
        "Agent": "Execution-CPU",
        "ProcessName": "Name",
        "TaskID": "39E8B75304B3A618",
        "ParentEventID": [
          "C83967A646B74484"
        ],
        "Label": "set",
        "Title": "X-Trace Task",
        "Host": "pinky19.mpi-sws.org",
        "HRT": 26962446956220918,
        "Operation": "set",
        "Timestamp": "1557746086896.123779",
        "TenantClass": 0,
        "Source": "Server.java:2071",
        "ThreadID": 61,
        "ThreadName": "",
        "EventID": "527A57193A548387",
        "BaggageBytes": "[[248 5] [240 0] [0 57 232 183 83 4 179 166 24] [240 1] [0 200 57 103 166 70 183 68 132] [240 3] [0 2]]",
        "ProcessID": 2171
      },
      {
        "Cycles": 0,
        "Agent": "org.apache.hadoop.hdfs.server.namenode.FSNamesystem.audit",
        "ProcessName": "Name",
        "TaskID": "39E8B75304B3A618",
        "ParentEventID": [
          "A2841ED9477DE0FC"
        ],
        "Label": "allowed=true\tugi=plascas (auth:SIMPLE)\tip=/139.19.171.63\tcmd=open\tsrc=/ds/KP4AnsHyA0GqqnIn\tdst=null\tperm=null\tproto=rpc",
        "Title": "X-Trace Task",
        "Host": "pinky19.mpi-sws.org",
        "HRT": 26962446956306665,
        "Timestamp": "1557746086896.209473",
        "TenantClass": 0,
        "Source": "FSNamesystem.java:8313",
        "ThreadID": 61,
        "ThreadName": "",
        "EventID": "E86102A0D1CDDC87",
        "BaggageBytes": "[[248 5] [240 0] [0 57 232 183 83 4 179 166 24] [240 1] [0 162 132 30 217 71 125 224 252] [240 3] [0 2]]",
        "ProcessID": 2171
      },
      {
        "Cycles": 0,
        "Agent": "org.apache.hadoop.ipc.Server",
        "ProcessName": "Name",
        "TaskID": "39E8B75304B3A618",
        "ParentEventID": [
          "527A57193A548387"
        ],
        "Label": "getBlockLocations in org.apache.hadoop.hdfs.protocol.ClientProtocol",
        "Title": "X-Trace Task",
        "Host": "pinky19.mpi-sws.org",
        "HRT": 26962446956255742,
        "Timestamp": "1557746086896.158691",
        "TenantClass": 0,
        "Source": "ProtobufRpcEngine.java:601",
        "ThreadID": 61,
        "ThreadName": "",
        "EventID": "A2841ED9477DE0FC",
        "BaggageBytes": "[[248 5] [240 0] [0 57 232 183 83 4 179 166 24] [240 1] [0 82 122 87 25 58 84 131 135] [240 3] [0 2]]",
        "ProcessID": 2171
      },
      {
        "Cycles": 0,
        "Agent": "edu.brown.cs.systems.xtrace.logging.BaggageWrappers",
        "ProcessName": "Name",
        "TaskID": "39E8B75304B3A618",
        "ParentEventID": [
          "E86102A0D1CDDC87"
        ],
        "Label": "Forking current baggage with Baggage.fork()",
        "Title": "X-Trace Task",
        "Host": "pinky19.mpi-sws.org",
        "HRT": 26962446956363988,
        "Operation": "fork",
        "Timestamp": "1557746086896.266846",
        "TenantClass": 0,
        "Source": "Server.java:2398",
        "ThreadID": 61,
        "ThreadName": "",
        "EventID": "2A578FEFA8497255",
        "BaggageBytes": "[[248 5] [240 0] [0 57 232 183 83 4 179 166 24] [240 1] [0 232 97 2 160 209 205 220 135] [240 3] [0 2]]",
        "ProcessID": 2171
      },
      {
        "Cycles": 0,
        "Agent": "Execution-CPU",
        "ProcessName": "Read",
        "TaskID": "39E8B75304B3A618",
        "ParentEventID": [
          "2A578FEFA8497255"
        ],
        "Label": "set",
        "Title": "X-Trace Task",
        "Host": "pinky19.mpi-sws.org",
        "HRT": 26962446956577428,
        "Operation": "set",
        "Timestamp": "1557746086896.460693",
        "TenantClass": 0,
        "Source": "Client.java:302",
        "ThreadID": 37,
        "ThreadName": "",
        "EventID": "E5BD942742834942",
        "ProcessID": 36430
      },
      {
        "Cycles": 0,
        "Agent": "Execution-CPU",
        "ProcessName": "Read",
        "TaskID": "39E8B75304B3A618",
        "ParentEventID": [
          "E5BD942742834942"
        ],
        "Label": "unset",
        "Title": "X-Trace Task",
        "Host": "pinky19.mpi-sws.org",
        "Duration": "19092",
        "HRT": 26962446956621227,
        "Operation": "unset",
        "Timestamp": "1557746086896.504639",
        "TenantClass": 0,
        "Source": "Client.java:1168",
        "ThreadID": 37,
        "ThreadName": "",
        "EventID": "824513A3F0942A94",
        "ProcessID": 36430
      },
      {
        "Cycles": 0,
        "Agent": "Execution-CPU",
        "ProcessName": "Name",
        "TaskID": "39E8B75304B3A618",
        "ParentEventID": [
          "2A578FEFA8497255"
        ],
        "Label": "unset",
        "Title": "X-Trace Task",
        "Host": "pinky19.mpi-sws.org",
        "Duration": "226985",
        "HRT": 26962446956470454,
        "Operation": "unset",
        "Timestamp": "1557746086896.373291",
        "TenantClass": 0,
        "Source": "Server.java:1058",
        "ThreadID": 61,
        "ThreadName": "",
        "EventID": "FD484D3C4D5A93A2",
        "BaggageBytes": "[[248 5] [240 0] [0 57 232 183 83 4 179 166 24] [240 1] [0 42 87 143 239 168 73 114 85] [240 3] [0 2]]",
        "ProcessID": 2171
      },
      {
        "Cycles": 0,
        "Agent": "Execution-Sleep",
        "ProcessName": "Read",
        "TaskID": "39E8B75304B3A618",
        "ParentEventID": [
          "3549A7F6C5944EF0"
        ],
        "Label": "waited",
        "Title": "X-Trace Task",
        "Host": "pinky19.mpi-sws.org",
        "Duration": "526392",
        "HRT": 26962446956656142,
        "Operation": "waited",
        "Timestamp": "1557746086896.539551",
        "TenantClass": 0,
        "Source": "Client.java:1537",
        "ThreadID": 1,
        "ThreadName": "",
        "EventID": "2694578ADEC1D3E9",
        "ProcessID": 36430
      },
      {
        "Cycles": 0,
        "Agent": "edu.brown.cs.systems.xtrace.logging.BaggageWrappers",
        "ProcessName": "Read",
        "TaskID": "39E8B75304B3A618",
        "ParentEventID": [
          "824513A3F0942A94",
          "2694578ADEC1D3E9"
        ],
        "Label": "Merged current baggage with other baggage",
        "Title": "X-Trace Task",
        "Host": "pinky19.mpi-sws.org",
        "HRT": 26962446956678783,
        "Operation": "join",
        "Timestamp": "1557746086896.562012",
        "TenantClass": 0,
        "Source": "Client.java:1545",
        "ThreadID": 1,
        "ThreadName": "",
        "EventID": "F2E8DBF998131A7F",
        "ProcessID": 36430
      },
      {
        "Cycles": 0,
        "Agent": "edu.brown.cs.systems.xtrace.logging.BaggageWrappers",
        "ProcessName": "Read",
        "TaskID": "39E8B75304B3A618",
        "ParentEventID": [
          "B9C16C96AB7DCF3D"
        ],
        "Label": "Forking current baggage with Baggage.fork()",
        "Title": "X-Trace Task",
        "Host": "pinky19.mpi-sws.org",
        "HRT": 26962446956836208,
        "Operation": "fork",
        "Timestamp": "1557746086896.719482",
        "TenantClass": 0,
        "Source": "DataTransferProtoUtil.java:94",
        "ThreadID": 1,
        "ThreadName": "",
        "EventID": "BCF13267D84B1D55",
        "ProcessID": 36430
      },
      {
        "Cycles": 0,
        "Agent": "org.apache.hadoop.ipc.ProtobufRpcEngine",
        "ProcessName": "Read",
        "TaskID": "39E8B75304B3A618",
        "ParentEventID": [
          "F2E8DBF998131A7F"
        ],
        "Label": "org.apache.hadoop.hdfs.protocol.ClientProtocol.getBlockLocations completed",
        "Title": "X-Trace Task",
        "Host": "pinky19.mpi-sws.org",
        "HRT": 26962446956739420,
        "Timestamp": "1557746086896.622803",
        "TenantClass": 0,
        "Source": "ProtobufRpcEngine.java:275",
        "ThreadID": 1,
        "ThreadName": "",
        "EventID": "B9C16C96AB7DCF3D",
        "ProcessID": 36430
      },
      {
        "Cycles": 0,
        "Agent": "Execution-CPU",
        "ProcessName": "Data",
        "TaskID": "39E8B75304B3A618",
        "ParentEventID": [
          "BCF13267D84B1D55"
        ],
        "Label": "set",
        "Title": "X-Trace Task",
        "Host": "pinky25.mpi-sws.org",
        "HRT": 47511552198610357,
        "Operation": "set",
        "Timestamp": "1557746086896.922119",
        "TenantClass": 0,
        "Source": "Receiver.java:117",
        "ThreadID": 14040,
        "ThreadName": "",
        "EventID": "3B8CFD8A30291BE4",
        "BaggageBytes": "[[248 5] [240 0] [0 57 232 183 83 4 179 166 24] [240 1] [0 188 241 50 103 216 75 29 85] [240 3] [0 2]]",
        "ProcessID": 28198
      },
      {
        "Cycles": 0,
        "Agent": "edu.brown.cs.systems.xtrace.logging.BaggageWrappers",
        "ProcessName": "Data",
        "TaskID": "39E8B75304B3A618",
        "ParentEventID": [
          "A6A708FC908486C0"
        ],
        "Label": "Forking current baggage with Baggage.fork()",
        "Title": "X-Trace Task",
        "Host": "pinky25.mpi-sws.org",
        "HRT": 47511552198839063,
        "Operation": "fork",
        "Timestamp": "1557746086897.150879",
        "TenantClass": 0,
        "Source": "DataXceiver.java:1257",
        "ThreadID": 14040,
        "ThreadName": "",
        "EventID": "D14F2D4D07711374",
        "BaggageBytes": "[[248 5] [240 0] [0 57 232 183 83 4 179 166 24] [240 1] [0 166 167 8 252 144 132 134 192] [240 3] [0 2]]",
        "ProcessID": 28198
      },
      {
        "Cycles": 0,
        "Agent": "edu.brown.cs.systems.xtrace.logging.XTraceInit",
        "ProcessName": "Data",
        "TaskID": "39E8B75304B3A618",
        "ParentEventID": [
          "3B8CFD8A30291BE4"
        ],
        "Label": "Thread.setName: DataXceiver for client DFSClient_NONMAPREDUCE_778905418_1 at /139.19.171.63:41180 [Sending block BP-1633380353-139.19.171.63-1554193446451:blk_1073756067_15243]",
        "Title": "X-Trace Task",
        "Host": "pinky25.mpi-sws.org",
        "HRT": 47511552198664537,
        "Timestamp": "1557746086896.976318",
        "TenantClass": 0,
        "Source": "DataXceiver.java:168",
        "ThreadID": 14040,
        "ThreadName": "",
        "EventID": "A6A708FC908486C0",
        "BaggageBytes": "[[248 5] [240 0] [0 57 232 183 83 4 179 166 24] [240 1] [0 59 140 253 138 48 41 27 228] [240 3] [0 2]]",
        "ProcessID": 28198
      },
      {
        "Cycles": 0,
        "Agent": "Execution-Sleep",
        "ProcessName": "Read",
        "TaskID": "39E8B75304B3A618",
        "ParentEventID": [
          "BCF13267D84B1D55"
        ],
        "Label": "waited",
        "Title": "X-Trace Task",
        "Host": "pinky19.mpi-sws.org",
        "Duration": "439184",
        "HRT": 26962446957381315,
        "Operation": "waited",
        "Timestamp": "1557746086897.264648",
        "TenantClass": 0,
        "Source": "SocketIOWithTimeout.java:335",
        "ThreadID": 1,
        "ThreadName": "",
        "EventID": "8946E787E75095F9",
        "ProcessID": 36430
      },
      {
        "Cycles": 0,
        "Agent": "Execution-Sleep",
        "ProcessName": "Data",
        "TaskID": "39E8B75304B3A618",
        "ParentEventID": [
          "7EA5793AB10896D7"
        ],
        "Label": "waited",
        "Title": "X-Trace Task",
        "Host": "pinky25.mpi-sws.org",
        "Duration": "5402",
        "HRT": 47511552199046048,
        "Operation": "waited",
        "Timestamp": "1557746086897.357910",
        "TenantClass": 0,
        "Source": "SocketIOWithTimeout.java:335",
        "ThreadID": 14040,
        "ThreadName": "",
        "EventID": "492A77F0E387E80E",
        "BaggageBytes": "[[248 5] [240 0] [0 57 232 183 83 4 179 166 24] [240 1] [0 126 165 121 58 177 8 150 215] [240 3] [0 2]]",
        "ProcessID": 28198
      },
      {
        "Cycles": 0,
        "Agent": "edu.brown.cs.systems.xtrace.logging.BaggageWrappers",
        "ProcessName": "Data",
        "TaskID": "39E8B75304B3A618",
        "ParentEventID": [
          "D14F2D4D07711374"
        ],
        "Label": "Forking current baggage with Baggage.fork()",
        "Title": "X-Trace Task",
        "Host": "pinky25.mpi-sws.org",
        "HRT": 47511552198952275,
        "Operation": "fork",
        "Timestamp": "1557746086897.264160",
        "TenantClass": 0,
        "Source": "PacketHeader.java:95",
        "ThreadID": 14040,
        "ThreadName": "",
        "EventID": "7EA5793AB10896D7",
        "BaggageBytes": "[[248 5] [240 0] [0 57 232 183 83 4 179 166 24] [240 1] [0 209 79 45 77 7 113 19 116] [240 3] [0 2]]",
        "ProcessID": 28198
      },
      {
        "Cycles": 0,
        "Agent": "edu.brown.cs.systems.xtrace.logging.BaggageWrappers",
        "ProcessName": "Read",
        "TaskID": "39E8B75304B3A618",
        "ParentEventID": [
          "D14F2D4D07711374",
          "8946E787E75095F9"
        ],
        "Label": "Merged current baggage with other baggage",
        "Title": "X-Trace Task",
        "Host": "pinky19.mpi-sws.org",
        "HRT": 26962446957470051,
        "Operation": "join",
        "Timestamp": "1557746086897.353516",
        "TenantClass": 0,
        "Source": "RemoteBlockReader2.java:429",
        "ThreadID": 1,
        "ThreadName": "",
        "EventID": "BD52348933873559",
        "ProcessID": 36430
      },
      {
        "Cycles": 0,
        "Agent": "Execution-Sleep",
        "ProcessName": "Read",
        "TaskID": "39E8B75304B3A618",
        "ParentEventID": [
          "BD52348933873559"
        ],
        "Label": "waited",
        "Title": "X-Trace Task",
        "Host": "pinky19.mpi-sws.org",
        "Duration": "101649",
        "HRT": 26962446957674041,
        "Operation": "waited",
        "Timestamp": "1557746086897.557373",
        "TenantClass": 0,
        "Source": "SocketIOWithTimeout.java:335",
        "ThreadID": 1,
        "ThreadName": "",
        "EventID": "0F089478F84A2D41",
        "ProcessID": 36430
      },
      {
        "Cycles": 0,
        "Agent": "edu.brown.cs.systems.xtrace.logging.BaggageWrappers",
        "ProcessName": "Data",
        "TaskID": "39E8B75304B3A618",
        "ParentEventID": [
          "492A77F0E387E80E"
        ],
        "Label": "Forking current baggage with Baggage.fork()",
        "Title": "X-Trace Task",
        "Host": "pinky25.mpi-sws.org",
        "HRT": 47511552199154648,
        "Operation": "fork",
        "Timestamp": "1557746086897.466553",
        "TenantClass": 0,
        "Source": "PacketHeader.java:95",
        "ThreadID": 14040,
        "ThreadName": "",
        "EventID": "E4FF55D3DFB2638C",
        "BaggageBytes": "[[248 5] [240 0] [0 57 232 183 83 4 179 166 24] [240 1] [0 73 42 119 240 227 135 232 14] [240 3] [0 2]]",
        "ProcessID": 28198
      },
      {
        "Cycles": 0,
        "Agent": "edu.brown.cs.systems.xtrace.logging.BaggageWrappers",
        "ProcessName": "Read",
        "TaskID": "39E8B75304B3A618",
        "ParentEventID": [
          "0F089478F84A2D41",
          "7EA5793AB10896D7"
        ],
        "Label": "Merged current baggage with other baggage",
        "Title": "X-Trace Task",
        "Host": "pinky19.mpi-sws.org",
        "HRT": 26962446957754167,
        "Operation": "join",
        "Timestamp": "1557746086897.637451",
        "TenantClass": 0,
        "Source": "PacketHeader.java:168",
        "ThreadID": 1,
        "ThreadName": "",
        "EventID": "FB3B37E0327E5C0F",
        "ProcessID": 36430
      },
      {
        "Cycles": 0,
        "Agent": "edu.brown.cs.systems.xtrace.logging.BaggageWrappers",
        "ProcessName": "Read",
        "TaskID": "39E8B75304B3A618",
        "ParentEventID": [
          "259B0C3D6C439AE2"
        ],
        "Label": "Forking current baggage with Baggage.fork()",
        "Title": "X-Trace Task",
        "Host": "pinky19.mpi-sws.org",
        "HRT": 26962446957843576,
        "Operation": "fork",
        "Timestamp": "1557746086897.726807",
        "TenantClass": 0,
        "Source": "RemoteBlockReader2.java:361",
        "ThreadID": 1,
        "ThreadName": "",
        "EventID": "43569CC3E6F78C23",
        "ProcessID": 36430
      },
      {
        "Cycles": 0,
        "Agent": "edu.brown.cs.systems.xtrace.logging.BaggageWrappers",
        "ProcessName": "Read",
        "TaskID": "39E8B75304B3A618",
        "ParentEventID": [
          "FB3B37E0327E5C0F",
          "E4FF55D3DFB2638C"
        ],
        "Label": "Merged current baggage with other baggage",
        "Title": "X-Trace Task",
        "Host": "pinky19.mpi-sws.org",
        "HRT": 26962446957828407,
        "Operation": "join",
        "Timestamp": "1557746086897.711670",
        "TenantClass": 0,
        "Source": "PacketHeader.java:168",
        "ThreadID": 1,
        "ThreadName": "",
        "EventID": "259B0C3D6C439AE2",
        "ProcessID": 36430
      },
      {
        "Cycles": 0,
        "Agent": "Execution-Sleep",
        "ProcessName": "Data",
        "TaskID": "39E8B75304B3A618",
        "ParentEventID": [
          "E4FF55D3DFB2638C"
        ],
        "Label": "waited",
        "Title": "X-Trace Task",
        "Host": "pinky25.mpi-sws.org",
        "Duration": "272487",
        "HRT": 47511552199553828,
        "Operation": "waited",
        "Timestamp": "1557746086897.865723",
        "TenantClass": 0,
        "Source": "SocketIOWithTimeout.java:335",
        "ThreadID": 14040,
        "ThreadName": "",
        "EventID": "00C12ABFF7ACB1CC",
        "BaggageBytes": "[[248 5] [240 0] [0 57 232 183 83 4 179 166 24] [240 1] [0 228 255 85 211 223 178 99 140] [240 3] [0 2]]",
        "ProcessID": 28198
      },
      {
        "Cycles": 0,
        "Agent": "edu.brown.cs.systems.xtrace.logging.BaggageWrappers",
        "ProcessName": "Data",
        "TaskID": "39E8B75304B3A618",
        "ParentEventID": [
          "00C12ABFF7ACB1CC",
          "43569CC3E6F78C23"
        ],
        "Label": "Merged current baggage with other baggage",
        "Title": "X-Trace Task",
        "Host": "pinky25.mpi-sws.org",
        "HRT": 47511552199628974,
        "Operation": "join",
        "Timestamp": "1557746086897.940674",
        "TenantClass": 0,
        "Source": "DataXceiver.java:574",
        "ThreadID": 14040,
        "ThreadName": "",
        "EventID": "1EDCB64D9D476542",
        "BaggageBytes": "[[248 5] [240 0] [0 57 232 183 83 4 179 166 24] [240 1] [0 0 193 42 191 247 172 177 204] [0 67 86 156 195 230 247 140 35] [240 3] [0 2]]",
        "ProcessID": 28198
      },
      {
        "Cycles": 0,
        "Agent": "Execution-CPU",
        "ProcessName": "Data",
        "TaskID": "39E8B75304B3A618",
        "ParentEventID": [
          "1EDCB64D9D476542"
        ],
        "Label": "unset",
        "Title": "X-Trace Task",
        "Host": "pinky25.mpi-sws.org",
        "Duration": "1015354",
        "HRT": 47511552199664057,
        "Operation": "unset",
        "Timestamp": "1557746086897.975830",
        "TenantClass": 0,
        "Source": "DataXceiver.java:261",
        "ThreadID": 14040,
        "ThreadName": "",
        "EventID": "C71D8F2156714252",
        "BaggageBytes": "[[248 5] [240 0] [0 57 232 183 83 4 179 166 24] [240 1] [0 30 220 182 77 157 71 101 66] [240 3] [0 2]]",
        "ProcessID": 28198
      },
      {
        "Cycles": 0,
        "Agent": "edu.brown.cs.systems.retro.benchmarks.hdfs_client.Reader",
        "ProcessName": "Read",
        "TaskID": "39E8B75304B3A618",
        "ParentEventID": [
          "0"
        ],
        "Label": "Reading file",
        "Title": "X-Trace Task",
        "Host": "pinky19.mpi-sws.org",
        "HRT": 26962446955781473,
        "Timestamp": "1557746086895.664795",
        "TenantClass": 0,
        "ThreadID": 1,
        "ThreadName": "",
        "EventID": "238C60F8E35CD132",
        "ProcessID": 36430,
        "Tag": [
          "reader_10kb",
          "Read Size: 10240"
        ]
      }
    ]
  }
]