[
  {
    "id": "0729A43D3473F381",
    "reports": [
      {
        "Cycles": 0,
        "Agent": "org.apache.hadoop.ipc.ProtobufRpcEngine",
        "ProcessName": "Read",
        "TaskID": "0729A43D3473F381",
        "ParentEventID": [
          "73D23EFD53106398"
        ],
        "Label": "Invoking org.apache.hadoop.hdfs.protocol.ClientProtocol.getBlockLocations",
        "Title": "X-Trace Task",
        "Host": "pinky19.mpi-sws.org",
        "HRT": 27726525138396601,
        "Timestamp": "1558510165079.041504",
        "TenantClass": 0,
        "Source": "ProtobufRpcEngine.java:228",
        "ThreadID": 1,
        "ThreadName": "",
        "EventID": "F3C75B264F699A1C",
        "ProcessID": 40748
      },
      {
        "Cycles": 0,
        "Agent": "Execution-CPU",
        "ProcessName": "Read",
        "TaskID": "0729A43D3473F381",
        "ParentEventID": [
          "F3C75B264F699A1C"
        ],
        "Label": "unset",
        "Title": "X-Trace Task",
        "Host": "pinky19.mpi-sws.org",
        "Duration": "21682506",
        "HRT": 27726525138428408,
        "Operation": "unset",
        "Timestamp": "1558510165079.073242",
        "TenantClass": 0,
        "Source": "Client.java:1027",
        "ThreadID": 1,
        "ThreadName": "",
        "EventID": "201013507000AE82",
        "ProcessID": 40748
      },
      {
        "Cycles": 0,
        "Agent": "edu.brown.cs.systems.retro.benchmarks.hdfs_client.ReaderRandomSize",
        "ProcessName": "Read",
        "TaskID": "0729A43D3473F381",
        "ParentEventID": [
          "DDAD25D6C58ED88D"
        ],
        "Label": "Reading file",
        "Title": "X-Trace Task",
        "Host": "pinky19.mpi-sws.org",
        "HRT": 27726525138331946,
        "Timestamp": "1558510165078.976807",
        "TenantClass": 0,
        "ThreadID": 1,
        "ThreadName": "",
        "EventID": "73D23EFD53106398",
        "ProcessID": 40748
      },
      {
        "Cycles": 0,
        "Agent": "edu.brown.cs.systems.xtrace.logging.BaggageWrappers",
        "ProcessName": "Read",
        "TaskID": "0729A43D3473F381",
        "ParentEventID": [
          "741887D3A4A01422"
        ],
        "Label": "Forking current baggage with Baggage.fork()",
        "Title": "X-Trace Task",
        "Host": "pinky19.mpi-sws.org",
        "HRT": 27726525138508067,
        "Operation": "fork",
        "Timestamp": "1558510165079.152832",
        "TenantClass": 0,
        "Source": "Client.java:1043",
        "ThreadID": 41,
        "ThreadName": "",
        "EventID": "554367A035B9BEFB",
        "ProcessID": 40748
      },
      {
        "Cycles": 0,
        "Agent": "Execution-CPU",
        "ProcessName": "Read",
        "TaskID": "0729A43D3473F381",
        "ParentEventID": [
          "201013507000AE82"
        ],
        "Label": "set",
        "Title": "X-Trace Task",
        "Host": "pinky19.mpi-sws.org",
        "HRT": 27726525138487389,
        "Operation": "set",
        "Timestamp": "1558510165079.132080",
        "TenantClass": 0,
        "Source": "Client.java:1032",
        "ThreadID": 41,
        "ThreadName": "",
        "EventID": "741887D3A4A01422",
        "ProcessID": 40748
      },
      {
        "Cycles": 0,
        "Agent": "Execution-CPU",
        "ProcessName": "Read",
        "TaskID": "0729A43D3473F381",
        "ParentEventID": [
          "554367A035B9BEFB"
        ],
        "Label": "unset",
        "Title": "X-Trace Task",
        "Host": "pinky19.mpi-sws.org",
        "Duration": "83775",
        "HRT": 27726525138590437,
        "Operation": "unset",
        "Timestamp": "1558510165079.235107",
        "TenantClass": 0,
        "Source": "Client.java:1062",
        "ThreadID": 41,
        "ThreadName": "",
        "EventID": "AC6F3183C14562A4",
        "ProcessID": 40748
      },
      {
        "Cycles": 0,
        "Agent": "Execution-CPU",
        "ProcessName": "Name",
        "TaskID": "0729A43D3473F381",
        "ParentEventID": [
          "554367A035B9BEFB"
        ],
        "Label": "set",
        "Title": "X-Trace Task",
        "Host": "pinky19.mpi-sws.org",
        "HRT": 27726525138649861,
        "Operation": "set",
        "Timestamp": "1558510165079.304932",
        "TenantClass": 0,
        "Source": "Server.java:1840",
        "ThreadID": 48,
        "ThreadName": "",
        "EventID": "B41F9E42599C1FFF",
        "BaggageBytes": "[[248 5] [240 0] [0 7 41 164 61 52 115 243 129] [240 1] [0 85 67 103 160 53 185 190 251] [240 3] [0 2]]",
        "ProcessID": 2171
      },
      {
        "Cycles": 0,
        "Agent": "edu.brown.cs.systems.xtrace.logging.BaggageWrappers",
        "ProcessName": "Name",
        "TaskID": "0729A43D3473F381",
        "ParentEventID": [
          "B41F9E42599C1FFF"
        ],
        "Label": "Forking current baggage with Baggage.fork()",
        "Title": "X-Trace Task",
        "Host": "pinky19.mpi-sws.org",
        "HRT": 27726525138679800,
        "Operation": "fork",
        "Timestamp": "1558510165079.334961",
        "TenantClass": 0,
        "Source": "Server.java:550",
        "ThreadID": 48,
        "ThreadName": "",
        "EventID": "959C8A3CD09F179C",
        "BaggageBytes": "[[248 5] [240 0] [0 7 41 164 61 52 115 243 129] [240 1] [0 180 31 158 66 89 156 31 255] [240 3] [0 2]]",
        "ProcessID": 2171
      },
      {
        "Cycles": 0,
        "Agent": "Execution-CPU",
        "ProcessName": "Read",
        "TaskID": "0729A43D3473F381",
        "ParentEventID": [
          "AC6F3183C14562A4"
        ],
        "Label": "set",
        "Title": "X-Trace Task",
        "Host": "pinky19.mpi-sws.org",
        "HRT": 27726525138613441,
        "Operation": "set",
        "Timestamp": "1558510165079.258301",
        "TenantClass": 0,
        "Source": "Client.java:1104",
        "ThreadID": 1,
        "ThreadName": "",
        "EventID": "BB06F0742E09C346",
        "ProcessID": 40748
      },
      {
        "Cycles": 0,
        "Agent": "Execution-CPU",
        "ProcessName": "Name",
        "TaskID": "0729A43D3473F381",
        "ParentEventID": [
          "959C8A3CD09F179C"
        ],
        "Label": "unset",
        "Title": "X-Trace Task",
        "Host": "pinky19.mpi-sws.org",
        "Duration": "25921",
        "HRT": 27726525138701482,
        "Operation": "unset",
        "Timestamp": "1558510165079.356689",
        "TenantClass": 0,
        "Source": "Server.java:1828",
        "ThreadID": 48,
        "ThreadName": "",
        "EventID": "0C20C62FC616DEC8",
        "BaggageBytes": "[[248 5] [240 0] [0 7 41 164 61 52 115 243 129] [240 1] [0 149 156 138 60 208 159 23 156] [240 3] [0 2]]",
        "ProcessID": 2171
      },
      {
        "Cycles": 0,
        "Agent": "Execution-CPU",
        "ProcessName": "Name",
        "TaskID": "0729A43D3473F381",
        "ParentEventID": [
          "959C8A3CD09F179C"
        ],
        "Label": "set",
        "Title": "X-Trace Task",
        "Host": "pinky19.mpi-sws.org",
        "HRT": 27726525138713395,
        "Operation": "set",
        "Timestamp": "1558510165079.368652",
        "TenantClass": 0,
        "Source": "Server.java:2071",
        "ThreadID": 60,
        "ThreadName": "",
        "EventID": "DE9957D90E767872",
        "BaggageBytes": "[[248 5] [240 0] [0 7 41 164 61 52 115 243 129] [240 1] [0 149 156 138 60 208 159 23 156] [240 3] [0 2]]",
        "ProcessID": 2171
      },
      {
        "Cycles": 0,
        "Agent": "org.apache.hadoop.ipc.Server",
        "ProcessName": "Name",
        "TaskID": "0729A43D3473F381",
        "ParentEventID": [
          "DE9957D90E767872"
        ],
        "Label": "getBlockLocations in org.apache.hadoop.hdfs.protocol.ClientProtocol",
        "Title": "X-Trace Task",
        "Host": "pinky19.mpi-sws.org",
        "HRT": 27726525138753661,
        "Timestamp": "1558510165079.408691",
        "TenantClass": 0,
        "Source": "ProtobufRpcEngine.java:601",
        "ThreadID": 60,
        "ThreadName": "",
        "EventID": "1D49F10B6677A482",
        "BaggageBytes": "[[248 5] [240 0] [0 7 41 164 61 52 115 243 129] [240 1] [0 222 153 87 217 14 118 120 114] [240 3] [0 2]]",
        "ProcessID": 2171
      },
      {
        "Cycles": 0,
        "Agent": "edu.brown.cs.systems.xtrace.logging.BaggageWrappers",
        "ProcessName": "Name",
        "TaskID": "0729A43D3473F381",
        "ParentEventID": [
          "D2CD34CA1AACD17F"
        ],
        "Label": "Forking current baggage with Baggage.fork()",
        "Title": "X-Trace Task",
        "Host": "pinky19.mpi-sws.org",
        "HRT": 27726525138857317,
        "Operation": "fork",
        "Timestamp": "1558510165079.512451",
        "TenantClass": 0,
        "Source": "Server.java:2398",
        "ThreadID": 60,
        "ThreadName": "",
        "EventID": "8E000F09FFB9D632",
        "BaggageBytes": "[[248 5] [240 0] [0 7 41 164 61 52 115 243 129] [240 1] [0 210 205 52 202 26 172 209 127] [240 3] [0 2]]",
        "ProcessID": 2171
      },
      {
        "Cycles": 0,
        "Agent": "org.apache.hadoop.hdfs.server.namenode.FSNamesystem.audit",
        "ProcessName": "Name",
        "TaskID": "0729A43D3473F381",
        "ParentEventID": [
          "1D49F10B6677A482"
        ],
        "Label": "allowed=true\tugi=plascas (auth:SIMPLE)\tip=/139.19.171.63\tcmd=open\tsrc=/ds/q3lkrXE43zpoQK54\tdst=null\tperm=null\tproto=rpc",
        "Title": "X-Trace Task",
        "Host": "pinky19.mpi-sws.org",
        "HRT": 27726525138802606,
        "Timestamp": "1558510165079.457764",
        "TenantClass": 0,
        "Source": "FSNamesystem.java:8313",
        "ThreadID": 60,
        "ThreadName": "",
        "EventID": "D2CD34CA1AACD17F",
        "BaggageBytes": "[[248 5] [240 0] [0 7 41 164 61 52 115 243 129] [240 1] [0 29 73 241 11 102 119 164 130] [240 3] [0 2]]",
        "ProcessID": 2171
      },
      {
        "Cycles": 0,
        "Agent": "Execution-CPU",
        "ProcessName": "Name",
        "TaskID": "0729A43D3473F381",
        "ParentEventID": [
          "8E000F09FFB9D632"
        ],
        "Label": "unset",
        "Title": "X-Trace Task",
        "Host": "pinky19.mpi-sws.org",
        "Duration": "227824",
        "HRT": 27726525138967875,
        "Operation": "unset",
        "Timestamp": "1558510165079.623047",
        "TenantClass": 0,
        "Source": "Server.java:1058",
        "ThreadID": 60,
        "ThreadName": "",
        "EventID": "E6724DC842A440B9",
        "BaggageBytes": "[[248 5] [240 0] [0 7 41 164 61 52 115 243 129] [240 1] [0 142 0 15 9 255 185 214 50] [240 3] [0 2]]",
        "ProcessID": 2171
      },
      {
        "Cycles": 0,
        "Agent": "Execution-CPU",
        "ProcessName": "Read",
        "TaskID": "0729A43D3473F381",
        "ParentEventID": [
          "007621F025649C9F"
        ],
        "Label": "unset",
        "Title": "X-Trace Task",
        "Host": "pinky19.mpi-sws.org",
        "Duration": "13550",
        "HRT": 27726525139051878,
        "Operation": "unset",
        "Timestamp": "1558510165079.696777",
        "TenantClass": 0,
        "Source": "Client.java:1168",
        "ThreadID": 40,
        "ThreadName": "",
        "EventID": "B84E2DF211BA9660",
        "ProcessID": 40748
      },
      {
        "Cycles": 0,
        "Agent": "Execution-CPU",
        "ProcessName": "Read",
        "TaskID": "0729A43D3473F381",
        "ParentEventID": [
          "8E000F09FFB9D632"
        ],
        "Label": "set",
        "Title": "X-Trace Task",
        "Host": "pinky19.mpi-sws.org",
        "HRT": 27726525139019643,
        "Operation": "set",
        "Timestamp": "1558510165079.664551",
        "TenantClass": 0,
        "Source": "Client.java:302",
        "ThreadID": 40,
        "ThreadName": "",
        "EventID": "007621F025649C9F",
        "ProcessID": 40748
      },
      {
        "Cycles": 0,
        "Agent": "Execution-Sleep",
        "ProcessName": "Read",
        "TaskID": "0729A43D3473F381",
        "ParentEventID": [
          "BB06F0742E09C346"
        ],
        "Label": "waited",
        "Title": "X-Trace Task",
        "Host": "pinky19.mpi-sws.org",
        "Duration": "458172",
        "HRT": 27726525139081304,
        "Operation": "waited",
        "Timestamp": "1558510165079.726074",
        "TenantClass": 0,
        "Source": "Client.java:1537",
        "ThreadID": 1,
        "ThreadName": "",
        "EventID": "D04FEA0CDA3A0260",
        "ProcessID": 40748
      },
      {
        "Cycles": 0,
        "Agent": "org.apache.hadoop.ipc.ProtobufRpcEngine",
        "ProcessName": "Read",
        "TaskID": "0729A43D3473F381",
        "ParentEventID": [
          "99CD9DA598550879"
        ],
        "Label": "org.apache.hadoop.hdfs.protocol.ClientProtocol.getBlockLocations completed",
        "Title": "X-Trace Task",
        "Host": "pinky19.mpi-sws.org",
        "HRT": 27726525139174071,
        "Timestamp": "1558510165079.818848",
        "TenantClass": 0,
        "Source": "ProtobufRpcEngine.java:275",
        "ThreadID": 1,
        "ThreadName": "",
        "EventID": "C4C4F36C05A03D12",
        "ProcessID": 40748
      },
      {
        "Cycles": 0,
        "Agent": "edu.brown.cs.systems.xtrace.logging.BaggageWrappers",
        "ProcessName": "Read",
        "TaskID": "0729A43D3473F381",
        "ParentEventID": [
          "D04FEA0CDA3A0260",
          "B84E2DF211BA9660"
        ],
        "Label": "Merged current baggage with other baggage",
        "Title": "X-Trace Task",
        "Host": "pinky19.mpi-sws.org",
        "HRT": 27726525139110998,
        "Operation": "join",
        "Timestamp": "1558510165079.755859",
        "TenantClass": 0,
        "Source": "Client.java:1545",
        "ThreadID": 1,
        "ThreadName": "",
        "EventID": "99CD9DA598550879",
        "ProcessID": 40748
      },
      {
        "Cycles": 0,
        "Agent": "edu.brown.cs.systems.xtrace.logging.BaggageWrappers",
        "ProcessName": "Read",
        "TaskID": "0729A43D3473F381",
        "ParentEventID": [
          "C4C4F36C05A03D12"
        ],
        "Label": "Forking current baggage with Baggage.fork()",
        "Title": "X-Trace Task",
        "Host": "pinky19.mpi-sws.org",
        "HRT": 27726525139249875,
        "Operation": "fork",
        "Timestamp": "1558510165079.894775",
        "TenantClass": 0,
        "Source": "DataTransferProtoUtil.java:94",
        "ThreadID": 1,
        "ThreadName": "",
        "EventID": "730DC4811BEBBA9F",
        "ProcessID": 40748
      },
      {
        "Cycles": 0,
        "Agent": "edu.brown.cs.systems.xtrace.logging.XTraceInit",
        "ProcessName": "Data",
        "TaskID": "0729A43D3473F381",
        "ParentEventID": [
          "8E12F1B7386B36D3"
        ],
        "Label": "Thread.setName: DataXceiver for client DFSClient_NONMAPREDUCE_1816546669_1 at /139.19.171.63:34834 [Sending block BP-1633380353-139.19.171.63-1554193446451:blk_1073762179_21355]",
        "Title": "X-Trace Task",
        "Host": "pinky19.mpi-sws.org",
        "HRT": 27726525139423276,
        "Timestamp": "1558510165080.092285",
        "TenantClass": 0,
        "Source": "DataXceiver.java:168",
        "ThreadID": 41693,
        "ThreadName": "",
        "EventID": "CB246A9540DF6F84",
        "BaggageBytes": "[[248 5] [240 0] [0 7 41 164 61 52 115 243 129] [240 1] [0 142 18 241 183 56 107 54 211] [240 3] [0 2]]",
        "ProcessID": 2319
      },
      {
        "Cycles": 0,
        "Agent": "Execution-CPU",
        "ProcessName": "Data",
        "TaskID": "0729A43D3473F381",
        "ParentEventID": [
          "730DC4811BEBBA9F"
        ],
        "Label": "set",
        "Title": "X-Trace Task",
        "Host": "pinky19.mpi-sws.org",
        "HRT": 27726525139385951,
        "Operation": "set",
        "Timestamp": "1558510165080.054932",
        "TenantClass": 0,
        "Source": "Receiver.java:117",
        "ThreadID": 41693,
        "ThreadName": "",
        "EventID": "8E12F1B7386B36D3",
        "BaggageBytes": "[[248 5] [240 0] [0 7 41 164 61 52 115 243 129] [240 1] [0 115 13 196 129 27 235 186 159] [240 3] [0 2]]",
        "ProcessID": 2319
      },
      {
        "Cycles": 0,
        "Agent": "edu.brown.cs.systems.xtrace.logging.BaggageWrappers",
        "ProcessName": "Data",
        "TaskID": "0729A43D3473F381",
        "ParentEventID": [
          "CB246A9540DF6F84"
        ],
        "Label": "Forking current baggage with Baggage.fork()",
        "Title": "X-Trace Task",
        "Host": "pinky19.mpi-sws.org",
        "HRT": 27726525139498827,
        "Operation": "fork",
        "Timestamp": "1558510165080.167725",
        "TenantClass": 0,
        "Source": "DataXceiver.java:1257",
        "ThreadID": 41693,
        "ThreadName": "",
        "EventID": "D09FA215730C974E",
        "BaggageBytes": "[[248 5] [240 0] [0 7 41 164 61 52 115 243 129] [240 1] [0 203 36 106 149 64 223 111 132] [240 3] [0 2]]",
        "ProcessID": 2319
      },
      {
        "Cycles": 0,
        "Agent": "edu.brown.cs.systems.xtrace.logging.BaggageWrappers",
        "ProcessName": "Data",
        "TaskID": "0729A43D3473F381",
        "ParentEventID": [
          "D09FA215730C974E"
        ],
        "Label": "Forking current baggage with Baggage.fork()",
        "Title": "X-Trace Task",
        "Host": "pinky19.mpi-sws.org",
        "HRT": 27726525139573856,
        "Operation": "fork",
        "Timestamp": "1558510165080.242920",
        "TenantClass": 0,
        "Source": "PacketHeader.java:95",
        "ThreadID": 41693,
        "ThreadName": "",
        "EventID": "50568A6B4FC0FAF2",
        "BaggageBytes": "[[248 5] [240 0] [0 7 41 164 61 52 115 243 129] [240 1] [0 208 159 162 21 115 12 151 78] [240 3] [0 2]]",
        "ProcessID": 2319
      },
      {
        "Cycles": 0,
        "Agent": "Execution-Sleep",
        "ProcessName": "Read",
        "TaskID": "0729A43D3473F381",
        "ParentEventID": [
          "730DC4811BEBBA9F"
        ],
        "Label": "waited",
        "Title": "X-Trace Task",
        "Host": "pinky19.mpi-sws.org",
        "Duration": "214099",
        "HRT": 27726525139571530,
        "Operation": "waited",
        "Timestamp": "1558510165080.216309",
        "TenantClass": 0,
        "Source": "SocketIOWithTimeout.java:335",
        "ThreadID": 1,
        "ThreadName": "",
        "EventID": "6FF6C3E2F8598398",
        "ProcessID": 40748
      },
      {
        "Cycles": 0,
        "Agent": "edu.brown.cs.systems.xtrace.logging.BaggageWrappers",
        "ProcessName": "Read",
        "TaskID": "0729A43D3473F381",
        "ParentEventID": [
          "D09FA215730C974E",
          "6FF6C3E2F8598398"
        ],
        "Label": "Merged current baggage with other baggage",
        "Title": "X-Trace Task",
        "Host": "pinky19.mpi-sws.org",
        "HRT": 27726525139650218,
        "Operation": "join",
        "Timestamp": "1558510165080.294922",
        "TenantClass": 0,
        "Source": "RemoteBlockReader2.java:429",
        "ThreadID": 1,
        "ThreadName": "",
        "EventID": "B6165523300B81BC",
        "ProcessID": 40748
      },
      {
        "Cycles": 0,
        "Agent": "Execution-Sleep",
        "ProcessName": "Data",
        "TaskID": "0729A43D3473F381",
        "ParentEventID": [
          "50568A6B4FC0FAF2"
        ],
        "Label": "waited",
        "Title": "X-Trace Task",
        "Host": "pinky19.mpi-sws.org",
        "Duration": "3995",
        "HRT": 27726525139650091,
        "Operation": "waited",
        "Timestamp": "1558510165080.319092",
        "TenantClass": 0,
        "Source": "SocketIOWithTimeout.java:335",
        "ThreadID": 41693,
        "ThreadName": "",
        "EventID": "0576E2959B6845B1",
        "BaggageBytes": "[[248 5] [240 0] [0 7 41 164 61 52 115 243 129] [240 1] [0 80 86 138 107 79 192 250 242] [240 3] [0 2]]",
        "ProcessID": 2319
      },
      {
        "Cycles": 0,
        "Agent": "edu.brown.cs.systems.xtrace.logging.BaggageWrappers",
        "ProcessName": "Data",
        "TaskID": "0729A43D3473F381",
        "ParentEventID": [
          "0576E2959B6845B1"
        ],
        "Label": "Forking current baggage with Baggage.fork()",
        "Title": "X-Trace Task",
        "Host": "pinky19.mpi-sws.org",
        "HRT": 27726525139738634,
        "Operation": "fork",
        "Timestamp": "1558510165080.407715",
        "TenantClass": 0,
        "Source": "PacketHeader.java:95",
        "ThreadID": 41693,
        "ThreadName": "",
        "EventID": "295AF4F262827AF0",
        "BaggageBytes": "[[248 5] [240 0] [0 7 41 164 61 52 115 243 129] [240 1] [0 5 118 226 149 155 104 69 177] [240 3] [0 2]]",
        "ProcessID": 2319
      },
      {
        "Cycles": 0,
        "Agent": "edu.brown.cs.systems.xtrace.logging.BaggageWrappers",
        "ProcessName": "Read",
        "TaskID": "0729A43D3473F381",
        "ParentEventID": [
          "295AF4F262827AF0",
          "5B91576C2605B89D"
        ],
        "Label": "Merged current baggage with other baggage",
        "Title": "X-Trace Task",
        "Host": "pinky19.mpi-sws.org",
        "HRT": 27726525139905013,
        "Operation": "join",
        "Timestamp": "1558510165080.549805",
        "TenantClass": 0,
        "Source": "PacketHeader.java:168",
        "ThreadID": 1,
        "ThreadName": "",
        "EventID": "F8AEF65C4A5A84C2",
        "ProcessID": 40748
      },
      {
        "Cycles": 0,
        "Agent": "edu.brown.cs.systems.xtrace.logging.BaggageWrappers",
        "ProcessName": "Read",
        "TaskID": "0729A43D3473F381",
        "ParentEventID": [
          "50568A6B4FC0FAF2",
          "B6165523300B81BC"
        ],
        "Label": "Merged current baggage with other baggage",
        "Title": "X-Trace Task",
        "Host": "pinky19.mpi-sws.org",
        "HRT": 27726525139778652,
        "Operation": "join",
        "Timestamp": "1558510165080.423340",
        "TenantClass": 0,
        "Source": "PacketHeader.java:168",
        "ThreadID": 1,
        "ThreadName": "",
        "EventID": "5B91576C2605B89D",
        "ProcessID": 40748
      },
      {
        "Cycles": 0,
        "Agent": "edu.brown.cs.systems.xtrace.logging.BaggageWrappers",
        "ProcessName": "Read",
        "TaskID": "0729A43D3473F381",
        "ParentEventID": [
          "F8AEF65C4A5A84C2"
        ],
        "Label": "Forking current baggage with Baggage.fork()",
        "Title": "X-Trace Task",
        "Host": "pinky19.mpi-sws.org",
        "HRT": 27726525139916765,
        "Operation": "fork",
        "Timestamp": "1558510165080.561523",
        "TenantClass": 0,
        "Source": "RemoteBlockReader2.java:361",
        "ThreadID": 1,
        "ThreadName": "",
        "EventID": "B99DB44C6913D5E8",
        "ProcessID": 40748
      },
      {
        "Cycles": 0,
        "Agent": "edu.brown.cs.systems.xtrace.logging.BaggageWrappers",
        "ProcessName": "Read",
        "TaskID": "0729A43D3473F381",
        "ParentEventID": [
          "B99DB44C6913D5E8"
        ],
        "Label": "Forking current baggage with Baggage.fork()",
        "Title": "X-Trace Task",
        "Host": "pinky19.mpi-sws.org",
        "HRT": 27726525140020794,
        "Operation": "fork",
        "Timestamp": "1558510165080.665527",
        "TenantClass": 0,
        "Source": "DataTransferProtoUtil.java:94",
        "ThreadID": 1,
        "ThreadName": "",
        "EventID": "92076DF05E4E8A24",
        "ProcessID": 40748
      },
      {
        "Cycles": 0,
        "Agent": "Execution-Sleep",
        "ProcessName": "Data",
        "TaskID": "0729A43D3473F381",
        "ParentEventID": [
          "295AF4F262827AF0"
        ],
        "Label": "waited",
        "Title": "X-Trace Task",
        "Host": "pinky19.mpi-sws.org",
        "Duration": "136109",
        "HRT": 27726525139970242,
        "Operation": "waited",
        "Timestamp": "1558510165080.639160",
        "TenantClass": 0,
        "Source": "SocketIOWithTimeout.java:335",
        "ThreadID": 41693,
        "ThreadName": "",
        "EventID": "D9D53D1FA6BC9A22",
        "BaggageBytes": "[[248 5] [240 0] [0 7 41 164 61 52 115 243 129] [240 1] [0 41 90 244 242 98 130 122 240] [240 3] [0 2]]",
        "ProcessID": 2319
      },
      {
        "Cycles": 0,
        "Agent": "edu.brown.cs.systems.xtrace.logging.BaggageWrappers",
        "ProcessName": "Data",
        "TaskID": "0729A43D3473F381",
        "ParentEventID": [
          "D9D53D1FA6BC9A22",
          "B99DB44C6913D5E8"
        ],
        "Label": "Merged current baggage with other baggage",
        "Title": "X-Trace Task",
        "Host": "pinky19.mpi-sws.org",
        "HRT": 27726525140030258,
        "Operation": "join",
        "Timestamp": "1558510165080.699219",
        "TenantClass": 0,
        "Source": "DataXceiver.java:574",
        "ThreadID": 41693,
        "ThreadName": "",
        "EventID": "504EBEC287DF1E4C",
        "BaggageBytes": "[[248 5] [240 0] [0 7 41 164 61 52 115 243 129] [240 1] [0 185 157 180 76 105 19 213 232] [0 217 213 61 31 166 188 154 34] [240 3] [0 2]]",
        "ProcessID": 2319
      },
      {
        "Cycles": 0,
        "Agent": "Execution-CPU",
        "ProcessName": "Data",
        "TaskID": "0729A43D3473F381",
        "ParentEventID": [
          "92076DF05E4E8A24"
        ],
        "Label": "set",
        "Title": "X-Trace Task",
        "Host": "pinky19.mpi-sws.org",
        "HRT": 27726525140111843,
        "Operation": "set",
        "Timestamp": "1558510165080.780762",
        "TenantClass": 0,
        "Source": "Receiver.java:117",
        "ThreadID": 41693,
        "ThreadName": "",
        "EventID": "2CDCAC31496CD517",
        "BaggageBytes": "[[248 5] [240 0] [0 7 41 164 61 52 115 243 129] [240 1] [0 146 7 109 240 94 78 138 36] [240 3] [0 2]]",
        "ProcessID": 2319
      },
      {
        "Cycles": 0,
        "Agent": "Execution-CPU",
        "ProcessName": "Data",
        "TaskID": "0729A43D3473F381",
        "ParentEventID": [
          "504EBEC287DF1E4C"
        ],
        "Label": "unset",
        "Title": "X-Trace Task",
        "Host": "pinky19.mpi-sws.org",
        "Duration": "640328",
        "HRT": 27726525140052015,
        "Operation": "unset",
        "Timestamp": "1558510165080.720947",
        "TenantClass": 0,
        "Source": "DataXceiver.java:261",
        "ThreadID": 41693,
        "ThreadName": "",
        "EventID": "9997B8A3ADE75FA5",
        "BaggageBytes": "[[248 5] [240 0] [0 7 41 164 61 52 115 243 129] [240 1] [0 80 78 190 194 135 223 30 76] [240 3] [0 2]]",
        "ProcessID": 2319
      },
      {
        "Cycles": 0,
        "Agent": "edu.brown.cs.systems.xtrace.logging.XTraceInit",
        "ProcessName": "Data",
        "TaskID": "0729A43D3473F381",
        "ParentEventID": [
          "2CDCAC31496CD517"
        ],
        "Label": "Thread.setName: DataXceiver for client DFSClient_NONMAPREDUCE_1816546669_1 at /139.19.171.63:34834 [Sending block BP-1633380353-139.19.171.63-1554193446451:blk_1073762179_21355]",
        "Title": "X-Trace Task",
        "Host": "pinky19.mpi-sws.org",
        "HRT": 27726525140148306,
        "Timestamp": "1558510165080.817383",
        "TenantClass": 0,
        "Source": "DataXceiver.java:168",
        "ThreadID": 41693,
        "ThreadName": "",
        "EventID": "A92D7780A9C41CB1",
        "BaggageBytes": "[[248 5] [240 0] [0 7 41 164 61 52 115 243 129] [240 1] [0 44 220 172 49 73 108 213 23] [240 3] [0 2]]",
        "ProcessID": 2319
      },
      {
        "Cycles": 0,
        "Agent": "edu.brown.cs.systems.xtrace.logging.BaggageWrappers",
        "ProcessName": "Data",
        "TaskID": "0729A43D3473F381",
        "ParentEventID": [
          "A92D7780A9C41CB1"
        ],
        "Label": "Forking current baggage with Baggage.fork()",
        "Title": "X-Trace Task",
        "Host": "pinky19.mpi-sws.org",
        "HRT": 27726525140232303,
        "Operation": "fork",
        "Timestamp": "1558510165080.901367",
        "TenantClass": 0,
        "Source": "DataXceiver.java:1257",
        "ThreadID": 41693,
        "ThreadName": "",
        "EventID": "BE071040E49DDD51",
        "BaggageBytes": "[[248 5] [240 0] [0 7 41 164 61 52 115 243 129] [240 1] [0 169 45 119 128 169 196 28 177] [240 3] [0 2]]",
        "ProcessID": 2319
      },
      {
        "Cycles": 0,
        "Agent": "edu.brown.cs.systems.xtrace.logging.BaggageWrappers",
        "ProcessName": "Data",
        "TaskID": "0729A43D3473F381",
        "ParentEventID": [
          "BE071040E49DDD51"
        ],
        "Label": "Forking current baggage with Baggage.fork()",
        "Title": "X-Trace Task",
        "Host": "pinky19.mpi-sws.org",
        "HRT": 27726525140296854,
        "Operation": "fork",
        "Timestamp": "1558510165080.965820",
        "TenantClass": 0,
        "Source": "PacketHeader.java:95",
        "ThreadID": 41693,
        "ThreadName": "",
        "EventID": "FD9A582A37CDD100",
        "BaggageBytes": "[[248 5] [240 0] [0 7 41 164 61 52 115 243 129] [240 1] [0 190 7 16 64 228 157 221 81] [240 3] [0 2]]",
        "ProcessID": 2319
      },
      {
        "Cycles": 0,
        "Agent": "Execution-Sleep",
        "ProcessName": "Data",
        "TaskID": "0729A43D3473F381",
        "ParentEventID": [
          "FD9A582A37CDD100"
        ],
        "Label": "waited",
        "Title": "X-Trace Task",
        "Host": "pinky19.mpi-sws.org",
        "Duration": "3811",
        "HRT": 27726525140363990,
        "Operation": "waited",
        "Timestamp": "1558510165081.032959",
        "TenantClass": 0,
        "Source": "SocketIOWithTimeout.java:335",
        "ThreadID": 41693,
        "ThreadName": "",
        "EventID": "7B0217F88201E6E3",
        "BaggageBytes": "[[248 5] [240 0] [0 7 41 164 61 52 115 243 129] [240 1] [0 253 154 88 42 55 205 209 0] [240 3] [0 2]]",
        "ProcessID": 2319
      },
      {
        "Cycles": 0,
        "Agent": "Execution-Sleep",
        "ProcessName": "Read",
        "TaskID": "0729A43D3473F381",
        "ParentEventID": [
          "92076DF05E4E8A24"
        ],
        "Label": "waited",
        "Title": "X-Trace Task",
        "Host": "pinky19.mpi-sws.org",
        "Duration": "179739",
        "HRT": 27726525140295283,
        "Operation": "waited",
        "Timestamp": "1558510165080.940186",
        "TenantClass": 0,
        "Source": "SocketIOWithTimeout.java:335",
        "ThreadID": 1,
        "ThreadName": "",
        "EventID": "79A71D769B0E38F4",
        "ProcessID": 40748
      },
      {
        "Cycles": 0,
        "Agent": "edu.brown.cs.systems.xtrace.logging.BaggageWrappers",
        "ProcessName": "Read",
        "TaskID": "0729A43D3473F381",
        "ParentEventID": [
          "BE071040E49DDD51",
          "79A71D769B0E38F4"
        ],
        "Label": "Merged current baggage with other baggage",
        "Title": "X-Trace Task",
        "Host": "pinky19.mpi-sws.org",
        "HRT": 27726525140372096,
        "Operation": "join",
        "Timestamp": "1558510165081.016846",
        "TenantClass": 0,
        "Source": "RemoteBlockReader2.java:429",
        "ThreadID": 1,
        "ThreadName": "",
        "EventID": "F071339A16F62887",
        "ProcessID": 40748
      },
      {
        "Cycles": 0,
        "Agent": "edu.brown.cs.systems.xtrace.logging.BaggageWrappers",
        "ProcessName": "Data",
        "TaskID": "0729A43D3473F381",
        "ParentEventID": [
          "7B0217F88201E6E3"
        ],
        "Label": "Forking current baggage with Baggage.fork()",
        "Title": "X-Trace Task",
        "Host": "pinky19.mpi-sws.org",
        "HRT": 27726525140453704,
        "Operation": "fork",
        "Timestamp": "1558510165081.122803",
        "TenantClass": 0,
        "Source": "PacketHeader.java:95",
        "ThreadID": 41693,
        "ThreadName": "",
        "EventID": "E6707C04DABE3CA6",
        "BaggageBytes": "[[248 5] [240 0] [0 7 41 164 61 52 115 243 129] [240 1] [0 123 2 23 248 130 1 230 227] [240 3] [0 2]]",
        "ProcessID": 2319
      },
      {
        "Cycles": 0,
        "Agent": "edu.brown.cs.systems.xtrace.logging.BaggageWrappers",
        "ProcessName": "Read",
        "TaskID": "0729A43D3473F381",
        "ParentEventID": [
          "F071339A16F62887",
          "FD9A582A37CDD100"
        ],
        "Label": "Merged current baggage with other baggage",
        "Title": "X-Trace Task",
        "Host": "pinky19.mpi-sws.org",
        "HRT": 27726525140466785,
        "Operation": "join",
        "Timestamp": "1558510165081.111572",
        "TenantClass": 0,
        "Source": "PacketHeader.java:168",
        "ThreadID": 1,
        "ThreadName": "",
        "EventID": "A3168731F786A4BF",
        "ProcessID": 40748
      },
      {
        "Cycles": 0,
        "Agent": "edu.brown.cs.systems.xtrace.logging.BaggageWrappers",
        "ProcessName": "Data",
        "TaskID": "0729A43D3473F381",
        "ParentEventID": [
          "CF5105DCA6E102D1"
        ],
        "Label": "Forking current baggage with Baggage.fork()",
        "Title": "X-Trace Task",
        "Host": "pinky19.mpi-sws.org",
        "HRT": 27726525140605727,
        "Operation": "fork",
        "Timestamp": "1558510165081.274658",
        "TenantClass": 0,
        "Source": "PacketHeader.java:95",
        "ThreadID": 41693,
        "ThreadName": "",
        "EventID": "3BA0D895E3F20465",
        "BaggageBytes": "[[248 5] [240 0] [0 7 41 164 61 52 115 243 129] [240 1] [0 207 81 5 220 166 225 2 209] [240 3] [0 2]]",
        "ProcessID": 2319
      },
      {
        "Cycles": 0,
        "Agent": "Execution-Sleep",
        "ProcessName": "Data",
        "TaskID": "0729A43D3473F381",
        "ParentEventID": [
          "E6707C04DABE3CA6"
        ],
        "Label": "waited",
        "Title": "X-Trace Task",
        "Host": "pinky19.mpi-sws.org",
        "Duration": "3721",
        "HRT": 27726525140515646,
        "Operation": "waited",
        "Timestamp": "1558510165081.184570",
        "TenantClass": 0,
        "Source": "SocketIOWithTimeout.java:335",
        "ThreadID": 41693,
        "ThreadName": "",
        "EventID": "CF5105DCA6E102D1",
        "BaggageBytes": "[[248 5] [240 0] [0 7 41 164 61 52 115 243 129] [240 1] [0 230 112 124 4 218 190 60 166] [240 3] [0 2]]",
        "ProcessID": 2319
      },
      {
        "Cycles": 0,
        "Agent": "Execution-CPU",
        "ProcessName": "Data",
        "TaskID": "0729A43D3473F381",
        "ParentEventID": [
          "3BA0D895E3F20465"
        ],
        "Label": "unset",
        "Title": "X-Trace Task",
        "Host": "pinky19.mpi-sws.org",
        "Duration": "635184",
        "HRT": 27726525140773738,
        "Operation": "unset",
        "Timestamp": "1558510165081.442627",
        "TenantClass": 0,
        "Source": "DataXceiver.java:261",
        "ThreadID": 41693,
        "ThreadName": "",
        "EventID": "C87D21B58839D1AF",
        "BaggageBytes": "[[248 5] [240 0] [0 7 41 164 61 52 115 243 129] [240 1] [0 59 160 216 149 227 242 4 101] [240 3] [0 2]]",
        "ProcessID": 2319
      },
      {
        "Cycles": 0,
        "Agent": "edu.brown.cs.systems.retro.benchmarks.hdfs_client.ReaderRandomSize",
        "ProcessName": "Read",
        "TaskID": "0729A43D3473F381",
        "ParentEventID": [
          "0"
        ],
        "Label": "Reading file",
        "Title": "X-Trace Task",
        "Host": "pinky19.mpi-sws.org",
        "HRT": 27726525138312860,
        "Timestamp": "1558510165078.957764",
        "TenantClass": 0,
        "ThreadID": 1,
        "ThreadName": "",
        "EventID": "DDAD25D6C58ED88D",
        "ProcessID": 40748,
        "Tag": [
          "/home/plascas/tracing-data/traceID-files/reader_small",
          "Read Size: 97280"
        ]
      }
    ]
  }
]