[
  {
    "id": "05379B28A104D1C6",
    "reports": [
      {
        "Cycles": 0,
        "Agent": "Execution-CPU",
        "ProcessName": "Read",
        "TaskID": "05379B28A104D1C6",
        "ParentEventID": [
          "632B9659D1257E49"
        ],
        "Label": "unset",
        "Title": "X-Trace Task",
        "Host": "pinky19.mpi-sws.org",
        "Duration": "21588859",
        "HRT": 25491791477907455,
        "Operation": "unset",
        "Timestamp": "1556275431418.066162",
        "TenantClass": 0,
        "Source": "Client.java:1027",
        "ThreadID": 1,
        "ThreadName": "",
        "EventID": "FC6CBF3F04A7057F",
        "ProcessID": 21035
      },
      {
        "Cycles": 0,
        "Agent": "Execution-CPU",
        "ProcessName": "Read",
        "TaskID": "05379B28A104D1C6",
        "ParentEventID": [
          "FC6CBF3F04A7057F"
        ],
        "Label": "set",
        "Title": "X-Trace Task",
        "Host": "pinky19.mpi-sws.org",
        "HRT": 25491791477957291,
        "Operation": "set",
        "Timestamp": "1556275431418.115967",
        "TenantClass": 0,
        "Source": "Client.java:1032",
        "ThreadID": 41,
        "ThreadName": "",
        "EventID": "AC07F0AF21B4393B",
        "ProcessID": 21035
      },
      {
        "Cycles": 0,
        "Agent": "org.apache.hadoop.ipc.ProtobufRpcEngine",
        "ProcessName": "Read",
        "TaskID": "05379B28A104D1C6",
        "ParentEventID": [
          "6331B4755DE7A331"
        ],
        "Label": "Invoking org.apache.hadoop.hdfs.protocol.ClientProtocol.getBlockLocations",
        "Title": "X-Trace Task",
        "Host": "pinky19.mpi-sws.org",
        "HRT": 25491791477882550,
        "Timestamp": "1556275431418.041260",
        "TenantClass": 0,
        "Source": "ProtobufRpcEngine.java:228",
        "ThreadID": 1,
        "ThreadName": "",
        "EventID": "632B9659D1257E49",
        "ProcessID": 21035
      },
      {
        "Cycles": 0,
        "Agent": "edu.brown.cs.systems.retro.benchmarks.hdfs_client.Reader",
        "ProcessName": "Read",
        "TaskID": "05379B28A104D1C6",
        "ParentEventID": [
          "0A7E92CF38458B61"
        ],
        "Label": "Reading file",
        "Title": "X-Trace Task",
        "Host": "pinky19.mpi-sws.org",
        "HRT": 25491791477850700,
        "Timestamp": "1556275431418.009277",
        "TenantClass": 0,
        "ThreadID": 1,
        "ThreadName": "",
        "EventID": "6331B4755DE7A331",
        "ProcessID": 21035
      },
      {
        "Cycles": 0,
        "Agent": "edu.brown.cs.systems.xtrace.logging.BaggageWrappers",
        "ProcessName": "Read",
        "TaskID": "05379B28A104D1C6",
        "ParentEventID": [
          "AC07F0AF21B4393B"
        ],
        "Label": "Forking current baggage with Baggage.fork()",
        "Title": "X-Trace Task",
        "Host": "pinky19.mpi-sws.org",
        "HRT": 25491791477976504,
        "Operation": "fork",
        "Timestamp": "1556275431418.135254",
        "TenantClass": 0,
        "Source": "Client.java:1043",
        "ThreadID": 41,
        "ThreadName": "",
        "EventID": "64EF60337F0607E7",
        "ProcessID": 21035
      },
      {
        "Cycles": 0,
        "Agent": "Execution-CPU",
        "ProcessName": "Read",
        "TaskID": "05379B28A104D1C6",
        "ParentEventID": [
          "64EF60337F0607E7"
        ],
        "Label": "unset",
        "Title": "X-Trace Task",
        "Host": "pinky19.mpi-sws.org",
        "Duration": "68299",
        "HRT": 25491791478043864,
        "Operation": "unset",
        "Timestamp": "1556275431418.202637",
        "TenantClass": 0,
        "Source": "Client.java:1062",
        "ThreadID": 41,
        "ThreadName": "",
        "EventID": "73B95B6810FA98C6",
        "ProcessID": 21035
      },
      {
        "Cycles": 0,
        "Agent": "Execution-CPU",
        "ProcessName": "Name",
        "TaskID": "05379B28A104D1C6",
        "ParentEventID": [
          "64EF60337F0607E7"
        ],
        "Label": "set",
        "Title": "X-Trace Task",
        "Host": "pinky19.mpi-sws.org",
        "HRT": 25491791478119960,
        "Operation": "set",
        "Timestamp": "1556275431418.301025",
        "TenantClass": 0,
        "Source": "Server.java:1840",
        "ThreadID": 48,
        "ThreadName": "",
        "EventID": "51953D01A0558AB7",
        "BaggageBytes": "[[248 5] [240 0] [0 5 55 155 40 161 4 209 198] [240 1] [0 100 239 96 51 127 6 7 231] [240 3] [0 2]]",
        "ProcessID": 2171
      },
      {
        "Cycles": 0,
        "Agent": "Execution-CPU",
        "ProcessName": "Read",
        "TaskID": "05379B28A104D1C6",
        "ParentEventID": [
          "73B95B6810FA98C6"
        ],
        "Label": "set",
        "Title": "X-Trace Task",
        "Host": "pinky19.mpi-sws.org",
        "HRT": 25491791478066282,
        "Operation": "set",
        "Timestamp": "1556275431418.224854",
        "TenantClass": 0,
        "Source": "Client.java:1104",
        "ThreadID": 1,
        "ThreadName": "",
        "EventID": "CF6C390AB0004631",
        "ProcessID": 21035
      },
      {
        "Cycles": 0,
        "Agent": "edu.brown.cs.systems.xtrace.logging.BaggageWrappers",
        "ProcessName": "Name",
        "TaskID": "05379B28A104D1C6",
        "ParentEventID": [
          "51953D01A0558AB7"
        ],
        "Label": "Forking current baggage with Baggage.fork()",
        "Title": "X-Trace Task",
        "Host": "pinky19.mpi-sws.org",
        "HRT": 25491791478151270,
        "Operation": "fork",
        "Timestamp": "1556275431418.332520",
        "TenantClass": 0,
        "Source": "Server.java:550",
        "ThreadID": 48,
        "ThreadName": "",
        "EventID": "C71FD484D98BA4C8",
        "BaggageBytes": "[[248 5] [240 0] [0 5 55 155 40 161 4 209 198] [240 1] [0 81 149 61 1 160 85 138 183] [240 3] [0 2]]",
        "ProcessID": 2171
      },
      {
        "Cycles": 0,
        "Agent": "Execution-CPU",
        "ProcessName": "Name",
        "TaskID": "05379B28A104D1C6",
        "ParentEventID": [
          "C71FD484D98BA4C8"
        ],
        "Label": "set",
        "Title": "X-Trace Task",
        "Host": "pinky19.mpi-sws.org",
        "HRT": 25491791478181665,
        "Operation": "set",
        "Timestamp": "1556275431418.362793",
        "TenantClass": 0,
        "Source": "Server.java:2071",
        "ThreadID": 56,
        "ThreadName": "",
        "EventID": "0A70FC096A5EDF5E",
        "BaggageBytes": "[[248 5] [240 0] [0 5 55 155 40 161 4 209 198] [240 1] [0 199 31 212 132 217 139 164 200] [240 3] [0 2]]",
        "ProcessID": 2171
      },
      {
        "Cycles": 0,
        "Agent": "Execution-CPU",
        "ProcessName": "Name",
        "TaskID": "05379B28A104D1C6",
        "ParentEventID": [
          "C71FD484D98BA4C8"
        ],
        "Label": "unset",
        "Title": "X-Trace Task",
        "Host": "pinky19.mpi-sws.org",
        "Duration": "23936",
        "HRT": 25491791478171664,
        "Operation": "unset",
        "Timestamp": "1556275431418.352783",
        "TenantClass": 0,
        "Source": "Server.java:1828",
        "ThreadID": 48,
        "ThreadName": "",
        "EventID": "C7C903743CA80C4B",
        "BaggageBytes": "[[248 5] [240 0] [0 5 55 155 40 161 4 209 198] [240 1] [0 199 31 212 132 217 139 164 200] [240 3] [0 2]]",
        "ProcessID": 2171
      },
      {
        "Cycles": 0,
        "Agent": "org.apache.hadoop.ipc.Server",
        "ProcessName": "Name",
        "TaskID": "05379B28A104D1C6",
        "ParentEventID": [
          "0A70FC096A5EDF5E"
        ],
        "Label": "getBlockLocations in org.apache.hadoop.hdfs.protocol.ClientProtocol",
        "Title": "X-Trace Task",
        "Host": "pinky19.mpi-sws.org",
        "HRT": 25491791478216879,
        "Timestamp": "1556275431418.397949",
        "TenantClass": 0,
        "Source": "ProtobufRpcEngine.java:601",
        "ThreadID": 56,
        "ThreadName": "",
        "EventID": "1F0E82B73072E1AB",
        "BaggageBytes": "[[248 5] [240 0] [0 5 55 155 40 161 4 209 198] [240 1] [0 10 112 252 9 106 94 223 94] [240 3] [0 2]]",
        "ProcessID": 2171
      },
      {
        "Cycles": 0,
        "Agent": "edu.brown.cs.systems.xtrace.logging.BaggageWrappers",
        "ProcessName": "Name",
        "TaskID": "05379B28A104D1C6",
        "ParentEventID": [
          "DDCA2C20579BA52D"
        ],
        "Label": "Forking current baggage with Baggage.fork()",
        "Title": "X-Trace Task",
        "Host": "pinky19.mpi-sws.org",
        "HRT": 25491791478334274,
        "Operation": "fork",
        "Timestamp": "1556275431418.515381",
        "TenantClass": 0,
        "Source": "Server.java:2398",
        "ThreadID": 56,
        "ThreadName": "",
        "EventID": "BFF2209761B00B1E",
        "BaggageBytes": "[[248 5] [240 0] [0 5 55 155 40 161 4 209 198] [240 1] [0 221 202 44 32 87 155 165 45] [240 3] [0 2]]",
        "ProcessID": 2171
      },
      {
        "Cycles": 0,
        "Agent": "org.apache.hadoop.hdfs.server.namenode.FSNamesystem.audit",
        "ProcessName": "Name",
        "TaskID": "05379B28A104D1C6",
        "ParentEventID": [
          "1F0E82B73072E1AB"
        ],
        "Label": "allowed=true\tugi=plascas (auth:SIMPLE)\tip=/139.19.171.63\tcmd=open\tsrc=/ds/WMNyIMMk5YMrdFSv\tdst=null\tperm=null\tproto=rpc",
        "Title": "X-Trace Task",
        "Host": "pinky19.mpi-sws.org",
        "HRT": 25491791478263082,
        "Timestamp": "1556275431418.444336",
        "TenantClass": 0,
        "Source": "FSNamesystem.java:8313",
        "ThreadID": 56,
        "ThreadName": "",
        "EventID": "DDCA2C20579BA52D",
        "BaggageBytes": "[[248 5] [240 0] [0 5 55 155 40 161 4 209 198] [240 1] [0 31 14 130 183 48 114 225 171] [240 3] [0 2]]",
        "ProcessID": 2171
      },
      {
        "Cycles": 0,
        "Agent": "Execution-CPU",
        "ProcessName": "Name",
        "TaskID": "05379B28A104D1C6",
        "ParentEventID": [
          "BFF2209761B00B1E"
        ],
        "Label": "unset",
        "Title": "X-Trace Task",
        "Host": "pinky19.mpi-sws.org",
        "Duration": "245382",
        "HRT": 25491791478449851,
        "Operation": "unset",
        "Timestamp": "1556275431418.631104",
        "TenantClass": 0,
        "Source": "Server.java:1058",
        "ThreadID": 56,
        "ThreadName": "",
        "EventID": "4554A56E912A5E0C",
        "BaggageBytes": "[[248 5] [240 0] [0 5 55 155 40 161 4 209 198] [240 1] [0 191 242 32 151 97 176 11 30] [240 3] [0 2]]",
        "ProcessID": 2171
      },
      {
        "Cycles": 0,
        "Agent": "Execution-CPU",
        "ProcessName": "Read",
        "TaskID": "05379B28A104D1C6",
        "ParentEventID": [
          "BFF2209761B00B1E"
        ],
        "Label": "set",
        "Title": "X-Trace Task",
        "Host": "pinky19.mpi-sws.org",
        "HRT": 25491791478522372,
        "Operation": "set",
        "Timestamp": "1556275431418.681152",
        "TenantClass": 0,
        "Source": "Client.java:302",
        "ThreadID": 37,
        "ThreadName": "",
        "EventID": "FFAAE976CB28CD8F",
        "ProcessID": 21035
      },
      {
        "Cycles": 0,
        "Agent": "Execution-CPU",
        "ProcessName": "Read",
        "TaskID": "05379B28A104D1C6",
        "ParentEventID": [
          "FFAAE976CB28CD8F"
        ],
        "Label": "unset",
        "Title": "X-Trace Task",
        "Host": "pinky19.mpi-sws.org",
        "Duration": "10404",
        "HRT": 25491791478549574,
        "Operation": "unset",
        "Timestamp": "1556275431418.708252",
        "TenantClass": 0,
        "Source": "Client.java:1168",
        "ThreadID": 37,
        "ThreadName": "",
        "EventID": "A91D033071339889",
        "ProcessID": 21035
      },
      {
        "Cycles": 0,
        "Agent": "edu.brown.cs.systems.xtrace.logging.BaggageWrappers",
        "ProcessName": "Read",
        "TaskID": "05379B28A104D1C6",
        "ParentEventID": [
          "A91D033071339889",
          "15755C69D24DC240"
        ],
        "Label": "Merged current baggage with other baggage",
        "Title": "X-Trace Task",
        "Host": "pinky19.mpi-sws.org",
        "HRT": 25491791478587620,
        "Operation": "join",
        "Timestamp": "1556275431418.746338",
        "TenantClass": 0,
        "Source": "Client.java:1545",
        "ThreadID": 1,
        "ThreadName": "",
        "EventID": "126230A763946C95",
        "ProcessID": 21035
      },
      {
        "Cycles": 0,
        "Agent": "Execution-Sleep",
        "ProcessName": "Read",
        "TaskID": "05379B28A104D1C6",
        "ParentEventID": [
          "CF6C390AB0004631"
        ],
        "Label": "waited",
        "Title": "X-Trace Task",
        "Host": "pinky19.mpi-sws.org",
        "Duration": "493741",
        "HRT": 25491791478568774,
        "Operation": "waited",
        "Timestamp": "1556275431418.727539",
        "TenantClass": 0,
        "Source": "Client.java:1537",
        "ThreadID": 1,
        "ThreadName": "",
        "EventID": "15755C69D24DC240",
        "ProcessID": 21035
      },
      {
        "Cycles": 0,
        "Agent": "edu.brown.cs.systems.xtrace.logging.BaggageWrappers",
        "ProcessName": "Read",
        "TaskID": "05379B28A104D1C6",
        "ParentEventID": [
          "562109EF1B4A6CC0"
        ],
        "Label": "Forking current baggage with Baggage.fork()",
        "Title": "X-Trace Task",
        "Host": "pinky19.mpi-sws.org",
        "HRT": 25491791478698886,
        "Operation": "fork",
        "Timestamp": "1556275431418.857666",
        "TenantClass": 0,
        "Source": "DataTransferProtoUtil.java:94",
        "ThreadID": 1,
        "ThreadName": "",
        "EventID": "C141372B53E61BC9",
        "ProcessID": 21035
      },
      {
        "Cycles": 0,
        "Agent": "org.apache.hadoop.ipc.ProtobufRpcEngine",
        "ProcessName": "Read",
        "TaskID": "05379B28A104D1C6",
        "ParentEventID": [
          "126230A763946C95"
        ],
        "Label": "org.apache.hadoop.hdfs.protocol.ClientProtocol.getBlockLocations completed",
        "Title": "X-Trace Task",
        "Host": "pinky19.mpi-sws.org",
        "HRT": 25491791478633869,
        "Timestamp": "1556275431418.792480",
        "TenantClass": 0,
        "Source": "ProtobufRpcEngine.java:275",
        "ThreadID": 1,
        "ThreadName": "",
        "EventID": "562109EF1B4A6CC0",
        "ProcessID": 21035
      },
      {
        "Cycles": 0,
        "Agent": "Execution-CPU",
        "ProcessName": "Data",
        "TaskID": "05379B28A104D1C6",
        "ParentEventID": [
          "C141372B53E61BC9"
        ],
        "Label": "set",
        "Title": "X-Trace Task",
        "Host": "pinky19.mpi-sws.org",
        "HRT": 25491791478879007,
        "Operation": "set",
        "Timestamp": "1556275431419.027100",
        "TenantClass": 0,
        "Source": "Receiver.java:117",
        "ThreadID": 9602,
        "ThreadName": "",
        "EventID": "BCEE782F3F230476",
        "BaggageBytes": "[[248 5] [240 0] [0 5 55 155 40 161 4 209 198] [240 1] [0 193 65 55 43 83 230 27 201] [240 3] [0 2]]",
        "ProcessID": 2319
      },
      {
        "Cycles": 0,
        "Agent": "edu.brown.cs.systems.xtrace.logging.XTraceInit",
        "ProcessName": "Data",
        "TaskID": "05379B28A104D1C6",
        "ParentEventID": [
          "BCEE782F3F230476"
        ],
        "Label": "Thread.setName: DataXceiver for client DFSClient_NONMAPREDUCE_1377588049_1 at /139.19.171.63:36074 [Sending block BP-1633380353-139.19.171.63-1554193446451:blk_1073757611_16787]",
        "Title": "X-Trace Task",
        "Host": "pinky19.mpi-sws.org",
        "HRT": 25491791478918300,
        "Timestamp": "1556275431419.066406",
        "TenantClass": 0,
        "Source": "DataXceiver.java:168",
        "ThreadID": 9602,
        "ThreadName": "",
        "EventID": "CE56E6068490B0C3",
        "BaggageBytes": "[[248 5] [240 0] [0 5 55 155 40 161 4 209 198] [240 1] [0 188 238 120 47 63 35 4 118] [240 3] [0 2]]",
        "ProcessID": 2319
      },
      {
        "Cycles": 0,
        "Agent": "Execution-Sleep",
        "ProcessName": "Read",
        "TaskID": "05379B28A104D1C6",
        "ParentEventID": [
          "C141372B53E61BC9"
        ],
        "Label": "waited",
        "Title": "X-Trace Task",
        "Host": "pinky19.mpi-sws.org",
        "Duration": "271050",
        "HRT": 25491791479066117,
        "Operation": "waited",
        "Timestamp": "1556275431419.224854",
        "TenantClass": 0,
        "Source": "SocketIOWithTimeout.java:335",
        "ThreadID": 1,
        "ThreadName": "",
        "EventID": "9062159B660C7EA4",
        "ProcessID": 21035
      },
      {
        "Cycles": 0,
        "Agent": "edu.brown.cs.systems.xtrace.logging.BaggageWrappers",
        "ProcessName": "Data",
        "TaskID": "05379B28A104D1C6",
        "ParentEventID": [
          "CE56E6068490B0C3"
        ],
        "Label": "Forking current baggage with Baggage.fork()",
        "Title": "X-Trace Task",
        "Host": "pinky19.mpi-sws.org",
        "HRT": 25491791479003709,
        "Operation": "fork",
        "Timestamp": "1556275431419.151611",
        "TenantClass": 0,
        "Source": "DataXceiver.java:1257",
        "ThreadID": 9602,
        "ThreadName": "",
        "EventID": "7371C0A44B55AA13",
        "BaggageBytes": "[[248 5] [240 0] [0 5 55 155 40 161 4 209 198] [240 1] [0 206 86 230 6 132 144 176 195] [240 3] [0 2]]",
        "ProcessID": 2319
      },
      {
        "Cycles": 0,
        "Agent": "edu.brown.cs.systems.xtrace.logging.BaggageWrappers",
        "ProcessName": "Data",
        "TaskID": "05379B28A104D1C6",
        "ParentEventID": [
          "7371C0A44B55AA13"
        ],
        "Label": "Forking current baggage with Baggage.fork()",
        "Title": "X-Trace Task",
        "Host": "pinky19.mpi-sws.org",
        "HRT": 25491791479068271,
        "Operation": "fork",
        "Timestamp": "1556275431419.216309",
        "TenantClass": 0,
        "Source": "PacketHeader.java:95",
        "ThreadID": 9602,
        "ThreadName": "",
        "EventID": "A4D7594A8466BBC5",
        "BaggageBytes": "[[248 5] [240 0] [0 5 55 155 40 161 4 209 198] [240 1] [0 115 113 192 164 75 85 170 19] [240 3] [0 2]]",
        "ProcessID": 2319
      },
      {
        "Cycles": 0,
        "Agent": "edu.brown.cs.systems.xtrace.logging.BaggageWrappers",
        "ProcessName": "Read",
        "TaskID": "05379B28A104D1C6",
        "ParentEventID": [
          "7371C0A44B55AA13",
          "9062159B660C7EA4"
        ],
        "Label": "Merged current baggage with other baggage",
        "Title": "X-Trace Task",
        "Host": "pinky19.mpi-sws.org",
        "HRT": 25491791479133729,
        "Operation": "join",
        "Timestamp": "1556275431419.292480",
        "TenantClass": 0,
        "Source": "RemoteBlockReader2.java:429",
        "ThreadID": 1,
        "ThreadName": "",
        "EventID": "8FD9E9957131D2F9",
        "ProcessID": 21035
      },
      {
        "Cycles": 0,
        "Agent": "edu.brown.cs.systems.xtrace.logging.BaggageWrappers",
        "ProcessName": "Data",
        "TaskID": "05379B28A104D1C6",
        "ParentEventID": [
          "19B31118388DBD79"
        ],
        "Label": "Forking current baggage with Baggage.fork()",
        "Title": "X-Trace Task",
        "Host": "pinky19.mpi-sws.org",
        "HRT": 25491791479187180,
        "Operation": "fork",
        "Timestamp": "1556275431419.335205",
        "TenantClass": 0,
        "Source": "PacketHeader.java:95",
        "ThreadID": 9602,
        "ThreadName": "",
        "EventID": "26B5DC0EBE189D80",
        "BaggageBytes": "[[248 5] [240 0] [0 5 55 155 40 161 4 209 198] [240 1] [0 25 179 17 24 56 141 189 121] [240 3] [0 2]]",
        "ProcessID": 2319
      },
      {
        "Cycles": 0,
        "Agent": "Execution-Sleep",
        "ProcessName": "Data",
        "TaskID": "05379B28A104D1C6",
        "ParentEventID": [
          "A4D7594A8466BBC5"
        ],
        "Label": "waited",
        "Title": "X-Trace Task",
        "Host": "pinky19.mpi-sws.org",
        "Duration": "4148",
        "HRT": 25491791479125816,
        "Operation": "waited",
        "Timestamp": "1556275431419.273926",
        "TenantClass": 0,
        "Source": "SocketIOWithTimeout.java:335",
        "ThreadID": 9602,
        "ThreadName": "",
        "EventID": "19B31118388DBD79",
        "BaggageBytes": "[[248 5] [240 0] [0 5 55 155 40 161 4 209 198] [240 1] [0 164 215 89 74 132 102 187 197] [240 3] [0 2]]",
        "ProcessID": 2319
      },
      {
        "Cycles": 0,
        "Agent": "edu.brown.cs.systems.xtrace.logging.BaggageWrappers",
        "ProcessName": "Read",
        "TaskID": "05379B28A104D1C6",
        "ParentEventID": [
          "A4D7594A8466BBC5",
          "8FD9E9957131D2F9"
        ],
        "Label": "Merged current baggage with other baggage",
        "Title": "X-Trace Task",
        "Host": "pinky19.mpi-sws.org",
        "HRT": 25491791479208649,
        "Operation": "join",
        "Timestamp": "1556275431419.367432",
        "TenantClass": 0,
        "Source": "PacketHeader.java:168",
        "ThreadID": 1,
        "ThreadName": "",
        "EventID": "99B802E620DF28E4",
        "ProcessID": 21035
      },
      {
        "Cycles": 0,
        "Agent": "edu.brown.cs.systems.xtrace.logging.BaggageWrappers",
        "ProcessName": "Read",
        "TaskID": "05379B28A104D1C6",
        "ParentEventID": [
          "26B5DC0EBE189D80",
          "99B802E620DF28E4"
        ],
        "Label": "Merged current baggage with other baggage",
        "Title": "X-Trace Task",
        "Host": "pinky19.mpi-sws.org",
        "HRT": 25491791479266919,
        "Operation": "join",
        "Timestamp": "1556275431419.425537",
        "TenantClass": 0,
        "Source": "PacketHeader.java:168",
        "ThreadID": 1,
        "ThreadName": "",
        "EventID": "578D8383A40BDF2F",
        "ProcessID": 21035
      },
      {
        "Cycles": 0,
        "Agent": "Execution-Sleep",
        "ProcessName": "Data",
        "TaskID": "05379B28A104D1C6",
        "ParentEventID": [
          "26B5DC0EBE189D80"
        ],
        "Label": "waited",
        "Title": "X-Trace Task",
        "Host": "pinky19.mpi-sws.org",
        "Duration": "55760",
        "HRT": 25491791479324668,
        "Operation": "waited",
        "Timestamp": "1556275431419.472656",
        "TenantClass": 0,
        "Source": "SocketIOWithTimeout.java:335",
        "ThreadID": 9602,
        "ThreadName": "",
        "EventID": "DC6855DE8318E06F",
        "BaggageBytes": "[[248 5] [240 0] [0 5 55 155 40 161 4 209 198] [240 1] [0 38 181 220 14 190 24 157 128] [240 3] [0 2]]",
        "ProcessID": 2319
      },
      {
        "Cycles": 0,
        "Agent": "edu.brown.cs.systems.xtrace.logging.BaggageWrappers",
        "ProcessName": "Data",
        "TaskID": "05379B28A104D1C6",
        "ParentEventID": [
          "DC6855DE8318E06F",
          "6565E379C857E6D1"
        ],
        "Label": "Merged current baggage with other baggage",
        "Title": "X-Trace Task",
        "Host": "pinky19.mpi-sws.org",
        "HRT": 25491791479377690,
        "Operation": "join",
        "Timestamp": "1556275431419.525635",
        "TenantClass": 0,
        "Source": "DataXceiver.java:574",
        "ThreadID": 9602,
        "ThreadName": "",
        "EventID": "3BC128D80056F230",
        "BaggageBytes": "[[248 5] [240 0] [0 5 55 155 40 161 4 209 198] [240 1] [0 220 104 85 222 131 24 224 111] [0 101 101 227 121 200 87 230 209] [240 3] [0 2]]",
        "ProcessID": 2319
      },
      {
        "Cycles": 0,
        "Agent": "edu.brown.cs.systems.xtrace.logging.BaggageWrappers",
        "ProcessName": "Read",
        "TaskID": "05379B28A104D1C6",
        "ParentEventID": [
          "578D8383A40BDF2F"
        ],
        "Label": "Forking current baggage with Baggage.fork()",
        "Title": "X-Trace Task",
        "Host": "pinky19.mpi-sws.org",
        "HRT": 25491791479276665,
        "Operation": "fork",
        "Timestamp": "1556275431419.435303",
        "TenantClass": 0,
        "Source": "RemoteBlockReader2.java:361",
        "ThreadID": 1,
        "ThreadName": "",
        "EventID": "6565E379C857E6D1",
        "ProcessID": 21035
      },
      {
        "Cycles": 0,
        "Agent": "Execution-CPU",
        "ProcessName": "Data",
        "TaskID": "05379B28A104D1C6",
        "ParentEventID": [
          "3BC128D80056F230"
        ],
        "Label": "unset",
        "Title": "X-Trace Task",
        "Host": "pinky19.mpi-sws.org",
        "Duration": "493616",
        "HRT": 25491791479398027,
        "Operation": "unset",
        "Timestamp": "1556275431419.546143",
        "TenantClass": 0,
        "Source": "DataXceiver.java:261",
        "ThreadID": 9602,
        "ThreadName": "",
        "EventID": "DB56C1AF3414F20F",
        "BaggageBytes": "[[248 5] [240 0] [0 5 55 155 40 161 4 209 198] [240 1] [0 59 193 40 216 0 86 242 48] [240 3] [0 2]]",
        "ProcessID": 2319
      },
      {
        "Cycles": 0,
        "Agent": "edu.brown.cs.systems.retro.benchmarks.hdfs_client.Reader",
        "ProcessName": "Read",
        "TaskID": "05379B28A104D1C6",
        "ParentEventID": [
          "0"
        ],
        "Label": "Reading file",
        "Title": "X-Trace Task",
        "Host": "pinky19.mpi-sws.org",
        "HRT": 25491791477838797,
        "Timestamp": "1556275431417.997559",
        "TenantClass": 0,
        "ThreadID": 1,
        "ThreadName": "",
        "EventID": "0A7E92CF38458B61",
        "ProcessID": 21035,
        "Tag": [
          "reader_1kb",
          "Read Size: 1024"
        ]
      }
    ]
  }
]