[
  {
    "id": "1251CFB2D82DB911",
    "reports": [
      {
        "Cycles": 0,
        "Agent": "Execution-CPU",
        "ProcessName": "Read",
        "TaskID": "1251CFB2D82DB911",
        "ParentEventID": [
          "83CD1323EA8CCE39"
        ],
        "Label": "unset",
        "Title": "X-Trace Task",
        "Host": "pinky19.mpi-sws.org",
        "Duration": "22060061",
        "HRT": 25491846149643041,
        "Operation": "unset",
        "Timestamp": "1556275486089.988037",
        "TenantClass": 0,
        "Source": "Client.java:1027",
        "ThreadID": 1,
        "ThreadName": "",
        "EventID": "9F37A2A97FB4D34E",
        "ProcessID": 21035
      },
      {
        "Cycles": 0,
        "Agent": "org.apache.hadoop.ipc.ProtobufRpcEngine",
        "ProcessName": "Read",
        "TaskID": "1251CFB2D82DB911",
        "ParentEventID": [
          "AADADE4C5F79C63B"
        ],
        "Label": "Invoking org.apache.hadoop.hdfs.protocol.ClientProtocol.getBlockLocations",
        "Title": "X-Trace Task",
        "Host": "pinky19.mpi-sws.org",
        "HRT": 25491846149612725,
        "Timestamp": "1556275486089.957764",
        "TenantClass": 0,
        "Source": "ProtobufRpcEngine.java:228",
        "ThreadID": 1,
        "ThreadName": "",
        "EventID": "83CD1323EA8CCE39",
        "ProcessID": 21035
      },
      {
        "Cycles": 0,
        "Agent": "edu.brown.cs.systems.retro.benchmarks.hdfs_client.Reader",
        "ProcessName": "Read",
        "TaskID": "1251CFB2D82DB911",
        "ParentEventID": [
          "A34E8F34DF361F5D"
        ],
        "Label": "Reading file",
        "Title": "X-Trace Task",
        "Host": "pinky19.mpi-sws.org",
        "HRT": 25491846149575141,
        "Timestamp": "1556275486089.920166",
        "TenantClass": 0,
        "ThreadID": 1,
        "ThreadName": "",
        "EventID": "AADADE4C5F79C63B",
        "ProcessID": 21035
      },
      {
        "Cycles": 0,
        "Agent": "edu.brown.cs.systems.xtrace.logging.BaggageWrappers",
        "ProcessName": "Read",
        "TaskID": "1251CFB2D82DB911",
        "ParentEventID": [
          "430EB237972C8B13"
        ],
        "Label": "Forking current baggage with Baggage.fork()",
        "Title": "X-Trace Task",
        "Host": "pinky19.mpi-sws.org",
        "HRT": 25491846149715379,
        "Operation": "fork",
        "Timestamp": "1556275486090.060547",
        "TenantClass": 0,
        "Source": "Client.java:1043",
        "ThreadID": 41,
        "ThreadName": "",
        "EventID": "34FD95A6D39A2E56",
        "ProcessID": 21035
      },
      {
        "Cycles": 0,
        "Agent": "Execution-CPU",
        "ProcessName": "Read",
        "TaskID": "1251CFB2D82DB911",
        "ParentEventID": [
          "34FD95A6D39A2E56"
        ],
        "Label": "unset",
        "Title": "X-Trace Task",
        "Host": "pinky19.mpi-sws.org",
        "Duration": "66374",
        "HRT": 25491846149780761,
        "Operation": "unset",
        "Timestamp": "1556275486090.125732",
        "TenantClass": 0,
        "Source": "Client.java:1062",
        "ThreadID": 41,
        "ThreadName": "",
        "EventID": "FC800B213B2C473B",
        "ProcessID": 21035
      },
      {
        "Cycles": 0,
        "Agent": "Execution-CPU",
        "ProcessName": "Read",
        "TaskID": "1251CFB2D82DB911",
        "ParentEventID": [
          "9F37A2A97FB4D34E"
        ],
        "Label": "set",
        "Title": "X-Trace Task",
        "Host": "pinky19.mpi-sws.org",
        "HRT": 25491846149696260,
        "Operation": "set",
        "Timestamp": "1556275486090.041260",
        "TenantClass": 0,
        "Source": "Client.java:1032",
        "ThreadID": 41,
        "ThreadName": "",
        "EventID": "430EB237972C8B13",
        "ProcessID": 21035
      },
      {
        "Cycles": 0,
        "Agent": "Execution-CPU",
        "ProcessName": "Read",
        "TaskID": "1251CFB2D82DB911",
        "ParentEventID": [
          "FC800B213B2C473B"
        ],
        "Label": "set",
        "Title": "X-Trace Task",
        "Host": "pinky19.mpi-sws.org",
        "HRT": 25491846149802852,
        "Operation": "set",
        "Timestamp": "1556275486090.147949",
        "TenantClass": 0,
        "Source": "Client.java:1104",
        "ThreadID": 1,
        "ThreadName": "",
        "EventID": "548E286A0FC3927A",
        "ProcessID": 21035
      },
      {
        "Cycles": 0,
        "Agent": "edu.brown.cs.systems.xtrace.logging.BaggageWrappers",
        "ProcessName": "Name",
        "TaskID": "1251CFB2D82DB911",
        "ParentEventID": [
          "CBFAC68716757253"
        ],
        "Label": "Forking current baggage with Baggage.fork()",
        "Title": "X-Trace Task",
        "Host": "pinky19.mpi-sws.org",
        "HRT": 25491846149860894,
        "Operation": "fork",
        "Timestamp": "1556275486090.221680",
        "TenantClass": 0,
        "Source": "Server.java:550",
        "ThreadID": 48,
        "ThreadName": "",
        "EventID": "391EEED123964F43",
        "BaggageBytes": "[[248 5] [240 0] [0 18 81 207 178 216 45 185 17] [240 1] [0 203 250 198 135 22 117 114 83] [240 3] [0 2]]",
        "ProcessID": 2171
      },
      {
        "Cycles": 0,
        "Agent": "Execution-CPU",
        "ProcessName": "Name",
        "TaskID": "1251CFB2D82DB911",
        "ParentEventID": [
          "391EEED123964F43"
        ],
        "Label": "unset",
        "Title": "X-Trace Task",
        "Host": "pinky19.mpi-sws.org",
        "Duration": "37027",
        "HRT": 25491846149894292,
        "Operation": "unset",
        "Timestamp": "1556275486090.255127",
        "TenantClass": 0,
        "Source": "Server.java:1828",
        "ThreadID": 48,
        "ThreadName": "",
        "EventID": "564A4A1399B90A93",
        "BaggageBytes": "[[248 5] [240 0] [0 18 81 207 178 216 45 185 17] [240 1] [0 57 30 238 209 35 150 79 67] [240 3] [0 2]]",
        "ProcessID": 2171
      },
      {
        "Cycles": 0,
        "Agent": "Execution-CPU",
        "ProcessName": "Name",
        "TaskID": "1251CFB2D82DB911",
        "ParentEventID": [
          "34FD95A6D39A2E56"
        ],
        "Label": "set",
        "Title": "X-Trace Task",
        "Host": "pinky19.mpi-sws.org",
        "HRT": 25491846149834516,
        "Operation": "set",
        "Timestamp": "1556275486090.195312",
        "TenantClass": 0,
        "Source": "Server.java:1840",
        "ThreadID": 48,
        "ThreadName": "",
        "EventID": "CBFAC68716757253",
        "BaggageBytes": "[[248 5] [240 0] [0 18 81 207 178 216 45 185 17] [240 1] [0 52 253 149 166 211 154 46 86] [240 3] [0 2]]",
        "ProcessID": 2171
      },
      {
        "Cycles": 0,
        "Agent": "Execution-CPU",
        "ProcessName": "Name",
        "TaskID": "1251CFB2D82DB911",
        "ParentEventID": [
          "391EEED123964F43"
        ],
        "Label": "set",
        "Title": "X-Trace Task",
        "Host": "pinky19.mpi-sws.org",
        "HRT": 25491846149906623,
        "Operation": "set",
        "Timestamp": "1556275486090.267578",
        "TenantClass": 0,
        "Source": "Server.java:2071",
        "ThreadID": 59,
        "ThreadName": "",
        "EventID": "25495BD2FA57107D",
        "BaggageBytes": "[[248 5] [240 0] [0 18 81 207 178 216 45 185 17] [240 1] [0 57 30 238 209 35 150 79 67] [240 3] [0 2]]",
        "ProcessID": 2171
      },
      {
        "Cycles": 0,
        "Agent": "org.apache.hadoop.hdfs.server.namenode.FSNamesystem.audit",
        "ProcessName": "Name",
        "TaskID": "1251CFB2D82DB911",
        "ParentEventID": [
          "C0D624D71B22486E"
        ],
        "Label": "allowed=true\tugi=plascas (auth:SIMPLE)\tip=/139.19.171.63\tcmd=open\tsrc=/ds/P0TA0QpdXtF3ejKW\tdst=null\tperm=null\tproto=rpc",
        "Title": "X-Trace Task",
        "Host": "pinky19.mpi-sws.org",
        "HRT": 25491846149990260,
        "Timestamp": "1556275486090.351074",
        "TenantClass": 0,
        "Source": "FSNamesystem.java:8313",
        "ThreadID": 59,
        "ThreadName": "",
        "EventID": "1ED93E93DCCA8D0A",
        "BaggageBytes": "[[248 5] [240 0] [0 18 81 207 178 216 45 185 17] [240 1] [0 192 214 36 215 27 34 72 110] [240 3] [0 2]]",
        "ProcessID": 2171
      },
      {
        "Cycles": 0,
        "Agent": "org.apache.hadoop.ipc.Server",
        "ProcessName": "Name",
        "TaskID": "1251CFB2D82DB911",
        "ParentEventID": [
          "25495BD2FA57107D"
        ],
        "Label": "getBlockLocations in org.apache.hadoop.hdfs.protocol.ClientProtocol",
        "Title": "X-Trace Task",
        "Host": "pinky19.mpi-sws.org",
        "HRT": 25491846149941731,
        "Timestamp": "1556275486090.302490",
        "TenantClass": 0,
        "Source": "ProtobufRpcEngine.java:601",
        "ThreadID": 59,
        "ThreadName": "",
        "EventID": "C0D624D71B22486E",
        "BaggageBytes": "[[248 5] [240 0] [0 18 81 207 178 216 45 185 17] [240 1] [0 37 73 91 210 250 87 16 125] [240 3] [0 2]]",
        "ProcessID": 2171
      },
      {
        "Cycles": 0,
        "Agent": "edu.brown.cs.systems.xtrace.logging.BaggageWrappers",
        "ProcessName": "Name",
        "TaskID": "1251CFB2D82DB911",
        "ParentEventID": [
          "1ED93E93DCCA8D0A"
        ],
        "Label": "Forking current baggage with Baggage.fork()",
        "Title": "X-Trace Task",
        "Host": "pinky19.mpi-sws.org",
        "HRT": 25491846150033833,
        "Operation": "fork",
        "Timestamp": "1556275486090.394775",
        "TenantClass": 0,
        "Source": "Server.java:2398",
        "ThreadID": 59,
        "ThreadName": "",
        "EventID": "02CC101775181983",
        "BaggageBytes": "[[248 5] [240 0] [0 18 81 207 178 216 45 185 17] [240 1] [0 30 217 62 147 220 202 141 10] [240 3] [0 2]]",
        "ProcessID": 2171
      },
      {
        "Cycles": 0,
        "Agent": "Execution-CPU",
        "ProcessName": "Read",
        "TaskID": "1251CFB2D82DB911",
        "ParentEventID": [
          "02CC101775181983"
        ],
        "Label": "set",
        "Title": "X-Trace Task",
        "Host": "pinky19.mpi-sws.org",
        "HRT": 25491846150184153,
        "Operation": "set",
        "Timestamp": "1556275486090.529297",
        "TenantClass": 0,
        "Source": "Client.java:302",
        "ThreadID": 37,
        "ThreadName": "",
        "EventID": "D9C17981F518D985",
        "ProcessID": 21035
      },
      {
        "Cycles": 0,
        "Agent": "Execution-CPU",
        "ProcessName": "Name",
        "TaskID": "1251CFB2D82DB911",
        "ParentEventID": [
          "02CC101775181983"
        ],
        "Label": "unset",
        "Title": "X-Trace Task",
        "Host": "pinky19.mpi-sws.org",
        "Duration": "213617",
        "HRT": 25491846150143116,
        "Operation": "unset",
        "Timestamp": "1556275486090.503906",
        "TenantClass": 0,
        "Source": "Server.java:1058",
        "ThreadID": 59,
        "ThreadName": "",
        "EventID": "E00DD6273C53E8D6",
        "BaggageBytes": "[[248 5] [240 0] [0 18 81 207 178 216 45 185 17] [240 1] [0 2 204 16 23 117 24 25 131] [240 3] [0 2]]",
        "ProcessID": 2171
      },
      {
        "Cycles": 0,
        "Agent": "Execution-CPU",
        "ProcessName": "Read",
        "TaskID": "1251CFB2D82DB911",
        "ParentEventID": [
          "D9C17981F518D985"
        ],
        "Label": "unset",
        "Title": "X-Trace Task",
        "Host": "pinky19.mpi-sws.org",
        "Duration": "8186",
        "HRT": 25491846150204549,
        "Operation": "unset",
        "Timestamp": "1556275486090.549561",
        "TenantClass": 0,
        "Source": "Client.java:1168",
        "ThreadID": 37,
        "ThreadName": "",
        "EventID": "577CD6C644D4D496",
        "ProcessID": 21035
      },
      {
        "Cycles": 0,
        "Agent": "Execution-Sleep",
        "ProcessName": "Read",
        "TaskID": "1251CFB2D82DB911",
        "ParentEventID": [
          "548E286A0FC3927A"
        ],
        "Label": "waited",
        "Title": "X-Trace Task",
        "Host": "pinky19.mpi-sws.org",
        "Duration": "411579",
        "HRT": 25491846150225949,
        "Operation": "waited",
        "Timestamp": "1556275486090.571045",
        "TenantClass": 0,
        "Source": "Client.java:1537",
        "ThreadID": 1,
        "ThreadName": "",
        "EventID": "ECBC88F84C1C8EF7",
        "ProcessID": 21035
      },
      {
        "Cycles": 0,
        "Agent": "edu.brown.cs.systems.xtrace.logging.BaggageWrappers",
        "ProcessName": "Read",
        "TaskID": "1251CFB2D82DB911",
        "ParentEventID": [
          "ECBC88F84C1C8EF7",
          "577CD6C644D4D496"
        ],
        "Label": "Merged current baggage with other baggage",
        "Title": "X-Trace Task",
        "Host": "pinky19.mpi-sws.org",
        "HRT": 25491846150241828,
        "Operation": "join",
        "Timestamp": "1556275486090.586914",
        "TenantClass": 0,
        "Source": "Client.java:1545",
        "ThreadID": 1,
        "ThreadName": "",
        "EventID": "43597BDFEEDD4506",
        "ProcessID": 21035
      },
      {
        "Cycles": 0,
        "Agent": "edu.brown.cs.systems.xtrace.logging.BaggageWrappers",
        "ProcessName": "Read",
        "TaskID": "1251CFB2D82DB911",
        "ParentEventID": [
          "416F145B0C4292BD"
        ],
        "Label": "Forking current baggage with Baggage.fork()",
        "Title": "X-Trace Task",
        "Host": "pinky19.mpi-sws.org",
        "HRT": 25491846150377889,
        "Operation": "fork",
        "Timestamp": "1556275486090.722900",
        "TenantClass": 0,
        "Source": "DataTransferProtoUtil.java:94",
        "ThreadID": 1,
        "ThreadName": "",
        "EventID": "8EB8CD157A8CDAC4",
        "ProcessID": 21035
      },
      {
        "Cycles": 0,
        "Agent": "org.apache.hadoop.ipc.ProtobufRpcEngine",
        "ProcessName": "Read",
        "TaskID": "1251CFB2D82DB911",
        "ParentEventID": [
          "43597BDFEEDD4506"
        ],
        "Label": "org.apache.hadoop.hdfs.protocol.ClientProtocol.getBlockLocations completed",
        "Title": "X-Trace Task",
        "Host": "pinky19.mpi-sws.org",
        "HRT": 25491846150299936,
        "Timestamp": "1556275486090.645020",
        "TenantClass": 0,
        "Source": "ProtobufRpcEngine.java:275",
        "ThreadID": 1,
        "ThreadName": "",
        "EventID": "416F145B0C4292BD",
        "ProcessID": 21035
      },
      {
        "Cycles": 0,
        "Agent": "Execution-CPU",
        "ProcessName": "Data",
        "TaskID": "1251CFB2D82DB911",
        "ParentEventID": [
          "8EB8CD157A8CDAC4"
        ],
        "Label": "set",
        "Title": "X-Trace Task",
        "Host": "pinky19.mpi-sws.org",
        "HRT": 25491846150510805,
        "Operation": "set",
        "Timestamp": "1556275486090.861816",
        "TenantClass": 0,
        "Source": "Receiver.java:117",
        "ThreadID": 9602,
        "ThreadName": "",
        "EventID": "06A1BAFE9D3FFC45",
        "BaggageBytes": "[[248 5] [240 0] [0 18 81 207 178 216 45 185 17] [240 1] [0 142 184 205 21 122 140 218 196] [240 3] [0 2]]",
        "ProcessID": 2319
      },
      {
        "Cycles": 0,
        "Agent": "edu.brown.cs.systems.xtrace.logging.BaggageWrappers",
        "ProcessName": "Data",
        "TaskID": "1251CFB2D82DB911",
        "ParentEventID": [
          "CD653A4681B4B556"
        ],
        "Label": "Forking current baggage with Baggage.fork()",
        "Title": "X-Trace Task",
        "Host": "pinky19.mpi-sws.org",
        "HRT": 25491846150623558,
        "Operation": "fork",
        "Timestamp": "1556275486090.974609",
        "TenantClass": 0,
        "Source": "DataXceiver.java:1257",
        "ThreadID": 9602,
        "ThreadName": "",
        "EventID": "1155E48297F53735",
        "BaggageBytes": "[[248 5] [240 0] [0 18 81 207 178 216 45 185 17] [240 1] [0 205 101 58 70 129 180 181 86] [240 3] [0 2]]",
        "ProcessID": 2319
      },
      {
        "Cycles": 0,
        "Agent": "edu.brown.cs.systems.xtrace.logging.XTraceInit",
        "ProcessName": "Data",
        "TaskID": "1251CFB2D82DB911",
        "ParentEventID": [
          "06A1BAFE9D3FFC45"
        ],
        "Label": "Thread.setName: DataXceiver for client DFSClient_NONMAPREDUCE_1377588049_1 at /139.19.171.63:36074 [Sending block BP-1633380353-139.19.171.63-1554193446451:blk_1073759267_18443]",
        "Title": "X-Trace Task",
        "Host": "pinky19.mpi-sws.org",
        "HRT": 25491846150546200,
        "Timestamp": "1556275486090.897217",
        "TenantClass": 0,
        "Source": "DataXceiver.java:168",
        "ThreadID": 9602,
        "ThreadName": "",
        "EventID": "CD653A4681B4B556",
        "BaggageBytes": "[[248 5] [240 0] [0 18 81 207 178 216 45 185 17] [240 1] [0 6 161 186 254 157 63 252 69] [240 3] [0 2]]",
        "ProcessID": 2319
      },
      {
        "Cycles": 0,
        "Agent": "edu.brown.cs.systems.xtrace.logging.BaggageWrappers",
        "ProcessName": "Data",
        "TaskID": "1251CFB2D82DB911",
        "ParentEventID": [
          "1155E48297F53735"
        ],
        "Label": "Forking current baggage with Baggage.fork()",
        "Title": "X-Trace Task",
        "Host": "pinky19.mpi-sws.org",
        "HRT": 25491846150689406,
        "Operation": "fork",
        "Timestamp": "1556275486091.040283",
        "TenantClass": 0,
        "Source": "PacketHeader.java:95",
        "ThreadID": 9602,
        "ThreadName": "",
        "EventID": "108C5CD21B4AC7EA",
        "BaggageBytes": "[[248 5] [240 0] [0 18 81 207 178 216 45 185 17] [240 1] [0 17 85 228 130 151 245 55 53] [240 3] [0 2]]",
        "ProcessID": 2319
      },
      {
        "Cycles": 0,
        "Agent": "Execution-Sleep",
        "ProcessName": "Data",
        "TaskID": "1251CFB2D82DB911",
        "ParentEventID": [
          "108C5CD21B4AC7EA"
        ],
        "Label": "waited",
        "Title": "X-Trace Task",
        "Host": "pinky19.mpi-sws.org",
        "Duration": "3993",
        "HRT": 25491846150748613,
        "Operation": "waited",
        "Timestamp": "1556275486091.099609",
        "TenantClass": 0,
        "Source": "SocketIOWithTimeout.java:335",
        "ThreadID": 9602,
        "ThreadName": "",
        "EventID": "312A2C4C5A6A322B",
        "BaggageBytes": "[[248 5] [240 0] [0 18 81 207 178 216 45 185 17] [240 1] [0 16 140 92 210 27 74 199 234] [240 3] [0 2]]",
        "ProcessID": 2319
      },
      {
        "Cycles": 0,
        "Agent": "Execution-Sleep",
        "ProcessName": "Read",
        "TaskID": "1251CFB2D82DB911",
        "ParentEventID": [
          "8EB8CD157A8CDAC4"
        ],
        "Label": "waited",
        "Title": "X-Trace Task",
        "Host": "pinky19.mpi-sws.org",
        "Duration": "203345",
        "HRT": 25491846150685360,
        "Operation": "waited",
        "Timestamp": "1556275486091.030518",
        "TenantClass": 0,
        "Source": "SocketIOWithTimeout.java:335",
        "ThreadID": 1,
        "ThreadName": "",
        "EventID": "68B2954334746160",
        "ProcessID": 21035
      },
      {
        "Cycles": 0,
        "Agent": "edu.brown.cs.systems.xtrace.logging.BaggageWrappers",
        "ProcessName": "Data",
        "TaskID": "1251CFB2D82DB911",
        "ParentEventID": [
          "312A2C4C5A6A322B"
        ],
        "Label": "Forking current baggage with Baggage.fork()",
        "Title": "X-Trace Task",
        "Host": "pinky19.mpi-sws.org",
        "HRT": 25491846150811516,
        "Operation": "fork",
        "Timestamp": "1556275486091.162354",
        "TenantClass": 0,
        "Source": "PacketHeader.java:95",
        "ThreadID": 9602,
        "ThreadName": "",
        "EventID": "C4587CDD5887D9A0",
        "BaggageBytes": "[[248 5] [240 0] [0 18 81 207 178 216 45 185 17] [240 1] [0 49 42 44 76 90 106 50 43] [240 3] [0 2]]",
        "ProcessID": 2319
      },
      {
        "Cycles": 0,
        "Agent": "edu.brown.cs.systems.xtrace.logging.BaggageWrappers",
        "ProcessName": "Read",
        "TaskID": "1251CFB2D82DB911",
        "ParentEventID": [
          "68B2954334746160",
          "1155E48297F53735"
        ],
        "Label": "Merged current baggage with other baggage",
        "Title": "X-Trace Task",
        "Host": "pinky19.mpi-sws.org",
        "HRT": 25491846150769577,
        "Operation": "join",
        "Timestamp": "1556275486091.114746",
        "TenantClass": 0,
        "Source": "RemoteBlockReader2.java:429",
        "ThreadID": 1,
        "ThreadName": "",
        "EventID": "778F1F188C287BB5",
        "ProcessID": 21035
      },
      {
        "Cycles": 0,
        "Agent": "edu.brown.cs.systems.xtrace.logging.BaggageWrappers",
        "ProcessName": "Read",
        "TaskID": "1251CFB2D82DB911",
        "ParentEventID": [
          "778F1F188C287BB5",
          "108C5CD21B4AC7EA"
        ],
        "Label": "Merged current baggage with other baggage",
        "Title": "X-Trace Task",
        "Host": "pinky19.mpi-sws.org",
        "HRT": 25491846150864164,
        "Operation": "join",
        "Timestamp": "1556275486091.209229",
        "TenantClass": 0,
        "Source": "PacketHeader.java:168",
        "ThreadID": 1,
        "ThreadName": "",
        "EventID": "ACAA67CCCAFEBB37",
        "ProcessID": 21035
      },
      {
        "Cycles": 0,
        "Agent": "edu.brown.cs.systems.xtrace.logging.BaggageWrappers",
        "ProcessName": "Read",
        "TaskID": "1251CFB2D82DB911",
        "ParentEventID": [
          "0C8FD962D709F63F"
        ],
        "Label": "Forking current baggage with Baggage.fork()",
        "Title": "X-Trace Task",
        "Host": "pinky19.mpi-sws.org",
        "HRT": 25491846150949220,
        "Operation": "fork",
        "Timestamp": "1556275486091.294434",
        "TenantClass": 0,
        "Source": "RemoteBlockReader2.java:361",
        "ThreadID": 1,
        "ThreadName": "",
        "EventID": "38EC069EE84ECA1D",
        "ProcessID": 21035
      },
      {
        "Cycles": 0,
        "Agent": "edu.brown.cs.systems.xtrace.logging.BaggageWrappers",
        "ProcessName": "Read",
        "TaskID": "1251CFB2D82DB911",
        "ParentEventID": [
          "ACAA67CCCAFEBB37",
          "C4587CDD5887D9A0"
        ],
        "Label": "Merged current baggage with other baggage",
        "Title": "X-Trace Task",
        "Host": "pinky19.mpi-sws.org",
        "HRT": 25491846150937691,
        "Operation": "join",
        "Timestamp": "1556275486091.282715",
        "TenantClass": 0,
        "Source": "PacketHeader.java:168",
        "ThreadID": 1,
        "ThreadName": "",
        "EventID": "0C8FD962D709F63F",
        "ProcessID": 21035
      },
      {
        "Cycles": 0,
        "Agent": "Execution-Sleep",
        "ProcessName": "Data",
        "TaskID": "1251CFB2D82DB911",
        "ParentEventID": [
          "C4587CDD5887D9A0"
        ],
        "Label": "waited",
        "Title": "X-Trace Task",
        "Host": "pinky19.mpi-sws.org",
        "Duration": "102263",
        "HRT": 25491846151008441,
        "Operation": "waited",
        "Timestamp": "1556275486091.359375",
        "TenantClass": 0,
        "Source": "SocketIOWithTimeout.java:335",
        "ThreadID": 9602,
        "ThreadName": "",
        "EventID": "844B08AFF8EADDB9",
        "BaggageBytes": "[[248 5] [240 0] [0 18 81 207 178 216 45 185 17] [240 1] [0 196 88 124 221 88 135 217 160] [240 3] [0 2]]",
        "ProcessID": 2319
      },
      {
        "Cycles": 0,
        "Agent": "Execution-CPU",
        "ProcessName": "Data",
        "TaskID": "1251CFB2D82DB911",
        "ParentEventID": [
          "E16AE9B7880EB658"
        ],
        "Label": "unset",
        "Title": "X-Trace Task",
        "Host": "pinky19.mpi-sws.org",
        "Duration": "549827",
        "HRT": 25491846151084540,
        "Operation": "unset",
        "Timestamp": "1556275486091.435547",
        "TenantClass": 0,
        "Source": "DataXceiver.java:261",
        "ThreadID": 9602,
        "ThreadName": "",
        "EventID": "2CFCA6DAA8D71ADB",
        "BaggageBytes": "[[248 5] [240 0] [0 18 81 207 178 216 45 185 17] [240 1] [0 225 106 233 183 136 14 182 88] [240 3] [0 2]]",
        "ProcessID": 2319
      },
      {
        "Cycles": 0,
        "Agent": "edu.brown.cs.systems.xtrace.logging.BaggageWrappers",
        "ProcessName": "Data",
        "TaskID": "1251CFB2D82DB911",
        "ParentEventID": [
          "38EC069EE84ECA1D",
          "844B08AFF8EADDB9"
        ],
        "Label": "Merged current baggage with other baggage",
        "Title": "X-Trace Task",
        "Host": "pinky19.mpi-sws.org",
        "HRT": 25491846151064143,
        "Operation": "join",
        "Timestamp": "1556275486091.415039",
        "TenantClass": 0,
        "Source": "DataXceiver.java:574",
        "ThreadID": 9602,
        "ThreadName": "",
        "EventID": "E16AE9B7880EB658",
        "BaggageBytes": "[[248 5] [240 0] [0 18 81 207 178 216 45 185 17] [240 1] [0 132 75 8 175 248 234 221 185] [0 56 236 6 158 232 78 202 29] [240 3] [0 2]]",
        "ProcessID": 2319
      },
      {
        "Cycles": 0,
        "Agent": "edu.brown.cs.systems.retro.benchmarks.hdfs_client.Reader",
        "ProcessName": "Read",
        "TaskID": "1251CFB2D82DB911",
        "ParentEventID": [
          "0"
        ],
        "Label": "Reading file",
        "Title": "X-Trace Task",
        "Host": "pinky19.mpi-sws.org",
        "HRT": 25491846149557696,
        "Timestamp": "1556275486089.902832",
        "TenantClass": 0,
        "ThreadID": 1,
        "ThreadName": "",
        "EventID": "A34E8F34DF361F5D",
        "ProcessID": 21035,
        "Tag": [
          "reader_1kb",
          "Read Size: 1024"
        ]
      }
    ]
  }
]