[
  {
    "id": "C42A3841E83EC5B4",
    "reports": [
      {
        "Cycles": 0,
        "Agent": "org.apache.hadoop.ipc.ProtobufRpcEngine",
        "ProcessName": "Read",
        "TaskID": "C42A3841E83EC5B4",
        "ParentEventID": [
          "3E87C1B4E943E5AD"
        ],
        "Label": "Invoking org.apache.hadoop.hdfs.protocol.ClientProtocol.getBlockLocations",
        "Title": "X-Trace Task",
        "Host": "pinky19.mpi-sws.org",
        "HRT": 26962560883939202,
        "Timestamp": "1557746200824.043701",
        "TenantClass": 0,
        "Source": "ProtobufRpcEngine.java:228",
        "ThreadID": 1,
        "ThreadName": "",
        "EventID": "B1CBCA73ED6A93BB",
        "ProcessID": 36430
      },
      {
        "Cycles": 0,
        "Agent": "Execution-CPU",
        "ProcessName": "Read",
        "TaskID": "C42A3841E83EC5B4",
        "ParentEventID": [
          "B1CBCA73ED6A93BB"
        ],
        "Label": "unset",
        "Title": "X-Trace Task",
        "Host": "pinky19.mpi-sws.org",
        "Duration": "24410977",
        "HRT": 26962560883965958,
        "Operation": "unset",
        "Timestamp": "1557746200824.070557",
        "TenantClass": 0,
        "Source": "Client.java:1027",
        "ThreadID": 1,
        "ThreadName": "",
        "EventID": "254589869CDE45D1",
        "ProcessID": 36430
      },
      {
        "Cycles": 0,
        "Agent": "edu.brown.cs.systems.retro.benchmarks.hdfs_client.Reader",
        "ProcessName": "Read",
        "TaskID": "C42A3841E83EC5B4",
        "ParentEventID": [
          "05FF35CBD515A1CA"
        ],
        "Label": "Reading file",
        "Title": "X-Trace Task",
        "Host": "pinky19.mpi-sws.org",
        "HRT": 26962560883907494,
        "Timestamp": "1557746200824.012207",
        "TenantClass": 0,
        "ThreadID": 1,
        "ThreadName": "",
        "EventID": "3E87C1B4E943E5AD",
        "ProcessID": 36430
      },
      {
        "Cycles": 0,
        "Agent": "Execution-CPU",
        "ProcessName": "Read",
        "TaskID": "C42A3841E83EC5B4",
        "ParentEventID": [
          "254589869CDE45D1"
        ],
        "Label": "set",
        "Title": "X-Trace Task",
        "Host": "pinky19.mpi-sws.org",
        "HRT": 26962560883994776,
        "Operation": "set",
        "Timestamp": "1557746200824.099365",
        "TenantClass": 0,
        "Source": "Client.java:1032",
        "ThreadID": 41,
        "ThreadName": "",
        "EventID": "12A5A0A92C9924A3",
        "ProcessID": 36430
      },
      {
        "Cycles": 0,
        "Agent": "edu.brown.cs.systems.xtrace.logging.BaggageWrappers",
        "ProcessName": "Read",
        "TaskID": "C42A3841E83EC5B4",
        "ParentEventID": [
          "12A5A0A92C9924A3"
        ],
        "Label": "Forking current baggage with Baggage.fork()",
        "Title": "X-Trace Task",
        "Host": "pinky19.mpi-sws.org",
        "HRT": 26962560884017239,
        "Operation": "fork",
        "Timestamp": "1557746200824.121826",
        "TenantClass": 0,
        "Source": "Client.java:1043",
        "ThreadID": 41,
        "ThreadName": "",
        "EventID": "607370BFDE3EDBBF",
        "ProcessID": 36430
      },
      {
        "Cycles": 0,
        "Agent": "Execution-CPU",
        "ProcessName": "Read",
        "TaskID": "C42A3841E83EC5B4",
        "ParentEventID": [
          "607370BFDE3EDBBF"
        ],
        "Label": "unset",
        "Title": "X-Trace Task",
        "Host": "pinky19.mpi-sws.org",
        "Duration": "86514",
        "HRT": 26962560884102723,
        "Operation": "unset",
        "Timestamp": "1557746200824.207275",
        "TenantClass": 0,
        "Source": "Client.java:1062",
        "ThreadID": 41,
        "ThreadName": "",
        "EventID": "E121DAB7CDBFC8E3",
        "ProcessID": 36430
      },
      {
        "Cycles": 0,
        "Agent": "Execution-CPU",
        "ProcessName": "Name",
        "TaskID": "C42A3841E83EC5B4",
        "ParentEventID": [
          "607370BFDE3EDBBF"
        ],
        "Label": "set",
        "Title": "X-Trace Task",
        "Host": "pinky19.mpi-sws.org",
        "HRT": 26962560884155266,
        "Operation": "set",
        "Timestamp": "1557746200824.281738",
        "TenantClass": 0,
        "Source": "Server.java:1840",
        "ThreadID": 48,
        "ThreadName": "",
        "EventID": "4371F2FC7D5DCAF6",
        "BaggageBytes": "[[248 5] [240 0] [0 196 42 56 65 232 62 197 180] [240 1] [0 96 115 112 191 222 62 219 191] [240 3] [0 2]]",
        "ProcessID": 2171
      },
      {
        "Cycles": 0,
        "Agent": "edu.brown.cs.systems.xtrace.logging.BaggageWrappers",
        "ProcessName": "Name",
        "TaskID": "C42A3841E83EC5B4",
        "ParentEventID": [
          "4371F2FC7D5DCAF6"
        ],
        "Label": "Forking current baggage with Baggage.fork()",
        "Title": "X-Trace Task",
        "Host": "pinky19.mpi-sws.org",
        "HRT": 26962560884185962,
        "Operation": "fork",
        "Timestamp": "1557746200824.312256",
        "TenantClass": 0,
        "Source": "Server.java:550",
        "ThreadID": 48,
        "ThreadName": "",
        "EventID": "72B44C640A87A6F3",
        "BaggageBytes": "[[248 5] [240 0] [0 196 42 56 65 232 62 197 180] [240 1] [0 67 113 242 252 125 93 202 246] [240 3] [0 2]]",
        "ProcessID": 2171
      },
      {
        "Cycles": 0,
        "Agent": "Execution-CPU",
        "ProcessName": "Name",
        "TaskID": "C42A3841E83EC5B4",
        "ParentEventID": [
          "72B44C640A87A6F3"
        ],
        "Label": "unset",
        "Title": "X-Trace Task",
        "Host": "pinky19.mpi-sws.org",
        "Duration": "25040",
        "HRT": 26962560884206661,
        "Operation": "unset",
        "Timestamp": "1557746200824.333008",
        "TenantClass": 0,
        "Source": "Server.java:1828",
        "ThreadID": 48,
        "ThreadName": "",
        "EventID": "D435CF12F358DBC1",
        "BaggageBytes": "[[248 5] [240 0] [0 196 42 56 65 232 62 197 180] [240 1] [0 114 180 76 100 10 135 166 243] [240 3] [0 2]]",
        "ProcessID": 2171
      },
      {
        "Cycles": 0,
        "Agent": "Execution-CPU",
        "ProcessName": "Name",
        "TaskID": "C42A3841E83EC5B4",
        "ParentEventID": [
          "72B44C640A87A6F3"
        ],
        "Label": "set",
        "Title": "X-Trace Task",
        "Host": "pinky19.mpi-sws.org",
        "HRT": 26962560884218609,
        "Operation": "set",
        "Timestamp": "1557746200824.344971",
        "TenantClass": 0,
        "Source": "Server.java:2071",
        "ThreadID": 64,
        "ThreadName": "",
        "EventID": "9C792792980C0457",
        "BaggageBytes": "[[248 5] [240 0] [0 196 42 56 65 232 62 197 180] [240 1] [0 114 180 76 100 10 135 166 243] [240 3] [0 2]]",
        "ProcessID": 2171
      },
      {
        "Cycles": 0,
        "Agent": "Execution-CPU",
        "ProcessName": "Read",
        "TaskID": "C42A3841E83EC5B4",
        "ParentEventID": [
          "E121DAB7CDBFC8E3"
        ],
        "Label": "set",
        "Title": "X-Trace Task",
        "Host": "pinky19.mpi-sws.org",
        "HRT": 26962560884124553,
        "Operation": "set",
        "Timestamp": "1557746200824.229248",
        "TenantClass": 0,
        "Source": "Client.java:1104",
        "ThreadID": 1,
        "ThreadName": "",
        "EventID": "C3E707DE34FCA984",
        "ProcessID": 36430
      },
      {
        "Cycles": 0,
        "Agent": "org.apache.hadoop.ipc.Server",
        "ProcessName": "Name",
        "TaskID": "C42A3841E83EC5B4",
        "ParentEventID": [
          "9C792792980C0457"
        ],
        "Label": "getBlockLocations in org.apache.hadoop.hdfs.protocol.ClientProtocol",
        "Title": "X-Trace Task",
        "Host": "pinky19.mpi-sws.org",
        "HRT": 26962560884254948,
        "Timestamp": "1557746200824.381348",
        "TenantClass": 0,
        "Source": "ProtobufRpcEngine.java:601",
        "ThreadID": 64,
        "ThreadName": "",
        "EventID": "E3815E539AFA8DD8",
        "BaggageBytes": "[[248 5] [240 0] [0 196 42 56 65 232 62 197 180] [240 1] [0 156 121 39 146 152 12 4 87] [240 3] [0 2]]",
        "ProcessID": 2171
      },
      {
        "Cycles": 0,
        "Agent": "edu.brown.cs.systems.xtrace.logging.BaggageWrappers",
        "ProcessName": "Name",
        "TaskID": "C42A3841E83EC5B4",
        "ParentEventID": [
          "D42FB8E1A21B4929"
        ],
        "Label": "Forking current baggage with Baggage.fork()",
        "Title": "X-Trace Task",
        "Host": "pinky19.mpi-sws.org",
        "HRT": 26962560884347029,
        "Operation": "fork",
        "Timestamp": "1557746200824.473389",
        "TenantClass": 0,
        "Source": "Server.java:2398",
        "ThreadID": 64,
        "ThreadName": "",
        "EventID": "ED2D31271807F456",
        "BaggageBytes": "[[248 5] [240 0] [0 196 42 56 65 232 62 197 180] [240 1] [0 212 47 184 225 162 27 73 41] [240 3] [0 2]]",
        "ProcessID": 2171
      },
      {
        "Cycles": 0,
        "Agent": "org.apache.hadoop.hdfs.server.namenode.FSNamesystem.audit",
        "ProcessName": "Name",
        "TaskID": "C42A3841E83EC5B4",
        "ParentEventID": [
          "E3815E539AFA8DD8"
        ],
        "Label": "allowed=true\tugi=plascas (auth:SIMPLE)\tip=/139.19.171.63\tcmd=open\tsrc=/ds/DHWV75Qic9vAQtHi\tdst=null\tperm=null\tproto=rpc",
        "Title": "X-Trace Task",
        "Host": "pinky19.mpi-sws.org",
        "HRT": 26962560884303588,
        "Timestamp": "1557746200824.429932",
        "TenantClass": 0,
        "Source": "FSNamesystem.java:8313",
        "ThreadID": 64,
        "ThreadName": "",
        "EventID": "D42FB8E1A21B4929",
        "BaggageBytes": "[[248 5] [240 0] [0 196 42 56 65 232 62 197 180] [240 1] [0 227 129 94 83 154 250 141 216] [240 3] [0 2]]",
        "ProcessID": 2171
      },
      {
        "Cycles": 0,
        "Agent": "Execution-CPU",
        "ProcessName": "Name",
        "TaskID": "C42A3841E83EC5B4",
        "ParentEventID": [
          "ED2D31271807F456"
        ],
        "Label": "unset",
        "Title": "X-Trace Task",
        "Host": "pinky19.mpi-sws.org",
        "Duration": "213434",
        "HRT": 26962560884455482,
        "Operation": "unset",
        "Timestamp": "1557746200824.581787",
        "TenantClass": 0,
        "Source": "Server.java:1058",
        "ThreadID": 64,
        "ThreadName": "",
        "EventID": "7F50D055B4ECBC5F",
        "BaggageBytes": "[[248 5] [240 0] [0 196 42 56 65 232 62 197 180] [240 1] [0 237 45 49 39 24 7 244 86] [240 3] [0 2]]",
        "ProcessID": 2171
      },
      {
        "Cycles": 0,
        "Agent": "Execution-CPU",
        "ProcessName": "Read",
        "TaskID": "C42A3841E83EC5B4",
        "ParentEventID": [
          "ED2D31271807F456"
        ],
        "Label": "set",
        "Title": "X-Trace Task",
        "Host": "pinky19.mpi-sws.org",
        "HRT": 26962560884528698,
        "Operation": "set",
        "Timestamp": "1557746200824.633301",
        "TenantClass": 0,
        "Source": "Client.java:302",
        "ThreadID": 37,
        "ThreadName": "",
        "EventID": "7FBD268383EC47C2",
        "ProcessID": 36430
      },
      {
        "Cycles": 0,
        "Agent": "Execution-CPU",
        "ProcessName": "Read",
        "TaskID": "C42A3841E83EC5B4",
        "ParentEventID": [
          "7FBD268383EC47C2"
        ],
        "Label": "unset",
        "Title": "X-Trace Task",
        "Host": "pinky19.mpi-sws.org",
        "Duration": "8889",
        "HRT": 26962560884554294,
        "Operation": "unset",
        "Timestamp": "1557746200824.658936",
        "TenantClass": 0,
        "Source": "Client.java:1168",
        "ThreadID": 37,
        "ThreadName": "",
        "EventID": "909A08E8AE6CB01A",
        "ProcessID": 36430
      },
      {
        "Cycles": 0,
        "Agent": "Execution-Sleep",
        "ProcessName": "Read",
        "TaskID": "C42A3841E83EC5B4",
        "ParentEventID": [
          "C3E707DE34FCA984"
        ],
        "Label": "waited",
        "Title": "X-Trace Task",
        "Host": "pinky19.mpi-sws.org",
        "Duration": "440334",
        "HRT": 26962560884572859,
        "Operation": "waited",
        "Timestamp": "1557746200824.677490",
        "TenantClass": 0,
        "Source": "Client.java:1537",
        "ThreadID": 1,
        "ThreadName": "",
        "EventID": "92E097BDD0275B91",
        "ProcessID": 36430
      },
      {
        "Cycles": 0,
        "Agent": "edu.brown.cs.systems.xtrace.logging.BaggageWrappers",
        "ProcessName": "Read",
        "TaskID": "C42A3841E83EC5B4",
        "ParentEventID": [
          "92E097BDD0275B91",
          "909A08E8AE6CB01A"
        ],
        "Label": "Merged current baggage with other baggage",
        "Title": "X-Trace Task",
        "Host": "pinky19.mpi-sws.org",
        "HRT": 26962560884584442,
        "Operation": "join",
        "Timestamp": "1557746200824.688965",
        "TenantClass": 0,
        "Source": "Client.java:1545",
        "ThreadID": 1,
        "ThreadName": "",
        "EventID": "62ADDEC4FA280632",
        "ProcessID": 36430
      },
      {
        "Cycles": 0,
        "Agent": "edu.brown.cs.systems.xtrace.logging.BaggageWrappers",
        "ProcessName": "Read",
        "TaskID": "C42A3841E83EC5B4",
        "ParentEventID": [
          "931D71534AD7B010"
        ],
        "Label": "Forking current baggage with Baggage.fork()",
        "Title": "X-Trace Task",
        "Host": "pinky19.mpi-sws.org",
        "HRT": 26962560884691265,
        "Operation": "fork",
        "Timestamp": "1557746200824.795898",
        "TenantClass": 0,
        "Source": "DataTransferProtoUtil.java:94",
        "ThreadID": 1,
        "ThreadName": "",
        "EventID": "9D4FCDC617161733",
        "ProcessID": 36430
      },
      {
        "Cycles": 0,
        "Agent": "org.apache.hadoop.ipc.ProtobufRpcEngine",
        "ProcessName": "Read",
        "TaskID": "C42A3841E83EC5B4",
        "ParentEventID": [
          "62ADDEC4FA280632"
        ],
        "Label": "org.apache.hadoop.hdfs.protocol.ClientProtocol.getBlockLocations completed",
        "Title": "X-Trace Task",
        "Host": "pinky19.mpi-sws.org",
        "HRT": 26962560884622436,
        "Timestamp": "1557746200824.727051",
        "TenantClass": 0,
        "Source": "ProtobufRpcEngine.java:275",
        "ThreadID": 1,
        "ThreadName": "",
        "EventID": "931D71534AD7B010",
        "ProcessID": 36430
      },
      {
        "Cycles": 0,
        "Agent": "Execution-CPU",
        "ProcessName": "Data",
        "TaskID": "C42A3841E83EC5B4",
        "ParentEventID": [
          "9D4FCDC617161733"
        ],
        "Label": "set",
        "Title": "X-Trace Task",
        "Host": "pinky21.mpi-sws.org",
        "HRT": 10808870591299072,
        "Operation": "set",
        "Timestamp": "1557746200825.105469",
        "TenantClass": 0,
        "Source": "Receiver.java:117",
        "ThreadID": 14875,
        "ThreadName": "",
        "EventID": "7BE3AFCA51D6D9DC",
        "BaggageBytes": "[[248 5] [240 0] [0 196 42 56 65 232 62 197 180] [240 1] [0 157 79 205 198 23 22 23 51] [240 3] [0 2]]",
        "ProcessID": 20775
      },
      {
        "Cycles": 0,
        "Agent": "edu.brown.cs.systems.xtrace.logging.BaggageWrappers",
        "ProcessName": "Data",
        "TaskID": "C42A3841E83EC5B4",
        "ParentEventID": [
          "5B7945271AF6794E"
        ],
        "Label": "Forking current baggage with Baggage.fork()",
        "Title": "X-Trace Task",
        "Host": "pinky21.mpi-sws.org",
        "HRT": 10808870591610533,
        "Operation": "fork",
        "Timestamp": "1557746200825.416992",
        "TenantClass": 0,
        "Source": "DataXceiver.java:1257",
        "ThreadID": 14875,
        "ThreadName": "",
        "EventID": "618FD10408FBA7B9",
        "BaggageBytes": "[[248 5] [240 0] [0 196 42 56 65 232 62 197 180] [240 1] [0 91 121 69 39 26 246 121 78] [240 3] [0 2]]",
        "ProcessID": 20775
      },
      {
        "Cycles": 0,
        "Agent": "edu.brown.cs.systems.xtrace.logging.XTraceInit",
        "ProcessName": "Data",
        "TaskID": "C42A3841E83EC5B4",
        "ParentEventID": [
          "7BE3AFCA51D6D9DC"
        ],
        "Label": "Thread.setName: DataXceiver for client DFSClient_NONMAPREDUCE_778905418_1 at /139.19.171.63:35320 [Sending block BP-1633380353-139.19.171.63-1554193446451:blk_1073761915_21091]",
        "Title": "X-Trace Task",
        "Host": "pinky21.mpi-sws.org",
        "HRT": 10808870591399936,
        "Timestamp": "1557746200825.206299",
        "TenantClass": 0,
        "Source": "DataXceiver.java:168",
        "ThreadID": 14875,
        "ThreadName": "",
        "EventID": "5B7945271AF6794E",
        "BaggageBytes": "[[248 5] [240 0] [0 196 42 56 65 232 62 197 180] [240 1] [0 123 227 175 202 81 214 217 220] [240 3] [0 2]]",
        "ProcessID": 20775
      },
      {
        "Cycles": 0,
        "Agent": "Execution-Sleep",
        "ProcessName": "Read",
        "TaskID": "C42A3841E83EC5B4",
        "ParentEventID": [
          "9D4FCDC617161733"
        ],
        "Label": "waited",
        "Title": "X-Trace Task",
        "Host": "pinky19.mpi-sws.org",
        "Duration": "712102",
        "HRT": 26962560885486832,
        "Operation": "waited",
        "Timestamp": "1557746200825.591553",
        "TenantClass": 0,
        "Source": "SocketIOWithTimeout.java:335",
        "ThreadID": 1,
        "ThreadName": "",
        "EventID": "3ED7922674EBE310",
        "ProcessID": 36430
      },
      {
        "Cycles": 0,
        "Agent": "edu.brown.cs.systems.xtrace.logging.BaggageWrappers",
        "ProcessName": "Data",
        "TaskID": "C42A3841E83EC5B4",
        "ParentEventID": [
          "618FD10408FBA7B9"
        ],
        "Label": "Forking current baggage with Baggage.fork()",
        "Title": "X-Trace Task",
        "Host": "pinky21.mpi-sws.org",
        "HRT": 10808870591794337,
        "Operation": "fork",
        "Timestamp": "1557746200825.600830",
        "TenantClass": 0,
        "Source": "PacketHeader.java:95",
        "ThreadID": 14875,
        "ThreadName": "",
        "EventID": "0C7882F7FDB4314A",
        "BaggageBytes": "[[248 5] [240 0] [0 196 42 56 65 232 62 197 180] [240 1] [0 97 143 209 4 8 251 167 185] [240 3] [0 2]]",
        "ProcessID": 20775
      },
      {
        "Cycles": 0,
        "Agent": "edu.brown.cs.systems.xtrace.logging.BaggageWrappers",
        "ProcessName": "Read",
        "TaskID": "C42A3841E83EC5B4",
        "ParentEventID": [
          "3ED7922674EBE310",
          "618FD10408FBA7B9"
        ],
        "Label": "Merged current baggage with other baggage",
        "Title": "X-Trace Task",
        "Host": "pinky19.mpi-sws.org",
        "HRT": 26962560885546297,
        "Operation": "join",
        "Timestamp": "1557746200825.650879",
        "TenantClass": 0,
        "Source": "RemoteBlockReader2.java:429",
        "ThreadID": 1,
        "ThreadName": "",
        "EventID": "055E91894F2D4E81",
        "ProcessID": 36430
      },
      {
        "Cycles": 0,
        "Agent": "Execution-Sleep",
        "ProcessName": "Data",
        "TaskID": "C42A3841E83EC5B4",
        "ParentEventID": [
          "0C7882F7FDB4314A"
        ],
        "Label": "waited",
        "Title": "X-Trace Task",
        "Host": "pinky21.mpi-sws.org",
        "Duration": "11430",
        "HRT": 10808870591951701,
        "Operation": "waited",
        "Timestamp": "1557746200825.758057",
        "TenantClass": 0,
        "Source": "SocketIOWithTimeout.java:335",
        "ThreadID": 14875,
        "ThreadName": "",
        "EventID": "2ECD8131C00A7938",
        "BaggageBytes": "[[248 5] [240 0] [0 196 42 56 65 232 62 197 180] [240 1] [0 12 120 130 247 253 180 49 74] [240 3] [0 2]]",
        "ProcessID": 20775
      },
      {
        "Cycles": 0,
        "Agent": "edu.brown.cs.systems.xtrace.logging.BaggageWrappers",
        "ProcessName": "Data",
        "TaskID": "C42A3841E83EC5B4",
        "ParentEventID": [
          "2ECD8131C00A7938"
        ],
        "Label": "Forking current baggage with Baggage.fork()",
        "Title": "X-Trace Task",
        "Host": "pinky21.mpi-sws.org",
        "HRT": 10808870592140311,
        "Operation": "fork",
        "Timestamp": "1557746200825.946777",
        "TenantClass": 0,
        "Source": "PacketHeader.java:95",
        "ThreadID": 14875,
        "ThreadName": "",
        "EventID": "FDC76A664C22D6A2",
        "BaggageBytes": "[[248 5] [240 0] [0 196 42 56 65 232 62 197 180] [240 1] [0 46 205 129 49 192 10 121 56] [240 3] [0 2]]",
        "ProcessID": 20775
      },
      {
        "Cycles": 0,
        "Agent": "Execution-Sleep",
        "ProcessName": "Read",
        "TaskID": "C42A3841E83EC5B4",
        "ParentEventID": [
          "055E91894F2D4E81"
        ],
        "Label": "waited",
        "Title": "X-Trace Task",
        "Host": "pinky19.mpi-sws.org",
        "Duration": "57637",
        "HRT": 26962560885651291,
        "Operation": "waited",
        "Timestamp": "1557746200825.755859",
        "TenantClass": 0,
        "Source": "SocketIOWithTimeout.java:335",
        "ThreadID": 1,
        "ThreadName": "",
        "EventID": "BFDD78FE8A116B59",
        "ProcessID": 36430
      },
      {
        "Cycles": 0,
        "Agent": "edu.brown.cs.systems.xtrace.logging.BaggageWrappers",
        "ProcessName": "Read",
        "TaskID": "C42A3841E83EC5B4",
        "ParentEventID": [
          "286B84017A7CB302",
          "0C7882F7FDB4314A"
        ],
        "Label": "Merged current baggage with other baggage",
        "Title": "X-Trace Task",
        "Host": "pinky19.mpi-sws.org",
        "HRT": 26962560886014065,
        "Operation": "join",
        "Timestamp": "1557746200826.118652",
        "TenantClass": 0,
        "Source": "PacketHeader.java:168",
        "ThreadID": 1,
        "ThreadName": "",
        "EventID": "ADE813C1813889CD",
        "ProcessID": 36430
      },
      {
        "Cycles": 0,
        "Agent": "Execution-Sleep",
        "ProcessName": "Read",
        "TaskID": "C42A3841E83EC5B4",
        "ParentEventID": [
          "BFDD78FE8A116B59"
        ],
        "Label": "waited",
        "Title": "X-Trace Task",
        "Host": "pinky19.mpi-sws.org",
        "Duration": "244229",
        "HRT": 26962560885960018,
        "Operation": "waited",
        "Timestamp": "1557746200826.064697",
        "TenantClass": 0,
        "Source": "SocketIOWithTimeout.java:335",
        "ThreadID": 1,
        "ThreadName": "",
        "EventID": "286B84017A7CB302",
        "ProcessID": 36430
      },
      {
        "Cycles": 0,
        "Agent": "edu.brown.cs.systems.xtrace.logging.BaggageWrappers",
        "ProcessName": "Read",
        "TaskID": "C42A3841E83EC5B4",
        "ParentEventID": [
          "ADE813C1813889CD",
          "FDC76A664C22D6A2"
        ],
        "Label": "Merged current baggage with other baggage",
        "Title": "X-Trace Task",
        "Host": "pinky19.mpi-sws.org",
        "HRT": 26962560886066563,
        "Operation": "join",
        "Timestamp": "1557746200826.171143",
        "TenantClass": 0,
        "Source": "PacketHeader.java:168",
        "ThreadID": 1,
        "ThreadName": "",
        "EventID": "A4BEA1D01A3536DD",
        "ProcessID": 36430
      },
      {
        "Cycles": 0,
        "Agent": "Execution-Sleep",
        "ProcessName": "Data",
        "TaskID": "C42A3841E83EC5B4",
        "ParentEventID": [
          "FDC76A664C22D6A2"
        ],
        "Label": "waited",
        "Title": "X-Trace Task",
        "Host": "pinky21.mpi-sws.org",
        "Duration": "88253",
        "HRT": 10808870592469406,
        "Operation": "waited",
        "Timestamp": "1557746200826.275879",
        "TenantClass": 0,
        "Source": "SocketIOWithTimeout.java:335",
        "ThreadID": 14875,
        "ThreadName": "",
        "EventID": "42AF175F42631537",
        "BaggageBytes": "[[248 5] [240 0] [0 196 42 56 65 232 62 197 180] [240 1] [0 253 199 106 102 76 34 214 162] [240 3] [0 2]]",
        "ProcessID": 20775
      },
      {
        "Cycles": 0,
        "Agent": "edu.brown.cs.systems.xtrace.logging.BaggageWrappers",
        "ProcessName": "Read",
        "TaskID": "C42A3841E83EC5B4",
        "ParentEventID": [
          "A4BEA1D01A3536DD"
        ],
        "Label": "Forking current baggage with Baggage.fork()",
        "Title": "X-Trace Task",
        "Host": "pinky19.mpi-sws.org",
        "HRT": 26962560886075739,
        "Operation": "fork",
        "Timestamp": "1557746200826.180420",
        "TenantClass": 0,
        "Source": "RemoteBlockReader2.java:361",
        "ThreadID": 1,
        "ThreadName": "",
        "EventID": "6FEBCDE33A03A8CD",
        "ProcessID": 36430
      },
      {
        "Cycles": 0,
        "Agent": "edu.brown.cs.systems.xtrace.logging.BaggageWrappers",
        "ProcessName": "Data",
        "TaskID": "C42A3841E83EC5B4",
        "ParentEventID": [
          "42AF175F42631537",
          "6FEBCDE33A03A8CD"
        ],
        "Label": "Merged current baggage with other baggage",
        "Title": "X-Trace Task",
        "Host": "pinky21.mpi-sws.org",
        "HRT": 10808870592598323,
        "Operation": "join",
        "Timestamp": "1557746200826.404785",
        "TenantClass": 0,
        "Source": "DataXceiver.java:574",
        "ThreadID": 14875,
        "ThreadName": "",
        "EventID": "4C4195F42F4923F3",
        "BaggageBytes": "[[248 5] [240 0] [0 196 42 56 65 232 62 197 180] [240 1] [0 66 175 23 95 66 99 21 55] [0 111 235 205 227 58 3 168 205] [240 3] [0 2]]",
        "ProcessID": 20775
      },
      {
        "Cycles": 0,
        "Agent": "Execution-CPU",
        "ProcessName": "Data",
        "TaskID": "C42A3841E83EC5B4",
        "ParentEventID": [
          "4C4195F42F4923F3"
        ],
        "Label": "unset",
        "Title": "X-Trace Task",
        "Host": "pinky21.mpi-sws.org",
        "Duration": "1278088",
        "HRT": 10808870592650086,
        "Operation": "unset",
        "Timestamp": "1557746200826.456543",
        "TenantClass": 0,
        "Source": "DataXceiver.java:261",
        "ThreadID": 14875,
        "ThreadName": "",
        "EventID": "9A8BA066CC67AC2D",
        "BaggageBytes": "[[248 5] [240 0] [0 196 42 56 65 232 62 197 180] [240 1] [0 76 65 149 244 47 73 35 243] [240 3] [0 2]]",
        "ProcessID": 20775
      },
      {
        "Cycles": 0,
        "Agent": "edu.brown.cs.systems.retro.benchmarks.hdfs_client.Reader",
        "ProcessName": "Read",
        "TaskID": "C42A3841E83EC5B4",
        "ParentEventID": [
          "0"
        ],
        "Label": "Reading file",
        "Title": "X-Trace Task",
        "Host": "pinky19.mpi-sws.org",
        "HRT": 26962560883894518,
        "Timestamp": "1557746200823.999023",
        "TenantClass": 0,
        "ThreadID": 1,
        "ThreadName": "",
        "EventID": "05FF35CBD515A1CA",
        "ProcessID": 36430,
        "Tag": [
          "reader_10kb",
          "Read Size: 10240"
        ]
      }
    ]
  }
]