[
  {
    "id": "8F6132146CEBA47F",
    "reports": [
      {
        "Cycles": 0,
        "Agent": "Execution-CPU",
        "ProcessName": "Read",
        "TaskID": "8F6132146CEBA47F",
        "ParentEventID": [
          "2C45A56789A6DE3F"
        ],
        "Label": "unset",
        "Title": "X-Trace Task",
        "Host": "pinky19.mpi-sws.org",
        "Duration": "35054941",
        "HRT": 27726513433511836,
        "Operation": "unset",
        "Timestamp": "1558510153373.748047",
        "TenantClass": 0,
        "Source": "Client.java:1027",
        "ThreadID": 1,
        "ThreadName": "",
        "EventID": "E8D9E4AB6A67BE2C",
        "ProcessID": 40748
      },
      {
        "Cycles": 0,
        "Agent": "edu.brown.cs.systems.retro.benchmarks.hdfs_client.ReaderRandomSize",
        "ProcessName": "Read",
        "TaskID": "8F6132146CEBA47F",
        "ParentEventID": [
          "ABEA51AF999C87D9"
        ],
        "Label": "Reading file",
        "Title": "X-Trace Task",
        "Host": "pinky19.mpi-sws.org",
        "HRT": 27726513433423316,
        "Timestamp": "1558510153373.659668",
        "TenantClass": 0,
        "ThreadID": 1,
        "ThreadName": "",
        "EventID": "C1767BD37A495164",
        "ProcessID": 40748
      },
      {
        "Cycles": 0,
        "Agent": "edu.brown.cs.systems.retro.benchmarks.hdfs_client.ReaderRandomSize",
        "ProcessName": "Read",
        "TaskID": "8F6132146CEBA47F",
        "ParentEventID": [
          "0"
        ],
        "Label": "Reading file",
        "Title": "X-Trace Task",
        "Host": "pinky19.mpi-sws.org",
        "HRT": 27726513433399454,
        "Timestamp": "1558510153373.635742",
        "TenantClass": 0,
        "ThreadID": 1,
        "ThreadName": "",
        "EventID": "ABEA51AF999C87D9",
        "ProcessID": 40748,
        "Tag": [
          "/home/plascas/tracing-data/traceID-files/reader_small",
          "Read Size: 14336"
        ]
      },
      {
        "Cycles": 0,
        "Agent": "Execution-CPU",
        "ProcessName": "Read",
        "TaskID": "8F6132146CEBA47F",
        "ParentEventID": [
          "E8D9E4AB6A67BE2C"
        ],
        "Label": "set",
        "Title": "X-Trace Task",
        "Host": "pinky19.mpi-sws.org",
        "HRT": 27726513433546495,
        "Operation": "set",
        "Timestamp": "1558510153373.782715",
        "TenantClass": 0,
        "Source": "Client.java:1032",
        "ThreadID": 41,
        "ThreadName": "",
        "EventID": "1437934CF96EBEA3",
        "ProcessID": 40748
      },
      {
        "Cycles": 0,
        "Agent": "edu.brown.cs.systems.xtrace.logging.BaggageWrappers",
        "ProcessName": "Read",
        "TaskID": "8F6132146CEBA47F",
        "ParentEventID": [
          "1437934CF96EBEA3"
        ],
        "Label": "Forking current baggage with Baggage.fork()",
        "Title": "X-Trace Task",
        "Host": "pinky19.mpi-sws.org",
        "HRT": 27726513433574709,
        "Operation": "fork",
        "Timestamp": "1558510153373.811035",
        "TenantClass": 0,
        "Source": "Client.java:1043",
        "ThreadID": 41,
        "ThreadName": "",
        "EventID": "6744E76569046C02",
        "ProcessID": 40748
      },
      {
        "Cycles": 0,
        "Agent": "org.apache.hadoop.ipc.ProtobufRpcEngine",
        "ProcessName": "Read",
        "TaskID": "8F6132146CEBA47F",
        "ParentEventID": [
          "C1767BD37A495164"
        ],
        "Label": "Invoking org.apache.hadoop.hdfs.protocol.ClientProtocol.getBlockLocations",
        "Title": "X-Trace Task",
        "Host": "pinky19.mpi-sws.org",
        "HRT": 27726513433478854,
        "Timestamp": "1558510153373.715088",
        "TenantClass": 0,
        "Source": "ProtobufRpcEngine.java:228",
        "ThreadID": 1,
        "ThreadName": "",
        "EventID": "2C45A56789A6DE3F",
        "ProcessID": 40748
      },
      {
        "Cycles": 0,
        "Agent": "Execution-CPU",
        "ProcessName": "Read",
        "TaskID": "8F6132146CEBA47F",
        "ParentEventID": [
          "2914CB7920C14D44"
        ],
        "Label": "set",
        "Title": "X-Trace Task",
        "Host": "pinky19.mpi-sws.org",
        "HRT": 27726513433702965,
        "Operation": "set",
        "Timestamp": "1558510153373.939209",
        "TenantClass": 0,
        "Source": "Client.java:1104",
        "ThreadID": 1,
        "ThreadName": "",
        "EventID": "9B86386A8AC12BA5",
        "ProcessID": 40748
      },
      {
        "Cycles": 0,
        "Agent": "Execution-CPU",
        "ProcessName": "Name",
        "TaskID": "8F6132146CEBA47F",
        "ParentEventID": [
          "6744E76569046C02"
        ],
        "Label": "set",
        "Title": "X-Trace Task",
        "Host": "pinky19.mpi-sws.org",
        "HRT": 27726513433725423,
        "Operation": "set",
        "Timestamp": "1558510153373.974365",
        "TenantClass": 0,
        "Source": "Server.java:1840",
        "ThreadID": 48,
        "ThreadName": "",
        "EventID": "26229C2AEBE6179F",
        "BaggageBytes": "[[248 5] [240 0] [0 143 97 50 20 108 235 164 127] [240 1] [0 103 68 231 101 105 4 108 2] [240 3] [0 2]]",
        "ProcessID": 2171
      },
      {
        "Cycles": 0,
        "Agent": "edu.brown.cs.systems.xtrace.logging.BaggageWrappers",
        "ProcessName": "Name",
        "TaskID": "8F6132146CEBA47F",
        "ParentEventID": [
          "26229C2AEBE6179F"
        ],
        "Label": "Forking current baggage with Baggage.fork()",
        "Title": "X-Trace Task",
        "Host": "pinky19.mpi-sws.org",
        "HRT": 27726513433755046,
        "Operation": "fork",
        "Timestamp": "1558510153374.003906",
        "TenantClass": 0,
        "Source": "Server.java:550",
        "ThreadID": 48,
        "ThreadName": "",
        "EventID": "3DCBF17ED364CD42",
        "BaggageBytes": "[[248 5] [240 0] [0 143 97 50 20 108 235 164 127] [240 1] [0 38 34 156 42 235 230 23 159] [240 3] [0 2]]",
        "ProcessID": 2171
      },
      {
        "Cycles": 0,
        "Agent": "Execution-CPU",
        "ProcessName": "Name",
        "TaskID": "8F6132146CEBA47F",
        "ParentEventID": [
          "3DCBF17ED364CD42"
        ],
        "Label": "unset",
        "Title": "X-Trace Task",
        "Host": "pinky19.mpi-sws.org",
        "Duration": "24843",
        "HRT": 27726513433776243,
        "Operation": "unset",
        "Timestamp": "1558510153374.025146",
        "TenantClass": 0,
        "Source": "Server.java:1828",
        "ThreadID": 48,
        "ThreadName": "",
        "EventID": "0A2117097D3D9C3C",
        "BaggageBytes": "[[248 5] [240 0] [0 143 97 50 20 108 235 164 127] [240 1] [0 61 203 241 126 211 100 205 66] [240 3] [0 2]]",
        "ProcessID": 2171
      },
      {
        "Cycles": 0,
        "Agent": "Execution-CPU",
        "ProcessName": "Name",
        "TaskID": "8F6132146CEBA47F",
        "ParentEventID": [
          "3DCBF17ED364CD42"
        ],
        "Label": "set",
        "Title": "X-Trace Task",
        "Host": "pinky19.mpi-sws.org",
        "HRT": 27726513433784028,
        "Operation": "set",
        "Timestamp": "1558510153374.032959",
        "TenantClass": 0,
        "Source": "Server.java:2071",
        "ThreadID": 63,
        "ThreadName": "",
        "EventID": "0E8C50A2C36B0FD8",
        "BaggageBytes": "[[248 5] [240 0] [0 143 97 50 20 108 235 164 127] [240 1] [0 61 203 241 126 211 100 205 66] [240 3] [0 2]]",
        "ProcessID": 2171
      },
      {
        "Cycles": 0,
        "Agent": "Execution-CPU",
        "ProcessName": "Read",
        "TaskID": "8F6132146CEBA47F",
        "ParentEventID": [
          "6744E76569046C02"
        ],
        "Label": "unset",
        "Title": "X-Trace Task",
        "Host": "pinky19.mpi-sws.org",
        "Duration": "98239",
        "HRT": 27726513433670166,
        "Operation": "unset",
        "Timestamp": "1558510153373.906494",
        "TenantClass": 0,
        "Source": "Client.java:1062",
        "ThreadID": 41,
        "ThreadName": "",
        "EventID": "2914CB7920C14D44",
        "ProcessID": 40748
      },
      {
        "Cycles": 0,
        "Agent": "edu.brown.cs.systems.xtrace.logging.BaggageWrappers",
        "ProcessName": "Name",
        "TaskID": "8F6132146CEBA47F",
        "ParentEventID": [
          "07BF5699F125A019"
        ],
        "Label": "Forking current baggage with Baggage.fork()",
        "Title": "X-Trace Task",
        "Host": "pinky19.mpi-sws.org",
        "HRT": 27726513433922620,
        "Operation": "fork",
        "Timestamp": "1558510153374.171631",
        "TenantClass": 0,
        "Source": "Server.java:2398",
        "ThreadID": 63,
        "ThreadName": "",
        "EventID": "8D78CC43C4C8330D",
        "BaggageBytes": "[[248 5] [240 0] [0 143 97 50 20 108 235 164 127] [240 1] [0 7 191 86 153 241 37 160 25] [240 3] [0 2]]",
        "ProcessID": 2171
      },
      {
        "Cycles": 0,
        "Agent": "org.apache.hadoop.hdfs.server.namenode.FSNamesystem.audit",
        "ProcessName": "Name",
        "TaskID": "8F6132146CEBA47F",
        "ParentEventID": [
          "765AEF471BF763F5"
        ],
        "Label": "allowed=true\tugi=plascas (auth:SIMPLE)\tip=/139.19.171.63\tcmd=open\tsrc=/ds/Cy2IjvkVdQjGHkpH\tdst=null\tperm=null\tproto=rpc",
        "Title": "X-Trace Task",
        "Host": "pinky19.mpi-sws.org",
        "HRT": 27726513433868071,
        "Timestamp": "1558510153374.116943",
        "TenantClass": 0,
        "Source": "FSNamesystem.java:8313",
        "ThreadID": 63,
        "ThreadName": "",
        "EventID": "07BF5699F125A019",
        "BaggageBytes": "[[248 5] [240 0] [0 143 97 50 20 108 235 164 127] [240 1] [0 118 90 239 71 27 247 99 245] [240 3] [0 2]]",
        "ProcessID": 2171
      },
      {
        "Cycles": 0,
        "Agent": "Execution-CPU",
        "ProcessName": "Name",
        "TaskID": "8F6132146CEBA47F",
        "ParentEventID": [
          "8D78CC43C4C8330D"
        ],
        "Label": "unset",
        "Title": "X-Trace Task",
        "Host": "pinky19.mpi-sws.org",
        "Duration": "233482",
        "HRT": 27726513434040411,
        "Operation": "unset",
        "Timestamp": "1558510153374.289307",
        "TenantClass": 0,
        "Source": "Server.java:1058",
        "ThreadID": 63,
        "ThreadName": "",
        "EventID": "63BCE4B96C271D9E",
        "BaggageBytes": "[[248 5] [240 0] [0 143 97 50 20 108 235 164 127] [240 1] [0 141 120 204 67 196 200 51 13] [240 3] [0 2]]",
        "ProcessID": 2171
      },
      {
        "Cycles": 0,
        "Agent": "Execution-CPU",
        "ProcessName": "Read",
        "TaskID": "8F6132146CEBA47F",
        "ParentEventID": [
          "83FEF81071242718"
        ],
        "Label": "unset",
        "Title": "X-Trace Task",
        "Host": "pinky19.mpi-sws.org",
        "Duration": "15788",
        "HRT": 27726513434132900,
        "Operation": "unset",
        "Timestamp": "1558510153374.369141",
        "TenantClass": 0,
        "Source": "Client.java:1168",
        "ThreadID": 40,
        "ThreadName": "",
        "EventID": "A6DB95AFE358797F",
        "ProcessID": 40748
      },
      {
        "Cycles": 0,
        "Agent": "Execution-Sleep",
        "ProcessName": "Read",
        "TaskID": "8F6132146CEBA47F",
        "ParentEventID": [
          "9B86386A8AC12BA5"
        ],
        "Label": "waited",
        "Title": "X-Trace Task",
        "Host": "pinky19.mpi-sws.org",
        "Duration": "440543",
        "HRT": 27726513434157710,
        "Operation": "waited",
        "Timestamp": "1558510153374.394043",
        "TenantClass": 0,
        "Source": "Client.java:1537",
        "ThreadID": 1,
        "ThreadName": "",
        "EventID": "4B59E9C95467EE01",
        "ProcessID": 40748
      },
      {
        "Cycles": 0,
        "Agent": "edu.brown.cs.systems.xtrace.logging.BaggageWrappers",
        "ProcessName": "Read",
        "TaskID": "8F6132146CEBA47F",
        "ParentEventID": [
          "4B59E9C95467EE01",
          "A6DB95AFE358797F"
        ],
        "Label": "Merged current baggage with other baggage",
        "Title": "X-Trace Task",
        "Host": "pinky19.mpi-sws.org",
        "HRT": 27726513434187669,
        "Operation": "join",
        "Timestamp": "1558510153374.423828",
        "TenantClass": 0,
        "Source": "Client.java:1545",
        "ThreadID": 1,
        "ThreadName": "",
        "EventID": "933E30CC8CB306F6",
        "ProcessID": 40748
      },
      {
        "Cycles": 0,
        "Agent": "org.apache.hadoop.ipc.Server",
        "ProcessName": "Name",
        "TaskID": "8F6132146CEBA47F",
        "ParentEventID": [
          "0E8C50A2C36B0FD8"
        ],
        "Label": "getBlockLocations in org.apache.hadoop.hdfs.protocol.ClientProtocol",
        "Title": "X-Trace Task",
        "Host": "pinky19.mpi-sws.org",
        "HRT": 27726513433818515,
        "Timestamp": "1558510153374.067383",
        "TenantClass": 0,
        "Source": "ProtobufRpcEngine.java:601",
        "ThreadID": 63,
        "ThreadName": "",
        "EventID": "765AEF471BF763F5",
        "BaggageBytes": "[[248 5] [240 0] [0 143 97 50 20 108 235 164 127] [240 1] [0 14 140 80 162 195 107 15 216] [240 3] [0 2]]",
        "ProcessID": 2171
      },
      {
        "Cycles": 0,
        "Agent": "org.apache.hadoop.ipc.ProtobufRpcEngine",
        "ProcessName": "Read",
        "TaskID": "8F6132146CEBA47F",
        "ParentEventID": [
          "933E30CC8CB306F6"
        ],
        "Label": "org.apache.hadoop.hdfs.protocol.ClientProtocol.getBlockLocations completed",
        "Title": "X-Trace Task",
        "Host": "pinky19.mpi-sws.org",
        "HRT": 27726513434274376,
        "Timestamp": "1558510153374.510742",
        "TenantClass": 0,
        "Source": "ProtobufRpcEngine.java:275",
        "ThreadID": 1,
        "ThreadName": "",
        "EventID": "81C888AC7B5AE43E",
        "ProcessID": 40748
      },
      {
        "Cycles": 0,
        "Agent": "edu.brown.cs.systems.xtrace.logging.BaggageWrappers",
        "ProcessName": "Read",
        "TaskID": "8F6132146CEBA47F",
        "ParentEventID": [
          "3409176BC3BC0501"
        ],
        "Label": "Forking current baggage with Baggage.fork()",
        "Title": "X-Trace Task",
        "Host": "pinky19.mpi-sws.org",
        "HRT": 27726513434691977,
        "Operation": "fork",
        "Timestamp": "1558510153374.928223",
        "TenantClass": 0,
        "Source": "DataTransferProtoUtil.java:94",
        "ThreadID": 1,
        "ThreadName": "",
        "EventID": "20018D1D03454B23",
        "ProcessID": 40748
      },
      {
        "Cycles": 0,
        "Agent": "Execution-CPU",
        "ProcessName": "Read",
        "TaskID": "8F6132146CEBA47F",
        "ParentEventID": [
          "8D78CC43C4C8330D"
        ],
        "Label": "set",
        "Title": "X-Trace Task",
        "Host": "pinky19.mpi-sws.org",
        "HRT": 27726513434098815,
        "Operation": "set",
        "Timestamp": "1558510153374.334961",
        "TenantClass": 0,
        "Source": "Client.java:302",
        "ThreadID": 40,
        "ThreadName": "",
        "EventID": "83FEF81071242718",
        "ProcessID": 40748
      },
      {
        "Cycles": 0,
        "Agent": "Execution-CPU",
        "ProcessName": "Data",
        "TaskID": "8F6132146CEBA47F",
        "ParentEventID": [
          "20018D1D03454B23"
        ],
        "Label": "set",
        "Title": "X-Trace Task",
        "Host": "pinky24.mpi-sws.org",
        "HRT": 7337766159343714,
        "Operation": "set",
        "Timestamp": "1558510153375.280273",
        "TenantClass": 0,
        "Source": "Receiver.java:117",
        "ThreadID": 17862,
        "ThreadName": "",
        "EventID": "2E09ECF40F0554FD",
        "BaggageBytes": "[[248 5] [240 0] [0 143 97 50 20 108 235 164 127] [240 1] [0 32 1 141 29 3 69 75 35] [240 3] [0 2]]",
        "ProcessID": 28692
      },
      {
        "Cycles": 0,
        "Agent": "Execution-Sleep",
        "ProcessName": "Read",
        "TaskID": "8F6132146CEBA47F",
        "ParentEventID": [
          "81C888AC7B5AE43E"
        ],
        "Label": "waited",
        "Title": "X-Trace Task",
        "Host": "pinky19.mpi-sws.org",
        "Duration": "154953",
        "HRT": 27726513434587957,
        "Operation": "waited",
        "Timestamp": "1558510153374.824219",
        "TenantClass": 0,
        "Source": "SocketIOWithTimeout.java:335",
        "ThreadID": 1,
        "ThreadName": "",
        "EventID": "3409176BC3BC0501",
        "ProcessID": 40748
      },
      {
        "Cycles": 0,
        "Agent": "edu.brown.cs.systems.xtrace.logging.XTraceInit",
        "ProcessName": "Data",
        "TaskID": "8F6132146CEBA47F",
        "ParentEventID": [
          "2E09ECF40F0554FD"
        ],
        "Label": "Thread.setName: DataXceiver for client DFSClient_NONMAPREDUCE_1816546669_1 at /139.19.171.63:50206 [Sending block BP-1633380353-139.19.171.63-1554193446451:blk_1073768134_27310]",
        "Title": "X-Trace Task",
        "Host": "pinky24.mpi-sws.org",
        "HRT": 7337766159452851,
        "Timestamp": "1558510153375.389404",
        "TenantClass": 0,
        "Source": "DataXceiver.java:168",
        "ThreadID": 17862,
        "ThreadName": "",
        "EventID": "9F0DA1A3F3410831",
        "BaggageBytes": "[[248 5] [240 0] [0 143 97 50 20 108 235 164 127] [240 1] [0 46 9 236 244 15 5 84 253] [240 3] [0 2]]",
        "ProcessID": 28692
      },
      {
        "Cycles": 0,
        "Agent": "Execution-Sleep",
        "ProcessName": "Read",
        "TaskID": "8F6132146CEBA47F",
        "ParentEventID": [
          "20018D1D03454B23"
        ],
        "Label": "waited",
        "Title": "X-Trace Task",
        "Host": "pinky19.mpi-sws.org",
        "Duration": "17189430",
        "HRT": 27726513451996044,
        "Operation": "waited",
        "Timestamp": "1558510153392.232178",
        "TenantClass": 0,
        "Source": "SocketIOWithTimeout.java:335",
        "ThreadID": 1,
        "ThreadName": "",
        "EventID": "3EF33DE9379703FD",
        "ProcessID": 40748
      },
      {
        "Cycles": 0,
        "Agent": "edu.brown.cs.systems.xtrace.logging.BaggageWrappers",
        "ProcessName": "Data",
        "TaskID": "8F6132146CEBA47F",
        "ParentEventID": [
          "9F0DA1A3F3410831"
        ],
        "Label": "Forking current baggage with Baggage.fork()",
        "Title": "X-Trace Task",
        "Host": "pinky24.mpi-sws.org",
        "HRT": 7337766176113283,
        "Operation": "fork",
        "Timestamp": "1558510153392.049805",
        "TenantClass": 0,
        "Source": "DataXceiver.java:1257",
        "ThreadID": 17862,
        "ThreadName": "",
        "EventID": "9D8DDDEBEFE83010",
        "BaggageBytes": "[[248 5] [240 0] [0 143 97 50 20 108 235 164 127] [240 1] [0 159 13 161 163 243 65 8 49] [240 3] [0 2]]",
        "ProcessID": 28692
      },
      {
        "Cycles": 0,
        "Agent": "edu.brown.cs.systems.xtrace.logging.BaggageWrappers",
        "ProcessName": "Data",
        "TaskID": "8F6132146CEBA47F",
        "ParentEventID": [
          "9D8DDDEBEFE83010"
        ],
        "Label": "Forking current baggage with Baggage.fork()",
        "Title": "X-Trace Task",
        "Host": "pinky24.mpi-sws.org",
        "HRT": 7337766176186811,
        "Operation": "fork",
        "Timestamp": "1558510153392.123291",
        "TenantClass": 0,
        "Source": "PacketHeader.java:95",
        "ThreadID": 17862,
        "ThreadName": "",
        "EventID": "D42DECEB3EBF46D8",
        "BaggageBytes": "[[248 5] [240 0] [0 143 97 50 20 108 235 164 127] [240 1] [0 157 141 221 235 239 232 48 16] [240 3] [0 2]]",
        "ProcessID": 28692
      },
      {
        "Cycles": 0,
        "Agent": "edu.brown.cs.systems.xtrace.logging.BaggageWrappers",
        "ProcessName": "Read",
        "TaskID": "8F6132146CEBA47F",
        "ParentEventID": [
          "3EF33DE9379703FD",
          "9D8DDDEBEFE83010"
        ],
        "Label": "Merged current baggage with other baggage",
        "Title": "X-Trace Task",
        "Host": "pinky19.mpi-sws.org",
        "HRT": 27726513452131821,
        "Operation": "join",
        "Timestamp": "1558510153392.368164",
        "TenantClass": 0,
        "Source": "RemoteBlockReader2.java:429",
        "ThreadID": 1,
        "ThreadName": "",
        "EventID": "654845180D40790C",
        "ProcessID": 40748
      },
      {
        "Cycles": 0,
        "Agent": "Execution-Sleep",
        "ProcessName": "Data",
        "TaskID": "8F6132146CEBA47F",
        "ParentEventID": [
          "D42DECEB3EBF46D8"
        ],
        "Label": "waited",
        "Title": "X-Trace Task",
        "Host": "pinky24.mpi-sws.org",
        "Duration": "6092",
        "HRT": 7337766176256485,
        "Operation": "waited",
        "Timestamp": "1558510153392.192871",
        "TenantClass": 0,
        "Source": "SocketIOWithTimeout.java:335",
        "ThreadID": 17862,
        "ThreadName": "",
        "EventID": "015C02183FF84FD0",
        "BaggageBytes": "[[248 5] [240 0] [0 143 97 50 20 108 235 164 127] [240 1] [0 212 45 236 235 62 191 70 216] [240 3] [0 2]]",
        "ProcessID": 28692
      },
      {
        "Cycles": 0,
        "Agent": "edu.brown.cs.systems.xtrace.logging.BaggageWrappers",
        "ProcessName": "Data",
        "TaskID": "8F6132146CEBA47F",
        "ParentEventID": [
          "015C02183FF84FD0"
        ],
        "Label": "Forking current baggage with Baggage.fork()",
        "Title": "X-Trace Task",
        "Host": "pinky24.mpi-sws.org",
        "HRT": 7337766178252459,
        "Operation": "fork",
        "Timestamp": "1558510153394.188965",
        "TenantClass": 0,
        "Source": "PacketHeader.java:95",
        "ThreadID": 17862,
        "ThreadName": "",
        "EventID": "58CE7CE473224C2D",
        "BaggageBytes": "[[248 5] [240 0] [0 143 97 50 20 108 235 164 127] [240 1] [0 1 92 2 24 63 248 79 208] [240 3] [0 2]]",
        "ProcessID": 28692
      },
      {
        "Cycles": 0,
        "Agent": "Execution-Sleep",
        "ProcessName": "Read",
        "TaskID": "8F6132146CEBA47F",
        "ParentEventID": [
          "654845180D40790C"
        ],
        "Label": "waited",
        "Title": "X-Trace Task",
        "Host": "pinky19.mpi-sws.org",
        "Duration": "1946829",
        "HRT": 27726513454172686,
        "Operation": "waited",
        "Timestamp": "1558510153394.408936",
        "TenantClass": 0,
        "Source": "SocketIOWithTimeout.java:335",
        "ThreadID": 1,
        "ThreadName": "",
        "EventID": "CECD10354EB37CC0",
        "ProcessID": 40748
      },
      {
        "Cycles": 0,
        "Agent": "edu.brown.cs.systems.xtrace.logging.BaggageWrappers",
        "ProcessName": "Read",
        "TaskID": "8F6132146CEBA47F",
        "ParentEventID": [
          "CECD10354EB37CC0",
          "D42DECEB3EBF46D8"
        ],
        "Label": "Merged current baggage with other baggage",
        "Title": "X-Trace Task",
        "Host": "pinky19.mpi-sws.org",
        "HRT": 27726513454279310,
        "Operation": "join",
        "Timestamp": "1558510153394.515625",
        "TenantClass": 0,
        "Source": "PacketHeader.java:168",
        "ThreadID": 1,
        "ThreadName": "",
        "EventID": "8455E9BD4E14DA8F",
        "ProcessID": 40748
      },
      {
        "Cycles": 0,
        "Agent": "edu.brown.cs.systems.xtrace.logging.BaggageWrappers",
        "ProcessName": "Read",
        "TaskID": "8F6132146CEBA47F",
        "ParentEventID": [
          "58CE7CE473224C2D",
          "8455E9BD4E14DA8F"
        ],
        "Label": "Merged current baggage with other baggage",
        "Title": "X-Trace Task",
        "Host": "pinky19.mpi-sws.org",
        "HRT": 27726513454359548,
        "Operation": "join",
        "Timestamp": "1558510153394.595703",
        "TenantClass": 0,
        "Source": "PacketHeader.java:168",
        "ThreadID": 1,
        "ThreadName": "",
        "EventID": "4E0BACFDD86756EE",
        "ProcessID": 40748
      },
      {
        "Cycles": 0,
        "Agent": "edu.brown.cs.systems.xtrace.logging.BaggageWrappers",
        "ProcessName": "Read",
        "TaskID": "8F6132146CEBA47F",
        "ParentEventID": [
          "4E0BACFDD86756EE"
        ],
        "Label": "Forking current baggage with Baggage.fork()",
        "Title": "X-Trace Task",
        "Host": "pinky19.mpi-sws.org",
        "HRT": 27726513454374314,
        "Operation": "fork",
        "Timestamp": "1558510153394.610596",
        "TenantClass": 0,
        "Source": "RemoteBlockReader2.java:361",
        "ThreadID": 1,
        "ThreadName": "",
        "EventID": "C444490F5F5A52F0",
        "ProcessID": 40748
      },
      {
        "Cycles": 0,
        "Agent": "Execution-Sleep",
        "ProcessName": "Data",
        "TaskID": "8F6132146CEBA47F",
        "ParentEventID": [
          "58CE7CE473224C2D"
        ],
        "Label": "waited",
        "Title": "X-Trace Task",
        "Host": "pinky24.mpi-sws.org",
        "Duration": "451616",
        "HRT": 7337766178801986,
        "Operation": "waited",
        "Timestamp": "1558510153394.738525",
        "TenantClass": 0,
        "Source": "SocketIOWithTimeout.java:335",
        "ThreadID": 17862,
        "ThreadName": "",
        "EventID": "45B52F8B53AD44BE",
        "BaggageBytes": "[[248 5] [240 0] [0 143 97 50 20 108 235 164 127] [240 1] [0 88 206 124 228 115 34 76 45] [240 3] [0 2]]",
        "ProcessID": 28692
      },
      {
        "Cycles": 0,
        "Agent": "Execution-CPU",
        "ProcessName": "Data",
        "TaskID": "8F6132146CEBA47F",
        "ParentEventID": [
          "10BF620ED78EE0BF"
        ],
        "Label": "unset",
        "Title": "X-Trace Task",
        "Host": "pinky24.mpi-sws.org",
        "Duration": "19674049",
        "HRT": 7337766179088850,
        "Operation": "unset",
        "Timestamp": "1558510153395.025391",
        "TenantClass": 0,
        "Source": "DataXceiver.java:261",
        "ThreadID": 17862,
        "ThreadName": "",
        "EventID": "7C9CC59E76247C7C",
        "BaggageBytes": "[[248 5] [240 0] [0 143 97 50 20 108 235 164 127] [240 1] [0 16 191 98 14 215 142 224 191] [240 3] [0 2]]",
        "ProcessID": 28692
      },
      {
        "Cycles": 0,
        "Agent": "edu.brown.cs.systems.xtrace.logging.BaggageWrappers",
        "ProcessName": "Data",
        "TaskID": "8F6132146CEBA47F",
        "ParentEventID": [
          "45B52F8B53AD44BE",
          "C444490F5F5A52F0"
        ],
        "Label": "Merged current baggage with other baggage",
        "Title": "X-Trace Task",
        "Host": "pinky24.mpi-sws.org",
        "HRT": 7337766178992553,
        "Operation": "join",
        "Timestamp": "1558510153394.928955",
        "TenantClass": 0,
        "Source": "DataXceiver.java:574",
        "ThreadID": 17862,
        "ThreadName": "",
        "EventID": "10BF620ED78EE0BF",
        "BaggageBytes": "[[248 5] [240 0] [0 143 97 50 20 108 235 164 127] [240 1] [0 196 68 73 15 95 90 82 240] [0 69 181 47 139 83 173 68 190] [240 3] [0 2]]",
        "ProcessID": 28692
      }
    ]
  }
]