[
  {
    "id": "86755B7AE4B4FA6D",
    "reports": [
      {
        "Cycles": 0,
        "Agent": "edu.brown.cs.systems.retro.benchmarks.hdfs_client.Reader",
        "ProcessName": "Read",
        "TaskID": "86755B7AE4B4FA6D",
        "ParentEventID": [
          "0"
        ],
        "Label": "Reading file",
        "Title": "X-Trace Task",
        "Host": "pinky19.mpi-sws.org",
        "HRT": 25488829156789431,
        "Timestamp": "1556272469096.907227",
        "TenantClass": 0,
        "ThreadID": 1,
        "ThreadName": "",
        "EventID": "E837253F5679E5C6",
        "ProcessID": 6356,
        "Tag": [
          "reader_1mb",
          "Read Size: 1048576"
        ]
      },
      {
        "Cycles": 0,
        "Agent": "edu.brown.cs.systems.retro.benchmarks.hdfs_client.Reader",
        "ProcessName": "Read",
        "TaskID": "86755B7AE4B4FA6D",
        "ParentEventID": [
          "E837253F5679E5C6"
        ],
        "Label": "Reading file",
        "Title": "X-Trace Task",
        "Host": "pinky19.mpi-sws.org",
        "HRT": 25488829156820886,
        "Timestamp": "1556272469096.938477",
        "TenantClass": 0,
        "ThreadID": 1,
        "ThreadName": "",
        "EventID": "9E2B3FB3877F3C66",
        "ProcessID": 6356
      },
      {
        "Cycles": 0,
        "Agent": "Execution-CPU",
        "ProcessName": "Read",
        "TaskID": "86755B7AE4B4FA6D",
        "ParentEventID": [
          "53FE45FA05AB478B"
        ],
        "Label": "unset",
        "Title": "X-Trace Task",
        "Host": "pinky19.mpi-sws.org",
        "Duration": "34815818",
        "HRT": 25488829157076906,
        "Operation": "unset",
        "Timestamp": "1556272469097.194580",
        "TenantClass": 0,
        "Source": "Client.java:1027",
        "ThreadID": 1,
        "ThreadName": "",
        "EventID": "4B047B1C36A32ECC",
        "ProcessID": 6356
      },
      {
        "Cycles": 0,
        "Agent": "org.apache.hadoop.ipc.ProtobufRpcEngine",
        "ProcessName": "Read",
        "TaskID": "86755B7AE4B4FA6D",
        "ParentEventID": [
          "9E2B3FB3877F3C66"
        ],
        "Label": "Invoking org.apache.hadoop.hdfs.protocol.ClientProtocol.getBlockLocations",
        "Title": "X-Trace Task",
        "Host": "pinky19.mpi-sws.org",
        "HRT": 25488829156993619,
        "Timestamp": "1556272469097.111328",
        "TenantClass": 0,
        "Source": "ProtobufRpcEngine.java:228",
        "ThreadID": 1,
        "ThreadName": "",
        "EventID": "53FE45FA05AB478B",
        "ProcessID": 6356
      },
      {
        "Cycles": 0,
        "Agent": "Execution-CPU",
        "ProcessName": "Read",
        "TaskID": "86755B7AE4B4FA6D",
        "ParentEventID": [
          "4B047B1C36A32ECC"
        ],
        "Label": "set",
        "Title": "X-Trace Task",
        "Host": "pinky19.mpi-sws.org",
        "HRT": 25488829157134883,
        "Operation": "set",
        "Timestamp": "1556272469097.252441",
        "TenantClass": 0,
        "Source": "Client.java:1032",
        "ThreadID": 41,
        "ThreadName": "",
        "EventID": "CA9AD2D79B4C41DD",
        "ProcessID": 6356
      },
      {
        "Cycles": 0,
        "Agent": "edu.brown.cs.systems.xtrace.logging.BaggageWrappers",
        "ProcessName": "Read",
        "TaskID": "86755B7AE4B4FA6D",
        "ParentEventID": [
          "CA9AD2D79B4C41DD"
        ],
        "Label": "Forking current baggage with Baggage.fork()",
        "Title": "X-Trace Task",
        "Host": "pinky19.mpi-sws.org",
        "HRT": 25488829157160946,
        "Operation": "fork",
        "Timestamp": "1556272469097.278564",
        "TenantClass": 0,
        "Source": "Client.java:1043",
        "ThreadID": 41,
        "ThreadName": "",
        "EventID": "BB070EDA1CC0E33D",
        "ProcessID": 6356
      },
      {
        "Cycles": 0,
        "Agent": "Execution-CPU",
        "ProcessName": "Read",
        "TaskID": "86755B7AE4B4FA6D",
        "ParentEventID": [
          "BB070EDA1CC0E33D"
        ],
        "Label": "unset",
        "Title": "X-Trace Task",
        "Host": "pinky19.mpi-sws.org",
        "Duration": "219096",
        "HRT": 25488829157375529,
        "Operation": "unset",
        "Timestamp": "1556272469097.493164",
        "TenantClass": 0,
        "Source": "Client.java:1062",
        "ThreadID": 41,
        "ThreadName": "",
        "EventID": "09A44EEABADBB624",
        "ProcessID": 6356
      },
      {
        "Cycles": 0,
        "Agent": "Execution-CPU",
        "ProcessName": "Name",
        "TaskID": "86755B7AE4B4FA6D",
        "ParentEventID": [
          "BB070EDA1CC0E33D"
        ],
        "Label": "set",
        "Title": "X-Trace Task",
        "Host": "pinky19.mpi-sws.org",
        "HRT": 25488829157471636,
        "Operation": "set",
        "Timestamp": "1556272469097.523193",
        "TenantClass": 0,
        "Source": "Server.java:1840",
        "ThreadID": 48,
        "ThreadName": "",
        "EventID": "E3F6669605168FBF",
        "BaggageBytes": "[[248 5] [240 0] [0 134 117 91 122 228 180 250 109] [240 1] [0 187 7 14 218 28 192 227 61] [240 3] [0 2]]",
        "ProcessID": 2171
      },
      {
        "Cycles": 0,
        "Agent": "edu.brown.cs.systems.xtrace.logging.BaggageWrappers",
        "ProcessName": "Name",
        "TaskID": "86755B7AE4B4FA6D",
        "ParentEventID": [
          "E3F6669605168FBF"
        ],
        "Label": "Forking current baggage with Baggage.fork()",
        "Title": "X-Trace Task",
        "Host": "pinky19.mpi-sws.org",
        "HRT": 25488829157534504,
        "Operation": "fork",
        "Timestamp": "1556272469097.585938",
        "TenantClass": 0,
        "Source": "Server.java:550",
        "ThreadID": 48,
        "ThreadName": "",
        "EventID": "9CDEACB22A29FE7D",
        "BaggageBytes": "[[248 5] [240 0] [0 134 117 91 122 228 180 250 109] [240 1] [0 227 246 102 150 5 22 143 191] [240 3] [0 2]]",
        "ProcessID": 2171
      },
      {
        "Cycles": 0,
        "Agent": "Execution-CPU",
        "ProcessName": "Read",
        "TaskID": "86755B7AE4B4FA6D",
        "ParentEventID": [
          "09A44EEABADBB624"
        ],
        "Label": "set",
        "Title": "X-Trace Task",
        "Host": "pinky19.mpi-sws.org",
        "HRT": 25488829157406472,
        "Operation": "set",
        "Timestamp": "1556272469097.524170",
        "TenantClass": 0,
        "Source": "Client.java:1104",
        "ThreadID": 1,
        "ThreadName": "",
        "EventID": "8547DCA797E46F1C",
        "ProcessID": 6356
      },
      {
        "Cycles": 0,
        "Agent": "Execution-CPU",
        "ProcessName": "Name",
        "TaskID": "86755B7AE4B4FA6D",
        "ParentEventID": [
          "9CDEACB22A29FE7D"
        ],
        "Label": "unset",
        "Title": "X-Trace Task",
        "Host": "pinky19.mpi-sws.org",
        "Duration": "39061",
        "HRT": 25488829157561829,
        "Operation": "unset",
        "Timestamp": "1556272469097.613281",
        "TenantClass": 0,
        "Source": "Server.java:1828",
        "ThreadID": 48,
        "ThreadName": "",
        "EventID": "3DC16F62346F0254",
        "BaggageBytes": "[[248 5] [240 0] [0 134 117 91 122 228 180 250 109] [240 1] [0 156 222 172 178 42 41 254 125] [240 3] [0 2]]",
        "ProcessID": 2171
      },
      {
        "Cycles": 0,
        "Agent": "org.apache.hadoop.ipc.Server",
        "ProcessName": "Name",
        "TaskID": "86755B7AE4B4FA6D",
        "ParentEventID": [
          "C9AAAFB468D6DA22"
        ],
        "Label": "getBlockLocations in org.apache.hadoop.hdfs.protocol.ClientProtocol",
        "Title": "X-Trace Task",
        "Host": "pinky19.mpi-sws.org",
        "HRT": 25488829157612761,
        "Timestamp": "1556272469097.664307",
        "TenantClass": 0,
        "Source": "ProtobufRpcEngine.java:601",
        "ThreadID": 58,
        "ThreadName": "",
        "EventID": "F8C8EDD0A103A25B",
        "BaggageBytes": "[[248 5] [240 0] [0 134 117 91 122 228 180 250 109] [240 1] [0 201 170 175 180 104 214 218 34] [240 3] [0 2]]",
        "ProcessID": 2171
      },
      {
        "Cycles": 0,
        "Agent": "Execution-CPU",
        "ProcessName": "Name",
        "TaskID": "86755B7AE4B4FA6D",
        "ParentEventID": [
          "9CDEACB22A29FE7D"
        ],
        "Label": "set",
        "Title": "X-Trace Task",
        "Host": "pinky19.mpi-sws.org",
        "HRT": 25488829157576164,
        "Operation": "set",
        "Timestamp": "1556272469097.627686",
        "TenantClass": 0,
        "Source": "Server.java:2071",
        "ThreadID": 58,
        "ThreadName": "",
        "EventID": "C9AAAFB468D6DA22",
        "BaggageBytes": "[[248 5] [240 0] [0 134 117 91 122 228 180 250 109] [240 1] [0 156 222 172 178 42 41 254 125] [240 3] [0 2]]",
        "ProcessID": 2171
      },
      {
        "Cycles": 0,
        "Agent": "edu.brown.cs.systems.xtrace.logging.BaggageWrappers",
        "ProcessName": "Name",
        "TaskID": "86755B7AE4B4FA6D",
        "ParentEventID": [
          "684D2F2A6E81C132"
        ],
        "Label": "Forking current baggage with Baggage.fork()",
        "Title": "X-Trace Task",
        "Host": "pinky19.mpi-sws.org",
        "HRT": 25488829157704798,
        "Operation": "fork",
        "Timestamp": "1556272469097.756348",
        "TenantClass": 0,
        "Source": "Server.java:2398",
        "ThreadID": 58,
        "ThreadName": "",
        "EventID": "51C79852911AD450",
        "BaggageBytes": "[[248 5] [240 0] [0 134 117 91 122 228 180 250 109] [240 1] [0 104 77 47 42 110 129 193 50] [240 3] [0 2]]",
        "ProcessID": 2171
      },
      {
        "Cycles": 0,
        "Agent": "Execution-CPU",
        "ProcessName": "Name",
        "TaskID": "86755B7AE4B4FA6D",
        "ParentEventID": [
          "51C79852911AD450"
        ],
        "Label": "unset",
        "Title": "X-Trace Task",
        "Host": "pinky19.mpi-sws.org",
        "Duration": "221416",
        "HRT": 25488829157822159,
        "Operation": "unset",
        "Timestamp": "1556272469097.873535",
        "TenantClass": 0,
        "Source": "Server.java:1058",
        "ThreadID": 58,
        "ThreadName": "",
        "EventID": "42C0DDE03A8E4359",
        "BaggageBytes": "[[248 5] [240 0] [0 134 117 91 122 228 180 250 109] [240 1] [0 81 199 152 82 145 26 212 80] [240 3] [0 2]]",
        "ProcessID": 2171
      },
      {
        "Cycles": 0,
        "Agent": "org.apache.hadoop.hdfs.server.namenode.FSNamesystem.audit",
        "ProcessName": "Name",
        "TaskID": "86755B7AE4B4FA6D",
        "ParentEventID": [
          "F8C8EDD0A103A25B"
        ],
        "Label": "allowed=true\tugi=plascas (auth:SIMPLE)\tip=/139.19.171.63\tcmd=open\tsrc=/ds/SapHrtbJThnDvcgh\tdst=null\tperm=null\tproto=rpc",
        "Title": "X-Trace Task",
        "Host": "pinky19.mpi-sws.org",
        "HRT": 25488829157659968,
        "Timestamp": "1556272469097.711426",
        "TenantClass": 0,
        "Source": "FSNamesystem.java:8313",
        "ThreadID": 58,
        "ThreadName": "",
        "EventID": "684D2F2A6E81C132",
        "BaggageBytes": "[[248 5] [240 0] [0 134 117 91 122 228 180 250 109] [240 1] [0 248 200 237 208 161 3 162 91] [240 3] [0 2]]",
        "ProcessID": 2171
      },
      {
        "Cycles": 0,
        "Agent": "Execution-CPU",
        "ProcessName": "Read",
        "TaskID": "86755B7AE4B4FA6D",
        "ParentEventID": [
          "51C79852911AD450"
        ],
        "Label": "set",
        "Title": "X-Trace Task",
        "Host": "pinky19.mpi-sws.org",
        "HRT": 25488829157883192,
        "Operation": "set",
        "Timestamp": "1556272469098.000977",
        "TenantClass": 0,
        "Source": "Client.java:302",
        "ThreadID": 40,
        "ThreadName": "",
        "EventID": "866A0FBD7243C632",
        "ProcessID": 6356
      },
      {
        "Cycles": 0,
        "Agent": "Execution-CPU",
        "ProcessName": "Read",
        "TaskID": "86755B7AE4B4FA6D",
        "ParentEventID": [
          "866A0FBD7243C632"
        ],
        "Label": "unset",
        "Title": "X-Trace Task",
        "Host": "pinky19.mpi-sws.org",
        "Duration": "20325",
        "HRT": 25488829157924683,
        "Operation": "unset",
        "Timestamp": "1556272469098.042480",
        "TenantClass": 0,
        "Source": "Client.java:1168",
        "ThreadID": 40,
        "ThreadName": "",
        "EventID": "1511F5B59C535AA4",
        "ProcessID": 6356
      },
      {
        "Cycles": 0,
        "Agent": "Execution-Sleep",
        "ProcessName": "Read",
        "TaskID": "86755B7AE4B4FA6D",
        "ParentEventID": [
          "8547DCA797E46F1C"
        ],
        "Label": "waited",
        "Title": "X-Trace Task",
        "Host": "pinky19.mpi-sws.org",
        "Duration": "532763",
        "HRT": 25488829157948791,
        "Operation": "waited",
        "Timestamp": "1556272469098.066406",
        "TenantClass": 0,
        "Source": "Client.java:1537",
        "ThreadID": 1,
        "ThreadName": "",
        "EventID": "CFA780DC7DF32B72",
        "ProcessID": 6356
      },
      {
        "Cycles": 0,
        "Agent": "edu.brown.cs.systems.xtrace.logging.BaggageWrappers",
        "ProcessName": "Read",
        "TaskID": "86755B7AE4B4FA6D",
        "ParentEventID": [
          "1511F5B59C535AA4",
          "CFA780DC7DF32B72"
        ],
        "Label": "Merged current baggage with other baggage",
        "Title": "X-Trace Task",
        "Host": "pinky19.mpi-sws.org",
        "HRT": 25488829157973210,
        "Operation": "join",
        "Timestamp": "1556272469098.090820",
        "TenantClass": 0,
        "Source": "Client.java:1545",
        "ThreadID": 1,
        "ThreadName": "",
        "EventID": "E8F973CCE3D96D40",
        "ProcessID": 6356
      },
      {
        "Cycles": 0,
        "Agent": "org.apache.hadoop.ipc.ProtobufRpcEngine",
        "ProcessName": "Read",
        "TaskID": "86755B7AE4B4FA6D",
        "ParentEventID": [
          "E8F973CCE3D96D40"
        ],
        "Label": "org.apache.hadoop.hdfs.protocol.ClientProtocol.getBlockLocations completed",
        "Title": "X-Trace Task",
        "Host": "pinky19.mpi-sws.org",
        "HRT": 25488829158073904,
        "Timestamp": "1556272469098.191650",
        "TenantClass": 0,
        "Source": "ProtobufRpcEngine.java:275",
        "ThreadID": 1,
        "ThreadName": "",
        "EventID": "E63A9B995ED84D61",
        "ProcessID": 6356
      },
      {
        "Cycles": 0,
        "Agent": "edu.brown.cs.systems.xtrace.logging.BaggageWrappers",
        "ProcessName": "Read",
        "TaskID": "86755B7AE4B4FA6D",
        "ParentEventID": [
          "CFE040B5BC256B18"
        ],
        "Label": "Forking current baggage with Baggage.fork()",
        "Title": "X-Trace Task",
        "Host": "pinky19.mpi-sws.org",
        "HRT": 25488829158529891,
        "Operation": "fork",
        "Timestamp": "1556272469098.647461",
        "TenantClass": 0,
        "Source": "DataTransferProtoUtil.java:94",
        "ThreadID": 1,
        "ThreadName": "",
        "EventID": "8963970BC552CB3E",
        "ProcessID": 6356
      },
      {
        "Cycles": 0,
        "Agent": "Execution-CPU",
        "ProcessName": "Data",
        "TaskID": "86755B7AE4B4FA6D",
        "ParentEventID": [
          "8963970BC552CB3E"
        ],
        "Label": "set",
        "Title": "X-Trace Task",
        "Host": "pinky19.mpi-sws.org",
        "HRT": 25488829158725142,
        "Operation": "set",
        "Timestamp": "1556272469098.836914",
        "TenantClass": 0,
        "Source": "Receiver.java:117",
        "ThreadID": 7108,
        "ThreadName": "",
        "EventID": "2E637DD0B43513C1",
        "BaggageBytes": "[[248 5] [240 0] [0 134 117 91 122 228 180 250 109] [240 1] [0 137 99 151 11 197 82 203 62] [240 3] [0 2]]",
        "ProcessID": 2319
      },
      {
        "Cycles": 0,
        "Agent": "Execution-Sleep",
        "ProcessName": "Read",
        "TaskID": "86755B7AE4B4FA6D",
        "ParentEventID": [
          "E63A9B995ED84D61"
        ],
        "Label": "waited",
        "Title": "X-Trace Task",
        "Host": "pinky19.mpi-sws.org",
        "Duration": "5573",
        "HRT": 25488829158366217,
        "Operation": "waited",
        "Timestamp": "1556272469098.483887",
        "TenantClass": 0,
        "Source": "SocketIOWithTimeout.java:335",
        "ThreadID": 1,
        "ThreadName": "",
        "EventID": "CFE040B5BC256B18",
        "ProcessID": 6356
      },
      {
        "Cycles": 0,
        "Agent": "edu.brown.cs.systems.xtrace.logging.XTraceInit",
        "ProcessName": "Data",
        "TaskID": "86755B7AE4B4FA6D",
        "ParentEventID": [
          "2E637DD0B43513C1"
        ],
        "Label": "Thread.setName: DataXceiver for client DFSClient_NONMAPREDUCE_614514224_1 at /139.19.171.63:40328 [Sending block BP-1633380353-139.19.171.63-1554193446451:blk_1073759411_18587]",
        "Title": "X-Trace Task",
        "Host": "pinky19.mpi-sws.org",
        "HRT": 25488829158770348,
        "Timestamp": "1556272469098.882080",
        "TenantClass": 0,
        "Source": "DataXceiver.java:168",
        "ThreadID": 7108,
        "ThreadName": "",
        "EventID": "902FC9FF6B73E711",
        "BaggageBytes": "[[248 5] [240 0] [0 134 117 91 122 228 180 250 109] [240 1] [0 46 99 125 208 180 53 19 193] [240 3] [0 2]]",
        "ProcessID": 2319
      },
      {
        "Cycles": 0,
        "Agent": "edu.brown.cs.systems.xtrace.logging.BaggageWrappers",
        "ProcessName": "Data",
        "TaskID": "86755B7AE4B4FA6D",
        "ParentEventID": [
          "0B28DCA81C30EDCA"
        ],
        "Label": "Forking current baggage with Baggage.fork()",
        "Title": "X-Trace Task",
        "Host": "pinky19.mpi-sws.org",
        "HRT": 25488829158937744,
        "Operation": "fork",
        "Timestamp": "1556272469099.049561",
        "TenantClass": 0,
        "Source": "PacketHeader.java:95",
        "ThreadID": 7108,
        "ThreadName": "",
        "EventID": "9672555CC2982621",
        "BaggageBytes": "[[248 5] [240 0] [0 134 117 91 122 228 180 250 109] [240 1] [0 11 40 220 168 28 48 237 202] [240 3] [0 2]]",
        "ProcessID": 2319
      },
      {
        "Cycles": 0,
        "Agent": "Execution-Sleep",
        "ProcessName": "Read",
        "TaskID": "86755B7AE4B4FA6D",
        "ParentEventID": [
          "8963970BC552CB3E"
        ],
        "Label": "waited",
        "Title": "X-Trace Task",
        "Host": "pinky19.mpi-sws.org",
        "Duration": "242528",
        "HRT": 25488829158953837,
        "Operation": "waited",
        "Timestamp": "1556272469099.071533",
        "TenantClass": 0,
        "Source": "SocketIOWithTimeout.java:335",
        "ThreadID": 1,
        "ThreadName": "",
        "EventID": "7D756FDA86BB97EF",
        "ProcessID": 6356
      },
      {
        "Cycles": 0,
        "Agent": "edu.brown.cs.systems.xtrace.logging.BaggageWrappers",
        "ProcessName": "Data",
        "TaskID": "86755B7AE4B4FA6D",
        "ParentEventID": [
          "902FC9FF6B73E711"
        ],
        "Label": "Forking current baggage with Baggage.fork()",
        "Title": "X-Trace Task",
        "Host": "pinky19.mpi-sws.org",
        "HRT": 25488829158861449,
        "Operation": "fork",
        "Timestamp": "1556272469098.973145",
        "TenantClass": 0,
        "Source": "DataXceiver.java:1257",
        "ThreadID": 7108,
        "ThreadName": "",
        "EventID": "0B28DCA81C30EDCA",
        "BaggageBytes": "[[248 5] [240 0] [0 134 117 91 122 228 180 250 109] [240 1] [0 144 47 201 255 107 115 231 17] [240 3] [0 2]]",
        "ProcessID": 2319
      },
      {
        "Cycles": 0,
        "Agent": "Execution-Sleep",
        "ProcessName": "Data",
        "TaskID": "86755B7AE4B4FA6D",
        "ParentEventID": [
          "9672555CC2982621"
        ],
        "Label": "waited",
        "Title": "X-Trace Task",
        "Host": "pinky19.mpi-sws.org",
        "Duration": "3867",
        "HRT": 25488829159000052,
        "Operation": "waited",
        "Timestamp": "1556272469099.111816",
        "TenantClass": 0,
        "Source": "SocketIOWithTimeout.java:335",
        "ThreadID": 7108,
        "ThreadName": "",
        "EventID": "066647866396119D",
        "BaggageBytes": "[[248 5] [240 0] [0 134 117 91 122 228 180 250 109] [240 1] [0 150 114 85 92 194 152 38 33] [240 3] [0 2]]",
        "ProcessID": 2319
      },
      {
        "Cycles": 0,
        "Agent": "edu.brown.cs.systems.xtrace.logging.BaggageWrappers",
        "ProcessName": "Read",
        "TaskID": "86755B7AE4B4FA6D",
        "ParentEventID": [
          "0B28DCA81C30EDCA",
          "7D756FDA86BB97EF"
        ],
        "Label": "Merged current baggage with other baggage",
        "Title": "X-Trace Task",
        "Host": "pinky19.mpi-sws.org",
        "HRT": 25488829159096730,
        "Operation": "join",
        "Timestamp": "1556272469099.214355",
        "TenantClass": 0,
        "Source": "RemoteBlockReader2.java:429",
        "ThreadID": 1,
        "ThreadName": "",
        "EventID": "06011459A4476CFD",
        "ProcessID": 6356
      },
      {
        "Cycles": 0,
        "Agent": "edu.brown.cs.systems.xtrace.logging.BaggageWrappers",
        "ProcessName": "Read",
        "TaskID": "86755B7AE4B4FA6D",
        "ParentEventID": [
          "06011459A4476CFD",
          "9672555CC2982621"
        ],
        "Label": "Merged current baggage with other baggage",
        "Title": "X-Trace Task",
        "Host": "pinky19.mpi-sws.org",
        "HRT": 25488829159264680,
        "Operation": "join",
        "Timestamp": "1556272469099.382324",
        "TenantClass": 0,
        "Source": "PacketHeader.java:168",
        "ThreadID": 1,
        "ThreadName": "",
        "EventID": "4D1E0E2F3F0D132B",
        "ProcessID": 6356
      },
      {
        "Cycles": 0,
        "Agent": "edu.brown.cs.systems.xtrace.logging.BaggageWrappers",
        "ProcessName": "Data",
        "TaskID": "86755B7AE4B4FA6D",
        "ParentEventID": [
          "066647866396119D"
        ],
        "Label": "Forking current baggage with Baggage.fork()",
        "Title": "X-Trace Task",
        "Host": "pinky19.mpi-sws.org",
        "HRT": 25488829159075697,
        "Operation": "fork",
        "Timestamp": "1556272469099.187500",
        "TenantClass": 0,
        "Source": "PacketHeader.java:95",
        "ThreadID": 7108,
        "ThreadName": "",
        "EventID": "A364281532D9CC55",
        "BaggageBytes": "[[248 5] [240 0] [0 134 117 91 122 228 180 250 109] [240 1] [0 6 102 71 134 99 150 17 157] [240 3] [0 2]]",
        "ProcessID": 2319
      },
      {
        "Cycles": 0,
        "Agent": "edu.brown.cs.systems.xtrace.logging.BaggageWrappers",
        "ProcessName": "Read",
        "TaskID": "86755B7AE4B4FA6D",
        "ParentEventID": [
          "4D1E0E2F3F0D132B",
          "A364281532D9CC55"
        ],
        "Label": "Merged current baggage with other baggage",
        "Title": "X-Trace Task",
        "Host": "pinky19.mpi-sws.org",
        "HRT": 25488829159386179,
        "Operation": "join",
        "Timestamp": "1556272469099.503906",
        "TenantClass": 0,
        "Source": "PacketHeader.java:168",
        "ThreadID": 1,
        "ThreadName": "",
        "EventID": "85AC4B38B1CDAF80",
        "ProcessID": 6356
      },
      {
        "Cycles": 0,
        "Agent": "Execution-Sleep",
        "ProcessName": "Data",
        "TaskID": "86755B7AE4B4FA6D",
        "ParentEventID": [
          "A364281532D9CC55"
        ],
        "Label": "waited",
        "Title": "X-Trace Task",
        "Host": "pinky19.mpi-sws.org",
        "Duration": "343606",
        "HRT": 25488829159502569,
        "Operation": "waited",
        "Timestamp": "1556272469099.614258",
        "TenantClass": 0,
        "Source": "SocketIOWithTimeout.java:335",
        "ThreadID": 7108,
        "ThreadName": "",
        "EventID": "89D550718744E36B",
        "BaggageBytes": "[[248 5] [240 0] [0 134 117 91 122 228 180 250 109] [240 1] [0 163 100 40 21 50 217 204 85] [240 3] [0 2]]",
        "ProcessID": 2319
      },
      {
        "Cycles": 0,
        "Agent": "edu.brown.cs.systems.xtrace.logging.BaggageWrappers",
        "ProcessName": "Data",
        "TaskID": "86755B7AE4B4FA6D",
        "ParentEventID": [
          "89D550718744E36B",
          "4FC08C4B2CA06135"
        ],
        "Label": "Merged current baggage with other baggage",
        "Title": "X-Trace Task",
        "Host": "pinky19.mpi-sws.org",
        "HRT": 25488829159553798,
        "Operation": "join",
        "Timestamp": "1556272469099.665527",
        "TenantClass": 0,
        "Source": "DataXceiver.java:574",
        "ThreadID": 7108,
        "ThreadName": "",
        "EventID": "B25FEFC901B750E0",
        "BaggageBytes": "[[248 5] [240 0] [0 134 117 91 122 228 180 250 109] [240 1] [0 137 213 80 113 135 68 227 107] [0 79 192 140 75 44 160 97 53] [240 3] [0 2]]",
        "ProcessID": 2319
      },
      {
        "Cycles": 0,
        "Agent": "edu.brown.cs.systems.xtrace.logging.BaggageWrappers",
        "ProcessName": "Read",
        "TaskID": "86755B7AE4B4FA6D",
        "ParentEventID": [
          "85AC4B38B1CDAF80"
        ],
        "Label": "Forking current baggage with Baggage.fork()",
        "Title": "X-Trace Task",
        "Host": "pinky19.mpi-sws.org",
        "HRT": 25488829159405573,
        "Operation": "fork",
        "Timestamp": "1556272469099.523193",
        "TenantClass": 0,
        "Source": "RemoteBlockReader2.java:361",
        "ThreadID": 1,
        "ThreadName": "",
        "EventID": "4FC08C4B2CA06135",
        "ProcessID": 6356
      },
      {
        "Cycles": 0,
        "Agent": "Execution-CPU",
        "ProcessName": "Data",
        "TaskID": "86755B7AE4B4FA6D",
        "ParentEventID": [
          "B25FEFC901B750E0"
        ],
        "Label": "unset",
        "Title": "X-Trace Task",
        "Host": "pinky19.mpi-sws.org",
        "Duration": "823136",
        "HRT": 25488829159573770,
        "Operation": "unset",
        "Timestamp": "1556272469099.685547",
        "TenantClass": 0,
        "Source": "DataXceiver.java:261",
        "ThreadID": 7108,
        "ThreadName": "",
        "EventID": "5DD50C2315FBC5EF",
        "BaggageBytes": "[[248 5] [240 0] [0 134 117 91 122 228 180 250 109] [240 1] [0 178 95 239 201 1 183 80 224] [240 3] [0 2]]",
        "ProcessID": 2319
      },
      {
        "Cycles": 0,
        "Agent": "edu.brown.cs.systems.xtrace.logging.BaggageWrappers",
        "ProcessName": "Read",
        "TaskID": "86755B7AE4B4FA6D",
        "ParentEventID": [
          "4FC08C4B2CA06135"
        ],
        "Label": "Forking current baggage with Baggage.fork()",
        "Title": "X-Trace Task",
        "Host": "pinky19.mpi-sws.org",
        "HRT": 25488829159603962,
        "Operation": "fork",
        "Timestamp": "1556272469099.721680",
        "TenantClass": 0,
        "Source": "DataTransferProtoUtil.java:94",
        "ThreadID": 1,
        "ThreadName": "",
        "EventID": "C6CCFAB39EAD6009",
        "ProcessID": 6356
      },
      {
        "Cycles": 0,
        "Agent": "Execution-CPU",
        "ProcessName": "Data",
        "TaskID": "86755B7AE4B4FA6D",
        "ParentEventID": [
          "C6CCFAB39EAD6009"
        ],
        "Label": "set",
        "Title": "X-Trace Task",
        "Host": "pinky19.mpi-sws.org",
        "HRT": 25488829159754858,
        "Operation": "set",
        "Timestamp": "1556272469099.866699",
        "TenantClass": 0,
        "Source": "Receiver.java:117",
        "ThreadID": 7108,
        "ThreadName": "",
        "EventID": "F6D5D6E851E60292",
        "BaggageBytes": "[[248 5] [240 0] [0 134 117 91 122 228 180 250 109] [240 1] [0 198 204 250 179 158 173 96 9] [240 3] [0 2]]",
        "ProcessID": 2319
      },
      {
        "Cycles": 0,
        "Agent": "edu.brown.cs.systems.xtrace.logging.BaggageWrappers",
        "ProcessName": "Data",
        "TaskID": "86755B7AE4B4FA6D",
        "ParentEventID": [
          "234CA4C4EA5BAFE3"
        ],
        "Label": "Forking current baggage with Baggage.fork()",
        "Title": "X-Trace Task",
        "Host": "pinky19.mpi-sws.org",
        "HRT": 25488829159842797,
        "Operation": "fork",
        "Timestamp": "1556272469099.954590",
        "TenantClass": 0,
        "Source": "DataXceiver.java:1257",
        "ThreadID": 7108,
        "ThreadName": "",
        "EventID": "8D755F0B3889DC6E",
        "BaggageBytes": "[[248 5] [240 0] [0 134 117 91 122 228 180 250 109] [240 1] [0 35 76 164 196 234 91 175 227] [240 3] [0 2]]",
        "ProcessID": 2319
      },
      {
        "Cycles": 0,
        "Agent": "edu.brown.cs.systems.xtrace.logging.XTraceInit",
        "ProcessName": "Data",
        "TaskID": "86755B7AE4B4FA6D",
        "ParentEventID": [
          "F6D5D6E851E60292"
        ],
        "Label": "Thread.setName: DataXceiver for client DFSClient_NONMAPREDUCE_614514224_1 at /139.19.171.63:40328 [Sending block BP-1633380353-139.19.171.63-1554193446451:blk_1073759411_18587]",
        "Title": "X-Trace Task",
        "Host": "pinky19.mpi-sws.org",
        "HRT": 25488829159783046,
        "Timestamp": "1556272469099.894775",
        "TenantClass": 0,
        "Source": "DataXceiver.java:168",
        "ThreadID": 7108,
        "ThreadName": "",
        "EventID": "234CA4C4EA5BAFE3",
        "BaggageBytes": "[[248 5] [240 0] [0 134 117 91 122 228 180 250 109] [240 1] [0 246 213 214 232 81 230 2 146] [240 3] [0 2]]",
        "ProcessID": 2319
      },
      {
        "Cycles": 0,
        "Agent": "edu.brown.cs.systems.xtrace.logging.BaggageWrappers",
        "ProcessName": "Data",
        "TaskID": "86755B7AE4B4FA6D",
        "ParentEventID": [
          "8D755F0B3889DC6E"
        ],
        "Label": "Forking current baggage with Baggage.fork()",
        "Title": "X-Trace Task",
        "Host": "pinky19.mpi-sws.org",
        "HRT": 25488829159899985,
        "Operation": "fork",
        "Timestamp": "1556272469100.011719",
        "TenantClass": 0,
        "Source": "PacketHeader.java:95",
        "ThreadID": 7108,
        "ThreadName": "",
        "EventID": "D5DDD4FBD49C24B5",
        "BaggageBytes": "[[248 5] [240 0] [0 134 117 91 122 228 180 250 109] [240 1] [0 141 117 95 11 56 137 220 110] [240 3] [0 2]]",
        "ProcessID": 2319
      },
      {
        "Cycles": 0,
        "Agent": "Execution-Sleep",
        "ProcessName": "Data",
        "TaskID": "86755B7AE4B4FA6D",
        "ParentEventID": [
          "D5DDD4FBD49C24B5"
        ],
        "Label": "waited",
        "Title": "X-Trace Task",
        "Host": "pinky19.mpi-sws.org",
        "Duration": "3566",
        "HRT": 25488829159954549,
        "Operation": "waited",
        "Timestamp": "1556272469100.066406",
        "TenantClass": 0,
        "Source": "SocketIOWithTimeout.java:335",
        "ThreadID": 7108,
        "ThreadName": "",
        "EventID": "CD2FFDA2333D8F79",
        "BaggageBytes": "[[248 5] [240 0] [0 134 117 91 122 228 180 250 109] [240 1] [0 213 221 212 251 212 156 36 181] [240 3] [0 2]]",
        "ProcessID": 2319
      },
      {
        "Cycles": 0,
        "Agent": "Execution-Sleep",
        "ProcessName": "Read",
        "TaskID": "86755B7AE4B4FA6D",
        "ParentEventID": [
          "C6CCFAB39EAD6009"
        ],
        "Label": "waited",
        "Title": "X-Trace Task",
        "Host": "pinky19.mpi-sws.org",
        "Duration": "154477",
        "HRT": 25488829159897778,
        "Operation": "waited",
        "Timestamp": "1556272469100.015381",
        "TenantClass": 0,
        "Source": "SocketIOWithTimeout.java:335",
        "ThreadID": 1,
        "ThreadName": "",
        "EventID": "ACDA26D96928B603",
        "ProcessID": 6356
      },
      {
        "Cycles": 0,
        "Agent": "edu.brown.cs.systems.xtrace.logging.BaggageWrappers",
        "ProcessName": "Read",
        "TaskID": "86755B7AE4B4FA6D",
        "ParentEventID": [
          "ACDA26D96928B603",
          "8D755F0B3889DC6E"
        ],
        "Label": "Merged current baggage with other baggage",
        "Title": "X-Trace Task",
        "Host": "pinky19.mpi-sws.org",
        "HRT": 25488829159979290,
        "Operation": "join",
        "Timestamp": "1556272469100.096924",
        "TenantClass": 0,
        "Source": "RemoteBlockReader2.java:429",
        "ThreadID": 1,
        "ThreadName": "",
        "EventID": "39F5222B0655FAE9",
        "ProcessID": 6356
      },
      {
        "Cycles": 0,
        "Agent": "edu.brown.cs.systems.xtrace.logging.BaggageWrappers",
        "ProcessName": "Data",
        "TaskID": "86755B7AE4B4FA6D",
        "ParentEventID": [
          "CD2FFDA2333D8F79"
        ],
        "Label": "Forking current baggage with Baggage.fork()",
        "Title": "X-Trace Task",
        "Host": "pinky19.mpi-sws.org",
        "HRT": 25488829160018400,
        "Operation": "fork",
        "Timestamp": "1556272469100.130127",
        "TenantClass": 0,
        "Source": "PacketHeader.java:95",
        "ThreadID": 7108,
        "ThreadName": "",
        "EventID": "2D958F2813B9847A",
        "BaggageBytes": "[[248 5] [240 0] [0 134 117 91 122 228 180 250 109] [240 1] [0 205 47 253 162 51 61 143 121] [240 3] [0 2]]",
        "ProcessID": 2319
      },
      {
        "Cycles": 0,
        "Agent": "Execution-Sleep",
        "ProcessName": "Data",
        "TaskID": "86755B7AE4B4FA6D",
        "ParentEventID": [
          "2D958F2813B9847A"
        ],
        "Label": "waited",
        "Title": "X-Trace Task",
        "Host": "pinky19.mpi-sws.org",
        "Duration": "3099",
        "HRT": 25488829160070218,
        "Operation": "waited",
        "Timestamp": "1556272469100.181885",
        "TenantClass": 0,
        "Source": "SocketIOWithTimeout.java:335",
        "ThreadID": 7108,
        "ThreadName": "",
        "EventID": "C8B65ECF36B0D5D4",
        "BaggageBytes": "[[248 5] [240 0] [0 134 117 91 122 228 180 250 109] [240 1] [0 45 149 143 40 19 185 132 122] [240 3] [0 2]]",
        "ProcessID": 2319
      },
      {
        "Cycles": 0,
        "Agent": "edu.brown.cs.systems.xtrace.logging.BaggageWrappers",
        "ProcessName": "Data",
        "TaskID": "86755B7AE4B4FA6D",
        "ParentEventID": [
          "C8B65ECF36B0D5D4"
        ],
        "Label": "Forking current baggage with Baggage.fork()",
        "Title": "X-Trace Task",
        "Host": "pinky19.mpi-sws.org",
        "HRT": 25488829160132045,
        "Operation": "fork",
        "Timestamp": "1556272469100.243896",
        "TenantClass": 0,
        "Source": "PacketHeader.java:95",
        "ThreadID": 7108,
        "ThreadName": "",
        "EventID": "056954E9BB23E723",
        "BaggageBytes": "[[248 5] [240 0] [0 134 117 91 122 228 180 250 109] [240 1] [0 200 182 94 207 54 176 213 212] [240 3] [0 2]]",
        "ProcessID": 2319
      },
      {
        "Cycles": 0,
        "Agent": "edu.brown.cs.systems.xtrace.logging.BaggageWrappers",
        "ProcessName": "Read",
        "TaskID": "86755B7AE4B4FA6D",
        "ParentEventID": [
          "39F5222B0655FAE9",
          "D5DDD4FBD49C24B5"
        ],
        "Label": "Merged current baggage with other baggage",
        "Title": "X-Trace Task",
        "Host": "pinky19.mpi-sws.org",
        "HRT": 25488829160080036,
        "Operation": "join",
        "Timestamp": "1556272469100.197754",
        "TenantClass": 0,
        "Source": "PacketHeader.java:168",
        "ThreadID": 1,
        "ThreadName": "",
        "EventID": "73D7F1350A2ED4F2",
        "ProcessID": 6356
      },
      {
        "Cycles": 0,
        "Agent": "Execution-Sleep",
        "ProcessName": "Data",
        "TaskID": "86755B7AE4B4FA6D",
        "ParentEventID": [
          "056954E9BB23E723"
        ],
        "Label": "waited",
        "Title": "X-Trace Task",
        "Host": "pinky19.mpi-sws.org",
        "Duration": "3128",
        "HRT": 25488829160183945,
        "Operation": "waited",
        "Timestamp": "1556272469100.295654",
        "TenantClass": 0,
        "Source": "SocketIOWithTimeout.java:335",
        "ThreadID": 7108,
        "ThreadName": "",
        "EventID": "DECC7290FB70630C",
        "BaggageBytes": "[[248 5] [240 0] [0 134 117 91 122 228 180 250 109] [240 1] [0 5 105 84 233 187 35 231 35] [240 3] [0 2]]",
        "ProcessID": 2319
      },
      {
        "Cycles": 0,
        "Agent": "edu.brown.cs.systems.xtrace.logging.BaggageWrappers",
        "ProcessName": "Read",
        "TaskID": "86755B7AE4B4FA6D",
        "ParentEventID": [
          "73D7F1350A2ED4F2",
          "2D958F2813B9847A"
        ],
        "Label": "Merged current baggage with other baggage",
        "Title": "X-Trace Task",
        "Host": "pinky19.mpi-sws.org",
        "HRT": 25488829160211584,
        "Operation": "join",
        "Timestamp": "1556272469100.329346",
        "TenantClass": 0,
        "Source": "PacketHeader.java:168",
        "ThreadID": 1,
        "ThreadName": "",
        "EventID": "A750C69E1D60C17D",
        "ProcessID": 6356
      },
      {
        "Cycles": 0,
        "Agent": "edu.brown.cs.systems.xtrace.logging.BaggageWrappers",
        "ProcessName": "Data",
        "TaskID": "86755B7AE4B4FA6D",
        "ParentEventID": [
          "DECC7290FB70630C"
        ],
        "Label": "Forking current baggage with Baggage.fork()",
        "Title": "X-Trace Task",
        "Host": "pinky19.mpi-sws.org",
        "HRT": 25488829160243440,
        "Operation": "fork",
        "Timestamp": "1556272469100.355225",
        "TenantClass": 0,
        "Source": "PacketHeader.java:95",
        "ThreadID": 7108,
        "ThreadName": "",
        "EventID": "13B402E72FA3F6ED",
        "BaggageBytes": "[[248 5] [240 0] [0 134 117 91 122 228 180 250 109] [240 1] [0 222 204 114 144 251 112 99 12] [240 3] [0 2]]",
        "ProcessID": 2319
      },
      {
        "Cycles": 0,
        "Agent": "Execution-Sleep",
        "ProcessName": "Data",
        "TaskID": "86755B7AE4B4FA6D",
        "ParentEventID": [
          "13B402E72FA3F6ED"
        ],
        "Label": "waited",
        "Title": "X-Trace Task",
        "Host": "pinky19.mpi-sws.org",
        "Duration": "3132",
        "HRT": 25488829160294531,
        "Operation": "waited",
        "Timestamp": "1556272469100.406250",
        "TenantClass": 0,
        "Source": "SocketIOWithTimeout.java:335",
        "ThreadID": 7108,
        "ThreadName": "",
        "EventID": "7EEEA824A3CC05B1",
        "BaggageBytes": "[[248 5] [240 0] [0 134 117 91 122 228 180 250 109] [240 1] [0 19 180 2 231 47 163 246 237] [240 3] [0 2]]",
        "ProcessID": 2319
      },
      {
        "Cycles": 0,
        "Agent": "edu.brown.cs.systems.xtrace.logging.BaggageWrappers",
        "ProcessName": "Read",
        "TaskID": "86755B7AE4B4FA6D",
        "ParentEventID": [
          "056954E9BB23E723",
          "A750C69E1D60C17D"
        ],
        "Label": "Merged current baggage with other baggage",
        "Title": "X-Trace Task",
        "Host": "pinky19.mpi-sws.org",
        "HRT": 25488829160339272,
        "Operation": "join",
        "Timestamp": "1556272469100.457031",
        "TenantClass": 0,
        "Source": "PacketHeader.java:168",
        "ThreadID": 1,
        "ThreadName": "",
        "EventID": "9E23664F94C799D8",
        "ProcessID": 6356
      },
      {
        "Cycles": 0,
        "Agent": "edu.brown.cs.systems.xtrace.logging.BaggageWrappers",
        "ProcessName": "Data",
        "TaskID": "86755B7AE4B4FA6D",
        "ParentEventID": [
          "7EEEA824A3CC05B1"
        ],
        "Label": "Forking current baggage with Baggage.fork()",
        "Title": "X-Trace Task",
        "Host": "pinky19.mpi-sws.org",
        "HRT": 25488829160352490,
        "Operation": "fork",
        "Timestamp": "1556272469100.464355",
        "TenantClass": 0,
        "Source": "PacketHeader.java:95",
        "ThreadID": 7108,
        "ThreadName": "",
        "EventID": "9BCD14CBD78E7E1E",
        "BaggageBytes": "[[248 5] [240 0] [0 134 117 91 122 228 180 250 109] [240 1] [0 126 238 168 36 163 204 5 177] [240 3] [0 2]]",
        "ProcessID": 2319
      },
      {
        "Cycles": 0,
        "Agent": "Execution-Sleep",
        "ProcessName": "Data",
        "TaskID": "86755B7AE4B4FA6D",
        "ParentEventID": [
          "9BCD14CBD78E7E1E"
        ],
        "Label": "waited",
        "Title": "X-Trace Task",
        "Host": "pinky19.mpi-sws.org",
        "Duration": "2991",
        "HRT": 25488829160404205,
        "Operation": "waited",
        "Timestamp": "1556272469100.515869",
        "TenantClass": 0,
        "Source": "SocketIOWithTimeout.java:335",
        "ThreadID": 7108,
        "ThreadName": "",
        "EventID": "3A84FBA7B804CE25",
        "BaggageBytes": "[[248 5] [240 0] [0 134 117 91 122 228 180 250 109] [240 1] [0 155 205 20 203 215 142 126 30] [240 3] [0 2]]",
        "ProcessID": 2319
      },
      {
        "Cycles": 0,
        "Agent": "edu.brown.cs.systems.xtrace.logging.BaggageWrappers",
        "ProcessName": "Data",
        "TaskID": "86755B7AE4B4FA6D",
        "ParentEventID": [
          "3A84FBA7B804CE25"
        ],
        "Label": "Forking current baggage with Baggage.fork()",
        "Title": "X-Trace Task",
        "Host": "pinky19.mpi-sws.org",
        "HRT": 25488829160458024,
        "Operation": "fork",
        "Timestamp": "1556272469100.569824",
        "TenantClass": 0,
        "Source": "PacketHeader.java:95",
        "ThreadID": 7108,
        "ThreadName": "",
        "EventID": "E801A590F6B69BED",
        "BaggageBytes": "[[248 5] [240 0] [0 134 117 91 122 228 180 250 109] [240 1] [0 58 132 251 167 184 4 206 37] [240 3] [0 2]]",
        "ProcessID": 2319
      },
      {
        "Cycles": 0,
        "Agent": "Execution-Sleep",
        "ProcessName": "Data",
        "TaskID": "86755B7AE4B4FA6D",
        "ParentEventID": [
          "E801A590F6B69BED"
        ],
        "Label": "waited",
        "Title": "X-Trace Task",
        "Host": "pinky19.mpi-sws.org",
        "Duration": "3028",
        "HRT": 25488829160510607,
        "Operation": "waited",
        "Timestamp": "1556272469100.622314",
        "TenantClass": 0,
        "Source": "SocketIOWithTimeout.java:335",
        "ThreadID": 7108,
        "ThreadName": "",
        "EventID": "6F86BA013E364EB5",
        "BaggageBytes": "[[248 5] [240 0] [0 134 117 91 122 228 180 250 109] [240 1] [0 232 1 165 144 246 182 155 237] [240 3] [0 2]]",
        "ProcessID": 2319
      },
      {
        "Cycles": 0,
        "Agent": "edu.brown.cs.systems.xtrace.logging.BaggageWrappers",
        "ProcessName": "Data",
        "TaskID": "86755B7AE4B4FA6D",
        "ParentEventID": [
          "6F86BA013E364EB5"
        ],
        "Label": "Forking current baggage with Baggage.fork()",
        "Title": "X-Trace Task",
        "Host": "pinky19.mpi-sws.org",
        "HRT": 25488829160566161,
        "Operation": "fork",
        "Timestamp": "1556272469100.677979",
        "TenantClass": 0,
        "Source": "PacketHeader.java:95",
        "ThreadID": 7108,
        "ThreadName": "",
        "EventID": "71E6AFFFB119D4C1",
        "BaggageBytes": "[[248 5] [240 0] [0 134 117 91 122 228 180 250 109] [240 1] [0 111 134 186 1 62 54 78 181] [240 3] [0 2]]",
        "ProcessID": 2319
      },
      {
        "Cycles": 0,
        "Agent": "edu.brown.cs.systems.xtrace.logging.BaggageWrappers",
        "ProcessName": "Read",
        "TaskID": "86755B7AE4B4FA6D",
        "ParentEventID": [
          "9E23664F94C799D8",
          "13B402E72FA3F6ED"
        ],
        "Label": "Merged current baggage with other baggage",
        "Title": "X-Trace Task",
        "Host": "pinky19.mpi-sws.org",
        "HRT": 25488829160478242,
        "Operation": "join",
        "Timestamp": "1556272469100.595947",
        "TenantClass": 0,
        "Source": "PacketHeader.java:168",
        "ThreadID": 1,
        "ThreadName": "",
        "EventID": "28F64829C049BB5A",
        "ProcessID": 6356
      },
      {
        "Cycles": 0,
        "Agent": "Execution-Sleep",
        "ProcessName": "Data",
        "TaskID": "86755B7AE4B4FA6D",
        "ParentEventID": [
          "71E6AFFFB119D4C1"
        ],
        "Label": "waited",
        "Title": "X-Trace Task",
        "Host": "pinky19.mpi-sws.org",
        "Duration": "3055",
        "HRT": 25488829160616441,
        "Operation": "waited",
        "Timestamp": "1556272469100.728271",
        "TenantClass": 0,
        "Source": "SocketIOWithTimeout.java:335",
        "ThreadID": 7108,
        "ThreadName": "",
        "EventID": "0A3C1EFD2F0B48ED",
        "BaggageBytes": "[[248 5] [240 0] [0 134 117 91 122 228 180 250 109] [240 1] [0 113 230 175 255 177 25 212 193] [240 3] [0 2]]",
        "ProcessID": 2319
      },
      {
        "Cycles": 0,
        "Agent": "edu.brown.cs.systems.xtrace.logging.BaggageWrappers",
        "ProcessName": "Read",
        "TaskID": "86755B7AE4B4FA6D",
        "ParentEventID": [
          "9BCD14CBD78E7E1E",
          "28F64829C049BB5A"
        ],
        "Label": "Merged current baggage with other baggage",
        "Title": "X-Trace Task",
        "Host": "pinky19.mpi-sws.org",
        "HRT": 25488829160616266,
        "Operation": "join",
        "Timestamp": "1556272469100.733887",
        "TenantClass": 0,
        "Source": "PacketHeader.java:168",
        "ThreadID": 1,
        "ThreadName": "",
        "EventID": "BEECA3D845017F59",
        "ProcessID": 6356
      },
      {
        "Cycles": 0,
        "Agent": "edu.brown.cs.systems.xtrace.logging.BaggageWrappers",
        "ProcessName": "Data",
        "TaskID": "86755B7AE4B4FA6D",
        "ParentEventID": [
          "0A3C1EFD2F0B48ED"
        ],
        "Label": "Forking current baggage with Baggage.fork()",
        "Title": "X-Trace Task",
        "Host": "pinky19.mpi-sws.org",
        "HRT": 25488829160672026,
        "Operation": "fork",
        "Timestamp": "1556272469100.783691",
        "TenantClass": 0,
        "Source": "PacketHeader.java:95",
        "ThreadID": 7108,
        "ThreadName": "",
        "EventID": "887053780740719E",
        "BaggageBytes": "[[248 5] [240 0] [0 134 117 91 122 228 180 250 109] [240 1] [0 10 60 30 253 47 11 72 237] [240 3] [0 2]]",
        "ProcessID": 2319
      },
      {
        "Cycles": 0,
        "Agent": "Execution-Sleep",
        "ProcessName": "Data",
        "TaskID": "86755B7AE4B4FA6D",
        "ParentEventID": [
          "887053780740719E"
        ],
        "Label": "waited",
        "Title": "X-Trace Task",
        "Host": "pinky19.mpi-sws.org",
        "Duration": "3065",
        "HRT": 25488829160728950,
        "Operation": "waited",
        "Timestamp": "1556272469100.840820",
        "TenantClass": 0,
        "Source": "SocketIOWithTimeout.java:335",
        "ThreadID": 7108,
        "ThreadName": "",
        "EventID": "26F931BA187F5C27",
        "BaggageBytes": "[[248 5] [240 0] [0 134 117 91 122 228 180 250 109] [240 1] [0 136 112 83 120 7 64 113 158] [240 3] [0 2]]",
        "ProcessID": 2319
      },
      {
        "Cycles": 0,
        "Agent": "edu.brown.cs.systems.xtrace.logging.BaggageWrappers",
        "ProcessName": "Read",
        "TaskID": "86755B7AE4B4FA6D",
        "ParentEventID": [
          "BEECA3D845017F59",
          "E801A590F6B69BED"
        ],
        "Label": "Merged current baggage with other baggage",
        "Title": "X-Trace Task",
        "Host": "pinky19.mpi-sws.org",
        "HRT": 25488829160752439,
        "Operation": "join",
        "Timestamp": "1556272469100.870117",
        "TenantClass": 0,
        "Source": "PacketHeader.java:168",
        "ThreadID": 1,
        "ThreadName": "",
        "EventID": "A8A80BD2761B16C7",
        "ProcessID": 6356
      },
      {
        "Cycles": 0,
        "Agent": "edu.brown.cs.systems.xtrace.logging.BaggageWrappers",
        "ProcessName": "Data",
        "TaskID": "86755B7AE4B4FA6D",
        "ParentEventID": [
          "26F931BA187F5C27"
        ],
        "Label": "Forking current baggage with Baggage.fork()",
        "Title": "X-Trace Task",
        "Host": "pinky19.mpi-sws.org",
        "HRT": 25488829160787563,
        "Operation": "fork",
        "Timestamp": "1556272469100.899414",
        "TenantClass": 0,
        "Source": "PacketHeader.java:95",
        "ThreadID": 7108,
        "ThreadName": "",
        "EventID": "E7B220EDAFFFE2DC",
        "BaggageBytes": "[[248 5] [240 0] [0 134 117 91 122 228 180 250 109] [240 1] [0 38 249 49 186 24 127 92 39] [240 3] [0 2]]",
        "ProcessID": 2319
      },
      {
        "Cycles": 0,
        "Agent": "edu.brown.cs.systems.xtrace.logging.BaggageWrappers",
        "ProcessName": "Read",
        "TaskID": "86755B7AE4B4FA6D",
        "ParentEventID": [
          "71E6AFFFB119D4C1",
          "A8A80BD2761B16C7"
        ],
        "Label": "Merged current baggage with other baggage",
        "Title": "X-Trace Task",
        "Host": "pinky19.mpi-sws.org",
        "HRT": 25488829160880416,
        "Operation": "join",
        "Timestamp": "1556272469100.998047",
        "TenantClass": 0,
        "Source": "PacketHeader.java:168",
        "ThreadID": 1,
        "ThreadName": "",
        "EventID": "A1BAB3949373B679",
        "ProcessID": 6356
      },
      {
        "Cycles": 0,
        "Agent": "edu.brown.cs.systems.xtrace.logging.BaggageWrappers",
        "ProcessName": "Data",
        "TaskID": "86755B7AE4B4FA6D",
        "ParentEventID": [
          "847F834899F48965"
        ],
        "Label": "Forking current baggage with Baggage.fork()",
        "Title": "X-Trace Task",
        "Host": "pinky19.mpi-sws.org",
        "HRT": 25488829160893389,
        "Operation": "fork",
        "Timestamp": "1556272469101.005127",
        "TenantClass": 0,
        "Source": "PacketHeader.java:95",
        "ThreadID": 7108,
        "ThreadName": "",
        "EventID": "41E8B43453F41A19",
        "BaggageBytes": "[[248 5] [240 0] [0 134 117 91 122 228 180 250 109] [240 1] [0 132 127 131 72 153 244 137 101] [240 3] [0 2]]",
        "ProcessID": 2319
      },
      {
        "Cycles": 0,
        "Agent": "Execution-Sleep",
        "ProcessName": "Data",
        "TaskID": "86755B7AE4B4FA6D",
        "ParentEventID": [
          "E7B220EDAFFFE2DC"
        ],
        "Label": "waited",
        "Title": "X-Trace Task",
        "Host": "pinky19.mpi-sws.org",
        "Duration": "3026",
        "HRT": 25488829160837238,
        "Operation": "waited",
        "Timestamp": "1556272469100.948975",
        "TenantClass": 0,
        "Source": "SocketIOWithTimeout.java:335",
        "ThreadID": 7108,
        "ThreadName": "",
        "EventID": "847F834899F48965",
        "BaggageBytes": "[[248 5] [240 0] [0 134 117 91 122 228 180 250 109] [240 1] [0 231 178 32 237 175 255 226 220] [240 3] [0 2]]",
        "ProcessID": 2319
      },
      {
        "Cycles": 0,
        "Agent": "Execution-Sleep",
        "ProcessName": "Data",
        "TaskID": "86755B7AE4B4FA6D",
        "ParentEventID": [
          "41E8B43453F41A19"
        ],
        "Label": "waited",
        "Title": "X-Trace Task",
        "Host": "pinky19.mpi-sws.org",
        "Duration": "3045",
        "HRT": 25488829160944421,
        "Operation": "waited",
        "Timestamp": "1556272469101.056152",
        "TenantClass": 0,
        "Source": "SocketIOWithTimeout.java:335",
        "ThreadID": 7108,
        "ThreadName": "",
        "EventID": "626AB38ED1FCA060",
        "BaggageBytes": "[[248 5] [240 0] [0 134 117 91 122 228 180 250 109] [240 1] [0 65 232 180 52 83 244 26 25] [240 3] [0 2]]",
        "ProcessID": 2319
      },
      {
        "Cycles": 0,
        "Agent": "edu.brown.cs.systems.xtrace.logging.BaggageWrappers",
        "ProcessName": "Data",
        "TaskID": "86755B7AE4B4FA6D",
        "ParentEventID": [
          "626AB38ED1FCA060"
        ],
        "Label": "Forking current baggage with Baggage.fork()",
        "Title": "X-Trace Task",
        "Host": "pinky19.mpi-sws.org",
        "HRT": 25488829160997621,
        "Operation": "fork",
        "Timestamp": "1556272469101.109375",
        "TenantClass": 0,
        "Source": "PacketHeader.java:95",
        "ThreadID": 7108,
        "ThreadName": "",
        "EventID": "DCAD1D7D6AE00F70",
        "BaggageBytes": "[[248 5] [240 0] [0 134 117 91 122 228 180 250 109] [240 1] [0 98 106 179 142 209 252 160 96] [240 3] [0 2]]",
        "ProcessID": 2319
      },
      {
        "Cycles": 0,
        "Agent": "edu.brown.cs.systems.xtrace.logging.BaggageWrappers",
        "ProcessName": "Read",
        "TaskID": "86755B7AE4B4FA6D",
        "ParentEventID": [
          "887053780740719E",
          "A1BAB3949373B679"
        ],
        "Label": "Merged current baggage with other baggage",
        "Title": "X-Trace Task",
        "Host": "pinky19.mpi-sws.org",
        "HRT": 25488829161017045,
        "Operation": "join",
        "Timestamp": "1556272469101.134766",
        "TenantClass": 0,
        "Source": "PacketHeader.java:168",
        "ThreadID": 1,
        "ThreadName": "",
        "EventID": "61607D81B6899C6B",
        "ProcessID": 6356
      },
      {
        "Cycles": 0,
        "Agent": "Execution-Sleep",
        "ProcessName": "Data",
        "TaskID": "86755B7AE4B4FA6D",
        "ParentEventID": [
          "DCAD1D7D6AE00F70"
        ],
        "Label": "waited",
        "Title": "X-Trace Task",
        "Host": "pinky19.mpi-sws.org",
        "Duration": "3083",
        "HRT": 25488829161048800,
        "Operation": "waited",
        "Timestamp": "1556272469101.160645",
        "TenantClass": 0,
        "Source": "SocketIOWithTimeout.java:335",
        "ThreadID": 7108,
        "ThreadName": "",
        "EventID": "5EE5E06B73A3E9E0",
        "BaggageBytes": "[[248 5] [240 0] [0 134 117 91 122 228 180 250 109] [240 1] [0 220 173 29 125 106 224 15 112] [240 3] [0 2]]",
        "ProcessID": 2319
      },
      {
        "Cycles": 0,
        "Agent": "edu.brown.cs.systems.xtrace.logging.BaggageWrappers",
        "ProcessName": "Data",
        "TaskID": "86755B7AE4B4FA6D",
        "ParentEventID": [
          "5EE5E06B73A3E9E0"
        ],
        "Label": "Forking current baggage with Baggage.fork()",
        "Title": "X-Trace Task",
        "Host": "pinky19.mpi-sws.org",
        "HRT": 25488829161102961,
        "Operation": "fork",
        "Timestamp": "1556272469101.214844",
        "TenantClass": 0,
        "Source": "PacketHeader.java:95",
        "ThreadID": 7108,
        "ThreadName": "",
        "EventID": "9436DF1FD174E5EA",
        "BaggageBytes": "[[248 5] [240 0] [0 134 117 91 122 228 180 250 109] [240 1] [0 94 229 224 107 115 163 233 224] [240 3] [0 2]]",
        "ProcessID": 2319
      },
      {
        "Cycles": 0,
        "Agent": "Execution-Sleep",
        "ProcessName": "Data",
        "TaskID": "86755B7AE4B4FA6D",
        "ParentEventID": [
          "9436DF1FD174E5EA"
        ],
        "Label": "waited",
        "Title": "X-Trace Task",
        "Host": "pinky19.mpi-sws.org",
        "Duration": "3078",
        "HRT": 25488829161166646,
        "Operation": "waited",
        "Timestamp": "1556272469101.278320",
        "TenantClass": 0,
        "Source": "SocketIOWithTimeout.java:335",
        "ThreadID": 7108,
        "ThreadName": "",
        "EventID": "5A26631D380BA34E",
        "BaggageBytes": "[[248 5] [240 0] [0 134 117 91 122 228 180 250 109] [240 1] [0 148 54 223 31 209 116 229 234] [240 3] [0 2]]",
        "ProcessID": 2319
      },
      {
        "Cycles": 0,
        "Agent": "edu.brown.cs.systems.xtrace.logging.BaggageWrappers",
        "ProcessName": "Data",
        "TaskID": "86755B7AE4B4FA6D",
        "ParentEventID": [
          "5A26631D380BA34E"
        ],
        "Label": "Forking current baggage with Baggage.fork()",
        "Title": "X-Trace Task",
        "Host": "pinky19.mpi-sws.org",
        "HRT": 25488829161227065,
        "Operation": "fork",
        "Timestamp": "1556272469101.338867",
        "TenantClass": 0,
        "Source": "PacketHeader.java:95",
        "ThreadID": 7108,
        "ThreadName": "",
        "EventID": "4999839BD2026334",
        "BaggageBytes": "[[248 5] [240 0] [0 134 117 91 122 228 180 250 109] [240 1] [0 90 38 99 29 56 11 163 78] [240 3] [0 2]]",
        "ProcessID": 2319
      },
      {
        "Cycles": 0,
        "Agent": "Execution-Sleep",
        "ProcessName": "Data",
        "TaskID": "86755B7AE4B4FA6D",
        "ParentEventID": [
          "4999839BD2026334"
        ],
        "Label": "waited",
        "Title": "X-Trace Task",
        "Host": "pinky19.mpi-sws.org",
        "Duration": "3101",
        "HRT": 25488829161277316,
        "Operation": "waited",
        "Timestamp": "1556272469101.389160",
        "TenantClass": 0,
        "Source": "SocketIOWithTimeout.java:335",
        "ThreadID": 7108,
        "ThreadName": "",
        "EventID": "270A7FE4C6F81F87",
        "BaggageBytes": "[[248 5] [240 0] [0 134 117 91 122 228 180 250 109] [240 1] [0 73 153 131 155 210 2 99 52] [240 3] [0 2]]",
        "ProcessID": 2319
      },
      {
        "Cycles": 0,
        "Agent": "edu.brown.cs.systems.xtrace.logging.BaggageWrappers",
        "ProcessName": "Read",
        "TaskID": "86755B7AE4B4FA6D",
        "ParentEventID": [
          "E7B220EDAFFFE2DC",
          "61607D81B6899C6B"
        ],
        "Label": "Merged current baggage with other baggage",
        "Title": "X-Trace Task",
        "Host": "pinky19.mpi-sws.org",
        "HRT": 25488829161168135,
        "Operation": "join",
        "Timestamp": "1556272469101.285889",
        "TenantClass": 0,
        "Source": "PacketHeader.java:168",
        "ThreadID": 1,
        "ThreadName": "",
        "EventID": "766C871606EEA373",
        "ProcessID": 6356
      },
      {
        "Cycles": 0,
        "Agent": "edu.brown.cs.systems.xtrace.logging.BaggageWrappers",
        "ProcessName": "Data",
        "TaskID": "86755B7AE4B4FA6D",
        "ParentEventID": [
          "270A7FE4C6F81F87"
        ],
        "Label": "Forking current baggage with Baggage.fork()",
        "Title": "X-Trace Task",
        "Host": "pinky19.mpi-sws.org",
        "HRT": 25488829161336219,
        "Operation": "fork",
        "Timestamp": "1556272469101.447998",
        "TenantClass": 0,
        "Source": "PacketHeader.java:95",
        "ThreadID": 7108,
        "ThreadName": "",
        "EventID": "B4370FDC738AAE92",
        "BaggageBytes": "[[248 5] [240 0] [0 134 117 91 122 228 180 250 109] [240 1] [0 39 10 127 228 198 248 31 135] [240 3] [0 2]]",
        "ProcessID": 2319
      },
      {
        "Cycles": 0,
        "Agent": "Execution-Sleep",
        "ProcessName": "Data",
        "TaskID": "86755B7AE4B4FA6D",
        "ParentEventID": [
          "B4370FDC738AAE92"
        ],
        "Label": "waited",
        "Title": "X-Trace Task",
        "Host": "pinky19.mpi-sws.org",
        "Duration": "3004",
        "HRT": 25488829161385560,
        "Operation": "waited",
        "Timestamp": "1556272469101.497314",
        "TenantClass": 0,
        "Source": "SocketIOWithTimeout.java:335",
        "ThreadID": 7108,
        "ThreadName": "",
        "EventID": "9500EBEA16DFA0F2",
        "BaggageBytes": "[[248 5] [240 0] [0 134 117 91 122 228 180 250 109] [240 1] [0 180 55 15 220 115 138 174 146] [240 3] [0 2]]",
        "ProcessID": 2319
      },
      {
        "Cycles": 0,
        "Agent": "edu.brown.cs.systems.xtrace.logging.BaggageWrappers",
        "ProcessName": "Data",
        "TaskID": "86755B7AE4B4FA6D",
        "ParentEventID": [
          "9500EBEA16DFA0F2"
        ],
        "Label": "Forking current baggage with Baggage.fork()",
        "Title": "X-Trace Task",
        "Host": "pinky19.mpi-sws.org",
        "HRT": 25488829161444832,
        "Operation": "fork",
        "Timestamp": "1556272469101.556641",
        "TenantClass": 0,
        "Source": "PacketHeader.java:95",
        "ThreadID": 7108,
        "ThreadName": "",
        "EventID": "0270D5BB4BDE8B13",
        "BaggageBytes": "[[248 5] [240 0] [0 134 117 91 122 228 180 250 109] [240 1] [0 149 0 235 234 22 223 160 242] [240 3] [0 2]]",
        "ProcessID": 2319
      },
      {
        "Cycles": 0,
        "Agent": "Execution-Sleep",
        "ProcessName": "Data",
        "TaskID": "86755B7AE4B4FA6D",
        "ParentEventID": [
          "0270D5BB4BDE8B13"
        ],
        "Label": "waited",
        "Title": "X-Trace Task",
        "Host": "pinky19.mpi-sws.org",
        "Duration": "3139",
        "HRT": 25488829161496923,
        "Operation": "waited",
        "Timestamp": "1556272469101.608643",
        "TenantClass": 0,
        "Source": "SocketIOWithTimeout.java:335",
        "ThreadID": 7108,
        "ThreadName": "",
        "EventID": "02484D5D184440D4",
        "BaggageBytes": "[[248 5] [240 0] [0 134 117 91 122 228 180 250 109] [240 1] [0 2 112 213 187 75 222 139 19] [240 3] [0 2]]",
        "ProcessID": 2319
      },
      {
        "Cycles": 0,
        "Agent": "edu.brown.cs.systems.xtrace.logging.BaggageWrappers",
        "ProcessName": "Read",
        "TaskID": "86755B7AE4B4FA6D",
        "ParentEventID": [
          "766C871606EEA373",
          "41E8B43453F41A19"
        ],
        "Label": "Merged current baggage with other baggage",
        "Title": "X-Trace Task",
        "Host": "pinky19.mpi-sws.org",
        "HRT": 25488829161296712,
        "Operation": "join",
        "Timestamp": "1556272469101.414307",
        "TenantClass": 0,
        "Source": "PacketHeader.java:168",
        "ThreadID": 1,
        "ThreadName": "",
        "EventID": "A30DAE50AFB82A47",
        "ProcessID": 6356
      },
      {
        "Cycles": 0,
        "Agent": "edu.brown.cs.systems.xtrace.logging.BaggageWrappers",
        "ProcessName": "Data",
        "TaskID": "86755B7AE4B4FA6D",
        "ParentEventID": [
          "02484D5D184440D4"
        ],
        "Label": "Forking current baggage with Baggage.fork()",
        "Title": "X-Trace Task",
        "Host": "pinky19.mpi-sws.org",
        "HRT": 25488829161554717,
        "Operation": "fork",
        "Timestamp": "1556272469101.666504",
        "TenantClass": 0,
        "Source": "PacketHeader.java:95",
        "ThreadID": 7108,
        "ThreadName": "",
        "EventID": "AE346AC91A068106",
        "BaggageBytes": "[[248 5] [240 0] [0 134 117 91 122 228 180 250 109] [240 1] [0 2 72 77 93 24 68 64 212] [240 3] [0 2]]",
        "ProcessID": 2319
      },
      {
        "Cycles": 0,
        "Agent": "edu.brown.cs.systems.xtrace.logging.BaggageWrappers",
        "ProcessName": "Read",
        "TaskID": "86755B7AE4B4FA6D",
        "ParentEventID": [
          "9436DF1FD174E5EA",
          "96DB898B9FF6D3C8"
        ],
        "Label": "Merged current baggage with other baggage",
        "Title": "X-Trace Task",
        "Host": "pinky19.mpi-sws.org",
        "HRT": 25488829161554662,
        "Operation": "join",
        "Timestamp": "1556272469101.672363",
        "TenantClass": 0,
        "Source": "PacketHeader.java:168",
        "ThreadID": 1,
        "ThreadName": "",
        "EventID": "4172130580C369E5",
        "ProcessID": 6356
      },
      {
        "Cycles": 0,
        "Agent": "edu.brown.cs.systems.xtrace.logging.BaggageWrappers",
        "ProcessName": "Read",
        "TaskID": "86755B7AE4B4FA6D",
        "ParentEventID": [
          "A30DAE50AFB82A47",
          "DCAD1D7D6AE00F70"
        ],
        "Label": "Merged current baggage with other baggage",
        "Title": "X-Trace Task",
        "Host": "pinky19.mpi-sws.org",
        "HRT": 25488829161425362,
        "Operation": "join",
        "Timestamp": "1556272469101.542969",
        "TenantClass": 0,
        "Source": "PacketHeader.java:168",
        "ThreadID": 1,
        "ThreadName": "",
        "EventID": "96DB898B9FF6D3C8",
        "ProcessID": 6356
      },
      {
        "Cycles": 0,
        "Agent": "Execution-Sleep",
        "ProcessName": "Data",
        "TaskID": "86755B7AE4B4FA6D",
        "ParentEventID": [
          "AE346AC91A068106"
        ],
        "Label": "waited",
        "Title": "X-Trace Task",
        "Host": "pinky19.mpi-sws.org",
        "Duration": "3561",
        "HRT": 25488829161612777,
        "Operation": "waited",
        "Timestamp": "1556272469101.724609",
        "TenantClass": 0,
        "Source": "SocketIOWithTimeout.java:335",
        "ThreadID": 7108,
        "ThreadName": "",
        "EventID": "64E419DE41F477E2",
        "BaggageBytes": "[[248 5] [240 0] [0 134 117 91 122 228 180 250 109] [240 1] [0 174 52 106 201 26 6 129 6] [240 3] [0 2]]",
        "ProcessID": 2319
      },
      {
        "Cycles": 0,
        "Agent": "edu.brown.cs.systems.xtrace.logging.BaggageWrappers",
        "ProcessName": "Data",
        "TaskID": "86755B7AE4B4FA6D",
        "ParentEventID": [
          "64E419DE41F477E2"
        ],
        "Label": "Forking current baggage with Baggage.fork()",
        "Title": "X-Trace Task",
        "Host": "pinky19.mpi-sws.org",
        "HRT": 25488829161666885,
        "Operation": "fork",
        "Timestamp": "1556272469101.778564",
        "TenantClass": 0,
        "Source": "PacketHeader.java:95",
        "ThreadID": 7108,
        "ThreadName": "",
        "EventID": "6F9AC74F1990AAAC",
        "BaggageBytes": "[[248 5] [240 0] [0 134 117 91 122 228 180 250 109] [240 1] [0 100 228 25 222 65 244 119 226] [240 3] [0 2]]",
        "ProcessID": 2319
      },
      {
        "Cycles": 0,
        "Agent": "Execution-Sleep",
        "ProcessName": "Data",
        "TaskID": "86755B7AE4B4FA6D",
        "ParentEventID": [
          "6F9AC74F1990AAAC"
        ],
        "Label": "waited",
        "Title": "X-Trace Task",
        "Host": "pinky19.mpi-sws.org",
        "Duration": "3080",
        "HRT": 25488829161718247,
        "Operation": "waited",
        "Timestamp": "1556272469101.830078",
        "TenantClass": 0,
        "Source": "SocketIOWithTimeout.java:335",
        "ThreadID": 7108,
        "ThreadName": "",
        "EventID": "7696771E19731C17",
        "BaggageBytes": "[[248 5] [240 0] [0 134 117 91 122 228 180 250 109] [240 1] [0 111 154 199 79 25 144 170 172] [240 3] [0 2]]",
        "ProcessID": 2319
      },
      {
        "Cycles": 0,
        "Agent": "edu.brown.cs.systems.xtrace.logging.BaggageWrappers",
        "ProcessName": "Read",
        "TaskID": "86755B7AE4B4FA6D",
        "ParentEventID": [
          "4172130580C369E5",
          "4999839BD2026334"
        ],
        "Label": "Merged current baggage with other baggage",
        "Title": "X-Trace Task",
        "Host": "pinky19.mpi-sws.org",
        "HRT": 25488829161690099,
        "Operation": "join",
        "Timestamp": "1556272469101.807861",
        "TenantClass": 0,
        "Source": "PacketHeader.java:168",
        "ThreadID": 1,
        "ThreadName": "",
        "EventID": "09FAEBF534B0C19A",
        "ProcessID": 6356
      },
      {
        "Cycles": 0,
        "Agent": "edu.brown.cs.systems.xtrace.logging.BaggageWrappers",
        "ProcessName": "Data",
        "TaskID": "86755B7AE4B4FA6D",
        "ParentEventID": [
          "7696771E19731C17"
        ],
        "Label": "Forking current baggage with Baggage.fork()",
        "Title": "X-Trace Task",
        "Host": "pinky19.mpi-sws.org",
        "HRT": 25488829161777806,
        "Operation": "fork",
        "Timestamp": "1556272469101.889648",
        "TenantClass": 0,
        "Source": "PacketHeader.java:95",
        "ThreadID": 7108,
        "ThreadName": "",
        "EventID": "96ABD19044A2182E",
        "BaggageBytes": "[[248 5] [240 0] [0 134 117 91 122 228 180 250 109] [240 1] [0 118 150 119 30 25 115 28 23] [240 3] [0 2]]",
        "ProcessID": 2319
      },
      {
        "Cycles": 0,
        "Agent": "Execution-Sleep",
        "ProcessName": "Data",
        "TaskID": "86755B7AE4B4FA6D",
        "ParentEventID": [
          "96ABD19044A2182E"
        ],
        "Label": "waited",
        "Title": "X-Trace Task",
        "Host": "pinky19.mpi-sws.org",
        "Duration": "3092",
        "HRT": 25488829161827856,
        "Operation": "waited",
        "Timestamp": "1556272469101.939697",
        "TenantClass": 0,
        "Source": "SocketIOWithTimeout.java:335",
        "ThreadID": 7108,
        "ThreadName": "",
        "EventID": "330501C50580E7C7",
        "BaggageBytes": "[[248 5] [240 0] [0 134 117 91 122 228 180 250 109] [240 1] [0 150 171 209 144 68 162 24 46] [240 3] [0 2]]",
        "ProcessID": 2319
      },
      {
        "Cycles": 0,
        "Agent": "edu.brown.cs.systems.xtrace.logging.BaggageWrappers",
        "ProcessName": "Data",
        "TaskID": "86755B7AE4B4FA6D",
        "ParentEventID": [
          "330501C50580E7C7"
        ],
        "Label": "Forking current baggage with Baggage.fork()",
        "Title": "X-Trace Task",
        "Host": "pinky19.mpi-sws.org",
        "HRT": 25488829161885898,
        "Operation": "fork",
        "Timestamp": "1556272469101.997559",
        "TenantClass": 0,
        "Source": "PacketHeader.java:95",
        "ThreadID": 7108,
        "ThreadName": "",
        "EventID": "1DB8D950C525FED1",
        "BaggageBytes": "[[248 5] [240 0] [0 134 117 91 122 228 180 250 109] [240 1] [0 51 5 1 197 5 128 231 199] [240 3] [0 2]]",
        "ProcessID": 2319
      },
      {
        "Cycles": 0,
        "Agent": "Execution-Sleep",
        "ProcessName": "Data",
        "TaskID": "86755B7AE4B4FA6D",
        "ParentEventID": [
          "1DB8D950C525FED1"
        ],
        "Label": "waited",
        "Title": "X-Trace Task",
        "Host": "pinky19.mpi-sws.org",
        "Duration": "3192",
        "HRT": 25488829161936228,
        "Operation": "waited",
        "Timestamp": "1556272469102.048096",
        "TenantClass": 0,
        "Source": "SocketIOWithTimeout.java:335",
        "ThreadID": 7108,
        "ThreadName": "",
        "EventID": "09289E94D5CEDDF4",
        "BaggageBytes": "[[248 5] [240 0] [0 134 117 91 122 228 180 250 109] [240 1] [0 29 184 217 80 197 37 254 209] [240 3] [0 2]]",
        "ProcessID": 2319
      },
      {
        "Cycles": 0,
        "Agent": "edu.brown.cs.systems.xtrace.logging.BaggageWrappers",
        "ProcessName": "Read",
        "TaskID": "86755B7AE4B4FA6D",
        "ParentEventID": [
          "0270D5BB4BDE8B13",
          "727426DD729635D1"
        ],
        "Label": "Merged current baggage with other baggage",
        "Title": "X-Trace Task",
        "Host": "pinky19.mpi-sws.org",
        "HRT": 25488829161946366,
        "Operation": "join",
        "Timestamp": "1556272469102.063965",
        "TenantClass": 0,
        "Source": "PacketHeader.java:168",
        "ThreadID": 1,
        "ThreadName": "",
        "EventID": "A85D0F7BA774F839",
        "ProcessID": 6356
      },
      {
        "Cycles": 0,
        "Agent": "edu.brown.cs.systems.xtrace.logging.BaggageWrappers",
        "ProcessName": "Read",
        "TaskID": "86755B7AE4B4FA6D",
        "ParentEventID": [
          "09FAEBF534B0C19A",
          "B4370FDC738AAE92"
        ],
        "Label": "Merged current baggage with other baggage",
        "Title": "X-Trace Task",
        "Host": "pinky19.mpi-sws.org",
        "HRT": 25488829161817187,
        "Operation": "join",
        "Timestamp": "1556272469101.934814",
        "TenantClass": 0,
        "Source": "PacketHeader.java:168",
        "ThreadID": 1,
        "ThreadName": "",
        "EventID": "727426DD729635D1",
        "ProcessID": 6356
      },
      {
        "Cycles": 0,
        "Agent": "edu.brown.cs.systems.xtrace.logging.BaggageWrappers",
        "ProcessName": "Data",
        "TaskID": "86755B7AE4B4FA6D",
        "ParentEventID": [
          "09289E94D5CEDDF4"
        ],
        "Label": "Forking current baggage with Baggage.fork()",
        "Title": "X-Trace Task",
        "Host": "pinky19.mpi-sws.org",
        "HRT": 25488829161994367,
        "Operation": "fork",
        "Timestamp": "1556272469102.106201",
        "TenantClass": 0,
        "Source": "PacketHeader.java:95",
        "ThreadID": 7108,
        "ThreadName": "",
        "EventID": "0BE4C79C44642767",
        "BaggageBytes": "[[248 5] [240 0] [0 134 117 91 122 228 180 250 109] [240 1] [0 9 40 158 148 213 206 221 244] [240 3] [0 2]]",
        "ProcessID": 2319
      },
      {
        "Cycles": 0,
        "Agent": "Execution-CPU",
        "ProcessName": "Data",
        "TaskID": "86755B7AE4B4FA6D",
        "ParentEventID": [
          "5086B9CE43821FE0"
        ],
        "Label": "unset",
        "Title": "X-Trace Task",
        "Host": "pinky19.mpi-sws.org",
        "Duration": "2395349",
        "HRT": 25488829162170541,
        "Operation": "unset",
        "Timestamp": "1556272469102.282227",
        "TenantClass": 0,
        "Source": "DataXceiver.java:261",
        "ThreadID": 7108,
        "ThreadName": "",
        "EventID": "DB9906BFEEEB5008",
        "BaggageBytes": "[[248 5] [240 0] [0 134 117 91 122 228 180 250 109] [240 1] [0 80 134 185 206 67 130 31 224] [240 3] [0 2]]",
        "ProcessID": 2319
      },
      {
        "Cycles": 0,
        "Agent": "Execution-Sleep",
        "ProcessName": "Data",
        "TaskID": "86755B7AE4B4FA6D",
        "ParentEventID": [
          "0BE4C79C44642767"
        ],
        "Label": "waited",
        "Title": "X-Trace Task",
        "Host": "pinky19.mpi-sws.org",
        "Duration": "3035",
        "HRT": 25488829162043847,
        "Operation": "waited",
        "Timestamp": "1556272469102.155518",
        "TenantClass": 0,
        "Source": "SocketIOWithTimeout.java:335",
        "ThreadID": 7108,
        "ThreadName": "",
        "EventID": "5086B9CE43821FE0",
        "BaggageBytes": "[[248 5] [240 0] [0 134 117 91 122 228 180 250 109] [240 1] [0 11 228 199 156 68 100 39 103] [240 3] [0 2]]",
        "ProcessID": 2319
      }
    ]
  }
]