[
  {
    "id": "DD8264EB047FF705",
    "reports": [
      {
        "Cycles": 0,
        "Agent": "org.apache.hadoop.ipc.ProtobufRpcEngine",
        "ProcessName": "Read",
        "TaskID": "DD8264EB047FF705",
        "ParentEventID": [
          "B5F4EAE8BF45F0FB"
        ],
        "Label": "Invoking org.apache.hadoop.hdfs.protocol.ClientProtocol.getBlockLocations",
        "Title": "X-Trace Task",
        "Host": "pinky19.mpi-sws.org",
        "HRT": 26966598533122739,
        "Timestamp": "1557750238473.612305",
        "TenantClass": 0,
        "Source": "ProtobufRpcEngine.java:228",
        "ThreadID": 1,
        "ThreadName": "",
        "EventID": "756F92A2F9A1AA3D",
        "ProcessID": 2801
      },
      {
        "Cycles": 0,
        "Agent": "edu.brown.cs.systems.retro.benchmarks.hdfs_client.Reader",
        "ProcessName": "Read",
        "TaskID": "DD8264EB047FF705",
        "ParentEventID": [
          "B0E73426965D15FB"
        ],
        "Label": "Reading file",
        "Title": "X-Trace Task",
        "Host": "pinky19.mpi-sws.org",
        "HRT": 26966598533056983,
        "Timestamp": "1557750238473.546631",
        "TenantClass": 0,
        "ThreadID": 1,
        "ThreadName": "",
        "EventID": "B5F4EAE8BF45F0FB",
        "ProcessID": 2801
      },
      {
        "Cycles": 0,
        "Agent": "Execution-CPU",
        "ProcessName": "Read",
        "TaskID": "DD8264EB047FF705",
        "ParentEventID": [
          "3EB9F729064F10DF"
        ],
        "Label": "set",
        "Title": "X-Trace Task",
        "Host": "pinky19.mpi-sws.org",
        "HRT": 26966598533202218,
        "Operation": "set",
        "Timestamp": "1557750238473.691895",
        "TenantClass": 0,
        "Source": "Client.java:1032",
        "ThreadID": 41,
        "ThreadName": "",
        "EventID": "17D9EEC3AF238C9C",
        "ProcessID": 2801
      },
      {
        "Cycles": 0,
        "Agent": "edu.brown.cs.systems.xtrace.logging.BaggageWrappers",
        "ProcessName": "Read",
        "TaskID": "DD8264EB047FF705",
        "ParentEventID": [
          "17D9EEC3AF238C9C"
        ],
        "Label": "Forking current baggage with Baggage.fork()",
        "Title": "X-Trace Task",
        "Host": "pinky19.mpi-sws.org",
        "HRT": 26966598533223800,
        "Operation": "fork",
        "Timestamp": "1557750238473.713379",
        "TenantClass": 0,
        "Source": "Client.java:1043",
        "ThreadID": 41,
        "ThreadName": "",
        "EventID": "7986A41651FA9570",
        "ProcessID": 2801
      },
      {
        "Cycles": 0,
        "Agent": "Execution-CPU",
        "ProcessName": "Read",
        "TaskID": "DD8264EB047FF705",
        "ParentEventID": [
          "7986A41651FA9570"
        ],
        "Label": "unset",
        "Title": "X-Trace Task",
        "Host": "pinky19.mpi-sws.org",
        "Duration": "72539",
        "HRT": 26966598533295425,
        "Operation": "unset",
        "Timestamp": "1557750238473.784912",
        "TenantClass": 0,
        "Source": "Client.java:1062",
        "ThreadID": 41,
        "ThreadName": "",
        "EventID": "C1C3C8B1B766780E",
        "ProcessID": 2801
      },
      {
        "Cycles": 0,
        "Agent": "Execution-CPU",
        "ProcessName": "Read",
        "TaskID": "DD8264EB047FF705",
        "ParentEventID": [
          "C1C3C8B1B766780E"
        ],
        "Label": "set",
        "Title": "X-Trace Task",
        "Host": "pinky19.mpi-sws.org",
        "HRT": 26966598533317162,
        "Operation": "set",
        "Timestamp": "1557750238473.806641",
        "TenantClass": 0,
        "Source": "Client.java:1104",
        "ThreadID": 1,
        "ThreadName": "",
        "EventID": "60BF759F89694918",
        "ProcessID": 2801
      },
      {
        "Cycles": 0,
        "Agent": "Execution-CPU",
        "ProcessName": "Name",
        "TaskID": "DD8264EB047FF705",
        "ParentEventID": [
          "7986A41651FA9570"
        ],
        "Label": "set",
        "Title": "X-Trace Task",
        "Host": "pinky19.mpi-sws.org",
        "HRT": 26966598533383826,
        "Operation": "set",
        "Timestamp": "1557750238473.878174",
        "TenantClass": 0,
        "Source": "Server.java:1840",
        "ThreadID": 48,
        "ThreadName": "",
        "EventID": "9F87FB0AB36DA34E",
        "BaggageBytes": "[[248 5] [240 0] [0 221 130 100 235 4 127 247 5] [240 1] [0 121 134 164 22 81 250 149 112] [240 3] [0 2]]",
        "ProcessID": 2171
      },
      {
        "Cycles": 0,
        "Agent": "Execution-CPU",
        "ProcessName": "Read",
        "TaskID": "DD8264EB047FF705",
        "ParentEventID": [
          "756F92A2F9A1AA3D"
        ],
        "Label": "unset",
        "Title": "X-Trace Task",
        "Host": "pinky19.mpi-sws.org",
        "Duration": "24142011",
        "HRT": 26966598533151909,
        "Operation": "unset",
        "Timestamp": "1557750238473.641602",
        "TenantClass": 0,
        "Source": "Client.java:1027",
        "ThreadID": 1,
        "ThreadName": "",
        "EventID": "3EB9F729064F10DF",
        "ProcessID": 2801
      },
      {
        "Cycles": 0,
        "Agent": "edu.brown.cs.systems.xtrace.logging.BaggageWrappers",
        "ProcessName": "Name",
        "TaskID": "DD8264EB047FF705",
        "ParentEventID": [
          "9F87FB0AB36DA34E"
        ],
        "Label": "Forking current baggage with Baggage.fork()",
        "Title": "X-Trace Task",
        "Host": "pinky19.mpi-sws.org",
        "HRT": 26966598533414265,
        "Operation": "fork",
        "Timestamp": "1557750238473.908691",
        "TenantClass": 0,
        "Source": "Server.java:550",
        "ThreadID": 48,
        "ThreadName": "",
        "EventID": "9A6C4D6310D4C076",
        "BaggageBytes": "[[248 5] [240 0] [0 221 130 100 235 4 127 247 5] [240 1] [0 159 135 251 10 179 109 163 78] [240 3] [0 2]]",
        "ProcessID": 2171
      },
      {
        "Cycles": 0,
        "Agent": "Execution-CPU",
        "ProcessName": "Name",
        "TaskID": "DD8264EB047FF705",
        "ParentEventID": [
          "9A6C4D6310D4C076"
        ],
        "Label": "unset",
        "Title": "X-Trace Task",
        "Host": "pinky19.mpi-sws.org",
        "Duration": "27707",
        "HRT": 26966598533437922,
        "Operation": "unset",
        "Timestamp": "1557750238473.932373",
        "TenantClass": 0,
        "Source": "Server.java:1828",
        "ThreadID": 48,
        "ThreadName": "",
        "EventID": "1076B1C8FF671B7A",
        "BaggageBytes": "[[248 5] [240 0] [0 221 130 100 235 4 127 247 5] [240 1] [0 154 108 77 99 16 212 192 118] [240 3] [0 2]]",
        "ProcessID": 2171
      },
      {
        "Cycles": 0,
        "Agent": "Execution-CPU",
        "ProcessName": "Name",
        "TaskID": "DD8264EB047FF705",
        "ParentEventID": [
          "9A6C4D6310D4C076"
        ],
        "Label": "set",
        "Title": "X-Trace Task",
        "Host": "pinky19.mpi-sws.org",
        "HRT": 26966598533472484,
        "Operation": "set",
        "Timestamp": "1557750238473.966797",
        "TenantClass": 0,
        "Source": "Server.java:2071",
        "ThreadID": 62,
        "ThreadName": "",
        "EventID": "7C0BECA125FE5AD3",
        "BaggageBytes": "[[248 5] [240 0] [0 221 130 100 235 4 127 247 5] [240 1] [0 154 108 77 99 16 212 192 118] [240 3] [0 2]]",
        "ProcessID": 2171
      },
      {
        "Cycles": 0,
        "Agent": "org.apache.hadoop.ipc.Server",
        "ProcessName": "Name",
        "TaskID": "DD8264EB047FF705",
        "ParentEventID": [
          "7C0BECA125FE5AD3"
        ],
        "Label": "getBlockLocations in org.apache.hadoop.hdfs.protocol.ClientProtocol",
        "Title": "X-Trace Task",
        "Host": "pinky19.mpi-sws.org",
        "HRT": 26966598533514133,
        "Timestamp": "1557750238474.008545",
        "TenantClass": 0,
        "Source": "ProtobufRpcEngine.java:601",
        "ThreadID": 62,
        "ThreadName": "",
        "EventID": "8045F51A19D5314A",
        "BaggageBytes": "[[248 5] [240 0] [0 221 130 100 235 4 127 247 5] [240 1] [0 124 11 236 161 37 254 90 211] [240 3] [0 2]]",
        "ProcessID": 2171
      },
      {
        "Cycles": 0,
        "Agent": "edu.brown.cs.systems.xtrace.logging.BaggageWrappers",
        "ProcessName": "Name",
        "TaskID": "DD8264EB047FF705",
        "ParentEventID": [
          "8F41D5A4C6B7047F"
        ],
        "Label": "Forking current baggage with Baggage.fork()",
        "Title": "X-Trace Task",
        "Host": "pinky19.mpi-sws.org",
        "HRT": 26966598533613606,
        "Operation": "fork",
        "Timestamp": "1557750238474.107910",
        "TenantClass": 0,
        "Source": "Server.java:2398",
        "ThreadID": 62,
        "ThreadName": "",
        "EventID": "CB91C6FF5F186255",
        "BaggageBytes": "[[248 5] [240 0] [0 221 130 100 235 4 127 247 5] [240 1] [0 143 65 213 164 198 183 4 127] [240 3] [0 2]]",
        "ProcessID": 2171
      },
      {
        "Cycles": 0,
        "Agent": "org.apache.hadoop.hdfs.server.namenode.FSNamesystem.audit",
        "ProcessName": "Name",
        "TaskID": "DD8264EB047FF705",
        "ParentEventID": [
          "8045F51A19D5314A"
        ],
        "Label": "allowed=true\tugi=plascas (auth:SIMPLE)\tip=/139.19.171.63\tcmd=open\tsrc=/ds/7PteyUOJ8erW6ZVw\tdst=null\tperm=null\tproto=rpc",
        "Title": "X-Trace Task",
        "Host": "pinky19.mpi-sws.org",
        "HRT": 26966598533559913,
        "Timestamp": "1557750238474.054199",
        "TenantClass": 0,
        "Source": "FSNamesystem.java:8313",
        "ThreadID": 62,
        "ThreadName": "",
        "EventID": "8F41D5A4C6B7047F",
        "BaggageBytes": "[[248 5] [240 0] [0 221 130 100 235 4 127 247 5] [240 1] [0 128 69 245 26 25 213 49 74] [240 3] [0 2]]",
        "ProcessID": 2171
      },
      {
        "Cycles": 0,
        "Agent": "Execution-CPU",
        "ProcessName": "Name",
        "TaskID": "DD8264EB047FF705",
        "ParentEventID": [
          "CB91C6FF5F186255"
        ],
        "Label": "unset",
        "Title": "X-Trace Task",
        "Host": "pinky19.mpi-sws.org",
        "Duration": "222384",
        "HRT": 26966598533723393,
        "Operation": "unset",
        "Timestamp": "1557750238474.217773",
        "TenantClass": 0,
        "Source": "Server.java:1058",
        "ThreadID": 62,
        "ThreadName": "",
        "EventID": "3A3454165FA1979D",
        "BaggageBytes": "[[248 5] [240 0] [0 221 130 100 235 4 127 247 5] [240 1] [0 203 145 198 255 95 24 98 85] [240 3] [0 2]]",
        "ProcessID": 2171
      },
      {
        "Cycles": 0,
        "Agent": "Execution-CPU",
        "ProcessName": "Read",
        "TaskID": "DD8264EB047FF705",
        "ParentEventID": [
          "CB91C6FF5F186255"
        ],
        "Label": "set",
        "Title": "X-Trace Task",
        "Host": "pinky19.mpi-sws.org",
        "HRT": 26966598533783198,
        "Operation": "set",
        "Timestamp": "1557750238474.272705",
        "TenantClass": 0,
        "Source": "Client.java:302",
        "ThreadID": 40,
        "ThreadName": "",
        "EventID": "6E342720703D0C75",
        "ProcessID": 2801
      },
      {
        "Cycles": 0,
        "Agent": "Execution-Sleep",
        "ProcessName": "Read",
        "TaskID": "DD8264EB047FF705",
        "ParentEventID": [
          "60BF759F89694918"
        ],
        "Label": "waited",
        "Title": "X-Trace Task",
        "Host": "pinky19.mpi-sws.org",
        "Duration": "506044",
        "HRT": 26966598533833941,
        "Operation": "waited",
        "Timestamp": "1557750238474.323486",
        "TenantClass": 0,
        "Source": "Client.java:1537",
        "ThreadID": 1,
        "ThreadName": "",
        "EventID": "17AE881A23D96A10",
        "ProcessID": 2801
      },
      {
        "Cycles": 0,
        "Agent": "Execution-CPU",
        "ProcessName": "Read",
        "TaskID": "DD8264EB047FF705",
        "ParentEventID": [
          "6E342720703D0C75"
        ],
        "Label": "unset",
        "Title": "X-Trace Task",
        "Host": "pinky19.mpi-sws.org",
        "Duration": "11842",
        "HRT": 26966598533811287,
        "Operation": "unset",
        "Timestamp": "1557750238474.300781",
        "TenantClass": 0,
        "Source": "Client.java:1168",
        "ThreadID": 40,
        "ThreadName": "",
        "EventID": "D56AC3632F410B3D",
        "ProcessID": 2801
      },
      {
        "Cycles": 0,
        "Agent": "edu.brown.cs.systems.xtrace.logging.BaggageWrappers",
        "ProcessName": "Read",
        "TaskID": "DD8264EB047FF705",
        "ParentEventID": [
          "D56AC3632F410B3D",
          "17AE881A23D96A10"
        ],
        "Label": "Merged current baggage with other baggage",
        "Title": "X-Trace Task",
        "Host": "pinky19.mpi-sws.org",
        "HRT": 26966598533858381,
        "Operation": "join",
        "Timestamp": "1557750238474.347900",
        "TenantClass": 0,
        "Source": "Client.java:1545",
        "ThreadID": 1,
        "ThreadName": "",
        "EventID": "5BDD2107910F1AD5",
        "ProcessID": 2801
      },
      {
        "Cycles": 0,
        "Agent": "Execution-Sleep",
        "ProcessName": "Read",
        "TaskID": "DD8264EB047FF705",
        "ParentEventID": [
          "4C7D9A0056879033"
        ],
        "Label": "waited",
        "Title": "X-Trace Task",
        "Host": "pinky19.mpi-sws.org",
        "Duration": "117764",
        "HRT": 26966598534138357,
        "Operation": "waited",
        "Timestamp": "1557750238474.627930",
        "TenantClass": 0,
        "Source": "SocketIOWithTimeout.java:335",
        "ThreadID": 1,
        "ThreadName": "",
        "EventID": "0B1968EB03EBF640",
        "ProcessID": 2801
      },
      {
        "Cycles": 0,
        "Agent": "edu.brown.cs.systems.xtrace.logging.BaggageWrappers",
        "ProcessName": "Read",
        "TaskID": "DD8264EB047FF705",
        "ParentEventID": [
          "0B1968EB03EBF640"
        ],
        "Label": "Forking current baggage with Baggage.fork()",
        "Title": "X-Trace Task",
        "Host": "pinky19.mpi-sws.org",
        "HRT": 26966598534191626,
        "Operation": "fork",
        "Timestamp": "1557750238474.681152",
        "TenantClass": 0,
        "Source": "DataTransferProtoUtil.java:94",
        "ThreadID": 1,
        "ThreadName": "",
        "EventID": "6B0200D10C22733A",
        "ProcessID": 2801
      },
      {
        "Cycles": 0,
        "Agent": "org.apache.hadoop.ipc.ProtobufRpcEngine",
        "ProcessName": "Read",
        "TaskID": "DD8264EB047FF705",
        "ParentEventID": [
          "5BDD2107910F1AD5"
        ],
        "Label": "org.apache.hadoop.hdfs.protocol.ClientProtocol.getBlockLocations completed",
        "Title": "X-Trace Task",
        "Host": "pinky19.mpi-sws.org",
        "HRT": 26966598533911546,
        "Timestamp": "1557750238474.401123",
        "TenantClass": 0,
        "Source": "ProtobufRpcEngine.java:275",
        "ThreadID": 1,
        "ThreadName": "",
        "EventID": "4C7D9A0056879033",
        "ProcessID": 2801
      },
      {
        "Cycles": 0,
        "Agent": "Execution-CPU",
        "ProcessName": "Data",
        "TaskID": "DD8264EB047FF705",
        "ParentEventID": [
          "6B0200D10C22733A"
        ],
        "Label": "set",
        "Title": "X-Trace Task",
        "Host": "pinky20.mpi-sws.org",
        "HRT": 6569802893781565,
        "Operation": "set",
        "Timestamp": "1557750238475.108887",
        "TenantClass": 0,
        "Source": "Receiver.java:117",
        "ThreadID": 14596,
        "ThreadName": "",
        "EventID": "FDCB0F6083481531",
        "BaggageBytes": "[[248 5] [240 0] [0 221 130 100 235 4 127 247 5] [240 1] [0 107 2 0 209 12 34 115 58] [240 3] [0 2]]",
        "ProcessID": 13111
      },
      {
        "Cycles": 0,
        "Agent": "edu.brown.cs.systems.xtrace.logging.BaggageWrappers",
        "ProcessName": "Data",
        "TaskID": "DD8264EB047FF705",
        "ParentEventID": [
          "F016F44FA0CC0524"
        ],
        "Label": "Forking current baggage with Baggage.fork()",
        "Title": "X-Trace Task",
        "Host": "pinky20.mpi-sws.org",
        "HRT": 6569802894100354,
        "Operation": "fork",
        "Timestamp": "1557750238475.427734",
        "TenantClass": 0,
        "Source": "DataXceiver.java:1257",
        "ThreadID": 14596,
        "ThreadName": "",
        "EventID": "403445CE8FF240D4",
        "BaggageBytes": "[[248 5] [240 0] [0 221 130 100 235 4 127 247 5] [240 1] [0 240 22 244 79 160 204 5 36] [240 3] [0 2]]",
        "ProcessID": 13111
      },
      {
        "Cycles": 0,
        "Agent": "edu.brown.cs.systems.xtrace.logging.XTraceInit",
        "ProcessName": "Data",
        "TaskID": "DD8264EB047FF705",
        "ParentEventID": [
          "FDCB0F6083481531"
        ],
        "Label": "Thread.setName: DataXceiver for client DFSClient_NONMAPREDUCE_310321604_1 at /139.19.171.63:44380 [Sending block BP-1633380353-139.19.171.63-1554193446451:blk_1073759259_18435]",
        "Title": "X-Trace Task",
        "Host": "pinky20.mpi-sws.org",
        "HRT": 6569802893877870,
        "Timestamp": "1557750238475.205322",
        "TenantClass": 0,
        "Source": "DataXceiver.java:168",
        "ThreadID": 14596,
        "ThreadName": "",
        "EventID": "F016F44FA0CC0524",
        "BaggageBytes": "[[248 5] [240 0] [0 221 130 100 235 4 127 247 5] [240 1] [0 253 203 15 96 131 72 21 49] [240 3] [0 2]]",
        "ProcessID": 13111
      },
      {
        "Cycles": 0,
        "Agent": "Execution-Sleep",
        "ProcessName": "Read",
        "TaskID": "DD8264EB047FF705",
        "ParentEventID": [
          "6B0200D10C22733A"
        ],
        "Label": "waited",
        "Title": "X-Trace Task",
        "Host": "pinky19.mpi-sws.org",
        "Duration": "867060",
        "HRT": 26966598535143876,
        "Operation": "waited",
        "Timestamp": "1557750238475.633545",
        "TenantClass": 0,
        "Source": "SocketIOWithTimeout.java:335",
        "ThreadID": 1,
        "ThreadName": "",
        "EventID": "26544CFDBFDCE451",
        "ProcessID": 2801
      },
      {
        "Cycles": 0,
        "Agent": "edu.brown.cs.systems.xtrace.logging.BaggageWrappers",
        "ProcessName": "Read",
        "TaskID": "DD8264EB047FF705",
        "ParentEventID": [
          "26544CFDBFDCE451",
          "403445CE8FF240D4"
        ],
        "Label": "Merged current baggage with other baggage",
        "Title": "X-Trace Task",
        "Host": "pinky19.mpi-sws.org",
        "HRT": 26966598535218931,
        "Operation": "join",
        "Timestamp": "1557750238475.708496",
        "TenantClass": 0,
        "Source": "RemoteBlockReader2.java:429",
        "ThreadID": 1,
        "ThreadName": "",
        "EventID": "61D1ABAD09EFFDBB",
        "ProcessID": 2801
      },
      {
        "Cycles": 0,
        "Agent": "edu.brown.cs.systems.xtrace.logging.BaggageWrappers",
        "ProcessName": "Data",
        "TaskID": "DD8264EB047FF705",
        "ParentEventID": [
          "403445CE8FF240D4"
        ],
        "Label": "Forking current baggage with Baggage.fork()",
        "Title": "X-Trace Task",
        "Host": "pinky20.mpi-sws.org",
        "HRT": 6569802894255215,
        "Operation": "fork",
        "Timestamp": "1557750238475.582520",
        "TenantClass": 0,
        "Source": "PacketHeader.java:95",
        "ThreadID": 14596,
        "ThreadName": "",
        "EventID": "D50D8B09DB8F3503",
        "BaggageBytes": "[[248 5] [240 0] [0 221 130 100 235 4 127 247 5] [240 1] [0 64 52 69 206 143 242 64 212] [240 3] [0 2]]",
        "ProcessID": 13111
      },
      {
        "Cycles": 0,
        "Agent": "Execution-Sleep",
        "ProcessName": "Read",
        "TaskID": "DD8264EB047FF705",
        "ParentEventID": [
          "61D1ABAD09EFFDBB"
        ],
        "Label": "waited",
        "Title": "X-Trace Task",
        "Host": "pinky19.mpi-sws.org",
        "Duration": "16226",
        "HRT": 26966598535297364,
        "Operation": "waited",
        "Timestamp": "1557750238475.786865",
        "TenantClass": 0,
        "Source": "SocketIOWithTimeout.java:335",
        "ThreadID": 1,
        "ThreadName": "",
        "EventID": "04A591EC7E9C7AAD",
        "ProcessID": 2801
      },
      {
        "Cycles": 0,
        "Agent": "Execution-Sleep",
        "ProcessName": "Data",
        "TaskID": "DD8264EB047FF705",
        "ParentEventID": [
          "D50D8B09DB8F3503"
        ],
        "Label": "waited",
        "Title": "X-Trace Task",
        "Host": "pinky20.mpi-sws.org",
        "Duration": "12898",
        "HRT": 6569802894401997,
        "Operation": "waited",
        "Timestamp": "1557750238475.729492",
        "TenantClass": 0,
        "Source": "SocketIOWithTimeout.java:335",
        "ThreadID": 14596,
        "ThreadName": "",
        "EventID": "FBE855816DAED646",
        "BaggageBytes": "[[248 5] [240 0] [0 221 130 100 235 4 127 247 5] [240 1] [0 213 13 139 9 219 143 53 3] [240 3] [0 2]]",
        "ProcessID": 13111
      },
      {
        "Cycles": 0,
        "Agent": "edu.brown.cs.systems.xtrace.logging.BaggageWrappers",
        "ProcessName": "Data",
        "TaskID": "DD8264EB047FF705",
        "ParentEventID": [
          "FBE855816DAED646"
        ],
        "Label": "Forking current baggage with Baggage.fork()",
        "Title": "X-Trace Task",
        "Host": "pinky20.mpi-sws.org",
        "HRT": 6569802894565982,
        "Operation": "fork",
        "Timestamp": "1557750238475.893311",
        "TenantClass": 0,
        "Source": "PacketHeader.java:95",
        "ThreadID": 14596,
        "ThreadName": "",
        "EventID": "23364C3F4411614C",
        "BaggageBytes": "[[248 5] [240 0] [0 221 130 100 235 4 127 247 5] [240 1] [0 251 232 85 129 109 174 214 70] [240 3] [0 2]]",
        "ProcessID": 13111
      },
      {
        "Cycles": 0,
        "Agent": "Execution-Sleep",
        "ProcessName": "Read",
        "TaskID": "DD8264EB047FF705",
        "ParentEventID": [
          "21387E943B9F70FA"
        ],
        "Label": "waited",
        "Title": "X-Trace Task",
        "Host": "pinky19.mpi-sws.org",
        "Duration": "215449",
        "HRT": 26966598535952957,
        "Operation": "waited",
        "Timestamp": "1557750238476.442627",
        "TenantClass": 0,
        "Source": "SocketIOWithTimeout.java:335",
        "ThreadID": 1,
        "ThreadName": "",
        "EventID": "1EEF58809334B558",
        "ProcessID": 2801
      },
      {
        "Cycles": 0,
        "Agent": "Execution-Sleep",
        "ProcessName": "Read",
        "TaskID": "DD8264EB047FF705",
        "ParentEventID": [
          "04A591EC7E9C7AAD"
        ],
        "Label": "waited",
        "Title": "X-Trace Task",
        "Host": "pinky19.mpi-sws.org",
        "Duration": "294085",
        "HRT": 26966598535664994,
        "Operation": "waited",
        "Timestamp": "1557750238476.154541",
        "TenantClass": 0,
        "Source": "SocketIOWithTimeout.java:335",
        "ThreadID": 1,
        "ThreadName": "",
        "EventID": "21387E943B9F70FA",
        "ProcessID": 2801
      },
      {
        "Cycles": 0,
        "Agent": "Execution-Sleep",
        "ProcessName": "Read",
        "TaskID": "DD8264EB047FF705",
        "ParentEventID": [
          "1EEF58809334B558"
        ],
        "Label": "waited",
        "Title": "X-Trace Task",
        "Host": "pinky19.mpi-sws.org",
        "Duration": "144910",
        "HRT": 26966598536157813,
        "Operation": "waited",
        "Timestamp": "1557750238476.647461",
        "TenantClass": 0,
        "Source": "SocketIOWithTimeout.java:335",
        "ThreadID": 1,
        "ThreadName": "",
        "EventID": "2D7354734DE8D8A1",
        "ProcessID": 2801
      },
      {
        "Cycles": 0,
        "Agent": "edu.brown.cs.systems.xtrace.logging.BaggageWrappers",
        "ProcessName": "Read",
        "TaskID": "DD8264EB047FF705",
        "ParentEventID": [
          "23364C3F4411614C",
          "E9A61947836A738C"
        ],
        "Label": "Merged current baggage with other baggage",
        "Title": "X-Trace Task",
        "Host": "pinky19.mpi-sws.org",
        "HRT": 26966598536327376,
        "Operation": "join",
        "Timestamp": "1557750238476.816895",
        "TenantClass": 0,
        "Source": "PacketHeader.java:168",
        "ThreadID": 1,
        "ThreadName": "",
        "EventID": "6F0A9D60AE0385B0",
        "ProcessID": 2801
      },
      {
        "Cycles": 0,
        "Agent": "edu.brown.cs.systems.xtrace.logging.BaggageWrappers",
        "ProcessName": "Read",
        "TaskID": "DD8264EB047FF705",
        "ParentEventID": [
          "D50D8B09DB8F3503",
          "2D7354734DE8D8A1"
        ],
        "Label": "Merged current baggage with other baggage",
        "Title": "X-Trace Task",
        "Host": "pinky19.mpi-sws.org",
        "HRT": 26966598536226775,
        "Operation": "join",
        "Timestamp": "1557750238476.716309",
        "TenantClass": 0,
        "Source": "PacketHeader.java:168",
        "ThreadID": 1,
        "ThreadName": "",
        "EventID": "E9A61947836A738C",
        "ProcessID": 2801
      },
      {
        "Cycles": 0,
        "Agent": "edu.brown.cs.systems.xtrace.logging.BaggageWrappers",
        "ProcessName": "Read",
        "TaskID": "DD8264EB047FF705",
        "ParentEventID": [
          "6F0A9D60AE0385B0"
        ],
        "Label": "Forking current baggage with Baggage.fork()",
        "Title": "X-Trace Task",
        "Host": "pinky19.mpi-sws.org",
        "HRT": 26966598536339118,
        "Operation": "fork",
        "Timestamp": "1557750238476.828613",
        "TenantClass": 0,
        "Source": "RemoteBlockReader2.java:361",
        "ThreadID": 1,
        "ThreadName": "",
        "EventID": "FDAA36751BA36DCD",
        "ProcessID": 2801
      },
      {
        "Cycles": 0,
        "Agent": "edu.brown.cs.systems.xtrace.logging.BaggageWrappers",
        "ProcessName": "Read",
        "TaskID": "DD8264EB047FF705",
        "ParentEventID": [
          "FDAA36751BA36DCD"
        ],
        "Label": "Forking current baggage with Baggage.fork()",
        "Title": "X-Trace Task",
        "Host": "pinky19.mpi-sws.org",
        "HRT": 26966598536413164,
        "Operation": "fork",
        "Timestamp": "1557750238476.902832",
        "TenantClass": 0,
        "Source": "DataTransferProtoUtil.java:94",
        "ThreadID": 1,
        "ThreadName": "",
        "EventID": "79421D250614C4B1",
        "ProcessID": 2801
      },
      {
        "Cycles": 0,
        "Agent": "Execution-Sleep",
        "ProcessName": "Data",
        "TaskID": "DD8264EB047FF705",
        "ParentEventID": [
          "23364C3F4411614C"
        ],
        "Label": "waited",
        "Title": "X-Trace Task",
        "Host": "pinky20.mpi-sws.org",
        "Duration": "811802",
        "HRT": 6569802895562363,
        "Operation": "waited",
        "Timestamp": "1557750238476.889648",
        "TenantClass": 0,
        "Source": "SocketIOWithTimeout.java:335",
        "ThreadID": 14596,
        "ThreadName": "",
        "EventID": "703EBDD862A5482C",
        "BaggageBytes": "[[248 5] [240 0] [0 221 130 100 235 4 127 247 5] [240 1] [0 35 54 76 63 68 17 97 76] [240 3] [0 2]]",
        "ProcessID": 13111
      },
      {
        "Cycles": 0,
        "Agent": "Execution-CPU",
        "ProcessName": "Data",
        "TaskID": "DD8264EB047FF705",
        "ParentEventID": [
          "0F3BA829D97A7577"
        ],
        "Label": "unset",
        "Title": "X-Trace Task",
        "Host": "pinky20.mpi-sws.org",
        "Duration": "2018305",
        "HRT": 6569802895868098,
        "Operation": "unset",
        "Timestamp": "1557750238477.195557",
        "TenantClass": 0,
        "Source": "DataXceiver.java:261",
        "ThreadID": 14596,
        "ThreadName": "",
        "EventID": "B8CB42F832B36F13",
        "BaggageBytes": "[[248 5] [240 0] [0 221 130 100 235 4 127 247 5] [240 1] [0 15 59 168 41 217 122 117 119] [240 3] [0 2]]",
        "ProcessID": 13111
      },
      {
        "Cycles": 0,
        "Agent": "edu.brown.cs.systems.xtrace.logging.BaggageWrappers",
        "ProcessName": "Data",
        "TaskID": "DD8264EB047FF705",
        "ParentEventID": [
          "FDAA36751BA36DCD",
          "703EBDD862A5482C"
        ],
        "Label": "Merged current baggage with other baggage",
        "Title": "X-Trace Task",
        "Host": "pinky20.mpi-sws.org",
        "HRT": 6569802895781713,
        "Operation": "join",
        "Timestamp": "1557750238477.109131",
        "TenantClass": 0,
        "Source": "DataXceiver.java:574",
        "ThreadID": 14596,
        "ThreadName": "",
        "EventID": "0F3BA829D97A7577",
        "BaggageBytes": "[[248 5] [240 0] [0 221 130 100 235 4 127 247 5] [240 1] [0 253 170 54 117 27 163 109 205] [0 112 62 189 216 98 165 72 44] [240 3] [0 2]]",
        "ProcessID": 13111
      },
      {
        "Cycles": 0,
        "Agent": "Execution-CPU",
        "ProcessName": "Data",
        "TaskID": "DD8264EB047FF705",
        "ParentEventID": [
          "79421D250614C4B1"
        ],
        "Label": "set",
        "Title": "X-Trace Task",
        "Host": "pinky20.mpi-sws.org",
        "HRT": 6569802895940249,
        "Operation": "set",
        "Timestamp": "1557750238477.267578",
        "TenantClass": 0,
        "Source": "Receiver.java:117",
        "ThreadID": 14596,
        "ThreadName": "",
        "EventID": "AC8802D18335462C",
        "BaggageBytes": "[[248 5] [240 0] [0 221 130 100 235 4 127 247 5] [240 1] [0 121 66 29 37 6 20 196 177] [240 3] [0 2]]",
        "ProcessID": 13111
      },
      {
        "Cycles": 0,
        "Agent": "edu.brown.cs.systems.xtrace.logging.BaggageWrappers",
        "ProcessName": "Data",
        "TaskID": "DD8264EB047FF705",
        "ParentEventID": [
          "A87ACBEF5B7C76C5"
        ],
        "Label": "Forking current baggage with Baggage.fork()",
        "Title": "X-Trace Task",
        "Host": "pinky20.mpi-sws.org",
        "HRT": 6569802896251382,
        "Operation": "fork",
        "Timestamp": "1557750238477.578857",
        "TenantClass": 0,
        "Source": "DataXceiver.java:1257",
        "ThreadID": 14596,
        "ThreadName": "",
        "EventID": "8A4A38D757D430AD",
        "BaggageBytes": "[[248 5] [240 0] [0 221 130 100 235 4 127 247 5] [240 1] [0 168 122 203 239 91 124 118 197] [240 3] [0 2]]",
        "ProcessID": 13111
      },
      {
        "Cycles": 0,
        "Agent": "edu.brown.cs.systems.xtrace.logging.XTraceInit",
        "ProcessName": "Data",
        "TaskID": "DD8264EB047FF705",
        "ParentEventID": [
          "AC8802D18335462C"
        ],
        "Label": "Thread.setName: DataXceiver for client DFSClient_NONMAPREDUCE_310321604_1 at /139.19.171.63:44380 [Sending block BP-1633380353-139.19.171.63-1554193446451:blk_1073759259_18435]",
        "Title": "X-Trace Task",
        "Host": "pinky20.mpi-sws.org",
        "HRT": 6569802896031142,
        "Timestamp": "1557750238477.358643",
        "TenantClass": 0,
        "Source": "DataXceiver.java:168",
        "ThreadID": 14596,
        "ThreadName": "",
        "EventID": "A87ACBEF5B7C76C5",
        "BaggageBytes": "[[248 5] [240 0] [0 221 130 100 235 4 127 247 5] [240 1] [0 172 136 2 209 131 53 70 44] [240 3] [0 2]]",
        "ProcessID": 13111
      },
      {
        "Cycles": 0,
        "Agent": "Execution-Sleep",
        "ProcessName": "Read",
        "TaskID": "DD8264EB047FF705",
        "ParentEventID": [
          "79421D250614C4B1"
        ],
        "Label": "waited",
        "Title": "X-Trace Task",
        "Host": "pinky19.mpi-sws.org",
        "Duration": "841525",
        "HRT": 26966598537330428,
        "Operation": "waited",
        "Timestamp": "1557750238477.820068",
        "TenantClass": 0,
        "Source": "SocketIOWithTimeout.java:335",
        "ThreadID": 1,
        "ThreadName": "",
        "EventID": "9B0E4804AEECF939",
        "ProcessID": 2801
      },
      {
        "Cycles": 0,
        "Agent": "edu.brown.cs.systems.xtrace.logging.BaggageWrappers",
        "ProcessName": "Read",
        "TaskID": "DD8264EB047FF705",
        "ParentEventID": [
          "8A4A38D757D430AD",
          "9B0E4804AEECF939"
        ],
        "Label": "Merged current baggage with other baggage",
        "Title": "X-Trace Task",
        "Host": "pinky19.mpi-sws.org",
        "HRT": 26966598537394067,
        "Operation": "join",
        "Timestamp": "1557750238477.883545",
        "TenantClass": 0,
        "Source": "RemoteBlockReader2.java:429",
        "ThreadID": 1,
        "ThreadName": "",
        "EventID": "C9E78DFB13174330",
        "ProcessID": 2801
      },
      {
        "Cycles": 0,
        "Agent": "edu.brown.cs.systems.xtrace.logging.BaggageWrappers",
        "ProcessName": "Data",
        "TaskID": "DD8264EB047FF705",
        "ParentEventID": [
          "8A4A38D757D430AD"
        ],
        "Label": "Forking current baggage with Baggage.fork()",
        "Title": "X-Trace Task",
        "Host": "pinky20.mpi-sws.org",
        "HRT": 6569802896454416,
        "Operation": "fork",
        "Timestamp": "1557750238477.781738",
        "TenantClass": 0,
        "Source": "PacketHeader.java:95",
        "ThreadID": 14596,
        "ThreadName": "",
        "EventID": "F71D7F1C71E8CCDD",
        "BaggageBytes": "[[248 5] [240 0] [0 221 130 100 235 4 127 247 5] [240 1] [0 138 74 56 215 87 212 48 173] [240 3] [0 2]]",
        "ProcessID": 13111
      },
      {
        "Cycles": 0,
        "Agent": "Execution-Sleep",
        "ProcessName": "Data",
        "TaskID": "DD8264EB047FF705",
        "ParentEventID": [
          "F71D7F1C71E8CCDD"
        ],
        "Label": "waited",
        "Title": "X-Trace Task",
        "Host": "pinky20.mpi-sws.org",
        "Duration": "29994",
        "HRT": 6569802896617149,
        "Operation": "waited",
        "Timestamp": "1557750238477.944580",
        "TenantClass": 0,
        "Source": "SocketIOWithTimeout.java:335",
        "ThreadID": 14596,
        "ThreadName": "",
        "EventID": "BBB72C6E7D5BBD93",
        "BaggageBytes": "[[248 5] [240 0] [0 221 130 100 235 4 127 247 5] [240 1] [0 247 29 127 28 113 232 204 221] [240 3] [0 2]]",
        "ProcessID": 13111
      },
      {
        "Cycles": 0,
        "Agent": "Execution-Sleep",
        "ProcessName": "Read",
        "TaskID": "DD8264EB047FF705",
        "ParentEventID": [
          "C9E78DFB13174330"
        ],
        "Label": "waited",
        "Title": "X-Trace Task",
        "Host": "pinky19.mpi-sws.org",
        "Duration": "14642",
        "HRT": 26966598537481221,
        "Operation": "waited",
        "Timestamp": "1557750238477.970703",
        "TenantClass": 0,
        "Source": "SocketIOWithTimeout.java:335",
        "ThreadID": 1,
        "ThreadName": "",
        "EventID": "C0B38623785B2C24",
        "ProcessID": 2801
      },
      {
        "Cycles": 0,
        "Agent": "Execution-Sleep",
        "ProcessName": "Read",
        "TaskID": "DD8264EB047FF705",
        "ParentEventID": [
          "C0B38623785B2C24"
        ],
        "Label": "waited",
        "Title": "X-Trace Task",
        "Host": "pinky19.mpi-sws.org",
        "Duration": "357573",
        "HRT": 26966598537903029,
        "Operation": "waited",
        "Timestamp": "1557750238478.392578",
        "TenantClass": 0,
        "Source": "SocketIOWithTimeout.java:335",
        "ThreadID": 1,
        "ThreadName": "",
        "EventID": "CA222B9713CED86A",
        "ProcessID": 2801
      },
      {
        "Cycles": 0,
        "Agent": "edu.brown.cs.systems.xtrace.logging.BaggageWrappers",
        "ProcessName": "Data",
        "TaskID": "DD8264EB047FF705",
        "ParentEventID": [
          "BBB72C6E7D5BBD93"
        ],
        "Label": "Forking current baggage with Baggage.fork()",
        "Title": "X-Trace Task",
        "Host": "pinky20.mpi-sws.org",
        "HRT": 6569802896807814,
        "Operation": "fork",
        "Timestamp": "1557750238478.135254",
        "TenantClass": 0,
        "Source": "PacketHeader.java:95",
        "ThreadID": 14596,
        "ThreadName": "",
        "EventID": "E54BC0CD9E9DE49D",
        "BaggageBytes": "[[248 5] [240 0] [0 221 130 100 235 4 127 247 5] [240 1] [0 187 183 44 110 125 91 189 147] [240 3] [0 2]]",
        "ProcessID": 13111
      },
      {
        "Cycles": 0,
        "Agent": "Execution-Sleep",
        "ProcessName": "Read",
        "TaskID": "DD8264EB047FF705",
        "ParentEventID": [
          "CA222B9713CED86A"
        ],
        "Label": "waited",
        "Title": "X-Trace Task",
        "Host": "pinky19.mpi-sws.org",
        "Duration": "166196",
        "HRT": 26966598538113436,
        "Operation": "waited",
        "Timestamp": "1557750238478.603027",
        "TenantClass": 0,
        "Source": "SocketIOWithTimeout.java:335",
        "ThreadID": 1,
        "ThreadName": "",
        "EventID": "8E57F5CD765D37E4",
        "ProcessID": 2801
      },
      {
        "Cycles": 0,
        "Agent": "Execution-Sleep",
        "ProcessName": "Read",
        "TaskID": "DD8264EB047FF705",
        "ParentEventID": [
          "8E57F5CD765D37E4"
        ],
        "Label": "waited",
        "Title": "X-Trace Task",
        "Host": "pinky19.mpi-sws.org",
        "Duration": "98018",
        "HRT": 26966598538258410,
        "Operation": "waited",
        "Timestamp": "1557750238478.748047",
        "TenantClass": 0,
        "Source": "SocketIOWithTimeout.java:335",
        "ThreadID": 1,
        "ThreadName": "",
        "EventID": "A1816A69C963A544",
        "ProcessID": 2801
      },
      {
        "Cycles": 0,
        "Agent": "edu.brown.cs.systems.xtrace.logging.BaggageWrappers",
        "ProcessName": "Read",
        "TaskID": "DD8264EB047FF705",
        "ParentEventID": [
          "F71D7F1C71E8CCDD",
          "A1816A69C963A544"
        ],
        "Label": "Merged current baggage with other baggage",
        "Title": "X-Trace Task",
        "Host": "pinky19.mpi-sws.org",
        "HRT": 26966598538295807,
        "Operation": "join",
        "Timestamp": "1557750238478.785400",
        "TenantClass": 0,
        "Source": "PacketHeader.java:168",
        "ThreadID": 1,
        "ThreadName": "",
        "EventID": "F2483BB7451D0BE8",
        "ProcessID": 2801
      },
      {
        "Cycles": 0,
        "Agent": "Execution-Sleep",
        "ProcessName": "Data",
        "TaskID": "DD8264EB047FF705",
        "ParentEventID": [
          "E54BC0CD9E9DE49D"
        ],
        "Label": "waited",
        "Title": "X-Trace Task",
        "Host": "pinky20.mpi-sws.org",
        "Duration": "178151",
        "HRT": 6569802897095374,
        "Operation": "waited",
        "Timestamp": "1557750238478.422852",
        "TenantClass": 0,
        "Source": "SocketIOWithTimeout.java:335",
        "ThreadID": 14596,
        "ThreadName": "",
        "EventID": "D0689EAA63883ABC",
        "BaggageBytes": "[[248 5] [240 0] [0 221 130 100 235 4 127 247 5] [240 1] [0 229 75 192 205 158 157 228 157] [240 3] [0 2]]",
        "ProcessID": 13111
      },
      {
        "Cycles": 0,
        "Agent": "edu.brown.cs.systems.xtrace.logging.BaggageWrappers",
        "ProcessName": "Data",
        "TaskID": "DD8264EB047FF705",
        "ParentEventID": [
          "D0689EAA63883ABC"
        ],
        "Label": "Forking current baggage with Baggage.fork()",
        "Title": "X-Trace Task",
        "Host": "pinky20.mpi-sws.org",
        "HRT": 6569802897288026,
        "Operation": "fork",
        "Timestamp": "1557750238478.615479",
        "TenantClass": 0,
        "Source": "PacketHeader.java:95",
        "ThreadID": 14596,
        "ThreadName": "",
        "EventID": "1949F82A880DE3FF",
        "BaggageBytes": "[[248 5] [240 0] [0 221 130 100 235 4 127 247 5] [240 1] [0 208 104 158 170 99 136 58 188] [240 3] [0 2]]",
        "ProcessID": 13111
      },
      {
        "Cycles": 0,
        "Agent": "Execution-Sleep",
        "ProcessName": "Data",
        "TaskID": "DD8264EB047FF705",
        "ParentEventID": [
          "1949F82A880DE3FF"
        ],
        "Label": "waited",
        "Title": "X-Trace Task",
        "Host": "pinky20.mpi-sws.org",
        "Duration": "9273",
        "HRT": 6569802897433298,
        "Operation": "waited",
        "Timestamp": "1557750238478.760742",
        "TenantClass": 0,
        "Source": "SocketIOWithTimeout.java:335",
        "ThreadID": 14596,
        "ThreadName": "",
        "EventID": "78F9D8FC587E8083",
        "BaggageBytes": "[[248 5] [240 0] [0 221 130 100 235 4 127 247 5] [240 1] [0 25 73 248 42 136 13 227 255] [240 3] [0 2]]",
        "ProcessID": 13111
      },
      {
        "Cycles": 0,
        "Agent": "Execution-CPU",
        "ProcessName": "Data",
        "TaskID": "DD8264EB047FF705",
        "ParentEventID": [
          "78F9D8FC587E8083"
        ],
        "Label": "unset",
        "Title": "X-Trace Task",
        "Host": "pinky20.mpi-sws.org",
        "Duration": "1842898",
        "HRT": 6569802897850261,
        "Operation": "unset",
        "Timestamp": "1557750238479.177734",
        "TenantClass": 0,
        "Source": "DataXceiver.java:261",
        "ThreadID": 14596,
        "ThreadName": "",
        "EventID": "A3693E51BA2C8E09",
        "BaggageBytes": "[[248 5] [240 0] [0 221 130 100 235 4 127 247 5] [240 1] [0 120 249 216 252 88 126 128 131] [240 3] [0 2]]",
        "ProcessID": 13111
      },
      {
        "Cycles": 0,
        "Agent": "edu.brown.cs.systems.retro.benchmarks.hdfs_client.Reader",
        "ProcessName": "Read",
        "TaskID": "DD8264EB047FF705",
        "ParentEventID": [
          "0"
        ],
        "Label": "Reading file",
        "Title": "X-Trace Task",
        "Host": "pinky19.mpi-sws.org",
        "HRT": 26966598533033454,
        "Timestamp": "1557750238473.522949",
        "TenantClass": 0,
        "ThreadID": 1,
        "ThreadName": "",
        "EventID": "B0E73426965D15FB",
        "ProcessID": 2801,
        "Tag": [
          "reader_100kb",
          "Read Size: 102400"
        ]
      }
    ]
  }
]