[
  {
    "id": "B9223899E498BD87",
    "reports": [
      {
        "Cycles": 0,
        "Agent": "Execution-CPU",
        "ProcessName": "Read",
        "TaskID": "B9223899E498BD87",
        "ParentEventID": [
          "D2BD2E993CFD742C"
        ],
        "Label": "unset",
        "Title": "X-Trace Task",
        "Host": "pinky19.mpi-sws.org",
        "Duration": "23018584",
        "HRT": 25491752637550292,
        "Operation": "unset",
        "Timestamp": "1556275392578.135254",
        "TenantClass": 0,
        "Source": "Client.java:1027",
        "ThreadID": 1,
        "ThreadName": "",
        "EventID": "5106E654B1274C47",
        "ProcessID": 21035
      },
      {
        "Cycles": 0,
        "Agent": "org.apache.hadoop.ipc.ProtobufRpcEngine",
        "ProcessName": "Read",
        "TaskID": "B9223899E498BD87",
        "ParentEventID": [
          "002DA1307F7144DD"
        ],
        "Label": "Invoking org.apache.hadoop.hdfs.protocol.ClientProtocol.getBlockLocations",
        "Title": "X-Trace Task",
        "Host": "pinky19.mpi-sws.org",
        "HRT": 25491752637481127,
        "Timestamp": "1556275392578.066162",
        "TenantClass": 0,
        "Source": "ProtobufRpcEngine.java:228",
        "ThreadID": 1,
        "ThreadName": "",
        "EventID": "D2BD2E993CFD742C",
        "ProcessID": 21035
      },
      {
        "Cycles": 0,
        "Agent": "edu.brown.cs.systems.retro.benchmarks.hdfs_client.Reader",
        "ProcessName": "Read",
        "TaskID": "B9223899E498BD87",
        "ParentEventID": [
          "0"
        ],
        "Label": "Reading file",
        "Title": "X-Trace Task",
        "Host": "pinky19.mpi-sws.org",
        "HRT": 25491752637350167,
        "Timestamp": "1556275392577.935059",
        "TenantClass": 0,
        "ThreadID": 1,
        "ThreadName": "",
        "EventID": "013D852B274C95ED",
        "ProcessID": 21035,
        "Tag": [
          "reader_1kb",
          "Read Size: 1024"
        ]
      },
      {
        "Cycles": 0,
        "Agent": "edu.brown.cs.systems.xtrace.logging.BaggageWrappers",
        "ProcessName": "Read",
        "TaskID": "B9223899E498BD87",
        "ParentEventID": [
          "6AB6707D375563B2"
        ],
        "Label": "Forking current baggage with Baggage.fork()",
        "Title": "X-Trace Task",
        "Host": "pinky19.mpi-sws.org",
        "HRT": 25491752637623737,
        "Operation": "fork",
        "Timestamp": "1556275392578.208740",
        "TenantClass": 0,
        "Source": "Client.java:1043",
        "ThreadID": 41,
        "ThreadName": "",
        "EventID": "DA2EADA84137B2EE",
        "ProcessID": 21035
      },
      {
        "Cycles": 0,
        "Agent": "Execution-CPU",
        "ProcessName": "Read",
        "TaskID": "B9223899E498BD87",
        "ParentEventID": [
          "5106E654B1274C47"
        ],
        "Label": "set",
        "Title": "X-Trace Task",
        "Host": "pinky19.mpi-sws.org",
        "HRT": 25491752637602724,
        "Operation": "set",
        "Timestamp": "1556275392578.187744",
        "TenantClass": 0,
        "Source": "Client.java:1032",
        "ThreadID": 41,
        "ThreadName": "",
        "EventID": "6AB6707D375563B2",
        "ProcessID": 21035
      },
      {
        "Cycles": 0,
        "Agent": "Execution-CPU",
        "ProcessName": "Read",
        "TaskID": "B9223899E498BD87",
        "ParentEventID": [
          "B597040B2E56EE68"
        ],
        "Label": "set",
        "Title": "X-Trace Task",
        "Host": "pinky19.mpi-sws.org",
        "HRT": 25491752637768528,
        "Operation": "set",
        "Timestamp": "1556275392578.353516",
        "TenantClass": 0,
        "Source": "Client.java:1104",
        "ThreadID": 1,
        "ThreadName": "",
        "EventID": "6C2F67585A0F972D",
        "ProcessID": 21035
      },
      {
        "Cycles": 0,
        "Agent": "Execution-CPU",
        "ProcessName": "Name",
        "TaskID": "B9223899E498BD87",
        "ParentEventID": [
          "DA2EADA84137B2EE"
        ],
        "Label": "set",
        "Title": "X-Trace Task",
        "Host": "pinky19.mpi-sws.org",
        "HRT": 25491752637826287,
        "Operation": "set",
        "Timestamp": "1556275392578.447510",
        "TenantClass": 0,
        "Source": "Server.java:1840",
        "ThreadID": 48,
        "ThreadName": "",
        "EventID": "3B1C2262D0E17A0E",
        "BaggageBytes": "[[248 5] [240 0] [0 185 34 56 153 228 152 189 135] [240 1] [0 218 46 173 168 65 55 178 238] [240 3] [0 2]]",
        "ProcessID": 2171
      },
      {
        "Cycles": 0,
        "Agent": "edu.brown.cs.systems.xtrace.logging.BaggageWrappers",
        "ProcessName": "Name",
        "TaskID": "B9223899E498BD87",
        "ParentEventID": [
          "3B1C2262D0E17A0E"
        ],
        "Label": "Forking current baggage with Baggage.fork()",
        "Title": "X-Trace Task",
        "Host": "pinky19.mpi-sws.org",
        "HRT": 25491752637876264,
        "Operation": "fork",
        "Timestamp": "1556275392578.497559",
        "TenantClass": 0,
        "Source": "Server.java:550",
        "ThreadID": 48,
        "ThreadName": "",
        "EventID": "DDE16BC7E806CC24",
        "BaggageBytes": "[[248 5] [240 0] [0 185 34 56 153 228 152 189 135] [240 1] [0 59 28 34 98 208 225 122 14] [240 3] [0 2]]",
        "ProcessID": 2171
      },
      {
        "Cycles": 0,
        "Agent": "edu.brown.cs.systems.retro.benchmarks.hdfs_client.Reader",
        "ProcessName": "Read",
        "TaskID": "B9223899E498BD87",
        "ParentEventID": [
          "013D852B274C95ED"
        ],
        "Label": "Reading file",
        "Title": "X-Trace Task",
        "Host": "pinky19.mpi-sws.org",
        "HRT": 25491752637381844,
        "Timestamp": "1556275392577.966797",
        "TenantClass": 0,
        "ThreadID": 1,
        "ThreadName": "",
        "EventID": "002DA1307F7144DD",
        "ProcessID": 21035
      },
      {
        "Cycles": 0,
        "Agent": "Execution-CPU",
        "ProcessName": "Name",
        "TaskID": "B9223899E498BD87",
        "ParentEventID": [
          "DDE16BC7E806CC24"
        ],
        "Label": "unset",
        "Title": "X-Trace Task",
        "Host": "pinky19.mpi-sws.org",
        "Duration": "32486",
        "HRT": 25491752637900758,
        "Operation": "unset",
        "Timestamp": "1556275392578.521973",
        "TenantClass": 0,
        "Source": "Server.java:1828",
        "ThreadID": 48,
        "ThreadName": "",
        "EventID": "6C68583F0C9C3405",
        "BaggageBytes": "[[248 5] [240 0] [0 185 34 56 153 228 152 189 135] [240 1] [0 221 225 107 199 232 6 204 36] [240 3] [0 2]]",
        "ProcessID": 2171
      },
      {
        "Cycles": 0,
        "Agent": "Execution-CPU",
        "ProcessName": "Read",
        "TaskID": "B9223899E498BD87",
        "ParentEventID": [
          "DA2EADA84137B2EE"
        ],
        "Label": "unset",
        "Title": "X-Trace Task",
        "Host": "pinky19.mpi-sws.org",
        "Duration": "119757",
        "HRT": 25491752637741250,
        "Operation": "unset",
        "Timestamp": "1556275392578.326172",
        "TenantClass": 0,
        "Source": "Client.java:1062",
        "ThreadID": 41,
        "ThreadName": "",
        "EventID": "B597040B2E56EE68",
        "ProcessID": 21035
      },
      {
        "Cycles": 0,
        "Agent": "org.apache.hadoop.hdfs.server.namenode.FSNamesystem.audit",
        "ProcessName": "Name",
        "TaskID": "B9223899E498BD87",
        "ParentEventID": [
          "99F251782C88D23C"
        ],
        "Label": "allowed=true\tugi=plascas (auth:SIMPLE)\tip=/139.19.171.63\tcmd=open\tsrc=/ds/nl5xL3hmuKM5hOZi\tdst=null\tperm=null\tproto=rpc",
        "Title": "X-Trace Task",
        "Host": "pinky19.mpi-sws.org",
        "HRT": 25491752638081614,
        "Timestamp": "1556275392578.702881",
        "TenantClass": 0,
        "Source": "FSNamesystem.java:8313",
        "ThreadID": 61,
        "ThreadName": "",
        "EventID": "E9D3CBD33250DD8F",
        "BaggageBytes": "[[248 5] [240 0] [0 185 34 56 153 228 152 189 135] [240 1] [0 153 242 81 120 44 136 210 60] [240 3] [0 2]]",
        "ProcessID": 2171
      },
      {
        "Cycles": 0,
        "Agent": "edu.brown.cs.systems.xtrace.logging.BaggageWrappers",
        "ProcessName": "Name",
        "TaskID": "B9223899E498BD87",
        "ParentEventID": [
          "E9D3CBD33250DD8F"
        ],
        "Label": "Forking current baggage with Baggage.fork()",
        "Title": "X-Trace Task",
        "Host": "pinky19.mpi-sws.org",
        "HRT": 25491752638158710,
        "Operation": "fork",
        "Timestamp": "1556275392578.780029",
        "TenantClass": 0,
        "Source": "Server.java:2398",
        "ThreadID": 61,
        "ThreadName": "",
        "EventID": "A40A575003AB4558",
        "BaggageBytes": "[[248 5] [240 0] [0 185 34 56 153 228 152 189 135] [240 1] [0 233 211 203 211 50 80 221 143] [240 3] [0 2]]",
        "ProcessID": 2171
      },
      {
        "Cycles": 0,
        "Agent": "Execution-CPU",
        "ProcessName": "Name",
        "TaskID": "B9223899E498BD87",
        "ParentEventID": [
          "A40A575003AB4558"
        ],
        "Label": "unset",
        "Title": "X-Trace Task",
        "Host": "pinky19.mpi-sws.org",
        "Duration": "372455",
        "HRT": 25491752638325349,
        "Operation": "unset",
        "Timestamp": "1556275392578.946533",
        "TenantClass": 0,
        "Source": "Server.java:1058",
        "ThreadID": 61,
        "ThreadName": "",
        "EventID": "37389E0F725ACCA0",
        "BaggageBytes": "[[248 5] [240 0] [0 185 34 56 153 228 152 189 135] [240 1] [0 164 10 87 80 3 171 69 88] [240 3] [0 2]]",
        "ProcessID": 2171
      },
      {
        "Cycles": 0,
        "Agent": "Execution-CPU",
        "ProcessName": "Name",
        "TaskID": "B9223899E498BD87",
        "ParentEventID": [
          "DDE16BC7E806CC24"
        ],
        "Label": "set",
        "Title": "X-Trace Task",
        "Host": "pinky19.mpi-sws.org",
        "HRT": 25491752637919316,
        "Operation": "set",
        "Timestamp": "1556275392578.540527",
        "TenantClass": 0,
        "Source": "Server.java:2071",
        "ThreadID": 61,
        "ThreadName": "",
        "EventID": "0D8567CCBF7763B9",
        "BaggageBytes": "[[248 5] [240 0] [0 185 34 56 153 228 152 189 135] [240 1] [0 221 225 107 199 232 6 204 36] [240 3] [0 2]]",
        "ProcessID": 2171
      },
      {
        "Cycles": 0,
        "Agent": "Execution-CPU",
        "ProcessName": "Read",
        "TaskID": "B9223899E498BD87",
        "ParentEventID": [
          "A40A575003AB4558"
        ],
        "Label": "set",
        "Title": "X-Trace Task",
        "Host": "pinky19.mpi-sws.org",
        "HRT": 25491752638433621,
        "Operation": "set",
        "Timestamp": "1556275392579.018555",
        "TenantClass": 0,
        "Source": "Client.java:302",
        "ThreadID": 37,
        "ThreadName": "",
        "EventID": "09523079BEBEB460",
        "ProcessID": 21035
      },
      {
        "Cycles": 0,
        "Agent": "Execution-Sleep",
        "ProcessName": "Read",
        "TaskID": "B9223899E498BD87",
        "ParentEventID": [
          "6C2F67585A0F972D"
        ],
        "Label": "waited",
        "Title": "X-Trace Task",
        "Host": "pinky19.mpi-sws.org",
        "Duration": "739314",
        "HRT": 25491752638522284,
        "Operation": "waited",
        "Timestamp": "1556275392579.107178",
        "TenantClass": 0,
        "Source": "Client.java:1537",
        "ThreadID": 1,
        "ThreadName": "",
        "EventID": "5E40FD2F1FB51D26",
        "ProcessID": 21035
      },
      {
        "Cycles": 0,
        "Agent": "org.apache.hadoop.ipc.Server",
        "ProcessName": "Name",
        "TaskID": "B9223899E498BD87",
        "ParentEventID": [
          "0D8567CCBF7763B9"
        ],
        "Label": "getBlockLocations in org.apache.hadoop.hdfs.protocol.ClientProtocol",
        "Title": "X-Trace Task",
        "Host": "pinky19.mpi-sws.org",
        "HRT": 25491752637988600,
        "Timestamp": "1556275392578.609863",
        "TenantClass": 0,
        "Source": "ProtobufRpcEngine.java:601",
        "ThreadID": 61,
        "ThreadName": "",
        "EventID": "99F251782C88D23C",
        "BaggageBytes": "[[248 5] [240 0] [0 185 34 56 153 228 152 189 135] [240 1] [0 13 133 103 204 191 119 99 185] [240 3] [0 2]]",
        "ProcessID": 2171
      },
      {
        "Cycles": 0,
        "Agent": "edu.brown.cs.systems.xtrace.logging.BaggageWrappers",
        "ProcessName": "Read",
        "TaskID": "B9223899E498BD87",
        "ParentEventID": [
          "5E40FD2F1FB51D26",
          "FE3F02A12BC4CAD0"
        ],
        "Label": "Merged current baggage with other baggage",
        "Title": "X-Trace Task",
        "Host": "pinky19.mpi-sws.org",
        "HRT": 25491752638558911,
        "Operation": "join",
        "Timestamp": "1556275392579.143799",
        "TenantClass": 0,
        "Source": "Client.java:1545",
        "ThreadID": 1,
        "ThreadName": "",
        "EventID": "E1A8E6955264D67D",
        "ProcessID": 21035
      },
      {
        "Cycles": 0,
        "Agent": "edu.brown.cs.systems.xtrace.logging.BaggageWrappers",
        "ProcessName": "Read",
        "TaskID": "B9223899E498BD87",
        "ParentEventID": [
          "A2D0E21B0AD94A5C"
        ],
        "Label": "Forking current baggage with Baggage.fork()",
        "Title": "X-Trace Task",
        "Host": "pinky19.mpi-sws.org",
        "HRT": 25491752638741954,
        "Operation": "fork",
        "Timestamp": "1556275392579.326904",
        "TenantClass": 0,
        "Source": "DataTransferProtoUtil.java:94",
        "ThreadID": 1,
        "ThreadName": "",
        "EventID": "5CD8331F776C4072",
        "ProcessID": 21035
      },
      {
        "Cycles": 0,
        "Agent": "Execution-CPU",
        "ProcessName": "Read",
        "TaskID": "B9223899E498BD87",
        "ParentEventID": [
          "09523079BEBEB460"
        ],
        "Label": "unset",
        "Title": "X-Trace Task",
        "Host": "pinky19.mpi-sws.org",
        "Duration": "18132",
        "HRT": 25491752638473914,
        "Operation": "unset",
        "Timestamp": "1556275392579.058838",
        "TenantClass": 0,
        "Source": "Client.java:1168",
        "ThreadID": 37,
        "ThreadName": "",
        "EventID": "FE3F02A12BC4CAD0",
        "ProcessID": 21035
      },
      {
        "Cycles": 0,
        "Agent": "Execution-CPU",
        "ProcessName": "Data",
        "TaskID": "B9223899E498BD87",
        "ParentEventID": [
          "5CD8331F776C4072"
        ],
        "Label": "set",
        "Title": "X-Trace Task",
        "Host": "pinky20.mpi-sws.org",
        "HRT": 5094956998577173,
        "Operation": "set",
        "Timestamp": "1556275392579.530518",
        "TenantClass": 0,
        "Source": "Receiver.java:117",
        "ThreadID": 5400,
        "ThreadName": "",
        "EventID": "B0F8FC87C6365840",
        "BaggageBytes": "[[248 5] [240 0] [0 185 34 56 153 228 152 189 135] [240 1] [0 92 216 51 31 119 108 64 114] [240 3] [0 2]]",
        "ProcessID": 13111
      },
      {
        "Cycles": 0,
        "Agent": "edu.brown.cs.systems.xtrace.logging.BaggageWrappers",
        "ProcessName": "Data",
        "TaskID": "B9223899E498BD87",
        "ParentEventID": [
          "0CBA197473FB9093"
        ],
        "Label": "Forking current baggage with Baggage.fork()",
        "Title": "X-Trace Task",
        "Host": "pinky20.mpi-sws.org",
        "HRT": 5094956998826580,
        "Operation": "fork",
        "Timestamp": "1556275392579.780029",
        "TenantClass": 0,
        "Source": "DataXceiver.java:1257",
        "ThreadID": 5400,
        "ThreadName": "",
        "EventID": "1F9FE6F47CC0F4E8",
        "BaggageBytes": "[[248 5] [240 0] [0 185 34 56 153 228 152 189 135] [240 1] [0 12 186 25 116 115 251 144 147] [240 3] [0 2]]",
        "ProcessID": 13111
      },
      {
        "Cycles": 0,
        "Agent": "org.apache.hadoop.ipc.ProtobufRpcEngine",
        "ProcessName": "Read",
        "TaskID": "B9223899E498BD87",
        "ParentEventID": [
          "E1A8E6955264D67D"
        ],
        "Label": "org.apache.hadoop.hdfs.protocol.ClientProtocol.getBlockLocations completed",
        "Title": "X-Trace Task",
        "Host": "pinky19.mpi-sws.org",
        "HRT": 25491752638619131,
        "Timestamp": "1556275392579.204102",
        "TenantClass": 0,
        "Source": "ProtobufRpcEngine.java:275",
        "ThreadID": 1,
        "ThreadName": "",
        "EventID": "A2D0E21B0AD94A5C",
        "ProcessID": 21035
      },
      {
        "Cycles": 0,
        "Agent": "Execution-Sleep",
        "ProcessName": "Read",
        "TaskID": "B9223899E498BD87",
        "ParentEventID": [
          "5CD8331F776C4072"
        ],
        "Label": "waited",
        "Title": "X-Trace Task",
        "Host": "pinky19.mpi-sws.org",
        "Duration": "491849",
        "HRT": 25491752639356914,
        "Operation": "waited",
        "Timestamp": "1556275392579.941895",
        "TenantClass": 0,
        "Source": "SocketIOWithTimeout.java:335",
        "ThreadID": 1,
        "ThreadName": "",
        "EventID": "EAC29A5FB2701F85",
        "ProcessID": 21035
      },
      {
        "Cycles": 0,
        "Agent": "Execution-Sleep",
        "ProcessName": "Data",
        "TaskID": "B9223899E498BD87",
        "ParentEventID": [
          "06DE6891E55B8213"
        ],
        "Label": "waited",
        "Title": "X-Trace Task",
        "Host": "pinky20.mpi-sws.org",
        "Duration": "8130",
        "HRT": 5094956999060601,
        "Operation": "waited",
        "Timestamp": "1556275392580.013916",
        "TenantClass": 0,
        "Source": "SocketIOWithTimeout.java:335",
        "ThreadID": 5400,
        "ThreadName": "",
        "EventID": "07D0EEA12610E677",
        "BaggageBytes": "[[248 5] [240 0] [0 185 34 56 153 228 152 189 135] [240 1] [0 6 222 104 145 229 91 130 19] [240 3] [0 2]]",
        "ProcessID": 13111
      },
      {
        "Cycles": 0,
        "Agent": "edu.brown.cs.systems.xtrace.logging.XTraceInit",
        "ProcessName": "Data",
        "TaskID": "B9223899E498BD87",
        "ParentEventID": [
          "B0F8FC87C6365840"
        ],
        "Label": "Thread.setName: DataXceiver for client DFSClient_NONMAPREDUCE_1377588049_1 at /139.19.171.63:32854 [Sending block BP-1633380353-139.19.171.63-1554193446451:blk_1073760747_19923]",
        "Title": "X-Trace Task",
        "Host": "pinky20.mpi-sws.org",
        "HRT": 5094956998648030,
        "Timestamp": "1556275392579.601318",
        "TenantClass": 0,
        "Source": "DataXceiver.java:168",
        "ThreadID": 5400,
        "ThreadName": "",
        "EventID": "0CBA197473FB9093",
        "BaggageBytes": "[[248 5] [240 0] [0 185 34 56 153 228 152 189 135] [240 1] [0 176 248 252 135 198 54 88 64] [240 3] [0 2]]",
        "ProcessID": 13111
      },
      {
        "Cycles": 0,
        "Agent": "edu.brown.cs.systems.xtrace.logging.BaggageWrappers",
        "ProcessName": "Read",
        "TaskID": "B9223899E498BD87",
        "ParentEventID": [
          "EAC29A5FB2701F85",
          "1F9FE6F47CC0F4E8"
        ],
        "Label": "Merged current baggage with other baggage",
        "Title": "X-Trace Task",
        "Host": "pinky19.mpi-sws.org",
        "HRT": 25491752639521790,
        "Operation": "join",
        "Timestamp": "1556275392580.106689",
        "TenantClass": 0,
        "Source": "RemoteBlockReader2.java:429",
        "ThreadID": 1,
        "ThreadName": "",
        "EventID": "CDD68E4420DF0A70",
        "ProcessID": 21035
      },
      {
        "Cycles": 0,
        "Agent": "edu.brown.cs.systems.xtrace.logging.BaggageWrappers",
        "ProcessName": "Read",
        "TaskID": "B9223899E498BD87",
        "ParentEventID": [
          "CDD68E4420DF0A70",
          "06DE6891E55B8213"
        ],
        "Label": "Merged current baggage with other baggage",
        "Title": "X-Trace Task",
        "Host": "pinky19.mpi-sws.org",
        "HRT": 25491752639675839,
        "Operation": "join",
        "Timestamp": "1556275392580.260742",
        "TenantClass": 0,
        "Source": "PacketHeader.java:168",
        "ThreadID": 1,
        "ThreadName": "",
        "EventID": "52B0FD3A72DB7320",
        "ProcessID": 21035
      },
      {
        "Cycles": 0,
        "Agent": "edu.brown.cs.systems.xtrace.logging.BaggageWrappers",
        "ProcessName": "Data",
        "TaskID": "B9223899E498BD87",
        "ParentEventID": [
          "1F9FE6F47CC0F4E8"
        ],
        "Label": "Forking current baggage with Baggage.fork()",
        "Title": "X-Trace Task",
        "Host": "pinky20.mpi-sws.org",
        "HRT": 5094956998955536,
        "Operation": "fork",
        "Timestamp": "1556275392579.908936",
        "TenantClass": 0,
        "Source": "PacketHeader.java:95",
        "ThreadID": 5400,
        "ThreadName": "",
        "EventID": "06DE6891E55B8213",
        "BaggageBytes": "[[248 5] [240 0] [0 185 34 56 153 228 152 189 135] [240 1] [0 31 159 230 244 124 192 244 232] [240 3] [0 2]]",
        "ProcessID": 13111
      },
      {
        "Cycles": 0,
        "Agent": "edu.brown.cs.systems.xtrace.logging.BaggageWrappers",
        "ProcessName": "Read",
        "TaskID": "B9223899E498BD87",
        "ParentEventID": [
          "6D4E98F3541EBD89",
          "52B0FD3A72DB7320"
        ],
        "Label": "Merged current baggage with other baggage",
        "Title": "X-Trace Task",
        "Host": "pinky19.mpi-sws.org",
        "HRT": 25491752639754583,
        "Operation": "join",
        "Timestamp": "1556275392580.339600",
        "TenantClass": 0,
        "Source": "PacketHeader.java:168",
        "ThreadID": 1,
        "ThreadName": "",
        "EventID": "E69401AB9A969AF6",
        "ProcessID": 21035
      },
      {
        "Cycles": 0,
        "Agent": "Execution-Sleep",
        "ProcessName": "Data",
        "TaskID": "B9223899E498BD87",
        "ParentEventID": [
          "6D4E98F3541EBD89"
        ],
        "Label": "waited",
        "Title": "X-Trace Task",
        "Host": "pinky20.mpi-sws.org",
        "Duration": "130569",
        "HRT": 5094956999484106,
        "Operation": "waited",
        "Timestamp": "1556275392580.437500",
        "TenantClass": 0,
        "Source": "SocketIOWithTimeout.java:335",
        "ThreadID": 5400,
        "ThreadName": "",
        "EventID": "096B160141D10D70",
        "BaggageBytes": "[[248 5] [240 0] [0 185 34 56 153 228 152 189 135] [240 1] [0 109 78 152 243 84 30 189 137] [240 3] [0 2]]",
        "ProcessID": 13111
      },
      {
        "Cycles": 0,
        "Agent": "edu.brown.cs.systems.xtrace.logging.BaggageWrappers",
        "ProcessName": "Data",
        "TaskID": "B9223899E498BD87",
        "ParentEventID": [
          "69B2011B922ABCF9",
          "096B160141D10D70"
        ],
        "Label": "Merged current baggage with other baggage",
        "Title": "X-Trace Task",
        "Host": "pinky20.mpi-sws.org",
        "HRT": 5094956999628932,
        "Operation": "join",
        "Timestamp": "1556275392580.582275",
        "TenantClass": 0,
        "Source": "DataXceiver.java:574",
        "ThreadID": 5400,
        "ThreadName": "",
        "EventID": "8058966786D00485",
        "BaggageBytes": "[[248 5] [240 0] [0 185 34 56 153 228 152 189 135] [240 1] [0 9 107 22 1 65 209 13 112] [0 105 178 1 27 146 42 188 249] [240 3] [0 2]]",
        "ProcessID": 13111
      },
      {
        "Cycles": 0,
        "Agent": "Execution-CPU",
        "ProcessName": "Data",
        "TaskID": "B9223899E498BD87",
        "ParentEventID": [
          "8058966786D00485"
        ],
        "Label": "unset",
        "Title": "X-Trace Task",
        "Host": "pinky20.mpi-sws.org",
        "Duration": "1048721",
        "HRT": 5094956999677587,
        "Operation": "unset",
        "Timestamp": "1556275392580.631104",
        "TenantClass": 0,
        "Source": "DataXceiver.java:261",
        "ThreadID": 5400,
        "ThreadName": "",
        "EventID": "9353B2F1E975DDC9",
        "BaggageBytes": "[[248 5] [240 0] [0 185 34 56 153 228 152 189 135] [240 1] [0 128 88 150 103 134 208 4 133] [240 3] [0 2]]",
        "ProcessID": 13111
      },
      {
        "Cycles": 0,
        "Agent": "edu.brown.cs.systems.xtrace.logging.BaggageWrappers",
        "ProcessName": "Data",
        "TaskID": "B9223899E498BD87",
        "ParentEventID": [
          "07D0EEA12610E677"
        ],
        "Label": "Forking current baggage with Baggage.fork()",
        "Title": "X-Trace Task",
        "Host": "pinky20.mpi-sws.org",
        "HRT": 5094956999182620,
        "Operation": "fork",
        "Timestamp": "1556275392580.135986",
        "TenantClass": 0,
        "Source": "PacketHeader.java:95",
        "ThreadID": 5400,
        "ThreadName": "",
        "EventID": "6D4E98F3541EBD89",
        "BaggageBytes": "[[248 5] [240 0] [0 185 34 56 153 228 152 189 135] [240 1] [0 7 208 238 161 38 16 230 119] [240 3] [0 2]]",
        "ProcessID": 13111
      },
      {
        "Cycles": 0,
        "Agent": "edu.brown.cs.systems.xtrace.logging.BaggageWrappers",
        "ProcessName": "Read",
        "TaskID": "B9223899E498BD87",
        "ParentEventID": [
          "E69401AB9A969AF6"
        ],
        "Label": "Forking current baggage with Baggage.fork()",
        "Title": "X-Trace Task",
        "Host": "pinky19.mpi-sws.org",
        "HRT": 25491752639768630,
        "Operation": "fork",
        "Timestamp": "1556275392580.353516",
        "TenantClass": 0,
        "Source": "RemoteBlockReader2.java:361",
        "ThreadID": 1,
        "ThreadName": "",
        "EventID": "69B2011B922ABCF9",
        "ProcessID": 21035
      }
    ]
  }
]