[
  {
    "id": "07CB94BB9D0A9F85",
    "reports": [
      {
        "Cycles": 0,
        "Agent": "Execution-CPU",
        "ProcessName": "Read",
        "TaskID": "07CB94BB9D0A9F85",
        "ParentEventID": [
          "A0C100ADF80EE964"
        ],
        "Label": "unset",
        "Title": "X-Trace Task",
        "Host": "pinky19.mpi-sws.org",
        "Duration": "24740932",
        "HRT": 26966693408738698,
        "Operation": "unset",
        "Timestamp": "1557750333349.082764",
        "TenantClass": 0,
        "Source": "Client.java:1027",
        "ThreadID": 1,
        "ThreadName": "",
        "EventID": "178018E465BD04F2",
        "ProcessID": 2801
      },
      {
        "Cycles": 0,
        "Agent": "edu.brown.cs.systems.retro.benchmarks.hdfs_client.Reader",
        "ProcessName": "Read",
        "TaskID": "07CB94BB9D0A9F85",
        "ParentEventID": [
          "FB33321007C78BF7"
        ],
        "Label": "Reading file",
        "Title": "X-Trace Task",
        "Host": "pinky19.mpi-sws.org",
        "HRT": 26966693408677396,
        "Timestamp": "1557750333349.021484",
        "TenantClass": 0,
        "ThreadID": 1,
        "ThreadName": "",
        "EventID": "243EAD615E20550D",
        "ProcessID": 2801
      },
      {
        "Cycles": 0,
        "Agent": "Execution-CPU",
        "ProcessName": "Read",
        "TaskID": "07CB94BB9D0A9F85",
        "ParentEventID": [
          "178018E465BD04F2"
        ],
        "Label": "set",
        "Title": "X-Trace Task",
        "Host": "pinky19.mpi-sws.org",
        "HRT": 26966693408760653,
        "Operation": "set",
        "Timestamp": "1557750333349.104736",
        "TenantClass": 0,
        "Source": "Client.java:1032",
        "ThreadID": 41,
        "ThreadName": "",
        "EventID": "101A569EEA3C92CC",
        "ProcessID": 2801
      },
      {
        "Cycles": 0,
        "Agent": "org.apache.hadoop.ipc.ProtobufRpcEngine",
        "ProcessName": "Read",
        "TaskID": "07CB94BB9D0A9F85",
        "ParentEventID": [
          "243EAD615E20550D"
        ],
        "Label": "Invoking org.apache.hadoop.hdfs.protocol.ClientProtocol.getBlockLocations",
        "Title": "X-Trace Task",
        "Host": "pinky19.mpi-sws.org",
        "HRT": 26966693408718363,
        "Timestamp": "1557750333349.062256",
        "TenantClass": 0,
        "Source": "ProtobufRpcEngine.java:228",
        "ThreadID": 1,
        "ThreadName": "",
        "EventID": "A0C100ADF80EE964",
        "ProcessID": 2801
      },
      {
        "Cycles": 0,
        "Agent": "edu.brown.cs.systems.xtrace.logging.BaggageWrappers",
        "ProcessName": "Read",
        "TaskID": "07CB94BB9D0A9F85",
        "ParentEventID": [
          "101A569EEA3C92CC"
        ],
        "Label": "Forking current baggage with Baggage.fork()",
        "Title": "X-Trace Task",
        "Host": "pinky19.mpi-sws.org",
        "HRT": 26966693408780556,
        "Operation": "fork",
        "Timestamp": "1557750333349.124512",
        "TenantClass": 0,
        "Source": "Client.java:1043",
        "ThreadID": 41,
        "ThreadName": "",
        "EventID": "AFEBE36C95056FD2",
        "ProcessID": 2801
      },
      {
        "Cycles": 0,
        "Agent": "Execution-CPU",
        "ProcessName": "Read",
        "TaskID": "07CB94BB9D0A9F85",
        "ParentEventID": [
          "AFEBE36C95056FD2"
        ],
        "Label": "unset",
        "Title": "X-Trace Task",
        "Host": "pinky19.mpi-sws.org",
        "Duration": "74769",
        "HRT": 26966693408855318,
        "Operation": "unset",
        "Timestamp": "1557750333349.199219",
        "TenantClass": 0,
        "Source": "Client.java:1062",
        "ThreadID": 41,
        "ThreadName": "",
        "EventID": "468F39F52D11309A",
        "ProcessID": 2801
      },
      {
        "Cycles": 0,
        "Agent": "Execution-CPU",
        "ProcessName": "Name",
        "TaskID": "07CB94BB9D0A9F85",
        "ParentEventID": [
          "AFEBE36C95056FD2"
        ],
        "Label": "set",
        "Title": "X-Trace Task",
        "Host": "pinky19.mpi-sws.org",
        "HRT": 26966693408912592,
        "Operation": "set",
        "Timestamp": "1557750333349.273926",
        "TenantClass": 0,
        "Source": "Server.java:1840",
        "ThreadID": 48,
        "ThreadName": "",
        "EventID": "9F844FBB520A73CC",
        "BaggageBytes": "[[248 5] [240 0] [0 7 203 148 187 157 10 159 133] [240 1] [0 175 235 227 108 149 5 111 210] [240 3] [0 2]]",
        "ProcessID": 2171
      },
      {
        "Cycles": 0,
        "Agent": "Execution-CPU",
        "ProcessName": "Read",
        "TaskID": "07CB94BB9D0A9F85",
        "ParentEventID": [
          "468F39F52D11309A"
        ],
        "Label": "set",
        "Title": "X-Trace Task",
        "Host": "pinky19.mpi-sws.org",
        "HRT": 26966693408880176,
        "Operation": "set",
        "Timestamp": "1557750333349.224121",
        "TenantClass": 0,
        "Source": "Client.java:1104",
        "ThreadID": 1,
        "ThreadName": "",
        "EventID": "FC62A9B5B9C64A10",
        "ProcessID": 2801
      },
      {
        "Cycles": 0,
        "Agent": "Execution-CPU",
        "ProcessName": "Name",
        "TaskID": "07CB94BB9D0A9F85",
        "ParentEventID": [
          "E03833EE263333DD"
        ],
        "Label": "unset",
        "Title": "X-Trace Task",
        "Host": "pinky19.mpi-sws.org",
        "Duration": "23791",
        "HRT": 26966693408964575,
        "Operation": "unset",
        "Timestamp": "1557750333349.325928",
        "TenantClass": 0,
        "Source": "Server.java:1828",
        "ThreadID": 48,
        "ThreadName": "",
        "EventID": "F26E74EE08C940D6",
        "BaggageBytes": "[[248 5] [240 0] [0 7 203 148 187 157 10 159 133] [240 1] [0 224 56 51 238 38 51 51 221] [240 3] [0 2]]",
        "ProcessID": 2171
      },
      {
        "Cycles": 0,
        "Agent": "Execution-CPU",
        "ProcessName": "Name",
        "TaskID": "07CB94BB9D0A9F85",
        "ParentEventID": [
          "E03833EE263333DD"
        ],
        "Label": "set",
        "Title": "X-Trace Task",
        "Host": "pinky19.mpi-sws.org",
        "HRT": 26966693408973425,
        "Operation": "set",
        "Timestamp": "1557750333349.334961",
        "TenantClass": 0,
        "Source": "Server.java:2071",
        "ThreadID": 57,
        "ThreadName": "",
        "EventID": "34F015D2ABEDC2F5",
        "BaggageBytes": "[[248 5] [240 0] [0 7 203 148 187 157 10 159 133] [240 1] [0 224 56 51 238 38 51 51 221] [240 3] [0 2]]",
        "ProcessID": 2171
      },
      {
        "Cycles": 0,
        "Agent": "edu.brown.cs.systems.xtrace.logging.BaggageWrappers",
        "ProcessName": "Name",
        "TaskID": "07CB94BB9D0A9F85",
        "ParentEventID": [
          "9F844FBB520A73CC"
        ],
        "Label": "Forking current baggage with Baggage.fork()",
        "Title": "X-Trace Task",
        "Host": "pinky19.mpi-sws.org",
        "HRT": 26966693408944100,
        "Operation": "fork",
        "Timestamp": "1557750333349.305420",
        "TenantClass": 0,
        "Source": "Server.java:550",
        "ThreadID": 48,
        "ThreadName": "",
        "EventID": "E03833EE263333DD",
        "BaggageBytes": "[[248 5] [240 0] [0 7 203 148 187 157 10 159 133] [240 1] [0 159 132 79 187 82 10 115 204] [240 3] [0 2]]",
        "ProcessID": 2171
      },
      {
        "Cycles": 0,
        "Agent": "org.apache.hadoop.ipc.Server",
        "ProcessName": "Name",
        "TaskID": "07CB94BB9D0A9F85",
        "ParentEventID": [
          "34F015D2ABEDC2F5"
        ],
        "Label": "getBlockLocations in org.apache.hadoop.hdfs.protocol.ClientProtocol",
        "Title": "X-Trace Task",
        "Host": "pinky19.mpi-sws.org",
        "HRT": 26966693409008333,
        "Timestamp": "1557750333349.369629",
        "TenantClass": 0,
        "Source": "ProtobufRpcEngine.java:601",
        "ThreadID": 57,
        "ThreadName": "",
        "EventID": "C7DEAD67ADEC41B6",
        "BaggageBytes": "[[248 5] [240 0] [0 7 203 148 187 157 10 159 133] [240 1] [0 52 240 21 210 171 237 194 245] [240 3] [0 2]]",
        "ProcessID": 2171
      },
      {
        "Cycles": 0,
        "Agent": "edu.brown.cs.systems.xtrace.logging.BaggageWrappers",
        "ProcessName": "Name",
        "TaskID": "07CB94BB9D0A9F85",
        "ParentEventID": [
          "7582F5F6B3E968E0"
        ],
        "Label": "Forking current baggage with Baggage.fork()",
        "Title": "X-Trace Task",
        "Host": "pinky19.mpi-sws.org",
        "HRT": 26966693409097644,
        "Operation": "fork",
        "Timestamp": "1557750333349.458984",
        "TenantClass": 0,
        "Source": "Server.java:2398",
        "ThreadID": 57,
        "ThreadName": "",
        "EventID": "A51FB1A560101544",
        "BaggageBytes": "[[248 5] [240 0] [0 7 203 148 187 157 10 159 133] [240 1] [0 117 130 245 246 179 233 104 224] [240 3] [0 2]]",
        "ProcessID": 2171
      },
      {
        "Cycles": 0,
        "Agent": "Execution-CPU",
        "ProcessName": "Name",
        "TaskID": "07CB94BB9D0A9F85",
        "ParentEventID": [
          "A51FB1A560101544"
        ],
        "Label": "unset",
        "Title": "X-Trace Task",
        "Host": "pinky19.mpi-sws.org",
        "Duration": "207696",
        "HRT": 26966693409203971,
        "Operation": "unset",
        "Timestamp": "1557750333349.565430",
        "TenantClass": 0,
        "Source": "Server.java:1058",
        "ThreadID": 57,
        "ThreadName": "",
        "EventID": "3F38E84908373004",
        "BaggageBytes": "[[248 5] [240 0] [0 7 203 148 187 157 10 159 133] [240 1] [0 165 31 177 165 96 16 21 68] [240 3] [0 2]]",
        "ProcessID": 2171
      },
      {
        "Cycles": 0,
        "Agent": "org.apache.hadoop.hdfs.server.namenode.FSNamesystem.audit",
        "ProcessName": "Name",
        "TaskID": "07CB94BB9D0A9F85",
        "ParentEventID": [
          "C7DEAD67ADEC41B6"
        ],
        "Label": "allowed=true\tugi=plascas (auth:SIMPLE)\tip=/139.19.171.63\tcmd=open\tsrc=/ds/Yf30ay4UQpCPveoD\tdst=null\tperm=null\tproto=rpc",
        "Title": "X-Trace Task",
        "Host": "pinky19.mpi-sws.org",
        "HRT": 26966693409054819,
        "Timestamp": "1557750333349.416260",
        "TenantClass": 0,
        "Source": "FSNamesystem.java:8313",
        "ThreadID": 57,
        "ThreadName": "",
        "EventID": "7582F5F6B3E968E0",
        "BaggageBytes": "[[248 5] [240 0] [0 7 203 148 187 157 10 159 133] [240 1] [0 199 222 173 103 173 236 65 182] [240 3] [0 2]]",
        "ProcessID": 2171
      },
      {
        "Cycles": 0,
        "Agent": "Execution-CPU",
        "ProcessName": "Read",
        "TaskID": "07CB94BB9D0A9F85",
        "ParentEventID": [
          "A51FB1A560101544"
        ],
        "Label": "set",
        "Title": "X-Trace Task",
        "Host": "pinky19.mpi-sws.org",
        "HRT": 26966693409264443,
        "Operation": "set",
        "Timestamp": "1557750333349.608398",
        "TenantClass": 0,
        "Source": "Client.java:302",
        "ThreadID": 40,
        "ThreadName": "",
        "EventID": "F14CB339CAAE1B9F",
        "ProcessID": 2801
      },
      {
        "Cycles": 0,
        "Agent": "Execution-CPU",
        "ProcessName": "Read",
        "TaskID": "07CB94BB9D0A9F85",
        "ParentEventID": [
          "F14CB339CAAE1B9F"
        ],
        "Label": "unset",
        "Title": "X-Trace Task",
        "Host": "pinky19.mpi-sws.org",
        "Duration": "8862",
        "HRT": 26966693409288159,
        "Operation": "unset",
        "Timestamp": "1557750333349.632080",
        "TenantClass": 0,
        "Source": "Client.java:1168",
        "ThreadID": 40,
        "ThreadName": "",
        "EventID": "1B1BE7EE0310AAE7",
        "ProcessID": 2801
      },
      {
        "Cycles": 0,
        "Agent": "Execution-Sleep",
        "ProcessName": "Read",
        "TaskID": "07CB94BB9D0A9F85",
        "ParentEventID": [
          "FC62A9B5B9C64A10"
        ],
        "Label": "waited",
        "Title": "X-Trace Task",
        "Host": "pinky19.mpi-sws.org",
        "Duration": "415811",
        "HRT": 26966693409306652,
        "Operation": "waited",
        "Timestamp": "1557750333349.650635",
        "TenantClass": 0,
        "Source": "Client.java:1537",
        "ThreadID": 1,
        "ThreadName": "",
        "EventID": "5E3410FD3095B447",
        "ProcessID": 2801
      },
      {
        "Cycles": 0,
        "Agent": "edu.brown.cs.systems.xtrace.logging.BaggageWrappers",
        "ProcessName": "Read",
        "TaskID": "07CB94BB9D0A9F85",
        "ParentEventID": [
          "5E3410FD3095B447",
          "1B1BE7EE0310AAE7"
        ],
        "Label": "Merged current baggage with other baggage",
        "Title": "X-Trace Task",
        "Host": "pinky19.mpi-sws.org",
        "HRT": 26966693409325820,
        "Operation": "join",
        "Timestamp": "1557750333349.669922",
        "TenantClass": 0,
        "Source": "Client.java:1545",
        "ThreadID": 1,
        "ThreadName": "",
        "EventID": "8C13D2E03045D8C1",
        "ProcessID": 2801
      },
      {
        "Cycles": 0,
        "Agent": "Execution-Sleep",
        "ProcessName": "Read",
        "TaskID": "07CB94BB9D0A9F85",
        "ParentEventID": [
          "52E45F8BA0FD790D"
        ],
        "Label": "waited",
        "Title": "X-Trace Task",
        "Host": "pinky19.mpi-sws.org",
        "Duration": "57239",
        "HRT": 26966693409517103,
        "Operation": "waited",
        "Timestamp": "1557750333349.861084",
        "TenantClass": 0,
        "Source": "SocketIOWithTimeout.java:335",
        "ThreadID": 1,
        "ThreadName": "",
        "EventID": "7C1B1F543C2306C9",
        "ProcessID": 2801
      },
      {
        "Cycles": 0,
        "Agent": "org.apache.hadoop.ipc.ProtobufRpcEngine",
        "ProcessName": "Read",
        "TaskID": "07CB94BB9D0A9F85",
        "ParentEventID": [
          "8C13D2E03045D8C1"
        ],
        "Label": "org.apache.hadoop.hdfs.protocol.ClientProtocol.getBlockLocations completed",
        "Title": "X-Trace Task",
        "Host": "pinky19.mpi-sws.org",
        "HRT": 26966693409368671,
        "Timestamp": "1557750333349.712646",
        "TenantClass": 0,
        "Source": "ProtobufRpcEngine.java:275",
        "ThreadID": 1,
        "ThreadName": "",
        "EventID": "52E45F8BA0FD790D",
        "ProcessID": 2801
      },
      {
        "Cycles": 0,
        "Agent": "edu.brown.cs.systems.xtrace.logging.BaggageWrappers",
        "ProcessName": "Read",
        "TaskID": "07CB94BB9D0A9F85",
        "ParentEventID": [
          "7C1B1F543C2306C9"
        ],
        "Label": "Forking current baggage with Baggage.fork()",
        "Title": "X-Trace Task",
        "Host": "pinky19.mpi-sws.org",
        "HRT": 26966693409558971,
        "Operation": "fork",
        "Timestamp": "1557750333349.903076",
        "TenantClass": 0,
        "Source": "DataTransferProtoUtil.java:94",
        "ThreadID": 1,
        "ThreadName": "",
        "EventID": "897D1901F7869030",
        "ProcessID": 2801
      },
      {
        "Cycles": 0,
        "Agent": "edu.brown.cs.systems.xtrace.logging.XTraceInit",
        "ProcessName": "Data",
        "TaskID": "07CB94BB9D0A9F85",
        "ParentEventID": [
          "4570AEFFE1C8B9FF"
        ],
        "Label": "Thread.setName: DataXceiver for client DFSClient_NONMAPREDUCE_310321604_1 at /139.19.171.63:51298 [Sending block BP-1633380353-139.19.171.63-1554193446451:blk_1073763163_22339]",
        "Title": "X-Trace Task",
        "Host": "pinky20.mpi-sws.org",
        "HRT": 6569897769257193,
        "Timestamp": "1557750333350.410889",
        "TenantClass": 0,
        "Source": "DataXceiver.java:168",
        "ThreadID": 14978,
        "ThreadName": "",
        "EventID": "99BF310CA00F91D4",
        "BaggageBytes": "[[248 5] [240 0] [0 7 203 148 187 157 10 159 133] [240 1] [0 69 112 174 255 225 200 185 255] [240 3] [0 2]]",
        "ProcessID": 13111
      },
      {
        "Cycles": 0,
        "Agent": "Execution-CPU",
        "ProcessName": "Data",
        "TaskID": "07CB94BB9D0A9F85",
        "ParentEventID": [
          "897D1901F7869030"
        ],
        "Label": "set",
        "Title": "X-Trace Task",
        "Host": "pinky20.mpi-sws.org",
        "HRT": 6569897769149070,
        "Operation": "set",
        "Timestamp": "1557750333350.302734",
        "TenantClass": 0,
        "Source": "Receiver.java:117",
        "ThreadID": 14978,
        "ThreadName": "",
        "EventID": "4570AEFFE1C8B9FF",
        "BaggageBytes": "[[248 5] [240 0] [0 7 203 148 187 157 10 159 133] [240 1] [0 137 125 25 1 247 134 144 48] [240 3] [0 2]]",
        "ProcessID": 13111
      },
      {
        "Cycles": 0,
        "Agent": "Execution-Sleep",
        "ProcessName": "Read",
        "TaskID": "07CB94BB9D0A9F85",
        "ParentEventID": [
          "897D1901F7869030"
        ],
        "Label": "waited",
        "Title": "X-Trace Task",
        "Host": "pinky19.mpi-sws.org",
        "Duration": "897587",
        "HRT": 26966693410523463,
        "Operation": "waited",
        "Timestamp": "1557750333350.867432",
        "TenantClass": 0,
        "Source": "SocketIOWithTimeout.java:335",
        "ThreadID": 1,
        "ThreadName": "",
        "EventID": "5D115BB57552D7BF",
        "ProcessID": 2801
      },
      {
        "Cycles": 0,
        "Agent": "edu.brown.cs.systems.xtrace.logging.BaggageWrappers",
        "ProcessName": "Read",
        "TaskID": "07CB94BB9D0A9F85",
        "ParentEventID": [
          "036E8BA19F27F763",
          "5D115BB57552D7BF"
        ],
        "Label": "Merged current baggage with other baggage",
        "Title": "X-Trace Task",
        "Host": "pinky19.mpi-sws.org",
        "HRT": 26966693410584979,
        "Operation": "join",
        "Timestamp": "1557750333350.928955",
        "TenantClass": 0,
        "Source": "RemoteBlockReader2.java:429",
        "ThreadID": 1,
        "ThreadName": "",
        "EventID": "558D51828B88B8A6",
        "ProcessID": 2801
      },
      {
        "Cycles": 0,
        "Agent": "edu.brown.cs.systems.xtrace.logging.BaggageWrappers",
        "ProcessName": "Data",
        "TaskID": "07CB94BB9D0A9F85",
        "ParentEventID": [
          "99BF310CA00F91D4"
        ],
        "Label": "Forking current baggage with Baggage.fork()",
        "Title": "X-Trace Task",
        "Host": "pinky20.mpi-sws.org",
        "HRT": 6569897769486134,
        "Operation": "fork",
        "Timestamp": "1557750333350.639893",
        "TenantClass": 0,
        "Source": "DataXceiver.java:1257",
        "ThreadID": 14978,
        "ThreadName": "",
        "EventID": "036E8BA19F27F763",
        "BaggageBytes": "[[248 5] [240 0] [0 7 203 148 187 157 10 159 133] [240 1] [0 153 191 49 12 160 15 145 212] [240 3] [0 2]]",
        "ProcessID": 13111
      },
      {
        "Cycles": 0,
        "Agent": "edu.brown.cs.systems.xtrace.logging.BaggageWrappers",
        "ProcessName": "Data",
        "TaskID": "07CB94BB9D0A9F85",
        "ParentEventID": [
          "036E8BA19F27F763"
        ],
        "Label": "Forking current baggage with Baggage.fork()",
        "Title": "X-Trace Task",
        "Host": "pinky20.mpi-sws.org",
        "HRT": 6569897769649640,
        "Operation": "fork",
        "Timestamp": "1557750333350.803223",
        "TenantClass": 0,
        "Source": "PacketHeader.java:95",
        "ThreadID": 14978,
        "ThreadName": "",
        "EventID": "6F3298516C20DE36",
        "BaggageBytes": "[[248 5] [240 0] [0 7 203 148 187 157 10 159 133] [240 1] [0 3 110 139 161 159 39 247 99] [240 3] [0 2]]",
        "ProcessID": 13111
      },
      {
        "Cycles": 0,
        "Agent": "Execution-Sleep",
        "ProcessName": "Data",
        "TaskID": "07CB94BB9D0A9F85",
        "ParentEventID": [
          "6F3298516C20DE36"
        ],
        "Label": "waited",
        "Title": "X-Trace Task",
        "Host": "pinky20.mpi-sws.org",
        "Duration": "13927",
        "HRT": 6569897769846134,
        "Operation": "waited",
        "Timestamp": "1557750333350.999756",
        "TenantClass": 0,
        "Source": "SocketIOWithTimeout.java:335",
        "ThreadID": 14978,
        "ThreadName": "",
        "EventID": "874F28A6B090180B",
        "BaggageBytes": "[[248 5] [240 0] [0 7 203 148 187 157 10 159 133] [240 1] [0 111 50 152 81 108 32 222 54] [240 3] [0 2]]",
        "ProcessID": 13111
      },
      {
        "Cycles": 0,
        "Agent": "Execution-Sleep",
        "ProcessName": "Read",
        "TaskID": "07CB94BB9D0A9F85",
        "ParentEventID": [
          "558D51828B88B8A6"
        ],
        "Label": "waited",
        "Title": "X-Trace Task",
        "Host": "pinky19.mpi-sws.org",
        "Duration": "93444",
        "HRT": 26966693410720174,
        "Operation": "waited",
        "Timestamp": "1557750333351.064209",
        "TenantClass": 0,
        "Source": "SocketIOWithTimeout.java:335",
        "ThreadID": 1,
        "ThreadName": "",
        "EventID": "4D38BFF32813BA0A",
        "ProcessID": 2801
      },
      {
        "Cycles": 0,
        "Agent": "edu.brown.cs.systems.xtrace.logging.BaggageWrappers",
        "ProcessName": "Data",
        "TaskID": "07CB94BB9D0A9F85",
        "ParentEventID": [
          "874F28A6B090180B"
        ],
        "Label": "Forking current baggage with Baggage.fork()",
        "Title": "X-Trace Task",
        "Host": "pinky20.mpi-sws.org",
        "HRT": 6569897770023408,
        "Operation": "fork",
        "Timestamp": "1557750333351.177002",
        "TenantClass": 0,
        "Source": "PacketHeader.java:95",
        "ThreadID": 14978,
        "ThreadName": "",
        "EventID": "2F82E198F1041710",
        "BaggageBytes": "[[248 5] [240 0] [0 7 203 148 187 157 10 159 133] [240 1] [0 135 79 40 166 176 144 24 11] [240 3] [0 2]]",
        "ProcessID": 13111
      },
      {
        "Cycles": 0,
        "Agent": "Execution-Sleep",
        "ProcessName": "Read",
        "TaskID": "07CB94BB9D0A9F85",
        "ParentEventID": [
          "9112E3C5DC66D651"
        ],
        "Label": "waited",
        "Title": "X-Trace Task",
        "Host": "pinky19.mpi-sws.org",
        "Duration": "231326",
        "HRT": 26966693411397242,
        "Operation": "waited",
        "Timestamp": "1557750333351.741211",
        "TenantClass": 0,
        "Source": "SocketIOWithTimeout.java:335",
        "ThreadID": 1,
        "ThreadName": "",
        "EventID": "C51C97A9BDDF7113",
        "ProcessID": 2801
      },
      {
        "Cycles": 0,
        "Agent": "Execution-Sleep",
        "ProcessName": "Read",
        "TaskID": "07CB94BB9D0A9F85",
        "ParentEventID": [
          "4D38BFF32813BA0A"
        ],
        "Label": "waited",
        "Title": "X-Trace Task",
        "Host": "pinky19.mpi-sws.org",
        "Duration": "342052",
        "HRT": 26966693411116532,
        "Operation": "waited",
        "Timestamp": "1557750333351.460449",
        "TenantClass": 0,
        "Source": "SocketIOWithTimeout.java:335",
        "ThreadID": 1,
        "ThreadName": "",
        "EventID": "9112E3C5DC66D651",
        "ProcessID": 2801
      },
      {
        "Cycles": 0,
        "Agent": "Execution-Sleep",
        "ProcessName": "Read",
        "TaskID": "07CB94BB9D0A9F85",
        "ParentEventID": [
          "C51C97A9BDDF7113"
        ],
        "Label": "waited",
        "Title": "X-Trace Task",
        "Host": "pinky19.mpi-sws.org",
        "Duration": "144335",
        "HRT": 26966693411604466,
        "Operation": "waited",
        "Timestamp": "1557750333351.948486",
        "TenantClass": 0,
        "Source": "SocketIOWithTimeout.java:335",
        "ThreadID": 1,
        "ThreadName": "",
        "EventID": "0DA161D2A8238D70",
        "ProcessID": 2801
      },
      {
        "Cycles": 0,
        "Agent": "edu.brown.cs.systems.xtrace.logging.BaggageWrappers",
        "ProcessName": "Read",
        "TaskID": "07CB94BB9D0A9F85",
        "ParentEventID": [
          "6F3298516C20DE36",
          "0DA161D2A8238D70"
        ],
        "Label": "Merged current baggage with other baggage",
        "Title": "X-Trace Task",
        "Host": "pinky19.mpi-sws.org",
        "HRT": 26966693411662357,
        "Operation": "join",
        "Timestamp": "1557750333352.006348",
        "TenantClass": 0,
        "Source": "PacketHeader.java:168",
        "ThreadID": 1,
        "ThreadName": "",
        "EventID": "9F71AA82A9F15FD0",
        "ProcessID": 2801
      },
      {
        "Cycles": 0,
        "Agent": "edu.brown.cs.systems.xtrace.logging.BaggageWrappers",
        "ProcessName": "Read",
        "TaskID": "07CB94BB9D0A9F85",
        "ParentEventID": [
          "9F71AA82A9F15FD0",
          "2F82E198F1041710"
        ],
        "Label": "Merged current baggage with other baggage",
        "Title": "X-Trace Task",
        "Host": "pinky19.mpi-sws.org",
        "HRT": 26966693411776047,
        "Operation": "join",
        "Timestamp": "1557750333352.120117",
        "TenantClass": 0,
        "Source": "PacketHeader.java:168",
        "ThreadID": 1,
        "ThreadName": "",
        "EventID": "0900CE0D34DFA157",
        "ProcessID": 2801
      },
      {
        "Cycles": 0,
        "Agent": "edu.brown.cs.systems.xtrace.logging.BaggageWrappers",
        "ProcessName": "Read",
        "TaskID": "07CB94BB9D0A9F85",
        "ParentEventID": [
          "52EA46D9914E689E"
        ],
        "Label": "Forking current baggage with Baggage.fork()",
        "Title": "X-Trace Task",
        "Host": "pinky19.mpi-sws.org",
        "HRT": 26966693411846430,
        "Operation": "fork",
        "Timestamp": "1557750333352.190430",
        "TenantClass": 0,
        "Source": "DataTransferProtoUtil.java:94",
        "ThreadID": 1,
        "ThreadName": "",
        "EventID": "7B1060730A530A62",
        "ProcessID": 2801
      },
      {
        "Cycles": 0,
        "Agent": "edu.brown.cs.systems.xtrace.logging.BaggageWrappers",
        "ProcessName": "Read",
        "TaskID": "07CB94BB9D0A9F85",
        "ParentEventID": [
          "0900CE0D34DFA157"
        ],
        "Label": "Forking current baggage with Baggage.fork()",
        "Title": "X-Trace Task",
        "Host": "pinky19.mpi-sws.org",
        "HRT": 26966693411787405,
        "Operation": "fork",
        "Timestamp": "1557750333352.131348",
        "TenantClass": 0,
        "Source": "RemoteBlockReader2.java:361",
        "ThreadID": 1,
        "ThreadName": "",
        "EventID": "52EA46D9914E689E",
        "ProcessID": 2801
      },
      {
        "Cycles": 0,
        "Agent": "Execution-Sleep",
        "ProcessName": "Data",
        "TaskID": "07CB94BB9D0A9F85",
        "ParentEventID": [
          "2F82E198F1041710"
        ],
        "Label": "waited",
        "Title": "X-Trace Task",
        "Host": "pinky20.mpi-sws.org",
        "Duration": "798814",
        "HRT": 6569897771010202,
        "Operation": "waited",
        "Timestamp": "1557750333352.163818",
        "TenantClass": 0,
        "Source": "SocketIOWithTimeout.java:335",
        "ThreadID": 14978,
        "ThreadName": "",
        "EventID": "44D07609B0A2402C",
        "BaggageBytes": "[[248 5] [240 0] [0 7 203 148 187 157 10 159 133] [240 1] [0 47 130 225 152 241 4 23 16] [240 3] [0 2]]",
        "ProcessID": 13111
      },
      {
        "Cycles": 0,
        "Agent": "edu.brown.cs.systems.xtrace.logging.BaggageWrappers",
        "ProcessName": "Data",
        "TaskID": "07CB94BB9D0A9F85",
        "ParentEventID": [
          "44D07609B0A2402C",
          "52EA46D9914E689E"
        ],
        "Label": "Merged current baggage with other baggage",
        "Title": "X-Trace Task",
        "Host": "pinky20.mpi-sws.org",
        "HRT": 6569897771214884,
        "Operation": "join",
        "Timestamp": "1557750333352.368408",
        "TenantClass": 0,
        "Source": "DataXceiver.java:574",
        "ThreadID": 14978,
        "ThreadName": "",
        "EventID": "D2D50FEE99EC1750",
        "BaggageBytes": "[[248 5] [240 0] [0 7 203 148 187 157 10 159 133] [240 1] [0 68 208 118 9 176 162 64 44] [0 82 234 70 217 145 78 104 158] [240 3] [0 2]]",
        "ProcessID": 13111
      },
      {
        "Cycles": 0,
        "Agent": "Execution-CPU",
        "ProcessName": "Data",
        "TaskID": "07CB94BB9D0A9F85",
        "ParentEventID": [
          "D2D50FEE99EC1750"
        ],
        "Label": "unset",
        "Title": "X-Trace Task",
        "Host": "pinky20.mpi-sws.org",
        "Duration": "2040458",
        "HRT": 6569897771262712,
        "Operation": "unset",
        "Timestamp": "1557750333352.416260",
        "TenantClass": 0,
        "Source": "DataXceiver.java:261",
        "ThreadID": 14978,
        "ThreadName": "",
        "EventID": "8290DE9282E5E0E0",
        "BaggageBytes": "[[248 5] [240 0] [0 7 203 148 187 157 10 159 133] [240 1] [0 210 213 15 238 153 236 23 80] [240 3] [0 2]]",
        "ProcessID": 13111
      },
      {
        "Cycles": 0,
        "Agent": "edu.brown.cs.systems.xtrace.logging.XTraceInit",
        "ProcessName": "Data",
        "TaskID": "07CB94BB9D0A9F85",
        "ParentEventID": [
          "2ED4296643A8C76F"
        ],
        "Label": "Thread.setName: DataXceiver for client DFSClient_NONMAPREDUCE_310321604_1 at /139.19.171.63:51298 [Sending block BP-1633380353-139.19.171.63-1554193446451:blk_1073763163_22339]",
        "Title": "X-Trace Task",
        "Host": "pinky20.mpi-sws.org",
        "HRT": 6569897771344574,
        "Timestamp": "1557750333352.498291",
        "TenantClass": 0,
        "Source": "DataXceiver.java:168",
        "ThreadID": 14978,
        "ThreadName": "",
        "EventID": "5DB4190072199A50",
        "BaggageBytes": "[[248 5] [240 0] [0 7 203 148 187 157 10 159 133] [240 1] [0 46 212 41 102 67 168 199 111] [240 3] [0 2]]",
        "ProcessID": 13111
      },
      {
        "Cycles": 0,
        "Agent": "Execution-CPU",
        "ProcessName": "Data",
        "TaskID": "07CB94BB9D0A9F85",
        "ParentEventID": [
          "7B1060730A530A62"
        ],
        "Label": "set",
        "Title": "X-Trace Task",
        "Host": "pinky20.mpi-sws.org",
        "HRT": 6569897771304625,
        "Operation": "set",
        "Timestamp": "1557750333352.458252",
        "TenantClass": 0,
        "Source": "Receiver.java:117",
        "ThreadID": 14978,
        "ThreadName": "",
        "EventID": "2ED4296643A8C76F",
        "BaggageBytes": "[[248 5] [240 0] [0 7 203 148 187 157 10 159 133] [240 1] [0 123 16 96 115 10 83 10 98] [240 3] [0 2]]",
        "ProcessID": 13111
      },
      {
        "Cycles": 0,
        "Agent": "edu.brown.cs.systems.xtrace.logging.BaggageWrappers",
        "ProcessName": "Data",
        "TaskID": "07CB94BB9D0A9F85",
        "ParentEventID": [
          "5DB4190072199A50"
        ],
        "Label": "Forking current baggage with Baggage.fork()",
        "Title": "X-Trace Task",
        "Host": "pinky20.mpi-sws.org",
        "HRT": 6569897771481707,
        "Operation": "fork",
        "Timestamp": "1557750333352.635254",
        "TenantClass": 0,
        "Source": "DataXceiver.java:1257",
        "ThreadID": 14978,
        "ThreadName": "",
        "EventID": "BDA724353E7AE0D8",
        "BaggageBytes": "[[248 5] [240 0] [0 7 203 148 187 157 10 159 133] [240 1] [0 93 180 25 0 114 25 154 80] [240 3] [0 2]]",
        "ProcessID": 13111
      },
      {
        "Cycles": 0,
        "Agent": "Execution-Sleep",
        "ProcessName": "Read",
        "TaskID": "07CB94BB9D0A9F85",
        "ParentEventID": [
          "7B1060730A530A62"
        ],
        "Label": "waited",
        "Title": "X-Trace Task",
        "Host": "pinky19.mpi-sws.org",
        "Duration": "540021",
        "HRT": 26966693412452270,
        "Operation": "waited",
        "Timestamp": "1557750333352.796387",
        "TenantClass": 0,
        "Source": "SocketIOWithTimeout.java:335",
        "ThreadID": 1,
        "ThreadName": "",
        "EventID": "896DD2A0E3CA7653",
        "ProcessID": 2801
      },
      {
        "Cycles": 0,
        "Agent": "edu.brown.cs.systems.xtrace.logging.BaggageWrappers",
        "ProcessName": "Data",
        "TaskID": "07CB94BB9D0A9F85",
        "ParentEventID": [
          "BDA724353E7AE0D8"
        ],
        "Label": "Forking current baggage with Baggage.fork()",
        "Title": "X-Trace Task",
        "Host": "pinky20.mpi-sws.org",
        "HRT": 6569897771581447,
        "Operation": "fork",
        "Timestamp": "1557750333352.735107",
        "TenantClass": 0,
        "Source": "PacketHeader.java:95",
        "ThreadID": 14978,
        "ThreadName": "",
        "EventID": "CC2CC5711D231743",
        "BaggageBytes": "[[248 5] [240 0] [0 7 203 148 187 157 10 159 133] [240 1] [0 189 167 36 53 62 122 224 216] [240 3] [0 2]]",
        "ProcessID": 13111
      },
      {
        "Cycles": 0,
        "Agent": "Execution-Sleep",
        "ProcessName": "Data",
        "TaskID": "07CB94BB9D0A9F85",
        "ParentEventID": [
          "CC2CC5711D231743"
        ],
        "Label": "waited",
        "Title": "X-Trace Task",
        "Host": "pinky20.mpi-sws.org",
        "Duration": "6408",
        "HRT": 6569897771667536,
        "Operation": "waited",
        "Timestamp": "1557750333352.821289",
        "TenantClass": 0,
        "Source": "SocketIOWithTimeout.java:335",
        "ThreadID": 14978,
        "ThreadName": "",
        "EventID": "C3C85CBA4288C596",
        "BaggageBytes": "[[248 5] [240 0] [0 7 203 148 187 157 10 159 133] [240 1] [0 204 44 197 113 29 35 23 67] [240 3] [0 2]]",
        "ProcessID": 13111
      },
      {
        "Cycles": 0,
        "Agent": "edu.brown.cs.systems.xtrace.logging.BaggageWrappers",
        "ProcessName": "Read",
        "TaskID": "07CB94BB9D0A9F85",
        "ParentEventID": [
          "896DD2A0E3CA7653",
          "BDA724353E7AE0D8"
        ],
        "Label": "Merged current baggage with other baggage",
        "Title": "X-Trace Task",
        "Host": "pinky19.mpi-sws.org",
        "HRT": 26966693412527961,
        "Operation": "join",
        "Timestamp": "1557750333352.872070",
        "TenantClass": 0,
        "Source": "RemoteBlockReader2.java:429",
        "ThreadID": 1,
        "ThreadName": "",
        "EventID": "ECB9DC2263ECF727",
        "ProcessID": 2801
      },
      {
        "Cycles": 0,
        "Agent": "Execution-Sleep",
        "ProcessName": "Read",
        "TaskID": "07CB94BB9D0A9F85",
        "ParentEventID": [
          "ECB9DC2263ECF727"
        ],
        "Label": "waited",
        "Title": "X-Trace Task",
        "Host": "pinky19.mpi-sws.org",
        "Duration": "267220",
        "HRT": 26966693412885684,
        "Operation": "waited",
        "Timestamp": "1557750333353.229736",
        "TenantClass": 0,
        "Source": "SocketIOWithTimeout.java:335",
        "ThreadID": 1,
        "ThreadName": "",
        "EventID": "ACBE0682EEB50293",
        "ProcessID": 2801
      },
      {
        "Cycles": 0,
        "Agent": "Execution-Sleep",
        "ProcessName": "Read",
        "TaskID": "07CB94BB9D0A9F85",
        "ParentEventID": [
          "ACBE0682EEB50293"
        ],
        "Label": "waited",
        "Title": "X-Trace Task",
        "Host": "pinky19.mpi-sws.org",
        "Duration": "158712",
        "HRT": 26966693413097798,
        "Operation": "waited",
        "Timestamp": "1557750333353.441895",
        "TenantClass": 0,
        "Source": "SocketIOWithTimeout.java:335",
        "ThreadID": 1,
        "ThreadName": "",
        "EventID": "1986391D06562CEA",
        "ProcessID": 2801
      },
      {
        "Cycles": 0,
        "Agent": "edu.brown.cs.systems.xtrace.logging.BaggageWrappers",
        "ProcessName": "Data",
        "TaskID": "07CB94BB9D0A9F85",
        "ParentEventID": [
          "C3C85CBA4288C596"
        ],
        "Label": "Forking current baggage with Baggage.fork()",
        "Title": "X-Trace Task",
        "Host": "pinky20.mpi-sws.org",
        "HRT": 6569897771787081,
        "Operation": "fork",
        "Timestamp": "1557750333352.940674",
        "TenantClass": 0,
        "Source": "PacketHeader.java:95",
        "ThreadID": 14978,
        "ThreadName": "",
        "EventID": "9E37FD05BEE88DF7",
        "BaggageBytes": "[[248 5] [240 0] [0 7 203 148 187 157 10 159 133] [240 1] [0 195 200 92 186 66 136 197 150] [240 3] [0 2]]",
        "ProcessID": 13111
      },
      {
        "Cycles": 0,
        "Agent": "Execution-Sleep",
        "ProcessName": "Data",
        "TaskID": "07CB94BB9D0A9F85",
        "ParentEventID": [
          "9E37FD05BEE88DF7"
        ],
        "Label": "waited",
        "Title": "X-Trace Task",
        "Host": "pinky20.mpi-sws.org",
        "Duration": "205791",
        "HRT": 6569897772057722,
        "Operation": "waited",
        "Timestamp": "1557750333353.211426",
        "TenantClass": 0,
        "Source": "SocketIOWithTimeout.java:335",
        "ThreadID": 14978,
        "ThreadName": "",
        "EventID": "ECCFE7C1C69C9F4E",
        "BaggageBytes": "[[248 5] [240 0] [0 7 203 148 187 157 10 159 133] [240 1] [0 158 55 253 5 190 232 141 247] [240 3] [0 2]]",
        "ProcessID": 13111
      },
      {
        "Cycles": 0,
        "Agent": "edu.brown.cs.systems.xtrace.logging.BaggageWrappers",
        "ProcessName": "Read",
        "TaskID": "07CB94BB9D0A9F85",
        "ParentEventID": [
          "CC2CC5711D231743",
          "7492374C42972D62"
        ],
        "Label": "Merged current baggage with other baggage",
        "Title": "X-Trace Task",
        "Host": "pinky19.mpi-sws.org",
        "HRT": 26966693413307350,
        "Operation": "join",
        "Timestamp": "1557750333353.651367",
        "TenantClass": 0,
        "Source": "PacketHeader.java:168",
        "ThreadID": 1,
        "ThreadName": "",
        "EventID": "1F2CA6514ED47B55",
        "ProcessID": 2801
      },
      {
        "Cycles": 0,
        "Agent": "Execution-Sleep",
        "ProcessName": "Read",
        "TaskID": "07CB94BB9D0A9F85",
        "ParentEventID": [
          "1986391D06562CEA"
        ],
        "Label": "waited",
        "Title": "X-Trace Task",
        "Host": "pinky19.mpi-sws.org",
        "Duration": "93958",
        "HRT": 26966693413250151,
        "Operation": "waited",
        "Timestamp": "1557750333353.594238",
        "TenantClass": 0,
        "Source": "SocketIOWithTimeout.java:335",
        "ThreadID": 1,
        "ThreadName": "",
        "EventID": "7492374C42972D62",
        "ProcessID": 2801
      },
      {
        "Cycles": 0,
        "Agent": "edu.brown.cs.systems.xtrace.logging.BaggageWrappers",
        "ProcessName": "Data",
        "TaskID": "07CB94BB9D0A9F85",
        "ParentEventID": [
          "ECCFE7C1C69C9F4E"
        ],
        "Label": "Forking current baggage with Baggage.fork()",
        "Title": "X-Trace Task",
        "Host": "pinky20.mpi-sws.org",
        "HRT": 6569897772147760,
        "Operation": "fork",
        "Timestamp": "1557750333353.301514",
        "TenantClass": 0,
        "Source": "PacketHeader.java:95",
        "ThreadID": 14978,
        "ThreadName": "",
        "EventID": "5E0FB7C65B00FA34",
        "BaggageBytes": "[[248 5] [240 0] [0 7 203 148 187 157 10 159 133] [240 1] [0 236 207 231 193 198 156 159 78] [240 3] [0 2]]",
        "ProcessID": 13111
      },
      {
        "Cycles": 0,
        "Agent": "Execution-Sleep",
        "ProcessName": "Data",
        "TaskID": "07CB94BB9D0A9F85",
        "ParentEventID": [
          "5E0FB7C65B00FA34"
        ],
        "Label": "waited",
        "Title": "X-Trace Task",
        "Host": "pinky20.mpi-sws.org",
        "Duration": "5051",
        "HRT": 6569897772211941,
        "Operation": "waited",
        "Timestamp": "1557750333353.365479",
        "TenantClass": 0,
        "Source": "SocketIOWithTimeout.java:335",
        "ThreadID": 14978,
        "ThreadName": "",
        "EventID": "891A45070E30F970",
        "BaggageBytes": "[[248 5] [240 0] [0 7 203 148 187 157 10 159 133] [240 1] [0 94 15 183 198 91 0 250 52] [240 3] [0 2]]",
        "ProcessID": 13111
      },
      {
        "Cycles": 0,
        "Agent": "edu.brown.cs.systems.xtrace.logging.BaggageWrappers",
        "ProcessName": "Data",
        "TaskID": "07CB94BB9D0A9F85",
        "ParentEventID": [
          "891A45070E30F970"
        ],
        "Label": "Forking current baggage with Baggage.fork()",
        "Title": "X-Trace Task",
        "Host": "pinky20.mpi-sws.org",
        "HRT": 6569897772320632,
        "Operation": "fork",
        "Timestamp": "1557750333353.474365",
        "TenantClass": 0,
        "Source": "PacketHeader.java:95",
        "ThreadID": 14978,
        "ThreadName": "",
        "EventID": "DDC32CC26265649D",
        "BaggageBytes": "[[248 5] [240 0] [0 7 203 148 187 157 10 159 133] [240 1] [0 137 26 69 7 14 48 249 112] [240 3] [0 2]]",
        "ProcessID": 13111
      },
      {
        "Cycles": 0,
        "Agent": "Execution-Sleep",
        "ProcessName": "Data",
        "TaskID": "07CB94BB9D0A9F85",
        "ParentEventID": [
          "DDC32CC26265649D"
        ],
        "Label": "waited",
        "Title": "X-Trace Task",
        "Host": "pinky20.mpi-sws.org",
        "Duration": "5031",
        "HRT": 6569897772401574,
        "Operation": "waited",
        "Timestamp": "1557750333353.555176",
        "TenantClass": 0,
        "Source": "SocketIOWithTimeout.java:335",
        "ThreadID": 14978,
        "ThreadName": "",
        "EventID": "8CC935F972704AA9",
        "BaggageBytes": "[[248 5] [240 0] [0 7 203 148 187 157 10 159 133] [240 1] [0 221 195 44 194 98 101 100 157] [240 3] [0 2]]",
        "ProcessID": 13111
      },
      {
        "Cycles": 0,
        "Agent": "edu.brown.cs.systems.xtrace.logging.BaggageWrappers",
        "ProcessName": "Data",
        "TaskID": "07CB94BB9D0A9F85",
        "ParentEventID": [
          "8CC935F972704AA9"
        ],
        "Label": "Forking current baggage with Baggage.fork()",
        "Title": "X-Trace Task",
        "Host": "pinky20.mpi-sws.org",
        "HRT": 6569897772477811,
        "Operation": "fork",
        "Timestamp": "1557750333353.631348",
        "TenantClass": 0,
        "Source": "PacketHeader.java:95",
        "ThreadID": 14978,
        "ThreadName": "",
        "EventID": "30729078BB1ECB48",
        "BaggageBytes": "[[248 5] [240 0] [0 7 203 148 187 157 10 159 133] [240 1] [0 140 201 53 249 114 112 74 169] [240 3] [0 2]]",
        "ProcessID": 13111
      },
      {
        "Cycles": 0,
        "Agent": "Execution-Sleep",
        "ProcessName": "Data",
        "TaskID": "07CB94BB9D0A9F85",
        "ParentEventID": [
          "30729078BB1ECB48"
        ],
        "Label": "waited",
        "Title": "X-Trace Task",
        "Host": "pinky20.mpi-sws.org",
        "Duration": "13926",
        "HRT": 6569897772575866,
        "Operation": "waited",
        "Timestamp": "1557750333353.729492",
        "TenantClass": 0,
        "Source": "SocketIOWithTimeout.java:335",
        "ThreadID": 14978,
        "ThreadName": "",
        "EventID": "D434BCC09B1F219B",
        "BaggageBytes": "[[248 5] [240 0] [0 7 203 148 187 157 10 159 133] [240 1] [0 48 114 144 120 187 30 203 72] [240 3] [0 2]]",
        "ProcessID": 13111
      },
      {
        "Cycles": 0,
        "Agent": "Execution-CPU",
        "ProcessName": "Data",
        "TaskID": "07CB94BB9D0A9F85",
        "ParentEventID": [
          "D434BCC09B1F219B"
        ],
        "Label": "unset",
        "Title": "X-Trace Task",
        "Host": "pinky20.mpi-sws.org",
        "Duration": "1457455",
        "HRT": 6569897772786093,
        "Operation": "unset",
        "Timestamp": "1557750333353.939697",
        "TenantClass": 0,
        "Source": "DataXceiver.java:261",
        "ThreadID": 14978,
        "ThreadName": "",
        "EventID": "981DD57D91917F91",
        "BaggageBytes": "[[248 5] [240 0] [0 7 203 148 187 157 10 159 133] [240 1] [0 212 52 188 192 155 31 33 155] [240 3] [0 2]]",
        "ProcessID": 13111
      },
      {
        "Cycles": 0,
        "Agent": "edu.brown.cs.systems.retro.benchmarks.hdfs_client.Reader",
        "ProcessName": "Read",
        "TaskID": "07CB94BB9D0A9F85",
        "ParentEventID": [
          "0"
        ],
        "Label": "Reading file",
        "Title": "X-Trace Task",
        "Host": "pinky19.mpi-sws.org",
        "HRT": 26966693408660304,
        "Timestamp": "1557750333349.004395",
        "TenantClass": 0,
        "ThreadID": 1,
        "ThreadName": "",
        "EventID": "FB33321007C78BF7",
        "ProcessID": 2801,
        "Tag": [
          "reader_100kb",
          "Read Size: 102400"
        ]
      }
    ]
  }
]