[
  {
    "id": "C29069FCB7387BB3",
    "reports": [
      {
        "Cycles": 0,
        "Agent": "edu.brown.cs.systems.retro.benchmarks.hdfs_client.Reader",
        "ProcessName": "Read",
        "TaskID": "C29069FCB7387BB3",
        "ParentEventID": [
          "FEFB55227A40146B"
        ],
        "Label": "Reading file",
        "Title": "X-Trace Task",
        "Host": "pinky19.mpi-sws.org",
        "HRT": 26962455716704629,
        "Timestamp": "1557746095656.962402",
        "TenantClass": 0,
        "ThreadID": 1,
        "ThreadName": "",
        "EventID": "A3C30E43C64CFADA",
        "ProcessID": 36430
      },
      {
        "Cycles": 0,
        "Agent": "Execution-CPU",
        "ProcessName": "Read",
        "TaskID": "C29069FCB7387BB3",
        "ParentEventID": [
          "4E15187920323C97"
        ],
        "Label": "unset",
        "Title": "X-Trace Task",
        "Host": "pinky19.mpi-sws.org",
        "Duration": "22501124",
        "HRT": 26962455716772746,
        "Operation": "unset",
        "Timestamp": "1557746095657.030518",
        "TenantClass": 0,
        "Source": "Client.java:1027",
        "ThreadID": 1,
        "ThreadName": "",
        "EventID": "4CAFBA8622574E63",
        "ProcessID": 36430
      },
      {
        "Cycles": 0,
        "Agent": "Execution-CPU",
        "ProcessName": "Read",
        "TaskID": "C29069FCB7387BB3",
        "ParentEventID": [
          "4CAFBA8622574E63"
        ],
        "Label": "set",
        "Title": "X-Trace Task",
        "Host": "pinky19.mpi-sws.org",
        "HRT": 26962455716817822,
        "Operation": "set",
        "Timestamp": "1557746095657.075439",
        "TenantClass": 0,
        "Source": "Client.java:1032",
        "ThreadID": 41,
        "ThreadName": "",
        "EventID": "749DE465AA7AFA25",
        "ProcessID": 36430
      },
      {
        "Cycles": 0,
        "Agent": "org.apache.hadoop.ipc.ProtobufRpcEngine",
        "ProcessName": "Read",
        "TaskID": "C29069FCB7387BB3",
        "ParentEventID": [
          "A3C30E43C64CFADA"
        ],
        "Label": "Invoking org.apache.hadoop.hdfs.protocol.ClientProtocol.getBlockLocations",
        "Title": "X-Trace Task",
        "Host": "pinky19.mpi-sws.org",
        "HRT": 26962455716746130,
        "Timestamp": "1557746095657.003906",
        "TenantClass": 0,
        "Source": "ProtobufRpcEngine.java:228",
        "ThreadID": 1,
        "ThreadName": "",
        "EventID": "4E15187920323C97",
        "ProcessID": 36430
      },
      {
        "Cycles": 0,
        "Agent": "edu.brown.cs.systems.xtrace.logging.BaggageWrappers",
        "ProcessName": "Read",
        "TaskID": "C29069FCB7387BB3",
        "ParentEventID": [
          "749DE465AA7AFA25"
        ],
        "Label": "Forking current baggage with Baggage.fork()",
        "Title": "X-Trace Task",
        "Host": "pinky19.mpi-sws.org",
        "HRT": 26962455716837363,
        "Operation": "fork",
        "Timestamp": "1557746095657.094971",
        "TenantClass": 0,
        "Source": "Client.java:1043",
        "ThreadID": 41,
        "ThreadName": "",
        "EventID": "B14B7BB8A10F0DD8",
        "ProcessID": 36430
      },
      {
        "Cycles": 0,
        "Agent": "Execution-CPU",
        "ProcessName": "Read",
        "TaskID": "C29069FCB7387BB3",
        "ParentEventID": [
          "B14B7BB8A10F0DD8"
        ],
        "Label": "unset",
        "Title": "X-Trace Task",
        "Host": "pinky19.mpi-sws.org",
        "Duration": "78508",
        "HRT": 26962455716914831,
        "Operation": "unset",
        "Timestamp": "1557746095657.172607",
        "TenantClass": 0,
        "Source": "Client.java:1062",
        "ThreadID": 41,
        "ThreadName": "",
        "EventID": "1CC12169E3244406",
        "ProcessID": 36430
      },
      {
        "Cycles": 0,
        "Agent": "Execution-CPU",
        "ProcessName": "Name",
        "TaskID": "C29069FCB7387BB3",
        "ParentEventID": [
          "B14B7BB8A10F0DD8"
        ],
        "Label": "set",
        "Title": "X-Trace Task",
        "Host": "pinky19.mpi-sws.org",
        "HRT": 26962455716971230,
        "Operation": "set",
        "Timestamp": "1557746095657.273682",
        "TenantClass": 0,
        "Source": "Server.java:1840",
        "ThreadID": 48,
        "ThreadName": "",
        "EventID": "F2F047B5091C30BF",
        "BaggageBytes": "[[248 5] [240 0] [0 194 144 105 252 183 56 123 179] [240 1] [0 177 75 123 184 161 15 13 216] [240 3] [0 2]]",
        "ProcessID": 2171
      },
      {
        "Cycles": 0,
        "Agent": "edu.brown.cs.systems.xtrace.logging.BaggageWrappers",
        "ProcessName": "Name",
        "TaskID": "C29069FCB7387BB3",
        "ParentEventID": [
          "F2F047B5091C30BF"
        ],
        "Label": "Forking current baggage with Baggage.fork()",
        "Title": "X-Trace Task",
        "Host": "pinky19.mpi-sws.org",
        "HRT": 26962455716998199,
        "Operation": "fork",
        "Timestamp": "1557746095657.300537",
        "TenantClass": 0,
        "Source": "Server.java:550",
        "ThreadID": 48,
        "ThreadName": "",
        "EventID": "DF34CF708F164A5B",
        "BaggageBytes": "[[248 5] [240 0] [0 194 144 105 252 183 56 123 179] [240 1] [0 242 240 71 181 9 28 48 191] [240 3] [0 2]]",
        "ProcessID": 2171
      },
      {
        "Cycles": 0,
        "Agent": "Execution-CPU",
        "ProcessName": "Read",
        "TaskID": "C29069FCB7387BB3",
        "ParentEventID": [
          "1CC12169E3244406"
        ],
        "Label": "set",
        "Title": "X-Trace Task",
        "Host": "pinky19.mpi-sws.org",
        "HRT": 26962455716938057,
        "Operation": "set",
        "Timestamp": "1557746095657.195801",
        "TenantClass": 0,
        "Source": "Client.java:1104",
        "ThreadID": 1,
        "ThreadName": "",
        "EventID": "32ACC015861D72BD",
        "ProcessID": 36430
      },
      {
        "Cycles": 0,
        "Agent": "Execution-CPU",
        "ProcessName": "Name",
        "TaskID": "C29069FCB7387BB3",
        "ParentEventID": [
          "DF34CF708F164A5B"
        ],
        "Label": "unset",
        "Title": "X-Trace Task",
        "Host": "pinky19.mpi-sws.org",
        "Duration": "24767",
        "HRT": 26962455717019103,
        "Operation": "unset",
        "Timestamp": "1557746095657.321533",
        "TenantClass": 0,
        "Source": "Server.java:1828",
        "ThreadID": 48,
        "ThreadName": "",
        "EventID": "D8DD0E193512B404",
        "BaggageBytes": "[[248 5] [240 0] [0 194 144 105 252 183 56 123 179] [240 1] [0 223 52 207 112 143 22 74 91] [240 3] [0 2]]",
        "ProcessID": 2171
      },
      {
        "Cycles": 0,
        "Agent": "org.apache.hadoop.ipc.Server",
        "ProcessName": "Name",
        "TaskID": "C29069FCB7387BB3",
        "ParentEventID": [
          "8FAB244B9B384A13"
        ],
        "Label": "getBlockLocations in org.apache.hadoop.hdfs.protocol.ClientProtocol",
        "Title": "X-Trace Task",
        "Host": "pinky19.mpi-sws.org",
        "HRT": 26962455717078357,
        "Timestamp": "1557746095657.380859",
        "TenantClass": 0,
        "Source": "ProtobufRpcEngine.java:601",
        "ThreadID": 58,
        "ThreadName": "",
        "EventID": "942D9A0359A1202A",
        "BaggageBytes": "[[248 5] [240 0] [0 194 144 105 252 183 56 123 179] [240 1] [0 143 171 36 75 155 56 74 19] [240 3] [0 2]]",
        "ProcessID": 2171
      },
      {
        "Cycles": 0,
        "Agent": "org.apache.hadoop.hdfs.server.namenode.FSNamesystem.audit",
        "ProcessName": "Name",
        "TaskID": "C29069FCB7387BB3",
        "ParentEventID": [
          "942D9A0359A1202A"
        ],
        "Label": "allowed=true\tugi=plascas (auth:SIMPLE)\tip=/139.19.171.63\tcmd=open\tsrc=/ds/r5umkD6skTksfw4o\tdst=null\tperm=null\tproto=rpc",
        "Title": "X-Trace Task",
        "Host": "pinky19.mpi-sws.org",
        "HRT": 26962455717165299,
        "Timestamp": "1557746095657.467773",
        "TenantClass": 0,
        "Source": "FSNamesystem.java:8313",
        "ThreadID": 58,
        "ThreadName": "",
        "EventID": "24D44FA93AF54890",
        "BaggageBytes": "[[248 5] [240 0] [0 194 144 105 252 183 56 123 179] [240 1] [0 148 45 154 3 89 161 32 42] [240 3] [0 2]]",
        "ProcessID": 2171
      },
      {
        "Cycles": 0,
        "Agent": "edu.brown.cs.systems.xtrace.logging.BaggageWrappers",
        "ProcessName": "Name",
        "TaskID": "C29069FCB7387BB3",
        "ParentEventID": [
          "24D44FA93AF54890"
        ],
        "Label": "Forking current baggage with Baggage.fork()",
        "Title": "X-Trace Task",
        "Host": "pinky19.mpi-sws.org",
        "HRT": 26962455717220105,
        "Operation": "fork",
        "Timestamp": "1557746095657.522461",
        "TenantClass": 0,
        "Source": "Server.java:2398",
        "ThreadID": 58,
        "ThreadName": "",
        "EventID": "5C8E8B8B8F1C3CA5",
        "BaggageBytes": "[[248 5] [240 0] [0 194 144 105 252 183 56 123 179] [240 1] [0 36 212 79 169 58 245 72 144] [240 3] [0 2]]",
        "ProcessID": 2171
      },
      {
        "Cycles": 0,
        "Agent": "Execution-CPU",
        "ProcessName": "Name",
        "TaskID": "C29069FCB7387BB3",
        "ParentEventID": [
          "DF34CF708F164A5B"
        ],
        "Label": "set",
        "Title": "X-Trace Task",
        "Host": "pinky19.mpi-sws.org",
        "HRT": 26962455717029657,
        "Operation": "set",
        "Timestamp": "1557746095657.332031",
        "TenantClass": 0,
        "Source": "Server.java:2071",
        "ThreadID": 58,
        "ThreadName": "",
        "EventID": "8FAB244B9B384A13",
        "BaggageBytes": "[[248 5] [240 0] [0 194 144 105 252 183 56 123 179] [240 1] [0 223 52 207 112 143 22 74 91] [240 3] [0 2]]",
        "ProcessID": 2171
      },
      {
        "Cycles": 0,
        "Agent": "Execution-CPU",
        "ProcessName": "Name",
        "TaskID": "C29069FCB7387BB3",
        "ParentEventID": [
          "5C8E8B8B8F1C3CA5"
        ],
        "Label": "unset",
        "Title": "X-Trace Task",
        "Host": "pinky19.mpi-sws.org",
        "Duration": "301561",
        "HRT": 26962455717364187,
        "Operation": "unset",
        "Timestamp": "1557746095657.666504",
        "TenantClass": 0,
        "Source": "Server.java:1058",
        "ThreadID": 58,
        "ThreadName": "",
        "EventID": "AD207B286D6128ED",
        "BaggageBytes": "[[248 5] [240 0] [0 194 144 105 252 183 56 123 179] [240 1] [0 92 142 139 139 143 28 60 165] [240 3] [0 2]]",
        "ProcessID": 2171
      },
      {
        "Cycles": 0,
        "Agent": "Execution-CPU",
        "ProcessName": "Read",
        "TaskID": "C29069FCB7387BB3",
        "ParentEventID": [
          "5C8E8B8B8F1C3CA5"
        ],
        "Label": "set",
        "Title": "X-Trace Task",
        "Host": "pinky19.mpi-sws.org",
        "HRT": 26962455717443771,
        "Operation": "set",
        "Timestamp": "1557746095657.701416",
        "TenantClass": 0,
        "Source": "Client.java:302",
        "ThreadID": 37,
        "ThreadName": "",
        "EventID": "2C1FD1EF383F5C22",
        "ProcessID": 36430
      },
      {
        "Cycles": 0,
        "Agent": "Execution-CPU",
        "ProcessName": "Read",
        "TaskID": "C29069FCB7387BB3",
        "ParentEventID": [
          "2C1FD1EF383F5C22"
        ],
        "Label": "unset",
        "Title": "X-Trace Task",
        "Host": "pinky19.mpi-sws.org",
        "Duration": "12219",
        "HRT": 26962455717473288,
        "Operation": "unset",
        "Timestamp": "1557746095657.730957",
        "TenantClass": 0,
        "Source": "Client.java:1168",
        "ThreadID": 37,
        "ThreadName": "",
        "EventID": "7CE11E32E66F1415",
        "ProcessID": 36430
      },
      {
        "Cycles": 0,
        "Agent": "Execution-Sleep",
        "ProcessName": "Read",
        "TaskID": "C29069FCB7387BB3",
        "ParentEventID": [
          "32ACC015861D72BD"
        ],
        "Label": "waited",
        "Title": "X-Trace Task",
        "Host": "pinky19.mpi-sws.org",
        "Duration": "545416",
        "HRT": 26962455717492578,
        "Operation": "waited",
        "Timestamp": "1557746095657.750244",
        "TenantClass": 0,
        "Source": "Client.java:1537",
        "ThreadID": 1,
        "ThreadName": "",
        "EventID": "D1C60177CB3DE07C",
        "ProcessID": 36430
      },
      {
        "Cycles": 0,
        "Agent": "org.apache.hadoop.ipc.ProtobufRpcEngine",
        "ProcessName": "Read",
        "TaskID": "C29069FCB7387BB3",
        "ParentEventID": [
          "1A6FF9502BE7562B"
        ],
        "Label": "org.apache.hadoop.hdfs.protocol.ClientProtocol.getBlockLocations completed",
        "Title": "X-Trace Task",
        "Host": "pinky19.mpi-sws.org",
        "HRT": 26962455717628545,
        "Timestamp": "1557746095657.886230",
        "TenantClass": 0,
        "Source": "ProtobufRpcEngine.java:275",
        "ThreadID": 1,
        "ThreadName": "",
        "EventID": "D0AB731831684A92",
        "ProcessID": 36430
      },
      {
        "Cycles": 0,
        "Agent": "edu.brown.cs.systems.xtrace.logging.BaggageWrappers",
        "ProcessName": "Read",
        "TaskID": "C29069FCB7387BB3",
        "ParentEventID": [
          "D1C60177CB3DE07C",
          "7CE11E32E66F1415"
        ],
        "Label": "Merged current baggage with other baggage",
        "Title": "X-Trace Task",
        "Host": "pinky19.mpi-sws.org",
        "HRT": 26962455717580298,
        "Operation": "join",
        "Timestamp": "1557746095657.837891",
        "TenantClass": 0,
        "Source": "Client.java:1545",
        "ThreadID": 1,
        "ThreadName": "",
        "EventID": "1A6FF9502BE7562B",
        "ProcessID": 36430
      },
      {
        "Cycles": 0,
        "Agent": "edu.brown.cs.systems.xtrace.logging.BaggageWrappers",
        "ProcessName": "Read",
        "TaskID": "C29069FCB7387BB3",
        "ParentEventID": [
          "D0AB731831684A92"
        ],
        "Label": "Forking current baggage with Baggage.fork()",
        "Title": "X-Trace Task",
        "Host": "pinky19.mpi-sws.org",
        "HRT": 26962455717701412,
        "Operation": "fork",
        "Timestamp": "1557746095657.958984",
        "TenantClass": 0,
        "Source": "DataTransferProtoUtil.java:94",
        "ThreadID": 1,
        "ThreadName": "",
        "EventID": "057296EFBC74928E",
        "ProcessID": 36430
      },
      {
        "Cycles": 0,
        "Agent": "Execution-CPU",
        "ProcessName": "Data",
        "TaskID": "C29069FCB7387BB3",
        "ParentEventID": [
          "057296EFBC74928E"
        ],
        "Label": "set",
        "Title": "X-Trace Task",
        "Host": "pinky19.mpi-sws.org",
        "HRT": 26962455717869738,
        "Operation": "set",
        "Timestamp": "1557746095658.145264",
        "TenantClass": 0,
        "Source": "Receiver.java:117",
        "ThreadID": 36633,
        "ThreadName": "",
        "EventID": "07F3712F892242EC",
        "BaggageBytes": "[[248 5] [240 0] [0 194 144 105 252 183 56 123 179] [240 1] [0 5 114 150 239 188 116 146 142] [240 3] [0 2]]",
        "ProcessID": 2319
      },
      {
        "Cycles": 0,
        "Agent": "edu.brown.cs.systems.xtrace.logging.XTraceInit",
        "ProcessName": "Data",
        "TaskID": "C29069FCB7387BB3",
        "ParentEventID": [
          "07F3712F892242EC"
        ],
        "Label": "Thread.setName: DataXceiver for client DFSClient_NONMAPREDUCE_778905418_1 at /139.19.171.63:43130 [Sending block BP-1633380353-139.19.171.63-1554193446451:blk_1073758131_17307]",
        "Title": "X-Trace Task",
        "Host": "pinky19.mpi-sws.org",
        "HRT": 26962455717906801,
        "Timestamp": "1557746095658.182129",
        "TenantClass": 0,
        "Source": "DataXceiver.java:168",
        "ThreadID": 36633,
        "ThreadName": "",
        "EventID": "21F93FF5E88C663B",
        "BaggageBytes": "[[248 5] [240 0] [0 194 144 105 252 183 56 123 179] [240 1] [0 7 243 113 47 137 34 66 236] [240 3] [0 2]]",
        "ProcessID": 2319
      },
      {
        "Cycles": 0,
        "Agent": "edu.brown.cs.systems.xtrace.logging.BaggageWrappers",
        "ProcessName": "Data",
        "TaskID": "C29069FCB7387BB3",
        "ParentEventID": [
          "21F93FF5E88C663B"
        ],
        "Label": "Forking current baggage with Baggage.fork()",
        "Title": "X-Trace Task",
        "Host": "pinky19.mpi-sws.org",
        "HRT": 26962455717980269,
        "Operation": "fork",
        "Timestamp": "1557746095658.255615",
        "TenantClass": 0,
        "Source": "DataXceiver.java:1257",
        "ThreadID": 36633,
        "ThreadName": "",
        "EventID": "559AAAB515F79871",
        "BaggageBytes": "[[248 5] [240 0] [0 194 144 105 252 183 56 123 179] [240 1] [0 33 249 63 245 232 140 102 59] [240 3] [0 2]]",
        "ProcessID": 2319
      },
      {
        "Cycles": 0,
        "Agent": "edu.brown.cs.systems.xtrace.logging.BaggageWrappers",
        "ProcessName": "Data",
        "TaskID": "C29069FCB7387BB3",
        "ParentEventID": [
          "559AAAB515F79871"
        ],
        "Label": "Forking current baggage with Baggage.fork()",
        "Title": "X-Trace Task",
        "Host": "pinky19.mpi-sws.org",
        "HRT": 26962455718042478,
        "Operation": "fork",
        "Timestamp": "1557746095658.317871",
        "TenantClass": 0,
        "Source": "PacketHeader.java:95",
        "ThreadID": 36633,
        "ThreadName": "",
        "EventID": "D6CC081FA142E38F",
        "BaggageBytes": "[[248 5] [240 0] [0 194 144 105 252 183 56 123 179] [240 1] [0 85 154 170 181 21 247 152 113] [240 3] [0 2]]",
        "ProcessID": 2319
      },
      {
        "Cycles": 0,
        "Agent": "Execution-Sleep",
        "ProcessName": "Data",
        "TaskID": "C29069FCB7387BB3",
        "ParentEventID": [
          "D6CC081FA142E38F"
        ],
        "Label": "waited",
        "Title": "X-Trace Task",
        "Host": "pinky19.mpi-sws.org",
        "Duration": "4144",
        "HRT": 26962455718100492,
        "Operation": "waited",
        "Timestamp": "1557746095658.375977",
        "TenantClass": 0,
        "Source": "SocketIOWithTimeout.java:335",
        "ThreadID": 36633,
        "ThreadName": "",
        "EventID": "3761BFED9498AF37",
        "BaggageBytes": "[[248 5] [240 0] [0 194 144 105 252 183 56 123 179] [240 1] [0 214 204 8 31 161 66 227 143] [240 3] [0 2]]",
        "ProcessID": 2319
      },
      {
        "Cycles": 0,
        "Agent": "Execution-Sleep",
        "ProcessName": "Read",
        "TaskID": "C29069FCB7387BB3",
        "ParentEventID": [
          "057296EFBC74928E"
        ],
        "Label": "waited",
        "Title": "X-Trace Task",
        "Host": "pinky19.mpi-sws.org",
        "Duration": "231047",
        "HRT": 26962455718039890,
        "Operation": "waited",
        "Timestamp": "1557746095658.297607",
        "TenantClass": 0,
        "Source": "SocketIOWithTimeout.java:335",
        "ThreadID": 1,
        "ThreadName": "",
        "EventID": "1AEC432796328109",
        "ProcessID": 36430
      },
      {
        "Cycles": 0,
        "Agent": "edu.brown.cs.systems.xtrace.logging.BaggageWrappers",
        "ProcessName": "Read",
        "TaskID": "C29069FCB7387BB3",
        "ParentEventID": [
          "559AAAB515F79871",
          "1AEC432796328109"
        ],
        "Label": "Merged current baggage with other baggage",
        "Title": "X-Trace Task",
        "Host": "pinky19.mpi-sws.org",
        "HRT": 26962455718134803,
        "Operation": "join",
        "Timestamp": "1557746095658.392578",
        "TenantClass": 0,
        "Source": "RemoteBlockReader2.java:429",
        "ThreadID": 1,
        "ThreadName": "",
        "EventID": "BB9F79AB49F03C5C",
        "ProcessID": 36430
      },
      {
        "Cycles": 0,
        "Agent": "edu.brown.cs.systems.xtrace.logging.BaggageWrappers",
        "ProcessName": "Data",
        "TaskID": "C29069FCB7387BB3",
        "ParentEventID": [
          "3761BFED9498AF37"
        ],
        "Label": "Forking current baggage with Baggage.fork()",
        "Title": "X-Trace Task",
        "Host": "pinky19.mpi-sws.org",
        "HRT": 26962455718161773,
        "Operation": "fork",
        "Timestamp": "1557746095658.437256",
        "TenantClass": 0,
        "Source": "PacketHeader.java:95",
        "ThreadID": 36633,
        "ThreadName": "",
        "EventID": "FDAB08E60B2069EF",
        "BaggageBytes": "[[248 5] [240 0] [0 194 144 105 252 183 56 123 179] [240 1] [0 55 97 191 237 148 152 175 55] [240 3] [0 2]]",
        "ProcessID": 2319
      },
      {
        "Cycles": 0,
        "Agent": "edu.brown.cs.systems.xtrace.logging.BaggageWrappers",
        "ProcessName": "Read",
        "TaskID": "C29069FCB7387BB3",
        "ParentEventID": [
          "BB9F79AB49F03C5C",
          "D6CC081FA142E38F"
        ],
        "Label": "Merged current baggage with other baggage",
        "Title": "X-Trace Task",
        "Host": "pinky19.mpi-sws.org",
        "HRT": 26962455718231405,
        "Operation": "join",
        "Timestamp": "1557746095658.489014",
        "TenantClass": 0,
        "Source": "PacketHeader.java:168",
        "ThreadID": 1,
        "ThreadName": "",
        "EventID": "9B7D7032A9155F89",
        "ProcessID": 36430
      },
      {
        "Cycles": 0,
        "Agent": "edu.brown.cs.systems.xtrace.logging.BaggageWrappers",
        "ProcessName": "Read",
        "TaskID": "C29069FCB7387BB3",
        "ParentEventID": [
          "FDAB08E60B2069EF",
          "9B7D7032A9155F89"
        ],
        "Label": "Merged current baggage with other baggage",
        "Title": "X-Trace Task",
        "Host": "pinky19.mpi-sws.org",
        "HRT": 26962455718305041,
        "Operation": "join",
        "Timestamp": "1557746095658.562744",
        "TenantClass": 0,
        "Source": "PacketHeader.java:168",
        "ThreadID": 1,
        "ThreadName": "",
        "EventID": "F2301542252684C3",
        "ProcessID": 36430
      },
      {
        "Cycles": 0,
        "Agent": "Execution-Sleep",
        "ProcessName": "Data",
        "TaskID": "C29069FCB7387BB3",
        "ParentEventID": [
          "FDAB08E60B2069EF"
        ],
        "Label": "waited",
        "Title": "X-Trace Task",
        "Host": "pinky19.mpi-sws.org",
        "Duration": "129221",
        "HRT": 26962455718371025,
        "Operation": "waited",
        "Timestamp": "1557746095658.646484",
        "TenantClass": 0,
        "Source": "SocketIOWithTimeout.java:335",
        "ThreadID": 36633,
        "ThreadName": "",
        "EventID": "4331FC943F25E838",
        "BaggageBytes": "[[248 5] [240 0] [0 194 144 105 252 183 56 123 179] [240 1] [0 253 171 8 230 11 32 105 239] [240 3] [0 2]]",
        "ProcessID": 2319
      },
      {
        "Cycles": 0,
        "Agent": "edu.brown.cs.systems.xtrace.logging.BaggageWrappers",
        "ProcessName": "Read",
        "TaskID": "C29069FCB7387BB3",
        "ParentEventID": [
          "F2301542252684C3"
        ],
        "Label": "Forking current baggage with Baggage.fork()",
        "Title": "X-Trace Task",
        "Host": "pinky19.mpi-sws.org",
        "HRT": 26962455718316575,
        "Operation": "fork",
        "Timestamp": "1557746095658.574219",
        "TenantClass": 0,
        "Source": "RemoteBlockReader2.java:361",
        "ThreadID": 1,
        "ThreadName": "",
        "EventID": "8FEC7F35799E58E6",
        "ProcessID": 36430
      },
      {
        "Cycles": 0,
        "Agent": "edu.brown.cs.systems.xtrace.logging.BaggageWrappers",
        "ProcessName": "Data",
        "TaskID": "C29069FCB7387BB3",
        "ParentEventID": [
          "4331FC943F25E838",
          "8FEC7F35799E58E6"
        ],
        "Label": "Merged current baggage with other baggage",
        "Title": "X-Trace Task",
        "Host": "pinky19.mpi-sws.org",
        "HRT": 26962455718424262,
        "Operation": "join",
        "Timestamp": "1557746095658.699707",
        "TenantClass": 0,
        "Source": "DataXceiver.java:574",
        "ThreadID": 36633,
        "ThreadName": "",
        "EventID": "59850DECDE820367",
        "BaggageBytes": "[[248 5] [240 0] [0 194 144 105 252 183 56 123 179] [240 1] [0 143 236 127 53 121 158 88 230] [0 67 49 252 148 63 37 232 56] [240 3] [0 2]]",
        "ProcessID": 2319
      },
      {
        "Cycles": 0,
        "Agent": "Execution-CPU",
        "ProcessName": "Data",
        "TaskID": "C29069FCB7387BB3",
        "ParentEventID": [
          "59850DECDE820367"
        ],
        "Label": "unset",
        "Title": "X-Trace Task",
        "Host": "pinky19.mpi-sws.org",
        "Duration": "547849",
        "HRT": 26962455718443701,
        "Operation": "unset",
        "Timestamp": "1557746095658.719238",
        "TenantClass": 0,
        "Source": "DataXceiver.java:261",
        "ThreadID": 36633,
        "ThreadName": "",
        "EventID": "8F16D830CD24659A",
        "BaggageBytes": "[[248 5] [240 0] [0 194 144 105 252 183 56 123 179] [240 1] [0 89 133 13 236 222 130 3 103] [240 3] [0 2]]",
        "ProcessID": 2319
      },
      {
        "Cycles": 0,
        "Agent": "edu.brown.cs.systems.retro.benchmarks.hdfs_client.Reader",
        "ProcessName": "Read",
        "TaskID": "C29069FCB7387BB3",
        "ParentEventID": [
          "0"
        ],
        "Label": "Reading file",
        "Title": "X-Trace Task",
        "Host": "pinky19.mpi-sws.org",
        "HRT": 26962455716688268,
        "Timestamp": "1557746095656.946045",
        "TenantClass": 0,
        "ThreadID": 1,
        "ThreadName": "",
        "EventID": "FEFB55227A40146B",
        "ProcessID": 36430,
        "Tag": [
          "reader_10kb",
          "Read Size: 10240"
        ]
      }
    ]
  }
]