[
  {
    "id": "FD515C4259DA69DB",
    "reports": [
      {
        "Cycles": 0,
        "Agent": "Execution-CPU",
        "ProcessName": "Read",
        "TaskID": "FD515C4259DA69DB",
        "ParentEventID": [
          "306F016096686869"
        ],
        "Label": "unset",
        "Title": "X-Trace Task",
        "Host": "pinky19.mpi-sws.org",
        "Duration": "22183480",
        "HRT": 26962539439558398,
        "Operation": "unset",
        "Timestamp": "1557746179379.878662",
        "TenantClass": 0,
        "Source": "Client.java:1027",
        "ThreadID": 1,
        "ThreadName": "",
        "EventID": "A37D4C2791E94CA7",
        "ProcessID": 36430
      },
      {
        "Cycles": 0,
        "Agent": "org.apache.hadoop.ipc.ProtobufRpcEngine",
        "ProcessName": "Read",
        "TaskID": "FD515C4259DA69DB",
        "ParentEventID": [
          "E95512EC732DBD9A"
        ],
        "Label": "Invoking org.apache.hadoop.hdfs.protocol.ClientProtocol.getBlockLocations",
        "Title": "X-Trace Task",
        "Host": "pinky19.mpi-sws.org",
        "HRT": 26962539439534445,
        "Timestamp": "1557746179379.854492",
        "TenantClass": 0,
        "Source": "ProtobufRpcEngine.java:228",
        "ThreadID": 1,
        "ThreadName": "",
        "EventID": "306F016096686869",
        "ProcessID": 36430
      },
      {
        "Cycles": 0,
        "Agent": "Execution-CPU",
        "ProcessName": "Read",
        "TaskID": "FD515C4259DA69DB",
        "ParentEventID": [
          "A37D4C2791E94CA7"
        ],
        "Label": "set",
        "Title": "X-Trace Task",
        "Host": "pinky19.mpi-sws.org",
        "HRT": 26962539439584659,
        "Operation": "set",
        "Timestamp": "1557746179379.904785",
        "TenantClass": 0,
        "Source": "Client.java:1032",
        "ThreadID": 41,
        "ThreadName": "",
        "EventID": "B951E1E6AFE17BDF",
        "ProcessID": 36430
      },
      {
        "Cycles": 0,
        "Agent": "edu.brown.cs.systems.xtrace.logging.BaggageWrappers",
        "ProcessName": "Read",
        "TaskID": "FD515C4259DA69DB",
        "ParentEventID": [
          "B951E1E6AFE17BDF"
        ],
        "Label": "Forking current baggage with Baggage.fork()",
        "Title": "X-Trace Task",
        "Host": "pinky19.mpi-sws.org",
        "HRT": 26962539439600631,
        "Operation": "fork",
        "Timestamp": "1557746179379.920898",
        "TenantClass": 0,
        "Source": "Client.java:1043",
        "ThreadID": 41,
        "ThreadName": "",
        "EventID": "87C75640FEBE0752",
        "ProcessID": 36430
      },
      {
        "Cycles": 0,
        "Agent": "edu.brown.cs.systems.retro.benchmarks.hdfs_client.Reader",
        "ProcessName": "Read",
        "TaskID": "FD515C4259DA69DB",
        "ParentEventID": [
          "0"
        ],
        "Label": "Reading file",
        "Title": "X-Trace Task",
        "Host": "pinky19.mpi-sws.org",
        "HRT": 26962539439485757,
        "Timestamp": "1557746179379.805908",
        "TenantClass": 0,
        "ThreadID": 1,
        "ThreadName": "",
        "EventID": "52F120E4521C0AE5",
        "ProcessID": 36430,
        "Tag": [
          "reader_10kb",
          "Read Size: 10240"
        ]
      },
      {
        "Cycles": 0,
        "Agent": "Execution-CPU",
        "ProcessName": "Read",
        "TaskID": "FD515C4259DA69DB",
        "ParentEventID": [
          "95F144ED4FDA778E"
        ],
        "Label": "set",
        "Title": "X-Trace Task",
        "Host": "pinky19.mpi-sws.org",
        "HRT": 26962539439692241,
        "Operation": "set",
        "Timestamp": "1557746179380.012451",
        "TenantClass": 0,
        "Source": "Client.java:1104",
        "ThreadID": 1,
        "ThreadName": "",
        "EventID": "60FFDD70D11BD049",
        "ProcessID": 36430
      },
      {
        "Cycles": 0,
        "Agent": "Execution-CPU",
        "ProcessName": "Read",
        "TaskID": "FD515C4259DA69DB",
        "ParentEventID": [
          "87C75640FEBE0752"
        ],
        "Label": "unset",
        "Title": "X-Trace Task",
        "Host": "pinky19.mpi-sws.org",
        "Duration": "72842",
        "HRT": 26962539439672512,
        "Operation": "unset",
        "Timestamp": "1557746179379.992676",
        "TenantClass": 0,
        "Source": "Client.java:1062",
        "ThreadID": 41,
        "ThreadName": "",
        "EventID": "95F144ED4FDA778E",
        "ProcessID": 36430
      },
      {
        "Cycles": 0,
        "Agent": "Execution-CPU",
        "ProcessName": "Name",
        "TaskID": "FD515C4259DA69DB",
        "ParentEventID": [
          "87C75640FEBE0752"
        ],
        "Label": "set",
        "Title": "X-Trace Task",
        "Host": "pinky19.mpi-sws.org",
        "HRT": 26962539439768832,
        "Operation": "set",
        "Timestamp": "1557746179380.095215",
        "TenantClass": 0,
        "Source": "Server.java:1840",
        "ThreadID": 48,
        "ThreadName": "",
        "EventID": "40B35063EB3EA80A",
        "BaggageBytes": "[[248 5] [240 0] [0 253 81 92 66 89 218 105 219] [240 1] [0 135 199 86 64 254 190 7 82] [240 3] [0 2]]",
        "ProcessID": 2171
      },
      {
        "Cycles": 0,
        "Agent": "Execution-CPU",
        "ProcessName": "Name",
        "TaskID": "FD515C4259DA69DB",
        "ParentEventID": [
          "C75C810A8E149C03"
        ],
        "Label": "unset",
        "Title": "X-Trace Task",
        "Host": "pinky19.mpi-sws.org",
        "Duration": "23094",
        "HRT": 26962539439817621,
        "Operation": "unset",
        "Timestamp": "1557746179380.144043",
        "TenantClass": 0,
        "Source": "Server.java:1828",
        "ThreadID": 48,
        "ThreadName": "",
        "EventID": "17751B11E5D4234A",
        "BaggageBytes": "[[248 5] [240 0] [0 253 81 92 66 89 218 105 219] [240 1] [0 199 92 129 10 142 20 156 3] [240 3] [0 2]]",
        "ProcessID": 2171
      },
      {
        "Cycles": 0,
        "Agent": "edu.brown.cs.systems.xtrace.logging.BaggageWrappers",
        "ProcessName": "Name",
        "TaskID": "FD515C4259DA69DB",
        "ParentEventID": [
          "40B35063EB3EA80A"
        ],
        "Label": "Forking current baggage with Baggage.fork()",
        "Title": "X-Trace Task",
        "Host": "pinky19.mpi-sws.org",
        "HRT": 26962539439798501,
        "Operation": "fork",
        "Timestamp": "1557746179380.125000",
        "TenantClass": 0,
        "Source": "Server.java:550",
        "ThreadID": 48,
        "ThreadName": "",
        "EventID": "C75C810A8E149C03",
        "BaggageBytes": "[[248 5] [240 0] [0 253 81 92 66 89 218 105 219] [240 1] [0 64 179 80 99 235 62 168 10] [240 3] [0 2]]",
        "ProcessID": 2171
      },
      {
        "Cycles": 0,
        "Agent": "Execution-CPU",
        "ProcessName": "Name",
        "TaskID": "FD515C4259DA69DB",
        "ParentEventID": [
          "C75C810A8E149C03"
        ],
        "Label": "set",
        "Title": "X-Trace Task",
        "Host": "pinky19.mpi-sws.org",
        "HRT": 26962539439825372,
        "Operation": "set",
        "Timestamp": "1557746179380.151855",
        "TenantClass": 0,
        "Source": "Server.java:2071",
        "ThreadID": 59,
        "ThreadName": "",
        "EventID": "DF19BB5DFC94A52D",
        "BaggageBytes": "[[248 5] [240 0] [0 253 81 92 66 89 218 105 219] [240 1] [0 199 92 129 10 142 20 156 3] [240 3] [0 2]]",
        "ProcessID": 2171
      },
      {
        "Cycles": 0,
        "Agent": "org.apache.hadoop.hdfs.server.namenode.FSNamesystem.audit",
        "ProcessName": "Name",
        "TaskID": "FD515C4259DA69DB",
        "ParentEventID": [
          "BAC60DDA400E563B"
        ],
        "Label": "allowed=true\tugi=plascas (auth:SIMPLE)\tip=/139.19.171.63\tcmd=open\tsrc=/ds/84EpvZPBbjWSvFBx\tdst=null\tperm=null\tproto=rpc",
        "Title": "X-Trace Task",
        "Host": "pinky19.mpi-sws.org",
        "HRT": 26962539439907572,
        "Timestamp": "1557746179380.234131",
        "TenantClass": 0,
        "Source": "FSNamesystem.java:8313",
        "ThreadID": 59,
        "ThreadName": "",
        "EventID": "5346C49C24A17407",
        "BaggageBytes": "[[248 5] [240 0] [0 253 81 92 66 89 218 105 219] [240 1] [0 186 198 13 218 64 14 86 59] [240 3] [0 2]]",
        "ProcessID": 2171
      },
      {
        "Cycles": 0,
        "Agent": "edu.brown.cs.systems.xtrace.logging.BaggageWrappers",
        "ProcessName": "Name",
        "TaskID": "FD515C4259DA69DB",
        "ParentEventID": [
          "5346C49C24A17407"
        ],
        "Label": "Forking current baggage with Baggage.fork()",
        "Title": "X-Trace Task",
        "Host": "pinky19.mpi-sws.org",
        "HRT": 26962539439952508,
        "Operation": "fork",
        "Timestamp": "1557746179380.279053",
        "TenantClass": 0,
        "Source": "Server.java:2398",
        "ThreadID": 59,
        "ThreadName": "",
        "EventID": "4D9B25ADD5EFB051",
        "BaggageBytes": "[[248 5] [240 0] [0 253 81 92 66 89 218 105 219] [240 1] [0 83 70 196 156 36 161 116 7] [240 3] [0 2]]",
        "ProcessID": 2171
      },
      {
        "Cycles": 0,
        "Agent": "org.apache.hadoop.ipc.Server",
        "ProcessName": "Name",
        "TaskID": "FD515C4259DA69DB",
        "ParentEventID": [
          "DF19BB5DFC94A52D"
        ],
        "Label": "getBlockLocations in org.apache.hadoop.hdfs.protocol.ClientProtocol",
        "Title": "X-Trace Task",
        "Host": "pinky19.mpi-sws.org",
        "HRT": 26962539439861453,
        "Timestamp": "1557746179380.187988",
        "TenantClass": 0,
        "Source": "ProtobufRpcEngine.java:601",
        "ThreadID": 59,
        "ThreadName": "",
        "EventID": "BAC60DDA400E563B",
        "BaggageBytes": "[[248 5] [240 0] [0 253 81 92 66 89 218 105 219] [240 1] [0 223 25 187 93 252 148 165 45] [240 3] [0 2]]",
        "ProcessID": 2171
      },
      {
        "Cycles": 0,
        "Agent": "Execution-CPU",
        "ProcessName": "Name",
        "TaskID": "FD515C4259DA69DB",
        "ParentEventID": [
          "4D9B25ADD5EFB051"
        ],
        "Label": "unset",
        "Title": "X-Trace Task",
        "Host": "pinky19.mpi-sws.org",
        "Duration": "207569",
        "HRT": 26962539440057723,
        "Operation": "unset",
        "Timestamp": "1557746179380.384277",
        "TenantClass": 0,
        "Source": "Server.java:1058",
        "ThreadID": 59,
        "ThreadName": "",
        "EventID": "A85E517D5524AB53",
        "BaggageBytes": "[[248 5] [240 0] [0 253 81 92 66 89 218 105 219] [240 1] [0 77 155 37 173 213 239 176 81] [240 3] [0 2]]",
        "ProcessID": 2171
      },
      {
        "Cycles": 0,
        "Agent": "Execution-CPU",
        "ProcessName": "Read",
        "TaskID": "FD515C4259DA69DB",
        "ParentEventID": [
          "4D9B25ADD5EFB051"
        ],
        "Label": "set",
        "Title": "X-Trace Task",
        "Host": "pinky19.mpi-sws.org",
        "HRT": 26962539440133109,
        "Operation": "set",
        "Timestamp": "1557746179380.453369",
        "TenantClass": 0,
        "Source": "Client.java:302",
        "ThreadID": 37,
        "ThreadName": "",
        "EventID": "6E158C8A91C7A4E5",
        "ProcessID": 36430
      },
      {
        "Cycles": 0,
        "Agent": "Execution-CPU",
        "ProcessName": "Read",
        "TaskID": "FD515C4259DA69DB",
        "ParentEventID": [
          "6E158C8A91C7A4E5"
        ],
        "Label": "unset",
        "Title": "X-Trace Task",
        "Host": "pinky19.mpi-sws.org",
        "Duration": "9632",
        "HRT": 26962539440158899,
        "Operation": "unset",
        "Timestamp": "1557746179380.479004",
        "TenantClass": 0,
        "Source": "Client.java:1168",
        "ThreadID": 37,
        "ThreadName": "",
        "EventID": "65739392EF049C3E",
        "ProcessID": 36430
      },
      {
        "Cycles": 0,
        "Agent": "Execution-Sleep",
        "ProcessName": "Read",
        "TaskID": "FD515C4259DA69DB",
        "ParentEventID": [
          "60FFDD70D11BD049"
        ],
        "Label": "waited",
        "Title": "X-Trace Task",
        "Host": "pinky19.mpi-sws.org",
        "Duration": "478127",
        "HRT": 26962539440178372,
        "Operation": "waited",
        "Timestamp": "1557746179380.498535",
        "TenantClass": 0,
        "Source": "Client.java:1537",
        "ThreadID": 1,
        "ThreadName": "",
        "EventID": "E779CB505592C6BE",
        "ProcessID": 36430
      },
      {
        "Cycles": 0,
        "Agent": "edu.brown.cs.systems.xtrace.logging.BaggageWrappers",
        "ProcessName": "Read",
        "TaskID": "FD515C4259DA69DB",
        "ParentEventID": [
          "E779CB505592C6BE",
          "65739392EF049C3E"
        ],
        "Label": "Merged current baggage with other baggage",
        "Title": "X-Trace Task",
        "Host": "pinky19.mpi-sws.org",
        "HRT": 26962539440194310,
        "Operation": "join",
        "Timestamp": "1557746179380.514404",
        "TenantClass": 0,
        "Source": "Client.java:1545",
        "ThreadID": 1,
        "ThreadName": "",
        "EventID": "0BD61F1C0EFF67C6",
        "ProcessID": 36430
      },
      {
        "Cycles": 0,
        "Agent": "org.apache.hadoop.ipc.ProtobufRpcEngine",
        "ProcessName": "Read",
        "TaskID": "FD515C4259DA69DB",
        "ParentEventID": [
          "0BD61F1C0EFF67C6"
        ],
        "Label": "org.apache.hadoop.hdfs.protocol.ClientProtocol.getBlockLocations completed",
        "Title": "X-Trace Task",
        "Host": "pinky19.mpi-sws.org",
        "HRT": 26962539440256880,
        "Timestamp": "1557746179380.577148",
        "TenantClass": 0,
        "Source": "ProtobufRpcEngine.java:275",
        "ThreadID": 1,
        "ThreadName": "",
        "EventID": "29594E520F5CDBE6",
        "ProcessID": 36430
      },
      {
        "Cycles": 0,
        "Agent": "Execution-CPU",
        "ProcessName": "Data",
        "TaskID": "FD515C4259DA69DB",
        "ParentEventID": [
          "5F34854B41AA2784"
        ],
        "Label": "set",
        "Title": "X-Trace Task",
        "Host": "pinky19.mpi-sws.org",
        "HRT": 26962539440448886,
        "Operation": "set",
        "Timestamp": "1557746179380.761963",
        "TenantClass": 0,
        "Source": "Receiver.java:117",
        "ThreadID": 36633,
        "ThreadName": "",
        "EventID": "8D0F2856D989F5CC",
        "BaggageBytes": "[[248 5] [240 0] [0 253 81 92 66 89 218 105 219] [240 1] [0 95 52 133 75 65 170 39 132] [240 3] [0 2]]",
        "ProcessID": 2319
      },
      {
        "Cycles": 0,
        "Agent": "edu.brown.cs.systems.xtrace.logging.BaggageWrappers",
        "ProcessName": "Read",
        "TaskID": "FD515C4259DA69DB",
        "ParentEventID": [
          "29594E520F5CDBE6"
        ],
        "Label": "Forking current baggage with Baggage.fork()",
        "Title": "X-Trace Task",
        "Host": "pinky19.mpi-sws.org",
        "HRT": 26962539440318287,
        "Operation": "fork",
        "Timestamp": "1557746179380.638428",
        "TenantClass": 0,
        "Source": "DataTransferProtoUtil.java:94",
        "ThreadID": 1,
        "ThreadName": "",
        "EventID": "5F34854B41AA2784",
        "ProcessID": 36430
      },
      {
        "Cycles": 0,
        "Agent": "edu.brown.cs.systems.xtrace.logging.XTraceInit",
        "ProcessName": "Data",
        "TaskID": "FD515C4259DA69DB",
        "ParentEventID": [
          "8D0F2856D989F5CC"
        ],
        "Label": "Thread.setName: DataXceiver for client DFSClient_NONMAPREDUCE_778905418_1 at /139.19.171.63:43130 [Sending block BP-1633380353-139.19.171.63-1554193446451:blk_1073756107_15283]",
        "Title": "X-Trace Task",
        "Host": "pinky19.mpi-sws.org",
        "HRT": 26962539440484784,
        "Timestamp": "1557746179380.797852",
        "TenantClass": 0,
        "Source": "DataXceiver.java:168",
        "ThreadID": 36633,
        "ThreadName": "",
        "EventID": "30D5D9281595AE87",
        "BaggageBytes": "[[248 5] [240 0] [0 253 81 92 66 89 218 105 219] [240 1] [0 141 15 40 86 217 137 245 204] [240 3] [0 2]]",
        "ProcessID": 2319
      },
      {
        "Cycles": 0,
        "Agent": "Execution-Sleep",
        "ProcessName": "Read",
        "TaskID": "FD515C4259DA69DB",
        "ParentEventID": [
          "5F34854B41AA2784"
        ],
        "Label": "waited",
        "Title": "X-Trace Task",
        "Host": "pinky19.mpi-sws.org",
        "Duration": "196093",
        "HRT": 26962539440624986,
        "Operation": "waited",
        "Timestamp": "1557746179380.945068",
        "TenantClass": 0,
        "Source": "SocketIOWithTimeout.java:335",
        "ThreadID": 1,
        "ThreadName": "",
        "EventID": "26833485453B05DD",
        "ProcessID": 36430
      },
      {
        "Cycles": 0,
        "Agent": "edu.brown.cs.systems.xtrace.logging.BaggageWrappers",
        "ProcessName": "Data",
        "TaskID": "FD515C4259DA69DB",
        "ParentEventID": [
          "E60CE82E605B00EB"
        ],
        "Label": "Forking current baggage with Baggage.fork()",
        "Title": "X-Trace Task",
        "Host": "pinky19.mpi-sws.org",
        "HRT": 26962539440627278,
        "Operation": "fork",
        "Timestamp": "1557746179380.940186",
        "TenantClass": 0,
        "Source": "PacketHeader.java:95",
        "ThreadID": 36633,
        "ThreadName": "",
        "EventID": "8E6D0F28A3A469FF",
        "BaggageBytes": "[[248 5] [240 0] [0 253 81 92 66 89 218 105 219] [240 1] [0 230 12 232 46 96 91 0 235] [240 3] [0 2]]",
        "ProcessID": 2319
      },
      {
        "Cycles": 0,
        "Agent": "edu.brown.cs.systems.xtrace.logging.BaggageWrappers",
        "ProcessName": "Data",
        "TaskID": "FD515C4259DA69DB",
        "ParentEventID": [
          "30D5D9281595AE87"
        ],
        "Label": "Forking current baggage with Baggage.fork()",
        "Title": "X-Trace Task",
        "Host": "pinky19.mpi-sws.org",
        "HRT": 26962539440562120,
        "Operation": "fork",
        "Timestamp": "1557746179380.875000",
        "TenantClass": 0,
        "Source": "DataXceiver.java:1257",
        "ThreadID": 36633,
        "ThreadName": "",
        "EventID": "E60CE82E605B00EB",
        "BaggageBytes": "[[248 5] [240 0] [0 253 81 92 66 89 218 105 219] [240 1] [0 48 213 217 40 21 149 174 135] [240 3] [0 2]]",
        "ProcessID": 2319
      },
      {
        "Cycles": 0,
        "Agent": "edu.brown.cs.systems.xtrace.logging.BaggageWrappers",
        "ProcessName": "Read",
        "TaskID": "FD515C4259DA69DB",
        "ParentEventID": [
          "E60CE82E605B00EB",
          "26833485453B05DD"
        ],
        "Label": "Merged current baggage with other baggage",
        "Title": "X-Trace Task",
        "Host": "pinky19.mpi-sws.org",
        "HRT": 26962539440694597,
        "Operation": "join",
        "Timestamp": "1557746179381.014648",
        "TenantClass": 0,
        "Source": "RemoteBlockReader2.java:429",
        "ThreadID": 1,
        "ThreadName": "",
        "EventID": "F467839F3EB81686",
        "ProcessID": 36430
      },
      {
        "Cycles": 0,
        "Agent": "Execution-Sleep",
        "ProcessName": "Data",
        "TaskID": "FD515C4259DA69DB",
        "ParentEventID": [
          "8E6D0F28A3A469FF"
        ],
        "Label": "waited",
        "Title": "X-Trace Task",
        "Host": "pinky19.mpi-sws.org",
        "Duration": "4423",
        "HRT": 26962539440685585,
        "Operation": "waited",
        "Timestamp": "1557746179380.998535",
        "TenantClass": 0,
        "Source": "SocketIOWithTimeout.java:335",
        "ThreadID": 36633,
        "ThreadName": "",
        "EventID": "8AC176E5A7121A7A",
        "BaggageBytes": "[[248 5] [240 0] [0 253 81 92 66 89 218 105 219] [240 1] [0 142 109 15 40 163 164 105 255] [240 3] [0 2]]",
        "ProcessID": 2319
      },
      {
        "Cycles": 0,
        "Agent": "edu.brown.cs.systems.xtrace.logging.BaggageWrappers",
        "ProcessName": "Data",
        "TaskID": "FD515C4259DA69DB",
        "ParentEventID": [
          "8AC176E5A7121A7A"
        ],
        "Label": "Forking current baggage with Baggage.fork()",
        "Title": "X-Trace Task",
        "Host": "pinky19.mpi-sws.org",
        "HRT": 26962539440747700,
        "Operation": "fork",
        "Timestamp": "1557746179381.060791",
        "TenantClass": 0,
        "Source": "PacketHeader.java:95",
        "ThreadID": 36633,
        "ThreadName": "",
        "EventID": "3950C5C5469766B0",
        "BaggageBytes": "[[248 5] [240 0] [0 253 81 92 66 89 218 105 219] [240 1] [0 138 193 118 229 167 18 26 122] [240 3] [0 2]]",
        "ProcessID": 2319
      },
      {
        "Cycles": 0,
        "Agent": "edu.brown.cs.systems.xtrace.logging.BaggageWrappers",
        "ProcessName": "Read",
        "TaskID": "FD515C4259DA69DB",
        "ParentEventID": [
          "3950C5C5469766B0",
          "DC3FA74FC81497D9"
        ],
        "Label": "Merged current baggage with other baggage",
        "Title": "X-Trace Task",
        "Host": "pinky19.mpi-sws.org",
        "HRT": 26962539440830590,
        "Operation": "join",
        "Timestamp": "1557746179381.150879",
        "TenantClass": 0,
        "Source": "PacketHeader.java:168",
        "ThreadID": 1,
        "ThreadName": "",
        "EventID": "F1CD8C88D61C06EE",
        "ProcessID": 36430
      },
      {
        "Cycles": 0,
        "Agent": "edu.brown.cs.systems.xtrace.logging.BaggageWrappers",
        "ProcessName": "Read",
        "TaskID": "FD515C4259DA69DB",
        "ParentEventID": [
          "F1CD8C88D61C06EE"
        ],
        "Label": "Forking current baggage with Baggage.fork()",
        "Title": "X-Trace Task",
        "Host": "pinky19.mpi-sws.org",
        "HRT": 26962539440840403,
        "Operation": "fork",
        "Timestamp": "1557746179381.160645",
        "TenantClass": 0,
        "Source": "RemoteBlockReader2.java:361",
        "ThreadID": 1,
        "ThreadName": "",
        "EventID": "14F7885D52A49210",
        "ProcessID": 36430
      },
      {
        "Cycles": 0,
        "Agent": "Execution-Sleep",
        "ProcessName": "Data",
        "TaskID": "FD515C4259DA69DB",
        "ParentEventID": [
          "3950C5C5469766B0"
        ],
        "Label": "waited",
        "Title": "X-Trace Task",
        "Host": "pinky19.mpi-sws.org",
        "Duration": "57275",
        "HRT": 26962539440885386,
        "Operation": "waited",
        "Timestamp": "1557746179381.198486",
        "TenantClass": 0,
        "Source": "SocketIOWithTimeout.java:335",
        "ThreadID": 36633,
        "ThreadName": "",
        "EventID": "6D416C03B158E7AE",
        "BaggageBytes": "[[248 5] [240 0] [0 253 81 92 66 89 218 105 219] [240 1] [0 57 80 197 197 70 151 102 176] [240 3] [0 2]]",
        "ProcessID": 2319
      },
      {
        "Cycles": 0,
        "Agent": "edu.brown.cs.systems.xtrace.logging.BaggageWrappers",
        "ProcessName": "Read",
        "TaskID": "FD515C4259DA69DB",
        "ParentEventID": [
          "8E6D0F28A3A469FF",
          "F467839F3EB81686"
        ],
        "Label": "Merged current baggage with other baggage",
        "Title": "X-Trace Task",
        "Host": "pinky19.mpi-sws.org",
        "HRT": 26962539440768816,
        "Operation": "join",
        "Timestamp": "1557746179381.088867",
        "TenantClass": 0,
        "Source": "PacketHeader.java:168",
        "ThreadID": 1,
        "ThreadName": "",
        "EventID": "DC3FA74FC81497D9",
        "ProcessID": 36430
      },
      {
        "Cycles": 0,
        "Agent": "edu.brown.cs.systems.xtrace.logging.BaggageWrappers",
        "ProcessName": "Data",
        "TaskID": "FD515C4259DA69DB",
        "ParentEventID": [
          "6D416C03B158E7AE",
          "14F7885D52A49210"
        ],
        "Label": "Merged current baggage with other baggage",
        "Title": "X-Trace Task",
        "Host": "pinky19.mpi-sws.org",
        "HRT": 26962539440937646,
        "Operation": "join",
        "Timestamp": "1557746179381.250732",
        "TenantClass": 0,
        "Source": "DataXceiver.java:574",
        "ThreadID": 36633,
        "ThreadName": "",
        "EventID": "B1D3CE30F3FF09C5",
        "BaggageBytes": "[[248 5] [240 0] [0 253 81 92 66 89 218 105 219] [240 1] [0 20 247 136 93 82 164 146 16] [0 109 65 108 3 177 88 231 174] [240 3] [0 2]]",
        "ProcessID": 2319
      },
      {
        "Cycles": 0,
        "Agent": "Execution-CPU",
        "ProcessName": "Data",
        "TaskID": "FD515C4259DA69DB",
        "ParentEventID": [
          "B1D3CE30F3FF09C5"
        ],
        "Label": "unset",
        "Title": "X-Trace Task",
        "Host": "pinky19.mpi-sws.org",
        "Duration": "483786",
        "HRT": 26962539440957437,
        "Operation": "unset",
        "Timestamp": "1557746179381.270508",
        "TenantClass": 0,
        "Source": "DataXceiver.java:261",
        "ThreadID": 36633,
        "ThreadName": "",
        "EventID": "A662286E51F01216",
        "BaggageBytes": "[[248 5] [240 0] [0 253 81 92 66 89 218 105 219] [240 1] [0 177 211 206 48 243 255 9 197] [240 3] [0 2]]",
        "ProcessID": 2319
      },
      {
        "Cycles": 0,
        "Agent": "edu.brown.cs.systems.retro.benchmarks.hdfs_client.Reader",
        "ProcessName": "Read",
        "TaskID": "FD515C4259DA69DB",
        "ParentEventID": [
          "52F120E4521C0AE5"
        ],
        "Label": "Reading file",
        "Title": "X-Trace Task",
        "Host": "pinky19.mpi-sws.org",
        "HRT": 26962539439503009,
        "Timestamp": "1557746179379.823242",
        "TenantClass": 0,
        "ThreadID": 1,
        "ThreadName": "",
        "EventID": "E95512EC732DBD9A",
        "ProcessID": 36430
      }
    ]
  }
]