[
  {
    "id": "AEC9EF05BE1C8125",
    "reports": [
      {
        "Cycles": 0,
        "Agent": "Execution-CPU",
        "ProcessName": "Read",
        "TaskID": "AEC9EF05BE1C8125",
        "ParentEventID": [
          "BDE1C1ED61AD065C"
        ],
        "Label": "unset",
        "Title": "X-Trace Task",
        "Host": "pinky19.mpi-sws.org",
        "Duration": "34742026",
        "HRT": 26966740071047647,
        "Operation": "unset",
        "Timestamp": "1557750380011.128906",
        "TenantClass": 0,
        "Source": "Client.java:1027",
        "ThreadID": 1,
        "ThreadName": "",
        "EventID": "78F572E5BE081C75",
        "ProcessID": 2801
      },
      {
        "Cycles": 0,
        "Agent": "edu.brown.cs.systems.retro.benchmarks.hdfs_client.Reader",
        "ProcessName": "Read",
        "TaskID": "AEC9EF05BE1C8125",
        "ParentEventID": [
          "26612A909911B560"
        ],
        "Label": "Reading file",
        "Title": "X-Trace Task",
        "Host": "pinky19.mpi-sws.org",
        "HRT": 26966740070992722,
        "Timestamp": "1557750380011.073975",
        "TenantClass": 0,
        "ThreadID": 1,
        "ThreadName": "",
        "EventID": "BDD1C9AD5B9E201B",
        "ProcessID": 2801
      },
      {
        "Cycles": 0,
        "Agent": "org.apache.hadoop.ipc.ProtobufRpcEngine",
        "ProcessName": "Read",
        "TaskID": "AEC9EF05BE1C8125",
        "ParentEventID": [
          "BDD1C9AD5B9E201B"
        ],
        "Label": "Invoking org.apache.hadoop.hdfs.protocol.ClientProtocol.getBlockLocations",
        "Title": "X-Trace Task",
        "Host": "pinky19.mpi-sws.org",
        "HRT": 26966740071027473,
        "Timestamp": "1557750380011.108643",
        "TenantClass": 0,
        "Source": "ProtobufRpcEngine.java:228",
        "ThreadID": 1,
        "ThreadName": "",
        "EventID": "BDE1C1ED61AD065C",
        "ProcessID": 2801
      },
      {
        "Cycles": 0,
        "Agent": "Execution-CPU",
        "ProcessName": "Read",
        "TaskID": "AEC9EF05BE1C8125",
        "ParentEventID": [
          "78F572E5BE081C75"
        ],
        "Label": "set",
        "Title": "X-Trace Task",
        "Host": "pinky19.mpi-sws.org",
        "HRT": 26966740071097288,
        "Operation": "set",
        "Timestamp": "1557750380011.178467",
        "TenantClass": 0,
        "Source": "Client.java:1032",
        "ThreadID": 41,
        "ThreadName": "",
        "EventID": "77E05FFE14C146A1",
        "ProcessID": 2801
      },
      {
        "Cycles": 0,
        "Agent": "edu.brown.cs.systems.xtrace.logging.BaggageWrappers",
        "ProcessName": "Read",
        "TaskID": "AEC9EF05BE1C8125",
        "ParentEventID": [
          "77E05FFE14C146A1"
        ],
        "Label": "Forking current baggage with Baggage.fork()",
        "Title": "X-Trace Task",
        "Host": "pinky19.mpi-sws.org",
        "HRT": 26966740071132686,
        "Operation": "fork",
        "Timestamp": "1557750380011.213867",
        "TenantClass": 0,
        "Source": "Client.java:1043",
        "ThreadID": 41,
        "ThreadName": "",
        "EventID": "72DF44573604930E",
        "ProcessID": 2801
      },
      {
        "Cycles": 0,
        "Agent": "Execution-CPU",
        "ProcessName": "Read",
        "TaskID": "AEC9EF05BE1C8125",
        "ParentEventID": [
          "486DBB9985C856EB"
        ],
        "Label": "set",
        "Title": "X-Trace Task",
        "Host": "pinky19.mpi-sws.org",
        "HRT": 26966740071240714,
        "Operation": "set",
        "Timestamp": "1557750380011.322021",
        "TenantClass": 0,
        "Source": "Client.java:1104",
        "ThreadID": 1,
        "ThreadName": "",
        "EventID": "695C1E6F1AD78738",
        "ProcessID": 2801
      },
      {
        "Cycles": 0,
        "Agent": "Execution-CPU",
        "ProcessName": "Read",
        "TaskID": "AEC9EF05BE1C8125",
        "ParentEventID": [
          "72DF44573604930E"
        ],
        "Label": "unset",
        "Title": "X-Trace Task",
        "Host": "pinky19.mpi-sws.org",
        "Duration": "62023",
        "HRT": 26966740071194561,
        "Operation": "unset",
        "Timestamp": "1557750380011.275879",
        "TenantClass": 0,
        "Source": "Client.java:1062",
        "ThreadID": 41,
        "ThreadName": "",
        "EventID": "486DBB9985C856EB",
        "ProcessID": 2801
      },
      {
        "Cycles": 0,
        "Agent": "Execution-CPU",
        "ProcessName": "Name",
        "TaskID": "AEC9EF05BE1C8125",
        "ParentEventID": [
          "72DF44573604930E"
        ],
        "Label": "set",
        "Title": "X-Trace Task",
        "Host": "pinky19.mpi-sws.org",
        "HRT": 26966740071272640,
        "Operation": "set",
        "Timestamp": "1557750380011.539307",
        "TenantClass": 0,
        "Source": "Server.java:1840",
        "ThreadID": 48,
        "ThreadName": "",
        "EventID": "088D6C2ECAA38ABB",
        "BaggageBytes": "[[248 5] [240 0] [0 174 201 239 5 190 28 129 37] [240 1] [0 114 223 68 87 54 4 147 14] [240 3] [0 2]]",
        "ProcessID": 2171
      },
      {
        "Cycles": 0,
        "Agent": "Execution-CPU",
        "ProcessName": "Name",
        "TaskID": "AEC9EF05BE1C8125",
        "ParentEventID": [
          "8DC052D69B055082"
        ],
        "Label": "unset",
        "Title": "X-Trace Task",
        "Host": "pinky19.mpi-sws.org",
        "Duration": "28695",
        "HRT": 26966740071328223,
        "Operation": "unset",
        "Timestamp": "1557750380011.594971",
        "TenantClass": 0,
        "Source": "Server.java:1828",
        "ThreadID": 48,
        "ThreadName": "",
        "EventID": "AA4803940110AC93",
        "BaggageBytes": "[[248 5] [240 0] [0 174 201 239 5 190 28 129 37] [240 1] [0 141 192 82 214 155 5 80 130] [240 3] [0 2]]",
        "ProcessID": 2171
      },
      {
        "Cycles": 0,
        "Agent": "Execution-CPU",
        "ProcessName": "Name",
        "TaskID": "AEC9EF05BE1C8125",
        "ParentEventID": [
          "8DC052D69B055082"
        ],
        "Label": "set",
        "Title": "X-Trace Task",
        "Host": "pinky19.mpi-sws.org",
        "HRT": 26966740071360886,
        "Operation": "set",
        "Timestamp": "1557750380011.627686",
        "TenantClass": 0,
        "Source": "Server.java:2071",
        "ThreadID": 56,
        "ThreadName": "",
        "EventID": "C88B3A70128BA841",
        "BaggageBytes": "[[248 5] [240 0] [0 174 201 239 5 190 28 129 37] [240 1] [0 141 192 82 214 155 5 80 130] [240 3] [0 2]]",
        "ProcessID": 2171
      },
      {
        "Cycles": 0,
        "Agent": "edu.brown.cs.systems.xtrace.logging.BaggageWrappers",
        "ProcessName": "Name",
        "TaskID": "AEC9EF05BE1C8125",
        "ParentEventID": [
          "088D6C2ECAA38ABB"
        ],
        "Label": "Forking current baggage with Baggage.fork()",
        "Title": "X-Trace Task",
        "Host": "pinky19.mpi-sws.org",
        "HRT": 26966740071307334,
        "Operation": "fork",
        "Timestamp": "1557750380011.573975",
        "TenantClass": 0,
        "Source": "Server.java:550",
        "ThreadID": 48,
        "ThreadName": "",
        "EventID": "8DC052D69B055082",
        "BaggageBytes": "[[248 5] [240 0] [0 174 201 239 5 190 28 129 37] [240 1] [0 8 141 108 46 202 163 138 187] [240 3] [0 2]]",
        "ProcessID": 2171
      },
      {
        "Cycles": 0,
        "Agent": "org.apache.hadoop.ipc.Server",
        "ProcessName": "Name",
        "TaskID": "AEC9EF05BE1C8125",
        "ParentEventID": [
          "C88B3A70128BA841"
        ],
        "Label": "getBlockLocations in org.apache.hadoop.hdfs.protocol.ClientProtocol",
        "Title": "X-Trace Task",
        "Host": "pinky19.mpi-sws.org",
        "HRT": 26966740071400549,
        "Timestamp": "1557750380011.667236",
        "TenantClass": 0,
        "Source": "ProtobufRpcEngine.java:601",
        "ThreadID": 56,
        "ThreadName": "",
        "EventID": "74D0736E78158D11",
        "BaggageBytes": "[[248 5] [240 0] [0 174 201 239 5 190 28 129 37] [240 1] [0 200 139 58 112 18 139 168 65] [240 3] [0 2]]",
        "ProcessID": 2171
      },
      {
        "Cycles": 0,
        "Agent": "org.apache.hadoop.hdfs.server.namenode.FSNamesystem.audit",
        "ProcessName": "Name",
        "TaskID": "AEC9EF05BE1C8125",
        "ParentEventID": [
          "74D0736E78158D11"
        ],
        "Label": "allowed=true\tugi=plascas (auth:SIMPLE)\tip=/139.19.171.63\tcmd=open\tsrc=/ds/mNLaBFIfCne3UOuG\tdst=null\tperm=null\tproto=rpc",
        "Title": "X-Trace Task",
        "Host": "pinky19.mpi-sws.org",
        "HRT": 26966740071446639,
        "Timestamp": "1557750380011.713379",
        "TenantClass": 0,
        "Source": "FSNamesystem.java:8313",
        "ThreadID": 56,
        "ThreadName": "",
        "EventID": "BD751772171E69F5",
        "BaggageBytes": "[[248 5] [240 0] [0 174 201 239 5 190 28 129 37] [240 1] [0 116 208 115 110 120 21 141 17] [240 3] [0 2]]",
        "ProcessID": 2171
      },
      {
        "Cycles": 0,
        "Agent": "Execution-CPU",
        "ProcessName": "Name",
        "TaskID": "AEC9EF05BE1C8125",
        "ParentEventID": [
          "ED6C0855938CF2F5"
        ],
        "Label": "unset",
        "Title": "X-Trace Task",
        "Host": "pinky19.mpi-sws.org",
        "Duration": "206571",
        "HRT": 26966740071595564,
        "Operation": "unset",
        "Timestamp": "1557750380011.862305",
        "TenantClass": 0,
        "Source": "Server.java:1058",
        "ThreadID": 56,
        "ThreadName": "",
        "EventID": "9B19CEC947500CDF",
        "BaggageBytes": "[[248 5] [240 0] [0 174 201 239 5 190 28 129 37] [240 1] [0 237 108 8 85 147 140 242 245] [240 3] [0 2]]",
        "ProcessID": 2171
      },
      {
        "Cycles": 0,
        "Agent": "edu.brown.cs.systems.xtrace.logging.BaggageWrappers",
        "ProcessName": "Name",
        "TaskID": "AEC9EF05BE1C8125",
        "ParentEventID": [
          "BD751772171E69F5"
        ],
        "Label": "Forking current baggage with Baggage.fork()",
        "Title": "X-Trace Task",
        "Host": "pinky19.mpi-sws.org",
        "HRT": 26966740071488672,
        "Operation": "fork",
        "Timestamp": "1557750380011.755371",
        "TenantClass": 0,
        "Source": "Server.java:2398",
        "ThreadID": 56,
        "ThreadName": "",
        "EventID": "ED6C0855938CF2F5",
        "BaggageBytes": "[[248 5] [240 0] [0 174 201 239 5 190 28 129 37] [240 1] [0 189 117 23 114 23 30 105 245] [240 3] [0 2]]",
        "ProcessID": 2171
      },
      {
        "Cycles": 0,
        "Agent": "Execution-CPU",
        "ProcessName": "Read",
        "TaskID": "AEC9EF05BE1C8125",
        "ParentEventID": [
          "ED6C0855938CF2F5"
        ],
        "Label": "set",
        "Title": "X-Trace Task",
        "Host": "pinky19.mpi-sws.org",
        "HRT": 26966740071669702,
        "Operation": "set",
        "Timestamp": "1557750380011.750977",
        "TenantClass": 0,
        "Source": "Client.java:302",
        "ThreadID": 40,
        "ThreadName": "",
        "EventID": "579FCFDD86144760",
        "ProcessID": 2801
      },
      {
        "Cycles": 0,
        "Agent": "Execution-CPU",
        "ProcessName": "Read",
        "TaskID": "AEC9EF05BE1C8125",
        "ParentEventID": [
          "579FCFDD86144760"
        ],
        "Label": "unset",
        "Title": "X-Trace Task",
        "Host": "pinky19.mpi-sws.org",
        "Duration": "6169",
        "HRT": 26966740071692456,
        "Operation": "unset",
        "Timestamp": "1557750380011.773682",
        "TenantClass": 0,
        "Source": "Client.java:1168",
        "ThreadID": 40,
        "ThreadName": "",
        "EventID": "A464A0F21BC28AEF",
        "ProcessID": 2801
      },
      {
        "Cycles": 0,
        "Agent": "Execution-Sleep",
        "ProcessName": "Read",
        "TaskID": "AEC9EF05BE1C8125",
        "ParentEventID": [
          "695C1E6F1AD78738"
        ],
        "Label": "waited",
        "Title": "X-Trace Task",
        "Host": "pinky19.mpi-sws.org",
        "Duration": "480949",
        "HRT": 26966740071741571,
        "Operation": "waited",
        "Timestamp": "1557750380011.822754",
        "TenantClass": 0,
        "Source": "Client.java:1537",
        "ThreadID": 1,
        "ThreadName": "",
        "EventID": "5A0F3251CEC15CE1",
        "ProcessID": 2801
      },
      {
        "Cycles": 0,
        "Agent": "org.apache.hadoop.ipc.ProtobufRpcEngine",
        "ProcessName": "Read",
        "TaskID": "AEC9EF05BE1C8125",
        "ParentEventID": [
          "C462E7B3B7FE3651"
        ],
        "Label": "org.apache.hadoop.hdfs.protocol.ClientProtocol.getBlockLocations completed",
        "Title": "X-Trace Task",
        "Host": "pinky19.mpi-sws.org",
        "HRT": 26966740071798227,
        "Timestamp": "1557750380011.879395",
        "TenantClass": 0,
        "Source": "ProtobufRpcEngine.java:275",
        "ThreadID": 1,
        "ThreadName": "",
        "EventID": "7E51274B503297A2",
        "ProcessID": 2801
      },
      {
        "Cycles": 0,
        "Agent": "Execution-Sleep",
        "ProcessName": "Read",
        "TaskID": "AEC9EF05BE1C8125",
        "ParentEventID": [
          "7E51274B503297A2"
        ],
        "Label": "waited",
        "Title": "X-Trace Task",
        "Host": "pinky19.mpi-sws.org",
        "Duration": "109580",
        "HRT": 26966740071986790,
        "Operation": "waited",
        "Timestamp": "1557750380012.068115",
        "TenantClass": 0,
        "Source": "SocketIOWithTimeout.java:335",
        "ThreadID": 1,
        "ThreadName": "",
        "EventID": "E390CFA43D8F224D",
        "ProcessID": 2801
      },
      {
        "Cycles": 0,
        "Agent": "edu.brown.cs.systems.xtrace.logging.BaggageWrappers",
        "ProcessName": "Read",
        "TaskID": "AEC9EF05BE1C8125",
        "ParentEventID": [
          "5A0F3251CEC15CE1",
          "A464A0F21BC28AEF"
        ],
        "Label": "Merged current baggage with other baggage",
        "Title": "X-Trace Task",
        "Host": "pinky19.mpi-sws.org",
        "HRT": 26966740071762594,
        "Operation": "join",
        "Timestamp": "1557750380011.843750",
        "TenantClass": 0,
        "Source": "Client.java:1545",
        "ThreadID": 1,
        "ThreadName": "",
        "EventID": "C462E7B3B7FE3651",
        "ProcessID": 2801
      },
      {
        "Cycles": 0,
        "Agent": "edu.brown.cs.systems.xtrace.logging.BaggageWrappers",
        "ProcessName": "Read",
        "TaskID": "AEC9EF05BE1C8125",
        "ParentEventID": [
          "E390CFA43D8F224D"
        ],
        "Label": "Forking current baggage with Baggage.fork()",
        "Title": "X-Trace Task",
        "Host": "pinky19.mpi-sws.org",
        "HRT": 26966740072034258,
        "Operation": "fork",
        "Timestamp": "1557750380012.115479",
        "TenantClass": 0,
        "Source": "DataTransferProtoUtil.java:94",
        "ThreadID": 1,
        "ThreadName": "",
        "EventID": "7CD4188F9CB78EFC",
        "ProcessID": 2801
      },
      {
        "Cycles": 0,
        "Agent": "edu.brown.cs.systems.xtrace.logging.XTraceInit",
        "ProcessName": "Data",
        "TaskID": "AEC9EF05BE1C8125",
        "ParentEventID": [
          "DC664CC84439A06B"
        ],
        "Label": "Thread.setName: DataXceiver for client DFSClient_NONMAPREDUCE_310321604_1 at /139.19.171.63:56114 [Sending block BP-1633380353-139.19.171.63-1554193446451:blk_1073766678_25854]",
        "Title": "X-Trace Task",
        "Host": "pinky25.mpi-sws.org",
        "HRT": 47515845314011925,
        "Timestamp": "1557750380012.334717",
        "TenantClass": 0,
        "Source": "DataXceiver.java:168",
        "ThreadID": 14841,
        "ThreadName": "",
        "EventID": "E5F27206D16554F8",
        "BaggageBytes": "[[248 5] [240 0] [0 174 201 239 5 190 28 129 37] [240 1] [0 220 102 76 200 68 57 160 107] [240 3] [0 2]]",
        "ProcessID": 28198
      },
      {
        "Cycles": 0,
        "Agent": "Execution-CPU",
        "ProcessName": "Data",
        "TaskID": "AEC9EF05BE1C8125",
        "ParentEventID": [
          "7CD4188F9CB78EFC"
        ],
        "Label": "set",
        "Title": "X-Trace Task",
        "Host": "pinky25.mpi-sws.org",
        "HRT": 47515845313854739,
        "Operation": "set",
        "Timestamp": "1557750380012.177734",
        "TenantClass": 0,
        "Source": "Receiver.java:117",
        "ThreadID": 14841,
        "ThreadName": "",
        "EventID": "DC664CC84439A06B",
        "BaggageBytes": "[[248 5] [240 0] [0 174 201 239 5 190 28 129 37] [240 1] [0 124 212 24 143 156 183 142 252] [240 3] [0 2]]",
        "ProcessID": 28198
      },
      {
        "Cycles": 0,
        "Agent": "edu.brown.cs.systems.xtrace.logging.BaggageWrappers",
        "ProcessName": "Data",
        "TaskID": "AEC9EF05BE1C8125",
        "ParentEventID": [
          "E5F27206D16554F8"
        ],
        "Label": "Forking current baggage with Baggage.fork()",
        "Title": "X-Trace Task",
        "Host": "pinky25.mpi-sws.org",
        "HRT": 47515845314226672,
        "Operation": "fork",
        "Timestamp": "1557750380012.549561",
        "TenantClass": 0,
        "Source": "DataXceiver.java:1257",
        "ThreadID": 14841,
        "ThreadName": "",
        "EventID": "E8A1C1EAD8B04F2E",
        "BaggageBytes": "[[248 5] [240 0] [0 174 201 239 5 190 28 129 37] [240 1] [0 229 242 114 6 209 101 84 248] [240 3] [0 2]]",
        "ProcessID": 28198
      },
      {
        "Cycles": 0,
        "Agent": "Execution-Sleep",
        "ProcessName": "Read",
        "TaskID": "AEC9EF05BE1C8125",
        "ParentEventID": [
          "7CD4188F9CB78EFC"
        ],
        "Label": "waited",
        "Title": "X-Trace Task",
        "Host": "pinky19.mpi-sws.org",
        "Duration": "920209",
        "HRT": 26966740073027353,
        "Operation": "waited",
        "Timestamp": "1557750380013.108643",
        "TenantClass": 0,
        "Source": "SocketIOWithTimeout.java:335",
        "ThreadID": 1,
        "ThreadName": "",
        "EventID": "8187080B81635A9A",
        "ProcessID": 2801
      },
      {
        "Cycles": 0,
        "Agent": "edu.brown.cs.systems.xtrace.logging.BaggageWrappers",
        "ProcessName": "Data",
        "TaskID": "AEC9EF05BE1C8125",
        "ParentEventID": [
          "E8A1C1EAD8B04F2E"
        ],
        "Label": "Forking current baggage with Baggage.fork()",
        "Title": "X-Trace Task",
        "Host": "pinky25.mpi-sws.org",
        "HRT": 47515845314352617,
        "Operation": "fork",
        "Timestamp": "1557750380012.675537",
        "TenantClass": 0,
        "Source": "PacketHeader.java:95",
        "ThreadID": 14841,
        "ThreadName": "",
        "EventID": "DC01866D34497CBE",
        "BaggageBytes": "[[248 5] [240 0] [0 174 201 239 5 190 28 129 37] [240 1] [0 232 161 193 234 216 176 79 46] [240 3] [0 2]]",
        "ProcessID": 28198
      },
      {
        "Cycles": 0,
        "Agent": "edu.brown.cs.systems.xtrace.logging.BaggageWrappers",
        "ProcessName": "Read",
        "TaskID": "AEC9EF05BE1C8125",
        "ParentEventID": [
          "E8A1C1EAD8B04F2E",
          "8187080B81635A9A"
        ],
        "Label": "Merged current baggage with other baggage",
        "Title": "X-Trace Task",
        "Host": "pinky19.mpi-sws.org",
        "HRT": 26966740073082417,
        "Operation": "join",
        "Timestamp": "1557750380013.163574",
        "TenantClass": 0,
        "Source": "RemoteBlockReader2.java:429",
        "ThreadID": 1,
        "ThreadName": "",
        "EventID": "15BA523FDE93B681",
        "ProcessID": 2801
      },
      {
        "Cycles": 0,
        "Agent": "Execution-Sleep",
        "ProcessName": "Read",
        "TaskID": "AEC9EF05BE1C8125",
        "ParentEventID": [
          "15BA523FDE93B681"
        ],
        "Label": "waited",
        "Title": "X-Trace Task",
        "Host": "pinky19.mpi-sws.org",
        "Duration": "52836",
        "HRT": 26966740073173319,
        "Operation": "waited",
        "Timestamp": "1557750380013.254639",
        "TenantClass": 0,
        "Source": "SocketIOWithTimeout.java:335",
        "ThreadID": 1,
        "ThreadName": "",
        "EventID": "D2D5741608807AEB",
        "ProcessID": 2801
      },
      {
        "Cycles": 0,
        "Agent": "Execution-Sleep",
        "ProcessName": "Data",
        "TaskID": "AEC9EF05BE1C8125",
        "ParentEventID": [
          "DC01866D34497CBE"
        ],
        "Label": "waited",
        "Title": "X-Trace Task",
        "Host": "pinky25.mpi-sws.org",
        "Duration": "12360",
        "HRT": 47515845314491642,
        "Operation": "waited",
        "Timestamp": "1557750380012.814453",
        "TenantClass": 0,
        "Source": "SocketIOWithTimeout.java:335",
        "ThreadID": 14841,
        "ThreadName": "",
        "EventID": "B3834C03FA1B05B5",
        "BaggageBytes": "[[248 5] [240 0] [0 174 201 239 5 190 28 129 37] [240 1] [0 220 1 134 109 52 73 124 190] [240 3] [0 2]]",
        "ProcessID": 28198
      },
      {
        "Cycles": 0,
        "Agent": "edu.brown.cs.systems.xtrace.logging.BaggageWrappers",
        "ProcessName": "Data",
        "TaskID": "AEC9EF05BE1C8125",
        "ParentEventID": [
          "B3834C03FA1B05B5"
        ],
        "Label": "Forking current baggage with Baggage.fork()",
        "Title": "X-Trace Task",
        "Host": "pinky25.mpi-sws.org",
        "HRT": 47515845314625624,
        "Operation": "fork",
        "Timestamp": "1557750380012.948486",
        "TenantClass": 0,
        "Source": "PacketHeader.java:95",
        "ThreadID": 14841,
        "ThreadName": "",
        "EventID": "ECEE28A240B0FE0B",
        "BaggageBytes": "[[248 5] [240 0] [0 174 201 239 5 190 28 129 37] [240 1] [0 179 131 76 3 250 27 5 181] [240 3] [0 2]]",
        "ProcessID": 28198
      },
      {
        "Cycles": 0,
        "Agent": "Execution-Sleep",
        "ProcessName": "Read",
        "TaskID": "AEC9EF05BE1C8125",
        "ParentEventID": [
          "0BA929F20C8C6050"
        ],
        "Label": "waited",
        "Title": "X-Trace Task",
        "Host": "pinky19.mpi-sws.org",
        "Duration": "229021",
        "HRT": 26966740073799356,
        "Operation": "waited",
        "Timestamp": "1557750380013.880615",
        "TenantClass": 0,
        "Source": "SocketIOWithTimeout.java:335",
        "ThreadID": 1,
        "ThreadName": "",
        "EventID": "B501A09111D9EB60",
        "ProcessID": 2801
      },
      {
        "Cycles": 0,
        "Agent": "Execution-Sleep",
        "ProcessName": "Read",
        "TaskID": "AEC9EF05BE1C8125",
        "ParentEventID": [
          "D2D5741608807AEB"
        ],
        "Label": "waited",
        "Title": "X-Trace Task",
        "Host": "pinky19.mpi-sws.org",
        "Duration": "301499",
        "HRT": 26966740073527323,
        "Operation": "waited",
        "Timestamp": "1557750380013.608643",
        "TenantClass": 0,
        "Source": "SocketIOWithTimeout.java:335",
        "ThreadID": 1,
        "ThreadName": "",
        "EventID": "0BA929F20C8C6050",
        "ProcessID": 2801
      },
      {
        "Cycles": 0,
        "Agent": "Execution-Sleep",
        "ProcessName": "Read",
        "TaskID": "AEC9EF05BE1C8125",
        "ParentEventID": [
          "B501A09111D9EB60"
        ],
        "Label": "waited",
        "Title": "X-Trace Task",
        "Host": "pinky19.mpi-sws.org",
        "Duration": "145420",
        "HRT": 26966740074003567,
        "Operation": "waited",
        "Timestamp": "1557750380014.084717",
        "TenantClass": 0,
        "Source": "SocketIOWithTimeout.java:335",
        "ThreadID": 1,
        "ThreadName": "",
        "EventID": "2140F41D8CA410AB",
        "ProcessID": 2801
      },
      {
        "Cycles": 0,
        "Agent": "edu.brown.cs.systems.xtrace.logging.BaggageWrappers",
        "ProcessName": "Read",
        "TaskID": "AEC9EF05BE1C8125",
        "ParentEventID": [
          "ECEE28A240B0FE0B",
          "A9D051F50DE9F03F"
        ],
        "Label": "Merged current baggage with other baggage",
        "Title": "X-Trace Task",
        "Host": "pinky19.mpi-sws.org",
        "HRT": 26966740074173970,
        "Operation": "join",
        "Timestamp": "1557750380014.255127",
        "TenantClass": 0,
        "Source": "PacketHeader.java:168",
        "ThreadID": 1,
        "ThreadName": "",
        "EventID": "1B546BB9AFFEF6C6",
        "ProcessID": 2801
      },
      {
        "Cycles": 0,
        "Agent": "edu.brown.cs.systems.xtrace.logging.BaggageWrappers",
        "ProcessName": "Read",
        "TaskID": "AEC9EF05BE1C8125",
        "ParentEventID": [
          "1B546BB9AFFEF6C6"
        ],
        "Label": "Forking current baggage with Baggage.fork()",
        "Title": "X-Trace Task",
        "Host": "pinky19.mpi-sws.org",
        "HRT": 26966740074185409,
        "Operation": "fork",
        "Timestamp": "1557750380014.266602",
        "TenantClass": 0,
        "Source": "RemoteBlockReader2.java:361",
        "ThreadID": 1,
        "ThreadName": "",
        "EventID": "178B6EA3BB9F80E3",
        "ProcessID": 2801
      },
      {
        "Cycles": 0,
        "Agent": "edu.brown.cs.systems.xtrace.logging.BaggageWrappers",
        "ProcessName": "Read",
        "TaskID": "AEC9EF05BE1C8125",
        "ParentEventID": [
          "DC01866D34497CBE",
          "2140F41D8CA410AB"
        ],
        "Label": "Merged current baggage with other baggage",
        "Title": "X-Trace Task",
        "Host": "pinky19.mpi-sws.org",
        "HRT": 26966740074054909,
        "Operation": "join",
        "Timestamp": "1557750380014.136230",
        "TenantClass": 0,
        "Source": "PacketHeader.java:168",
        "ThreadID": 1,
        "ThreadName": "",
        "EventID": "A9D051F50DE9F03F",
        "ProcessID": 2801
      },
      {
        "Cycles": 0,
        "Agent": "edu.brown.cs.systems.xtrace.logging.BaggageWrappers",
        "ProcessName": "Read",
        "TaskID": "AEC9EF05BE1C8125",
        "ParentEventID": [
          "178B6EA3BB9F80E3"
        ],
        "Label": "Forking current baggage with Baggage.fork()",
        "Title": "X-Trace Task",
        "Host": "pinky19.mpi-sws.org",
        "HRT": 26966740074238049,
        "Operation": "fork",
        "Timestamp": "1557750380014.319336",
        "TenantClass": 0,
        "Source": "DataTransferProtoUtil.java:94",
        "ThreadID": 1,
        "ThreadName": "",
        "EventID": "823C702806559EE1",
        "ProcessID": 2801
      },
      {
        "Cycles": 0,
        "Agent": "Execution-Sleep",
        "ProcessName": "Data",
        "TaskID": "AEC9EF05BE1C8125",
        "ParentEventID": [
          "ECEE28A240B0FE0B"
        ],
        "Label": "waited",
        "Title": "X-Trace Task",
        "Host": "pinky25.mpi-sws.org",
        "Duration": "807549",
        "HRT": 47515845315578340,
        "Operation": "waited",
        "Timestamp": "1557750380013.901123",
        "TenantClass": 0,
        "Source": "SocketIOWithTimeout.java:335",
        "ThreadID": 14841,
        "ThreadName": "",
        "EventID": "B4971FB63A13EFD0",
        "BaggageBytes": "[[248 5] [240 0] [0 174 201 239 5 190 28 129 37] [240 1] [0 236 238 40 162 64 176 254 11] [240 3] [0 2]]",
        "ProcessID": 28198
      },
      {
        "Cycles": 0,
        "Agent": "edu.brown.cs.systems.xtrace.logging.BaggageWrappers",
        "ProcessName": "Data",
        "TaskID": "AEC9EF05BE1C8125",
        "ParentEventID": [
          "B4971FB63A13EFD0",
          "178B6EA3BB9F80E3"
        ],
        "Label": "Merged current baggage with other baggage",
        "Title": "X-Trace Task",
        "Host": "pinky25.mpi-sws.org",
        "HRT": 47515845315713786,
        "Operation": "join",
        "Timestamp": "1557750380014.036621",
        "TenantClass": 0,
        "Source": "DataXceiver.java:574",
        "ThreadID": 14841,
        "ThreadName": "",
        "EventID": "8DC5CEF4B4FD5FC7",
        "BaggageBytes": "[[248 5] [240 0] [0 174 201 239 5 190 28 129 37] [240 1] [0 180 151 31 182 58 19 239 208] [0 23 139 110 163 187 159 128 227] [240 3] [0 2]]",
        "ProcessID": 28198
      },
      {
        "Cycles": 0,
        "Agent": "Execution-CPU",
        "ProcessName": "Data",
        "TaskID": "AEC9EF05BE1C8125",
        "ParentEventID": [
          "8DC5CEF4B4FD5FC7"
        ],
        "Label": "unset",
        "Title": "X-Trace Task",
        "Host": "pinky25.mpi-sws.org",
        "Duration": "1803738",
        "HRT": 47515845315749179,
        "Operation": "unset",
        "Timestamp": "1557750380014.072021",
        "TenantClass": 0,
        "Source": "DataXceiver.java:261",
        "ThreadID": 14841,
        "ThreadName": "",
        "EventID": "D17B7632069BF75E",
        "BaggageBytes": "[[248 5] [240 0] [0 174 201 239 5 190 28 129 37] [240 1] [0 141 197 206 244 180 253 95 199] [240 3] [0 2]]",
        "ProcessID": 28198
      },
      {
        "Cycles": 0,
        "Agent": "edu.brown.cs.systems.xtrace.logging.XTraceInit",
        "ProcessName": "Data",
        "TaskID": "AEC9EF05BE1C8125",
        "ParentEventID": [
          "C77F5C922098CA6D"
        ],
        "Label": "Thread.setName: DataXceiver for client DFSClient_NONMAPREDUCE_310321604_1 at /139.19.171.63:56114 [Sending block BP-1633380353-139.19.171.63-1554193446451:blk_1073766678_25854]",
        "Title": "X-Trace Task",
        "Host": "pinky25.mpi-sws.org",
        "HRT": 47515845315839966,
        "Timestamp": "1557750380014.162842",
        "TenantClass": 0,
        "Source": "DataXceiver.java:168",
        "ThreadID": 14841,
        "ThreadName": "",
        "EventID": "96E49FDD00C60C24",
        "BaggageBytes": "[[248 5] [240 0] [0 174 201 239 5 190 28 129 37] [240 1] [0 199 127 92 146 32 152 202 109] [240 3] [0 2]]",
        "ProcessID": 28198
      },
      {
        "Cycles": 0,
        "Agent": "Execution-CPU",
        "ProcessName": "Data",
        "TaskID": "AEC9EF05BE1C8125",
        "ParentEventID": [
          "823C702806559EE1"
        ],
        "Label": "set",
        "Title": "X-Trace Task",
        "Host": "pinky25.mpi-sws.org",
        "HRT": 47515845315791187,
        "Operation": "set",
        "Timestamp": "1557750380014.114014",
        "TenantClass": 0,
        "Source": "Receiver.java:117",
        "ThreadID": 14841,
        "ThreadName": "",
        "EventID": "C77F5C922098CA6D",
        "BaggageBytes": "[[248 5] [240 0] [0 174 201 239 5 190 28 129 37] [240 1] [0 130 60 112 40 6 85 158 225] [240 3] [0 2]]",
        "ProcessID": 28198
      },
      {
        "Cycles": 0,
        "Agent": "edu.brown.cs.systems.xtrace.logging.BaggageWrappers",
        "ProcessName": "Data",
        "TaskID": "AEC9EF05BE1C8125",
        "ParentEventID": [
          "96E49FDD00C60C24"
        ],
        "Label": "Forking current baggage with Baggage.fork()",
        "Title": "X-Trace Task",
        "Host": "pinky25.mpi-sws.org",
        "HRT": 47515845315965043,
        "Operation": "fork",
        "Timestamp": "1557750380014.287842",
        "TenantClass": 0,
        "Source": "DataXceiver.java:1257",
        "ThreadID": 14841,
        "ThreadName": "",
        "EventID": "0FE12EBF2084C602",
        "BaggageBytes": "[[248 5] [240 0] [0 174 201 239 5 190 28 129 37] [240 1] [0 150 228 159 221 0 198 12 36] [240 3] [0 2]]",
        "ProcessID": 28198
      },
      {
        "Cycles": 0,
        "Agent": "edu.brown.cs.systems.xtrace.logging.BaggageWrappers",
        "ProcessName": "Data",
        "TaskID": "AEC9EF05BE1C8125",
        "ParentEventID": [
          "0FE12EBF2084C602"
        ],
        "Label": "Forking current baggage with Baggage.fork()",
        "Title": "X-Trace Task",
        "Host": "pinky25.mpi-sws.org",
        "HRT": 47515845316045879,
        "Operation": "fork",
        "Timestamp": "1557750380014.368896",
        "TenantClass": 0,
        "Source": "PacketHeader.java:95",
        "ThreadID": 14841,
        "ThreadName": "",
        "EventID": "F4FD1D30322E94DF",
        "BaggageBytes": "[[248 5] [240 0] [0 174 201 239 5 190 28 129 37] [240 1] [0 15 225 46 191 32 132 198 2] [240 3] [0 2]]",
        "ProcessID": 28198
      },
      {
        "Cycles": 0,
        "Agent": "Execution-Sleep",
        "ProcessName": "Read",
        "TaskID": "AEC9EF05BE1C8125",
        "ParentEventID": [
          "823C702806559EE1"
        ],
        "Label": "waited",
        "Title": "X-Trace Task",
        "Host": "pinky19.mpi-sws.org",
        "Duration": "411009",
        "HRT": 26966740074708298,
        "Operation": "waited",
        "Timestamp": "1557750380014.789551",
        "TenantClass": 0,
        "Source": "SocketIOWithTimeout.java:335",
        "ThreadID": 1,
        "ThreadName": "",
        "EventID": "5F45C971B4DE19F4",
        "ProcessID": 2801
      },
      {
        "Cycles": 0,
        "Agent": "Execution-Sleep",
        "ProcessName": "Data",
        "TaskID": "AEC9EF05BE1C8125",
        "ParentEventID": [
          "F4FD1D30322E94DF"
        ],
        "Label": "waited",
        "Title": "X-Trace Task",
        "Host": "pinky25.mpi-sws.org",
        "Duration": "5142",
        "HRT": 47515845316108427,
        "Operation": "waited",
        "Timestamp": "1557750380014.431396",
        "TenantClass": 0,
        "Source": "SocketIOWithTimeout.java:335",
        "ThreadID": 14841,
        "ThreadName": "",
        "EventID": "F3643A626F426342",
        "BaggageBytes": "[[248 5] [240 0] [0 174 201 239 5 190 28 129 37] [240 1] [0 244 253 29 48 50 46 148 223] [240 3] [0 2]]",
        "ProcessID": 28198
      },
      {
        "Cycles": 0,
        "Agent": "edu.brown.cs.systems.xtrace.logging.BaggageWrappers",
        "ProcessName": "Read",
        "TaskID": "AEC9EF05BE1C8125",
        "ParentEventID": [
          "5F45C971B4DE19F4",
          "0FE12EBF2084C602"
        ],
        "Label": "Merged current baggage with other baggage",
        "Title": "X-Trace Task",
        "Host": "pinky19.mpi-sws.org",
        "HRT": 26966740074758052,
        "Operation": "join",
        "Timestamp": "1557750380014.839355",
        "TenantClass": 0,
        "Source": "RemoteBlockReader2.java:429",
        "ThreadID": 1,
        "ThreadName": "",
        "EventID": "2B0F3D4F60183198",
        "ProcessID": 2801
      },
      {
        "Cycles": 0,
        "Agent": "Execution-Sleep",
        "ProcessName": "Read",
        "TaskID": "AEC9EF05BE1C8125",
        "ParentEventID": [
          "2B0F3D4F60183198"
        ],
        "Label": "waited",
        "Title": "X-Trace Task",
        "Host": "pinky19.mpi-sws.org",
        "Duration": "245733",
        "HRT": 26966740075094895,
        "Operation": "waited",
        "Timestamp": "1557750380015.176025",
        "TenantClass": 0,
        "Source": "SocketIOWithTimeout.java:335",
        "ThreadID": 1,
        "ThreadName": "",
        "EventID": "AA3290677EEBFED8",
        "ProcessID": 2801
      },
      {
        "Cycles": 0,
        "Agent": "edu.brown.cs.systems.xtrace.logging.BaggageWrappers",
        "ProcessName": "Data",
        "TaskID": "AEC9EF05BE1C8125",
        "ParentEventID": [
          "F3643A626F426342"
        ],
        "Label": "Forking current baggage with Baggage.fork()",
        "Title": "X-Trace Task",
        "Host": "pinky25.mpi-sws.org",
        "HRT": 47515845316189955,
        "Operation": "fork",
        "Timestamp": "1557750380014.512939",
        "TenantClass": 0,
        "Source": "PacketHeader.java:95",
        "ThreadID": 14841,
        "ThreadName": "",
        "EventID": "AE33E1DFA8505D9B",
        "BaggageBytes": "[[248 5] [240 0] [0 174 201 239 5 190 28 129 37] [240 1] [0 243 100 58 98 111 66 99 66] [240 3] [0 2]]",
        "ProcessID": 28198
      },
      {
        "Cycles": 0,
        "Agent": "Execution-Sleep",
        "ProcessName": "Data",
        "TaskID": "AEC9EF05BE1C8125",
        "ParentEventID": [
          "AE33E1DFA8505D9B"
        ],
        "Label": "waited",
        "Title": "X-Trace Task",
        "Host": "pinky25.mpi-sws.org",
        "Duration": "217736",
        "HRT": 47515845316446101,
        "Operation": "waited",
        "Timestamp": "1557750380014.769043",
        "TenantClass": 0,
        "Source": "SocketIOWithTimeout.java:335",
        "ThreadID": 14841,
        "ThreadName": "",
        "EventID": "13ECFDC65B77441C",
        "BaggageBytes": "[[248 5] [240 0] [0 174 201 239 5 190 28 129 37] [240 1] [0 174 51 225 223 168 80 93 155] [240 3] [0 2]]",
        "ProcessID": 28198
      },
      {
        "Cycles": 0,
        "Agent": "Execution-Sleep",
        "ProcessName": "Read",
        "TaskID": "AEC9EF05BE1C8125",
        "ParentEventID": [
          "AA3290677EEBFED8"
        ],
        "Label": "waited",
        "Title": "X-Trace Task",
        "Host": "pinky19.mpi-sws.org",
        "Duration": "161947",
        "HRT": 26966740075301526,
        "Operation": "waited",
        "Timestamp": "1557750380015.382812",
        "TenantClass": 0,
        "Source": "SocketIOWithTimeout.java:335",
        "ThreadID": 1,
        "ThreadName": "",
        "EventID": "34508205F5B5D479",
        "ProcessID": 2801
      },
      {
        "Cycles": 0,
        "Agent": "edu.brown.cs.systems.xtrace.logging.BaggageWrappers",
        "ProcessName": "Data",
        "TaskID": "AEC9EF05BE1C8125",
        "ParentEventID": [
          "13ECFDC65B77441C"
        ],
        "Label": "Forking current baggage with Baggage.fork()",
        "Title": "X-Trace Task",
        "Host": "pinky25.mpi-sws.org",
        "HRT": 47515845316502269,
        "Operation": "fork",
        "Timestamp": "1557750380014.825195",
        "TenantClass": 0,
        "Source": "PacketHeader.java:95",
        "ThreadID": 14841,
        "ThreadName": "",
        "EventID": "8409263E4C099745",
        "BaggageBytes": "[[248 5] [240 0] [0 174 201 239 5 190 28 129 37] [240 1] [0 19 236 253 198 91 119 68 28] [240 3] [0 2]]",
        "ProcessID": 28198
      },
      {
        "Cycles": 0,
        "Agent": "edu.brown.cs.systems.xtrace.logging.BaggageWrappers",
        "ProcessName": "Read",
        "TaskID": "AEC9EF05BE1C8125",
        "ParentEventID": [
          "F4FD1D30322E94DF",
          "243E63C2B7FE9E68"
        ],
        "Label": "Merged current baggage with other baggage",
        "Title": "X-Trace Task",
        "Host": "pinky19.mpi-sws.org",
        "HRT": 26966740075499389,
        "Operation": "join",
        "Timestamp": "1557750380015.580566",
        "TenantClass": 0,
        "Source": "PacketHeader.java:168",
        "ThreadID": 1,
        "ThreadName": "",
        "EventID": "7B21F8B8E5A0FFD7",
        "ProcessID": 2801
      },
      {
        "Cycles": 0,
        "Agent": "Execution-Sleep",
        "ProcessName": "Data",
        "TaskID": "AEC9EF05BE1C8125",
        "ParentEventID": [
          "8409263E4C099745"
        ],
        "Label": "waited",
        "Title": "X-Trace Task",
        "Host": "pinky25.mpi-sws.org",
        "Duration": "2660",
        "HRT": 47515845316545642,
        "Operation": "waited",
        "Timestamp": "1557750380014.868652",
        "TenantClass": 0,
        "Source": "SocketIOWithTimeout.java:335",
        "ThreadID": 14841,
        "ThreadName": "",
        "EventID": "5E7B4A9E46F63761",
        "BaggageBytes": "[[248 5] [240 0] [0 174 201 239 5 190 28 129 37] [240 1] [0 132 9 38 62 76 9 151 69] [240 3] [0 2]]",
        "ProcessID": 28198
      },
      {
        "Cycles": 0,
        "Agent": "edu.brown.cs.systems.xtrace.logging.BaggageWrappers",
        "ProcessName": "Data",
        "TaskID": "AEC9EF05BE1C8125",
        "ParentEventID": [
          "5E7B4A9E46F63761"
        ],
        "Label": "Forking current baggage with Baggage.fork()",
        "Title": "X-Trace Task",
        "Host": "pinky25.mpi-sws.org",
        "HRT": 47515845316595207,
        "Operation": "fork",
        "Timestamp": "1557750380014.918213",
        "TenantClass": 0,
        "Source": "PacketHeader.java:95",
        "ThreadID": 14841,
        "ThreadName": "",
        "EventID": "AB8C6ADF45B8BC7F",
        "BaggageBytes": "[[248 5] [240 0] [0 174 201 239 5 190 28 129 37] [240 1] [0 94 123 74 158 70 246 55 97] [240 3] [0 2]]",
        "ProcessID": 28198
      },
      {
        "Cycles": 0,
        "Agent": "Execution-Sleep",
        "ProcessName": "Read",
        "TaskID": "AEC9EF05BE1C8125",
        "ParentEventID": [
          "34508205F5B5D479"
        ],
        "Label": "waited",
        "Title": "X-Trace Task",
        "Host": "pinky19.mpi-sws.org",
        "Duration": "121030",
        "HRT": 26966740075463956,
        "Operation": "waited",
        "Timestamp": "1557750380015.545166",
        "TenantClass": 0,
        "Source": "SocketIOWithTimeout.java:335",
        "ThreadID": 1,
        "ThreadName": "",
        "EventID": "243E63C2B7FE9E68",
        "ProcessID": 2801
      },
      {
        "Cycles": 0,
        "Agent": "Execution-Sleep",
        "ProcessName": "Data",
        "TaskID": "AEC9EF05BE1C8125",
        "ParentEventID": [
          "AB8C6ADF45B8BC7F"
        ],
        "Label": "waited",
        "Title": "X-Trace Task",
        "Host": "pinky25.mpi-sws.org",
        "Duration": "2777",
        "HRT": 47515845316652157,
        "Operation": "waited",
        "Timestamp": "1557750380014.975098",
        "TenantClass": 0,
        "Source": "SocketIOWithTimeout.java:335",
        "ThreadID": 14841,
        "ThreadName": "",
        "EventID": "6C7E2C48B7095BB7",
        "BaggageBytes": "[[248 5] [240 0] [0 174 201 239 5 190 28 129 37] [240 1] [0 171 140 106 223 69 184 188 127] [240 3] [0 2]]",
        "ProcessID": 28198
      },
      {
        "Cycles": 0,
        "Agent": "edu.brown.cs.systems.xtrace.logging.BaggageWrappers",
        "ProcessName": "Data",
        "TaskID": "AEC9EF05BE1C8125",
        "ParentEventID": [
          "6C7E2C48B7095BB7"
        ],
        "Label": "Forking current baggage with Baggage.fork()",
        "Title": "X-Trace Task",
        "Host": "pinky25.mpi-sws.org",
        "HRT": 47515845316695803,
        "Operation": "fork",
        "Timestamp": "1557750380015.018799",
        "TenantClass": 0,
        "Source": "PacketHeader.java:95",
        "ThreadID": 14841,
        "ThreadName": "",
        "EventID": "2944927F3C826FB3",
        "BaggageBytes": "[[248 5] [240 0] [0 174 201 239 5 190 28 129 37] [240 1] [0 108 126 44 72 183 9 91 183] [240 3] [0 2]]",
        "ProcessID": 28198
      },
      {
        "Cycles": 0,
        "Agent": "edu.brown.cs.systems.xtrace.logging.BaggageWrappers",
        "ProcessName": "Data",
        "TaskID": "AEC9EF05BE1C8125",
        "ParentEventID": [
          "4C896E575A46FDD3"
        ],
        "Label": "Forking current baggage with Baggage.fork()",
        "Title": "X-Trace Task",
        "Host": "pinky25.mpi-sws.org",
        "HRT": 47515845316857378,
        "Operation": "fork",
        "Timestamp": "1557750380015.180176",
        "TenantClass": 0,
        "Source": "PacketHeader.java:95",
        "ThreadID": 14841,
        "ThreadName": "",
        "EventID": "7C653621EECEA66A",
        "BaggageBytes": "[[248 5] [240 0] [0 174 201 239 5 190 28 129 37] [240 1] [0 76 137 110 87 90 70 253 211] [240 3] [0 2]]",
        "ProcessID": 28198
      },
      {
        "Cycles": 0,
        "Agent": "Execution-Sleep",
        "ProcessName": "Data",
        "TaskID": "AEC9EF05BE1C8125",
        "ParentEventID": [
          "2944927F3C826FB3"
        ],
        "Label": "waited",
        "Title": "X-Trace Task",
        "Host": "pinky25.mpi-sws.org",
        "Duration": "72880",
        "HRT": 47515845316813033,
        "Operation": "waited",
        "Timestamp": "1557750380015.135986",
        "TenantClass": 0,
        "Source": "SocketIOWithTimeout.java:335",
        "ThreadID": 14841,
        "ThreadName": "",
        "EventID": "4C896E575A46FDD3",
        "BaggageBytes": "[[248 5] [240 0] [0 174 201 239 5 190 28 129 37] [240 1] [0 41 68 146 127 60 130 111 179] [240 3] [0 2]]",
        "ProcessID": 28198
      },
      {
        "Cycles": 0,
        "Agent": "Execution-Sleep",
        "ProcessName": "Data",
        "TaskID": "AEC9EF05BE1C8125",
        "ParentEventID": [
          "7C653621EECEA66A"
        ],
        "Label": "waited",
        "Title": "X-Trace Task",
        "Host": "pinky25.mpi-sws.org",
        "Duration": "35602",
        "HRT": 47515845316953008,
        "Operation": "waited",
        "Timestamp": "1557750380015.275879",
        "TenantClass": 0,
        "Source": "SocketIOWithTimeout.java:335",
        "ThreadID": 14841,
        "ThreadName": "",
        "EventID": "ADFE874AC719A5E6",
        "BaggageBytes": "[[248 5] [240 0] [0 174 201 239 5 190 28 129 37] [240 1] [0 124 101 54 33 238 206 166 106] [240 3] [0 2]]",
        "ProcessID": 28198
      },
      {
        "Cycles": 0,
        "Agent": "Execution-CPU",
        "ProcessName": "Data",
        "TaskID": "AEC9EF05BE1C8125",
        "ParentEventID": [
          "ADFE874AC719A5E6"
        ],
        "Label": "unset",
        "Title": "X-Trace Task",
        "Host": "pinky25.mpi-sws.org",
        "Duration": "1502257",
        "HRT": 47515845317319566,
        "Operation": "unset",
        "Timestamp": "1557750380015.642578",
        "TenantClass": 0,
        "Source": "DataXceiver.java:261",
        "ThreadID": 14841,
        "ThreadName": "",
        "EventID": "F9C2977B441CB5DE",
        "BaggageBytes": "[[248 5] [240 0] [0 174 201 239 5 190 28 129 37] [240 1] [0 173 254 135 74 199 25 165 230] [240 3] [0 2]]",
        "ProcessID": 28198
      },
      {
        "Cycles": 0,
        "Agent": "edu.brown.cs.systems.retro.benchmarks.hdfs_client.Reader",
        "ProcessName": "Read",
        "TaskID": "AEC9EF05BE1C8125",
        "ParentEventID": [
          "0"
        ],
        "Label": "Reading file",
        "Title": "X-Trace Task",
        "Host": "pinky19.mpi-sws.org",
        "HRT": 26966740070972275,
        "Timestamp": "1557750380011.053467",
        "TenantClass": 0,
        "ThreadID": 1,
        "ThreadName": "",
        "EventID": "26612A909911B560",
        "ProcessID": 2801,
        "Tag": [
          "reader_100kb",
          "Read Size: 102400"
        ]
      }
    ]
  }
]