[
  {
    "id": "6E57F016C0B0E98A",
    "reports": [
      {
        "Cycles": 0,
        "Agent": "Execution-CPU",
        "ProcessName": "Read",
        "TaskID": "6E57F016C0B0E98A",
        "ParentEventID": [
          "437CA46913AE0A0A"
        ],
        "Label": "unset",
        "Title": "X-Trace Task",
        "Host": "pinky19.mpi-sws.org",
        "Duration": "22191329",
        "HRT": 25491806214621280,
        "Operation": "unset",
        "Timestamp": "1556275446154.971680",
        "TenantClass": 0,
        "Source": "Client.java:1027",
        "ThreadID": 1,
        "ThreadName": "",
        "EventID": "C4038A64918941A5",
        "ProcessID": 21035
      },
      {
        "Cycles": 0,
        "Agent": "org.apache.hadoop.ipc.ProtobufRpcEngine",
        "ProcessName": "Read",
        "TaskID": "6E57F016C0B0E98A",
        "ParentEventID": [
          "525D33BC29D736D0"
        ],
        "Label": "Invoking org.apache.hadoop.hdfs.protocol.ClientProtocol.getBlockLocations",
        "Title": "X-Trace Task",
        "Host": "pinky19.mpi-sws.org",
        "HRT": 25491806214569832,
        "Timestamp": "1556275446154.920166",
        "TenantClass": 0,
        "Source": "ProtobufRpcEngine.java:228",
        "ThreadID": 1,
        "ThreadName": "",
        "EventID": "437CA46913AE0A0A",
        "ProcessID": 21035
      },
      {
        "Cycles": 0,
        "Agent": "edu.brown.cs.systems.retro.benchmarks.hdfs_client.Reader",
        "ProcessName": "Read",
        "TaskID": "6E57F016C0B0E98A",
        "ParentEventID": [
          "CB31ED8539F713C2"
        ],
        "Label": "Reading file",
        "Title": "X-Trace Task",
        "Host": "pinky19.mpi-sws.org",
        "HRT": 25491806214488523,
        "Timestamp": "1556275446154.838867",
        "TenantClass": 0,
        "ThreadID": 1,
        "ThreadName": "",
        "EventID": "525D33BC29D736D0",
        "ProcessID": 21035
      },
      {
        "Cycles": 0,
        "Agent": "Execution-CPU",
        "ProcessName": "Read",
        "TaskID": "6E57F016C0B0E98A",
        "ParentEventID": [
          "C4038A64918941A5"
        ],
        "Label": "set",
        "Title": "X-Trace Task",
        "Host": "pinky19.mpi-sws.org",
        "HRT": 25491806214661979,
        "Operation": "set",
        "Timestamp": "1556275446155.012451",
        "TenantClass": 0,
        "Source": "Client.java:1032",
        "ThreadID": 41,
        "ThreadName": "",
        "EventID": "AD7574509BAA8E6E",
        "ProcessID": 21035
      },
      {
        "Cycles": 0,
        "Agent": "edu.brown.cs.systems.xtrace.logging.BaggageWrappers",
        "ProcessName": "Read",
        "TaskID": "6E57F016C0B0E98A",
        "ParentEventID": [
          "AD7574509BAA8E6E"
        ],
        "Label": "Forking current baggage with Baggage.fork()",
        "Title": "X-Trace Task",
        "Host": "pinky19.mpi-sws.org",
        "HRT": 25491806214686277,
        "Operation": "fork",
        "Timestamp": "1556275446155.036621",
        "TenantClass": 0,
        "Source": "Client.java:1043",
        "ThreadID": 41,
        "ThreadName": "",
        "EventID": "DC7D1C4EA26BA726",
        "ProcessID": 21035
      },
      {
        "Cycles": 0,
        "Agent": "Execution-CPU",
        "ProcessName": "Read",
        "TaskID": "6E57F016C0B0E98A",
        "ParentEventID": [
          "3C1AA8FF5E2FB88B"
        ],
        "Label": "set",
        "Title": "X-Trace Task",
        "Host": "pinky19.mpi-sws.org",
        "HRT": 25491806214828091,
        "Operation": "set",
        "Timestamp": "1556275446155.178467",
        "TenantClass": 0,
        "Source": "Client.java:1104",
        "ThreadID": 1,
        "ThreadName": "",
        "EventID": "0C42141BF5B6B455",
        "ProcessID": 21035
      },
      {
        "Cycles": 0,
        "Agent": "Execution-CPU",
        "ProcessName": "Name",
        "TaskID": "6E57F016C0B0E98A",
        "ParentEventID": [
          "DC7D1C4EA26BA726"
        ],
        "Label": "set",
        "Title": "X-Trace Task",
        "Host": "pinky19.mpi-sws.org",
        "HRT": 25491806214919888,
        "Operation": "set",
        "Timestamp": "1556275446155.240479",
        "TenantClass": 0,
        "Source": "Server.java:1840",
        "ThreadID": 48,
        "ThreadName": "",
        "EventID": "0C3019B641C18DD7",
        "BaggageBytes": "[[248 5] [240 0] [0 110 87 240 22 192 176 233 138] [240 1] [0 220 125 28 78 162 107 167 38] [240 3] [0 2]]",
        "ProcessID": 2171
      },
      {
        "Cycles": 0,
        "Agent": "Execution-CPU",
        "ProcessName": "Read",
        "TaskID": "6E57F016C0B0E98A",
        "ParentEventID": [
          "DC7D1C4EA26BA726"
        ],
        "Label": "unset",
        "Title": "X-Trace Task",
        "Host": "pinky19.mpi-sws.org",
        "Duration": "105163",
        "HRT": 25491806214790822,
        "Operation": "unset",
        "Timestamp": "1556275446155.141113",
        "TenantClass": 0,
        "Source": "Client.java:1062",
        "ThreadID": 41,
        "ThreadName": "",
        "EventID": "3C1AA8FF5E2FB88B",
        "ProcessID": 21035
      },
      {
        "Cycles": 0,
        "Agent": "Execution-CPU",
        "ProcessName": "Name",
        "TaskID": "6E57F016C0B0E98A",
        "ParentEventID": [
          "3C8BDB76CFDCE3CD"
        ],
        "Label": "unset",
        "Title": "X-Trace Task",
        "Host": "pinky19.mpi-sws.org",
        "Duration": "26916",
        "HRT": 25491806214974119,
        "Operation": "unset",
        "Timestamp": "1556275446155.294678",
        "TenantClass": 0,
        "Source": "Server.java:1828",
        "ThreadID": 48,
        "ThreadName": "",
        "EventID": "AAC9241CBD3F1BDA",
        "BaggageBytes": "[[248 5] [240 0] [0 110 87 240 22 192 176 233 138] [240 1] [0 60 139 219 118 207 220 227 205] [240 3] [0 2]]",
        "ProcessID": 2171
      },
      {
        "Cycles": 0,
        "Agent": "Execution-CPU",
        "ProcessName": "Name",
        "TaskID": "6E57F016C0B0E98A",
        "ParentEventID": [
          "3C8BDB76CFDCE3CD"
        ],
        "Label": "set",
        "Title": "X-Trace Task",
        "Host": "pinky19.mpi-sws.org",
        "HRT": 25491806215005180,
        "Operation": "set",
        "Timestamp": "1556275446155.325684",
        "TenantClass": 0,
        "Source": "Server.java:2071",
        "ThreadID": 59,
        "ThreadName": "",
        "EventID": "4A34B0A293A48459",
        "BaggageBytes": "[[248 5] [240 0] [0 110 87 240 22 192 176 233 138] [240 1] [0 60 139 219 118 207 220 227 205] [240 3] [0 2]]",
        "ProcessID": 2171
      },
      {
        "Cycles": 0,
        "Agent": "edu.brown.cs.systems.xtrace.logging.BaggageWrappers",
        "ProcessName": "Name",
        "TaskID": "6E57F016C0B0E98A",
        "ParentEventID": [
          "0C3019B641C18DD7"
        ],
        "Label": "Forking current baggage with Baggage.fork()",
        "Title": "X-Trace Task",
        "Host": "pinky19.mpi-sws.org",
        "HRT": 25491806214950858,
        "Operation": "fork",
        "Timestamp": "1556275446155.271240",
        "TenantClass": 0,
        "Source": "Server.java:550",
        "ThreadID": 48,
        "ThreadName": "",
        "EventID": "3C8BDB76CFDCE3CD",
        "BaggageBytes": "[[248 5] [240 0] [0 110 87 240 22 192 176 233 138] [240 1] [0 12 48 25 182 65 193 141 215] [240 3] [0 2]]",
        "ProcessID": 2171
      },
      {
        "Cycles": 0,
        "Agent": "org.apache.hadoop.hdfs.server.namenode.FSNamesystem.audit",
        "ProcessName": "Name",
        "TaskID": "6E57F016C0B0E98A",
        "ParentEventID": [
          "69904E9C0B167655"
        ],
        "Label": "allowed=true\tugi=plascas (auth:SIMPLE)\tip=/139.19.171.63\tcmd=open\tsrc=/ds/gdq6GsITQVIP9Okm\tdst=null\tperm=null\tproto=rpc",
        "Title": "X-Trace Task",
        "Host": "pinky19.mpi-sws.org",
        "HRT": 25491806215097141,
        "Timestamp": "1556275446155.417725",
        "TenantClass": 0,
        "Source": "FSNamesystem.java:8313",
        "ThreadID": 59,
        "ThreadName": "",
        "EventID": "6B450102C1922548",
        "BaggageBytes": "[[248 5] [240 0] [0 110 87 240 22 192 176 233 138] [240 1] [0 105 144 78 156 11 22 118 85] [240 3] [0 2]]",
        "ProcessID": 2171
      },
      {
        "Cycles": 0,
        "Agent": "org.apache.hadoop.ipc.Server",
        "ProcessName": "Name",
        "TaskID": "6E57F016C0B0E98A",
        "ParentEventID": [
          "4A34B0A293A48459"
        ],
        "Label": "getBlockLocations in org.apache.hadoop.hdfs.protocol.ClientProtocol",
        "Title": "X-Trace Task",
        "Host": "pinky19.mpi-sws.org",
        "HRT": 25491806215047459,
        "Timestamp": "1556275446155.367920",
        "TenantClass": 0,
        "Source": "ProtobufRpcEngine.java:601",
        "ThreadID": 59,
        "ThreadName": "",
        "EventID": "69904E9C0B167655",
        "BaggageBytes": "[[248 5] [240 0] [0 110 87 240 22 192 176 233 138] [240 1] [0 74 52 176 162 147 164 132 89] [240 3] [0 2]]",
        "ProcessID": 2171
      },
      {
        "Cycles": 0,
        "Agent": "edu.brown.cs.systems.xtrace.logging.BaggageWrappers",
        "ProcessName": "Name",
        "TaskID": "6E57F016C0B0E98A",
        "ParentEventID": [
          "6B450102C1922548"
        ],
        "Label": "Forking current baggage with Baggage.fork()",
        "Title": "X-Trace Task",
        "Host": "pinky19.mpi-sws.org",
        "HRT": 25491806215150152,
        "Operation": "fork",
        "Timestamp": "1556275446155.470703",
        "TenantClass": 0,
        "Source": "Server.java:2398",
        "ThreadID": 59,
        "ThreadName": "",
        "EventID": "5D602B34D6DD17AF",
        "BaggageBytes": "[[248 5] [240 0] [0 110 87 240 22 192 176 233 138] [240 1] [0 107 69 1 2 193 146 37 72] [240 3] [0 2]]",
        "ProcessID": 2171
      },
      {
        "Cycles": 0,
        "Agent": "Execution-CPU",
        "ProcessName": "Read",
        "TaskID": "6E57F016C0B0E98A",
        "ParentEventID": [
          "5D602B34D6DD17AF"
        ],
        "Label": "set",
        "Title": "X-Trace Task",
        "Host": "pinky19.mpi-sws.org",
        "HRT": 25491806215324199,
        "Operation": "set",
        "Timestamp": "1556275446155.674561",
        "TenantClass": 0,
        "Source": "Client.java:302",
        "ThreadID": 37,
        "ThreadName": "",
        "EventID": "DE519D76452AA4B2",
        "ProcessID": 21035
      },
      {
        "Cycles": 0,
        "Agent": "Execution-CPU",
        "ProcessName": "Read",
        "TaskID": "6E57F016C0B0E98A",
        "ParentEventID": [
          "DE519D76452AA4B2"
        ],
        "Label": "unset",
        "Title": "X-Trace Task",
        "Host": "pinky19.mpi-sws.org",
        "Duration": "10021",
        "HRT": 25491806215350443,
        "Operation": "unset",
        "Timestamp": "1556275446155.700928",
        "TenantClass": 0,
        "Source": "Client.java:1168",
        "ThreadID": 37,
        "ThreadName": "",
        "EventID": "2A00751B6885B908",
        "ProcessID": 21035
      },
      {
        "Cycles": 0,
        "Agent": "Execution-CPU",
        "ProcessName": "Name",
        "TaskID": "6E57F016C0B0E98A",
        "ParentEventID": [
          "5D602B34D6DD17AF"
        ],
        "Label": "unset",
        "Title": "X-Trace Task",
        "Host": "pinky19.mpi-sws.org",
        "Duration": "227785",
        "HRT": 25491806215262066,
        "Operation": "unset",
        "Timestamp": "1556275446155.582520",
        "TenantClass": 0,
        "Source": "Server.java:1058",
        "ThreadID": 59,
        "ThreadName": "",
        "EventID": "1074300E9E8C8445",
        "BaggageBytes": "[[248 5] [240 0] [0 110 87 240 22 192 176 233 138] [240 1] [0 93 96 43 52 214 221 23 175] [240 3] [0 2]]",
        "ProcessID": 2171
      },
      {
        "Cycles": 0,
        "Agent": "Execution-Sleep",
        "ProcessName": "Read",
        "TaskID": "6E57F016C0B0E98A",
        "ParentEventID": [
          "0C42141BF5B6B455"
        ],
        "Label": "waited",
        "Title": "X-Trace Task",
        "Host": "pinky19.mpi-sws.org",
        "Duration": "506164",
        "HRT": 25491806215395401,
        "Operation": "waited",
        "Timestamp": "1556275446155.745850",
        "TenantClass": 0,
        "Source": "Client.java:1537",
        "ThreadID": 1,
        "ThreadName": "",
        "EventID": "E72445E45A7901FF",
        "ProcessID": 21035
      },
      {
        "Cycles": 0,
        "Agent": "edu.brown.cs.systems.xtrace.logging.BaggageWrappers",
        "ProcessName": "Read",
        "TaskID": "6E57F016C0B0E98A",
        "ParentEventID": [
          "2A00751B6885B908",
          "E72445E45A7901FF"
        ],
        "Label": "Merged current baggage with other baggage",
        "Title": "X-Trace Task",
        "Host": "pinky19.mpi-sws.org",
        "HRT": 25491806215430319,
        "Operation": "join",
        "Timestamp": "1556275446155.780762",
        "TenantClass": 0,
        "Source": "Client.java:1545",
        "ThreadID": 1,
        "ThreadName": "",
        "EventID": "E0BC91CBE3D41624",
        "ProcessID": 21035
      },
      {
        "Cycles": 0,
        "Agent": "edu.brown.cs.systems.xtrace.logging.BaggageWrappers",
        "ProcessName": "Read",
        "TaskID": "6E57F016C0B0E98A",
        "ParentEventID": [
          "BF32F3BA94C1EDAA"
        ],
        "Label": "Forking current baggage with Baggage.fork()",
        "Title": "X-Trace Task",
        "Host": "pinky19.mpi-sws.org",
        "HRT": 25491806215626961,
        "Operation": "fork",
        "Timestamp": "1556275446155.977295",
        "TenantClass": 0,
        "Source": "DataTransferProtoUtil.java:94",
        "ThreadID": 1,
        "ThreadName": "",
        "EventID": "C6A3E6A229807B0B",
        "ProcessID": 21035
      },
      {
        "Cycles": 0,
        "Agent": "org.apache.hadoop.ipc.ProtobufRpcEngine",
        "ProcessName": "Read",
        "TaskID": "6E57F016C0B0E98A",
        "ParentEventID": [
          "E0BC91CBE3D41624"
        ],
        "Label": "org.apache.hadoop.hdfs.protocol.ClientProtocol.getBlockLocations completed",
        "Title": "X-Trace Task",
        "Host": "pinky19.mpi-sws.org",
        "HRT": 25491806215519883,
        "Timestamp": "1556275446155.870361",
        "TenantClass": 0,
        "Source": "ProtobufRpcEngine.java:275",
        "ThreadID": 1,
        "ThreadName": "",
        "EventID": "BF32F3BA94C1EDAA",
        "ProcessID": 21035
      },
      {
        "Cycles": 0,
        "Agent": "Execution-CPU",
        "ProcessName": "Data",
        "TaskID": "6E57F016C0B0E98A",
        "ParentEventID": [
          "C6A3E6A229807B0B"
        ],
        "Label": "set",
        "Title": "X-Trace Task",
        "Host": "pinky22.mpi-sws.org",
        "HRT": 46041778470874148,
        "Operation": "set",
        "Timestamp": "1556275446156.255127",
        "TenantClass": 0,
        "Source": "Receiver.java:117",
        "ThreadID": 5996,
        "ThreadName": "",
        "EventID": "1B9FE4070F2F2D64",
        "BaggageBytes": "[[248 5] [240 0] [0 110 87 240 22 192 176 233 138] [240 1] [0 198 163 230 162 41 128 123 11] [240 3] [0 2]]",
        "ProcessID": 28841
      },
      {
        "Cycles": 0,
        "Agent": "edu.brown.cs.systems.xtrace.logging.XTraceInit",
        "ProcessName": "Data",
        "TaskID": "6E57F016C0B0E98A",
        "ParentEventID": [
          "1B9FE4070F2F2D64"
        ],
        "Label": "Thread.setName: DataXceiver for client DFSClient_NONMAPREDUCE_1377588049_1 at /139.19.171.63:38298 [Sending block BP-1633380353-139.19.171.63-1554193446451:blk_1073759699_18875]",
        "Title": "X-Trace Task",
        "Host": "pinky22.mpi-sws.org",
        "HRT": 46041778470963212,
        "Timestamp": "1556275446156.343994",
        "TenantClass": 0,
        "Source": "DataXceiver.java:168",
        "ThreadID": 5996,
        "ThreadName": "",
        "EventID": "1772D6BCD7023291",
        "BaggageBytes": "[[248 5] [240 0] [0 110 87 240 22 192 176 233 138] [240 1] [0 27 159 228 7 15 47 45 100] [240 3] [0 2]]",
        "ProcessID": 28841
      },
      {
        "Cycles": 0,
        "Agent": "edu.brown.cs.systems.xtrace.logging.BaggageWrappers",
        "ProcessName": "Data",
        "TaskID": "6E57F016C0B0E98A",
        "ParentEventID": [
          "1772D6BCD7023291"
        ],
        "Label": "Forking current baggage with Baggage.fork()",
        "Title": "X-Trace Task",
        "Host": "pinky22.mpi-sws.org",
        "HRT": 46041778471141432,
        "Operation": "fork",
        "Timestamp": "1556275446156.522217",
        "TenantClass": 0,
        "Source": "DataXceiver.java:1257",
        "ThreadID": 5996,
        "ThreadName": "",
        "EventID": "5349E82CAA109897",
        "BaggageBytes": "[[248 5] [240 0] [0 110 87 240 22 192 176 233 138] [240 1] [0 23 114 214 188 215 2 50 145] [240 3] [0 2]]",
        "ProcessID": 28841
      },
      {
        "Cycles": 0,
        "Agent": "Execution-Sleep",
        "ProcessName": "Read",
        "TaskID": "6E57F016C0B0E98A",
        "ParentEventID": [
          "C6A3E6A229807B0B"
        ],
        "Label": "waited",
        "Title": "X-Trace Task",
        "Host": "pinky19.mpi-sws.org",
        "Duration": "632476",
        "HRT": 25491806216349571,
        "Operation": "waited",
        "Timestamp": "1556275446156.699951",
        "TenantClass": 0,
        "Source": "SocketIOWithTimeout.java:335",
        "ThreadID": 1,
        "ThreadName": "",
        "EventID": "573BB81FA9B0AF9C",
        "ProcessID": 21035
      },
      {
        "Cycles": 0,
        "Agent": "edu.brown.cs.systems.xtrace.logging.BaggageWrappers",
        "ProcessName": "Data",
        "TaskID": "6E57F016C0B0E98A",
        "ParentEventID": [
          "5349E82CAA109897"
        ],
        "Label": "Forking current baggage with Baggage.fork()",
        "Title": "X-Trace Task",
        "Host": "pinky22.mpi-sws.org",
        "HRT": 46041778471295001,
        "Operation": "fork",
        "Timestamp": "1556275446156.675781",
        "TenantClass": 0,
        "Source": "PacketHeader.java:95",
        "ThreadID": 5996,
        "ThreadName": "",
        "EventID": "79414CF1B10473BD",
        "BaggageBytes": "[[248 5] [240 0] [0 110 87 240 22 192 176 233 138] [240 1] [0 83 73 232 44 170 16 152 151] [240 3] [0 2]]",
        "ProcessID": 28841
      },
      {
        "Cycles": 0,
        "Agent": "edu.brown.cs.systems.xtrace.logging.BaggageWrappers",
        "ProcessName": "Read",
        "TaskID": "6E57F016C0B0E98A",
        "ParentEventID": [
          "573BB81FA9B0AF9C",
          "5349E82CAA109897"
        ],
        "Label": "Merged current baggage with other baggage",
        "Title": "X-Trace Task",
        "Host": "pinky19.mpi-sws.org",
        "HRT": 25491806216446327,
        "Operation": "join",
        "Timestamp": "1556275446156.796631",
        "TenantClass": 0,
        "Source": "RemoteBlockReader2.java:429",
        "ThreadID": 1,
        "ThreadName": "",
        "EventID": "D5EC5D0A21420652",
        "ProcessID": 21035
      },
      {
        "Cycles": 0,
        "Agent": "Execution-Sleep",
        "ProcessName": "Data",
        "TaskID": "6E57F016C0B0E98A",
        "ParentEventID": [
          "79414CF1B10473BD"
        ],
        "Label": "waited",
        "Title": "X-Trace Task",
        "Host": "pinky22.mpi-sws.org",
        "Duration": "8015",
        "HRT": 46041778471421141,
        "Operation": "waited",
        "Timestamp": "1556275446156.802002",
        "TenantClass": 0,
        "Source": "SocketIOWithTimeout.java:335",
        "ThreadID": 5996,
        "ThreadName": "",
        "EventID": "B624A21DD3C003AB",
        "BaggageBytes": "[[248 5] [240 0] [0 110 87 240 22 192 176 233 138] [240 1] [0 121 65 76 241 177 4 115 189] [240 3] [0 2]]",
        "ProcessID": 28841
      },
      {
        "Cycles": 0,
        "Agent": "edu.brown.cs.systems.xtrace.logging.BaggageWrappers",
        "ProcessName": "Data",
        "TaskID": "6E57F016C0B0E98A",
        "ParentEventID": [
          "B624A21DD3C003AB"
        ],
        "Label": "Forking current baggage with Baggage.fork()",
        "Title": "X-Trace Task",
        "Host": "pinky22.mpi-sws.org",
        "HRT": 46041778471554473,
        "Operation": "fork",
        "Timestamp": "1556275446156.935303",
        "TenantClass": 0,
        "Source": "PacketHeader.java:95",
        "ThreadID": 5996,
        "ThreadName": "",
        "EventID": "BBFF61E2985CABF4",
        "BaggageBytes": "[[248 5] [240 0] [0 110 87 240 22 192 176 233 138] [240 1] [0 182 36 162 29 211 192 3 171] [240 3] [0 2]]",
        "ProcessID": 28841
      },
      {
        "Cycles": 0,
        "Agent": "Execution-Sleep",
        "ProcessName": "Read",
        "TaskID": "6E57F016C0B0E98A",
        "ParentEventID": [
          "D5EC5D0A21420652"
        ],
        "Label": "waited",
        "Title": "X-Trace Task",
        "Host": "pinky19.mpi-sws.org",
        "Duration": "89854",
        "HRT": 25491806216621383,
        "Operation": "waited",
        "Timestamp": "1556275446156.971680",
        "TenantClass": 0,
        "Source": "SocketIOWithTimeout.java:335",
        "ThreadID": 1,
        "ThreadName": "",
        "EventID": "65CB088905462C45",
        "ProcessID": 21035
      },
      {
        "Cycles": 0,
        "Agent": "edu.brown.cs.systems.xtrace.logging.BaggageWrappers",
        "ProcessName": "Read",
        "TaskID": "6E57F016C0B0E98A",
        "ParentEventID": [
          "65CB088905462C45",
          "79414CF1B10473BD"
        ],
        "Label": "Merged current baggage with other baggage",
        "Title": "X-Trace Task",
        "Host": "pinky19.mpi-sws.org",
        "HRT": 25491806216680222,
        "Operation": "join",
        "Timestamp": "1556275446157.030518",
        "TenantClass": 0,
        "Source": "PacketHeader.java:168",
        "ThreadID": 1,
        "ThreadName": "",
        "EventID": "AE363AAC37023DB7",
        "ProcessID": 21035
      },
      {
        "Cycles": 0,
        "Agent": "edu.brown.cs.systems.xtrace.logging.BaggageWrappers",
        "ProcessName": "Read",
        "TaskID": "6E57F016C0B0E98A",
        "ParentEventID": [
          "953F899F8BEF1FAC"
        ],
        "Label": "Forking current baggage with Baggage.fork()",
        "Title": "X-Trace Task",
        "Host": "pinky19.mpi-sws.org",
        "HRT": 25491806216759660,
        "Operation": "fork",
        "Timestamp": "1556275446157.110107",
        "TenantClass": 0,
        "Source": "RemoteBlockReader2.java:361",
        "ThreadID": 1,
        "ThreadName": "",
        "EventID": "FF8740F00BCA1152",
        "ProcessID": 21035
      },
      {
        "Cycles": 0,
        "Agent": "Execution-Sleep",
        "ProcessName": "Data",
        "TaskID": "6E57F016C0B0E98A",
        "ParentEventID": [
          "BBFF61E2985CABF4"
        ],
        "Label": "waited",
        "Title": "X-Trace Task",
        "Host": "pinky22.mpi-sws.org",
        "Duration": "69917",
        "HRT": 46041778471788211,
        "Operation": "waited",
        "Timestamp": "1556275446157.169189",
        "TenantClass": 0,
        "Source": "SocketIOWithTimeout.java:335",
        "ThreadID": 5996,
        "ThreadName": "",
        "EventID": "B2479BDFC4A02AC0",
        "BaggageBytes": "[[248 5] [240 0] [0 110 87 240 22 192 176 233 138] [240 1] [0 187 255 97 226 152 92 171 244] [240 3] [0 2]]",
        "ProcessID": 28841
      },
      {
        "Cycles": 0,
        "Agent": "edu.brown.cs.systems.xtrace.logging.BaggageWrappers",
        "ProcessName": "Read",
        "TaskID": "6E57F016C0B0E98A",
        "ParentEventID": [
          "BBFF61E2985CABF4",
          "AE363AAC37023DB7"
        ],
        "Label": "Merged current baggage with other baggage",
        "Title": "X-Trace Task",
        "Host": "pinky19.mpi-sws.org",
        "HRT": 25491806216745852,
        "Operation": "join",
        "Timestamp": "1556275446157.096191",
        "TenantClass": 0,
        "Source": "PacketHeader.java:168",
        "ThreadID": 1,
        "ThreadName": "",
        "EventID": "953F899F8BEF1FAC",
        "ProcessID": 21035
      },
      {
        "Cycles": 0,
        "Agent": "edu.brown.cs.systems.xtrace.logging.BaggageWrappers",
        "ProcessName": "Data",
        "TaskID": "6E57F016C0B0E98A",
        "ParentEventID": [
          "FF8740F00BCA1152",
          "B2479BDFC4A02AC0"
        ],
        "Label": "Merged current baggage with other baggage",
        "Title": "X-Trace Task",
        "Host": "pinky22.mpi-sws.org",
        "HRT": 46041778471890329,
        "Operation": "join",
        "Timestamp": "1556275446157.271240",
        "TenantClass": 0,
        "Source": "DataXceiver.java:574",
        "ThreadID": 5996,
        "ThreadName": "",
        "EventID": "8E52612AB23EBEA5",
        "BaggageBytes": "[[248 5] [240 0] [0 110 87 240 22 192 176 233 138] [240 1] [0 178 71 155 223 196 160 42 192] [0 255 135 64 240 11 202 17 82] [240 3] [0 2]]",
        "ProcessID": 28841
      },
      {
        "Cycles": 0,
        "Agent": "Execution-CPU",
        "ProcessName": "Data",
        "TaskID": "6E57F016C0B0E98A",
        "ParentEventID": [
          "8E52612AB23EBEA5"
        ],
        "Label": "unset",
        "Title": "X-Trace Task",
        "Host": "pinky22.mpi-sws.org",
        "Duration": "1014180",
        "HRT": 46041778471952085,
        "Operation": "unset",
        "Timestamp": "1556275446157.333008",
        "TenantClass": 0,
        "Source": "DataXceiver.java:261",
        "ThreadID": 5996,
        "ThreadName": "",
        "EventID": "2F6874804F6327F8",
        "BaggageBytes": "[[248 5] [240 0] [0 110 87 240 22 192 176 233 138] [240 1] [0 142 82 97 42 178 62 190 165] [240 3] [0 2]]",
        "ProcessID": 28841
      },
      {
        "Cycles": 0,
        "Agent": "edu.brown.cs.systems.retro.benchmarks.hdfs_client.Reader",
        "ProcessName": "Read",
        "TaskID": "6E57F016C0B0E98A",
        "ParentEventID": [
          "0"
        ],
        "Label": "Reading file",
        "Title": "X-Trace Task",
        "Host": "pinky19.mpi-sws.org",
        "HRT": 25491806214379067,
        "Timestamp": "1556275446154.729492",
        "TenantClass": 0,
        "ThreadID": 1,
        "ThreadName": "",
        "EventID": "CB31ED8539F713C2",
        "ProcessID": 21035,
        "Tag": [
          "reader_1kb",
          "Read Size: 1024"
        ]
      }
    ]
  }
]