[
  {
    "id": "A633A3CEF2885145",
    "reports": [
      {
        "Cycles": 0,
        "Agent": "Execution-CPU",
        "ProcessName": "Read",
        "TaskID": "A633A3CEF2885145",
        "ParentEventID": [
          "7FE72E8BAB748F6C"
        ],
        "Label": "unset",
        "Title": "X-Trace Task",
        "Host": "pinky19.mpi-sws.org",
        "Duration": "22346558",
        "HRT": 26966622172777974,
        "Operation": "unset",
        "Timestamp": "1557750262112.954590",
        "TenantClass": 0,
        "Source": "Client.java:1027",
        "ThreadID": 1,
        "ThreadName": "",
        "EventID": "D0A8CB0E31F6413C",
        "ProcessID": 2801
      },
      {
        "Cycles": 0,
        "Agent": "edu.brown.cs.systems.retro.benchmarks.hdfs_client.Reader",
        "ProcessName": "Read",
        "TaskID": "A633A3CEF2885145",
        "ParentEventID": [
          "0"
        ],
        "Label": "Reading file",
        "Title": "X-Trace Task",
        "Host": "pinky19.mpi-sws.org",
        "HRT": 26966622172695815,
        "Timestamp": "1557750262112.872559",
        "TenantClass": 0,
        "ThreadID": 1,
        "ThreadName": "",
        "EventID": "D1683753EB3E1CF3",
        "ProcessID": 2801,
        "Tag": [
          "reader_100kb",
          "Read Size: 102400"
        ]
      },
      {
        "Cycles": 0,
        "Agent": "org.apache.hadoop.ipc.ProtobufRpcEngine",
        "ProcessName": "Read",
        "TaskID": "A633A3CEF2885145",
        "ParentEventID": [
          "A9D8326AF177A98B"
        ],
        "Label": "Invoking org.apache.hadoop.hdfs.protocol.ClientProtocol.getBlockLocations",
        "Title": "X-Trace Task",
        "Host": "pinky19.mpi-sws.org",
        "HRT": 26966622172751046,
        "Timestamp": "1557750262112.927734",
        "TenantClass": 0,
        "Source": "ProtobufRpcEngine.java:228",
        "ThreadID": 1,
        "ThreadName": "",
        "EventID": "7FE72E8BAB748F6C",
        "ProcessID": 2801
      },
      {
        "Cycles": 0,
        "Agent": "edu.brown.cs.systems.retro.benchmarks.hdfs_client.Reader",
        "ProcessName": "Read",
        "TaskID": "A633A3CEF2885145",
        "ParentEventID": [
          "D1683753EB3E1CF3"
        ],
        "Label": "Reading file",
        "Title": "X-Trace Task",
        "Host": "pinky19.mpi-sws.org",
        "HRT": 26966622172713718,
        "Timestamp": "1557750262112.890381",
        "TenantClass": 0,
        "ThreadID": 1,
        "ThreadName": "",
        "EventID": "A9D8326AF177A98B",
        "ProcessID": 2801
      },
      {
        "Cycles": 0,
        "Agent": "edu.brown.cs.systems.xtrace.logging.BaggageWrappers",
        "ProcessName": "Read",
        "TaskID": "A633A3CEF2885145",
        "ParentEventID": [
          "B2EF26AB043AF141"
        ],
        "Label": "Forking current baggage with Baggage.fork()",
        "Title": "X-Trace Task",
        "Host": "pinky19.mpi-sws.org",
        "HRT": 26966622172819973,
        "Operation": "fork",
        "Timestamp": "1557750262112.996582",
        "TenantClass": 0,
        "Source": "Client.java:1043",
        "ThreadID": 41,
        "ThreadName": "",
        "EventID": "7B16193592C71E2C",
        "ProcessID": 2801
      },
      {
        "Cycles": 0,
        "Agent": "Execution-CPU",
        "ProcessName": "Read",
        "TaskID": "A633A3CEF2885145",
        "ParentEventID": [
          "D0A8CB0E31F6413C"
        ],
        "Label": "set",
        "Title": "X-Trace Task",
        "Host": "pinky19.mpi-sws.org",
        "HRT": 26966622172806899,
        "Operation": "set",
        "Timestamp": "1557750262112.983643",
        "TenantClass": 0,
        "Source": "Client.java:1032",
        "ThreadID": 41,
        "ThreadName": "",
        "EventID": "B2EF26AB043AF141",
        "ProcessID": 2801
      },
      {
        "Cycles": 0,
        "Agent": "Execution-CPU",
        "ProcessName": "Read",
        "TaskID": "A633A3CEF2885145",
        "ParentEventID": [
          "7B16193592C71E2C"
        ],
        "Label": "unset",
        "Title": "X-Trace Task",
        "Host": "pinky19.mpi-sws.org",
        "Duration": "69020",
        "HRT": 26966622172888531,
        "Operation": "unset",
        "Timestamp": "1557750262113.065186",
        "TenantClass": 0,
        "Source": "Client.java:1062",
        "ThreadID": 41,
        "ThreadName": "",
        "EventID": "151AD81EC75C60E7",
        "ProcessID": 2801
      },
      {
        "Cycles": 0,
        "Agent": "Execution-CPU",
        "ProcessName": "Name",
        "TaskID": "A633A3CEF2885145",
        "ParentEventID": [
          "7B16193592C71E2C"
        ],
        "Label": "set",
        "Title": "X-Trace Task",
        "Host": "pinky19.mpi-sws.org",
        "HRT": 26966622172952488,
        "Operation": "set",
        "Timestamp": "1557750262112.996582",
        "TenantClass": 0,
        "Source": "Server.java:1840",
        "ThreadID": 48,
        "ThreadName": "",
        "EventID": "ECAFFA7B2C2D4225",
        "BaggageBytes": "[[248 5] [240 0] [0 166 51 163 206 242 136 81 69] [240 1] [0 123 22 25 53 146 199 30 44] [240 3] [0 2]]",
        "ProcessID": 2171
      },
      {
        "Cycles": 0,
        "Agent": "edu.brown.cs.systems.xtrace.logging.BaggageWrappers",
        "ProcessName": "Name",
        "TaskID": "A633A3CEF2885145",
        "ParentEventID": [
          "ECAFFA7B2C2D4225"
        ],
        "Label": "Forking current baggage with Baggage.fork()",
        "Title": "X-Trace Task",
        "Host": "pinky19.mpi-sws.org",
        "HRT": 26966622172987157,
        "Operation": "fork",
        "Timestamp": "1557750262113.031250",
        "TenantClass": 0,
        "Source": "Server.java:550",
        "ThreadID": 48,
        "ThreadName": "",
        "EventID": "D12D7CFB9BF48ED8",
        "BaggageBytes": "[[248 5] [240 0] [0 166 51 163 206 242 136 81 69] [240 1] [0 236 175 250 123 44 45 66 37] [240 3] [0 2]]",
        "ProcessID": 2171
      },
      {
        "Cycles": 0,
        "Agent": "Execution-CPU",
        "ProcessName": "Name",
        "TaskID": "A633A3CEF2885145",
        "ParentEventID": [
          "D12D7CFB9BF48ED8"
        ],
        "Label": "unset",
        "Title": "X-Trace Task",
        "Host": "pinky19.mpi-sws.org",
        "Duration": "32846",
        "HRT": 26966622173014449,
        "Operation": "unset",
        "Timestamp": "1557750262113.058594",
        "TenantClass": 0,
        "Source": "Server.java:1828",
        "ThreadID": 48,
        "ThreadName": "",
        "EventID": "9FE14C051FE6CD68",
        "BaggageBytes": "[[248 5] [240 0] [0 166 51 163 206 242 136 81 69] [240 1] [0 209 45 124 251 155 244 142 216] [240 3] [0 2]]",
        "ProcessID": 2171
      },
      {
        "Cycles": 0,
        "Agent": "Execution-CPU",
        "ProcessName": "Read",
        "TaskID": "A633A3CEF2885145",
        "ParentEventID": [
          "151AD81EC75C60E7"
        ],
        "Label": "set",
        "Title": "X-Trace Task",
        "Host": "pinky19.mpi-sws.org",
        "HRT": 26966622172911369,
        "Operation": "set",
        "Timestamp": "1557750262113.088135",
        "TenantClass": 0,
        "Source": "Client.java:1104",
        "ThreadID": 1,
        "ThreadName": "",
        "EventID": "229794AC6BE9C424",
        "ProcessID": 2801
      },
      {
        "Cycles": 0,
        "Agent": "Execution-CPU",
        "ProcessName": "Name",
        "TaskID": "A633A3CEF2885145",
        "ParentEventID": [
          "D12D7CFB9BF48ED8"
        ],
        "Label": "set",
        "Title": "X-Trace Task",
        "Host": "pinky19.mpi-sws.org",
        "HRT": 26966622173043560,
        "Operation": "set",
        "Timestamp": "1557750262113.087646",
        "TenantClass": 0,
        "Source": "Server.java:2071",
        "ThreadID": 60,
        "ThreadName": "",
        "EventID": "955A64FB9446BE7D",
        "BaggageBytes": "[[248 5] [240 0] [0 166 51 163 206 242 136 81 69] [240 1] [0 209 45 124 251 155 244 142 216] [240 3] [0 2]]",
        "ProcessID": 2171
      },
      {
        "Cycles": 0,
        "Agent": "org.apache.hadoop.hdfs.server.namenode.FSNamesystem.audit",
        "ProcessName": "Name",
        "TaskID": "A633A3CEF2885145",
        "ParentEventID": [
          "050D990BC4CA25B7"
        ],
        "Label": "allowed=true\tugi=plascas (auth:SIMPLE)\tip=/139.19.171.63\tcmd=open\tsrc=/ds/QIbTtGcjLv4OSsaZ\tdst=null\tperm=null\tproto=rpc",
        "Title": "X-Trace Task",
        "Host": "pinky19.mpi-sws.org",
        "HRT": 26966622173134697,
        "Timestamp": "1557750262113.178711",
        "TenantClass": 0,
        "Source": "FSNamesystem.java:8313",
        "ThreadID": 60,
        "ThreadName": "",
        "EventID": "88FAEBCC5314308A",
        "BaggageBytes": "[[248 5] [240 0] [0 166 51 163 206 242 136 81 69] [240 1] [0 5 13 153 11 196 202 37 183] [240 3] [0 2]]",
        "ProcessID": 2171
      },
      {
        "Cycles": 0,
        "Agent": "edu.brown.cs.systems.xtrace.logging.BaggageWrappers",
        "ProcessName": "Name",
        "TaskID": "A633A3CEF2885145",
        "ParentEventID": [
          "88FAEBCC5314308A"
        ],
        "Label": "Forking current baggage with Baggage.fork()",
        "Title": "X-Trace Task",
        "Host": "pinky19.mpi-sws.org",
        "HRT": 26966622173179977,
        "Operation": "fork",
        "Timestamp": "1557750262113.224121",
        "TenantClass": 0,
        "Source": "Server.java:2398",
        "ThreadID": 60,
        "ThreadName": "",
        "EventID": "51CF8A1A145A4A35",
        "BaggageBytes": "[[248 5] [240 0] [0 166 51 163 206 242 136 81 69] [240 1] [0 136 250 235 204 83 20 48 138] [240 3] [0 2]]",
        "ProcessID": 2171
      },
      {
        "Cycles": 0,
        "Agent": "Execution-CPU",
        "ProcessName": "Name",
        "TaskID": "A633A3CEF2885145",
        "ParentEventID": [
          "51CF8A1A145A4A35"
        ],
        "Label": "unset",
        "Title": "X-Trace Task",
        "Host": "pinky19.mpi-sws.org",
        "Duration": "215391",
        "HRT": 26966622173287678,
        "Operation": "unset",
        "Timestamp": "1557750262113.331787",
        "TenantClass": 0,
        "Source": "Server.java:1058",
        "ThreadID": 60,
        "ThreadName": "",
        "EventID": "177510FBA3927F4B",
        "BaggageBytes": "[[248 5] [240 0] [0 166 51 163 206 242 136 81 69] [240 1] [0 81 207 138 26 20 90 74 53] [240 3] [0 2]]",
        "ProcessID": 2171
      },
      {
        "Cycles": 0,
        "Agent": "Execution-CPU",
        "ProcessName": "Read",
        "TaskID": "A633A3CEF2885145",
        "ParentEventID": [
          "51CF8A1A145A4A35"
        ],
        "Label": "set",
        "Title": "X-Trace Task",
        "Host": "pinky19.mpi-sws.org",
        "HRT": 26966622173355009,
        "Operation": "set",
        "Timestamp": "1557750262113.531738",
        "TenantClass": 0,
        "Source": "Client.java:302",
        "ThreadID": 40,
        "ThreadName": "",
        "EventID": "1261C11CF3174FBA",
        "ProcessID": 2801
      },
      {
        "Cycles": 0,
        "Agent": "org.apache.hadoop.ipc.Server",
        "ProcessName": "Name",
        "TaskID": "A633A3CEF2885145",
        "ParentEventID": [
          "955A64FB9446BE7D"
        ],
        "Label": "getBlockLocations in org.apache.hadoop.hdfs.protocol.ClientProtocol",
        "Title": "X-Trace Task",
        "Host": "pinky19.mpi-sws.org",
        "HRT": 26966622173085997,
        "Timestamp": "1557750262113.130127",
        "TenantClass": 0,
        "Source": "ProtobufRpcEngine.java:601",
        "ThreadID": 60,
        "ThreadName": "",
        "EventID": "050D990BC4CA25B7",
        "BaggageBytes": "[[248 5] [240 0] [0 166 51 163 206 242 136 81 69] [240 1] [0 149 90 100 251 148 70 190 125] [240 3] [0 2]]",
        "ProcessID": 2171
      },
      {
        "Cycles": 0,
        "Agent": "Execution-CPU",
        "ProcessName": "Read",
        "TaskID": "A633A3CEF2885145",
        "ParentEventID": [
          "1261C11CF3174FBA"
        ],
        "Label": "unset",
        "Title": "X-Trace Task",
        "Host": "pinky19.mpi-sws.org",
        "Duration": "20374",
        "HRT": 26966622173390815,
        "Operation": "unset",
        "Timestamp": "1557750262113.567383",
        "TenantClass": 0,
        "Source": "Client.java:1168",
        "ThreadID": 40,
        "ThreadName": "",
        "EventID": "BEC39209EA5FD519",
        "ProcessID": 2801
      },
      {
        "Cycles": 0,
        "Agent": "edu.brown.cs.systems.xtrace.logging.BaggageWrappers",
        "ProcessName": "Read",
        "TaskID": "A633A3CEF2885145",
        "ParentEventID": [
          "BEC39209EA5FD519",
          "411C13C2B1EE3F56"
        ],
        "Label": "Merged current baggage with other baggage",
        "Title": "X-Trace Task",
        "Host": "pinky19.mpi-sws.org",
        "HRT": 26966622173430465,
        "Operation": "join",
        "Timestamp": "1557750262113.607178",
        "TenantClass": 0,
        "Source": "Client.java:1545",
        "ThreadID": 1,
        "ThreadName": "",
        "EventID": "9CB9577C33B000A1",
        "ProcessID": 2801
      },
      {
        "Cycles": 0,
        "Agent": "org.apache.hadoop.ipc.ProtobufRpcEngine",
        "ProcessName": "Read",
        "TaskID": "A633A3CEF2885145",
        "ParentEventID": [
          "9CB9577C33B000A1"
        ],
        "Label": "org.apache.hadoop.hdfs.protocol.ClientProtocol.getBlockLocations completed",
        "Title": "X-Trace Task",
        "Host": "pinky19.mpi-sws.org",
        "HRT": 26966622173492559,
        "Timestamp": "1557750262113.669189",
        "TenantClass": 0,
        "Source": "ProtobufRpcEngine.java:275",
        "ThreadID": 1,
        "ThreadName": "",
        "EventID": "7AD4E28064368025",
        "ProcessID": 2801
      },
      {
        "Cycles": 0,
        "Agent": "Execution-Sleep",
        "ProcessName": "Read",
        "TaskID": "A633A3CEF2885145",
        "ParentEventID": [
          "229794AC6BE9C424"
        ],
        "Label": "waited",
        "Title": "X-Trace Task",
        "Host": "pinky19.mpi-sws.org",
        "Duration": "494694",
        "HRT": 26966622173415139,
        "Operation": "waited",
        "Timestamp": "1557750262113.591797",
        "TenantClass": 0,
        "Source": "Client.java:1537",
        "ThreadID": 1,
        "ThreadName": "",
        "EventID": "411C13C2B1EE3F56",
        "ProcessID": 2801
      },
      {
        "Cycles": 0,
        "Agent": "Execution-Sleep",
        "ProcessName": "Read",
        "TaskID": "A633A3CEF2885145",
        "ParentEventID": [
          "7AD4E28064368025"
        ],
        "Label": "waited",
        "Title": "X-Trace Task",
        "Host": "pinky19.mpi-sws.org",
        "Duration": "150891",
        "HRT": 26966622173744543,
        "Operation": "waited",
        "Timestamp": "1557750262113.921143",
        "TenantClass": 0,
        "Source": "SocketIOWithTimeout.java:335",
        "ThreadID": 1,
        "ThreadName": "",
        "EventID": "B89139CA6C63F6A2",
        "ProcessID": 2801
      },
      {
        "Cycles": 0,
        "Agent": "edu.brown.cs.systems.xtrace.logging.BaggageWrappers",
        "ProcessName": "Read",
        "TaskID": "A633A3CEF2885145",
        "ParentEventID": [
          "B89139CA6C63F6A2"
        ],
        "Label": "Forking current baggage with Baggage.fork()",
        "Title": "X-Trace Task",
        "Host": "pinky19.mpi-sws.org",
        "HRT": 26966622173792271,
        "Operation": "fork",
        "Timestamp": "1557750262113.968994",
        "TenantClass": 0,
        "Source": "DataTransferProtoUtil.java:94",
        "ThreadID": 1,
        "ThreadName": "",
        "EventID": "9DE82EB2C8BBC539",
        "ProcessID": 2801
      },
      {
        "Cycles": 0,
        "Agent": "edu.brown.cs.systems.xtrace.logging.XTraceInit",
        "ProcessName": "Data",
        "TaskID": "A633A3CEF2885145",
        "ParentEventID": [
          "C1156A7A9F885852"
        ],
        "Label": "Thread.setName: DataXceiver for client DFSClient_NONMAPREDUCE_310321604_1 at /139.19.171.63:46082 [Sending block BP-1633380353-139.19.171.63-1554193446451:blk_1073763827_23003]",
        "Title": "X-Trace Task",
        "Host": "pinky20.mpi-sws.org",
        "HRT": 6569826533573603,
        "Timestamp": "1557750262114.817383",
        "TenantClass": 0,
        "Source": "DataXceiver.java:168",
        "ThreadID": 14680,
        "ThreadName": "",
        "EventID": "3ED8DFCECBA7D206",
        "BaggageBytes": "[[248 5] [240 0] [0 166 51 163 206 242 136 81 69] [240 1] [0 193 21 106 122 159 136 88 82] [240 3] [0 2]]",
        "ProcessID": 13111
      },
      {
        "Cycles": 0,
        "Agent": "edu.brown.cs.systems.xtrace.logging.BaggageWrappers",
        "ProcessName": "Data",
        "TaskID": "A633A3CEF2885145",
        "ParentEventID": [
          "3ED8DFCECBA7D206"
        ],
        "Label": "Forking current baggage with Baggage.fork()",
        "Title": "X-Trace Task",
        "Host": "pinky20.mpi-sws.org",
        "HRT": 6569826533796180,
        "Operation": "fork",
        "Timestamp": "1557750262115.040039",
        "TenantClass": 0,
        "Source": "DataXceiver.java:1257",
        "ThreadID": 14680,
        "ThreadName": "",
        "EventID": "F2FDA54209150873",
        "BaggageBytes": "[[248 5] [240 0] [0 166 51 163 206 242 136 81 69] [240 1] [0 62 216 223 206 203 167 210 6] [240 3] [0 2]]",
        "ProcessID": 13111
      },
      {
        "Cycles": 0,
        "Agent": "Execution-Sleep",
        "ProcessName": "Read",
        "TaskID": "A633A3CEF2885145",
        "ParentEventID": [
          "9DE82EB2C8BBC539"
        ],
        "Label": "waited",
        "Title": "X-Trace Task",
        "Host": "pinky19.mpi-sws.org",
        "Duration": "975685",
        "HRT": 26966622174859662,
        "Operation": "waited",
        "Timestamp": "1557750262115.036377",
        "TenantClass": 0,
        "Source": "SocketIOWithTimeout.java:335",
        "ThreadID": 1,
        "ThreadName": "",
        "EventID": "214305954666514C",
        "ProcessID": 2801
      },
      {
        "Cycles": 0,
        "Agent": "Execution-CPU",
        "ProcessName": "Data",
        "TaskID": "A633A3CEF2885145",
        "ParentEventID": [
          "9DE82EB2C8BBC539"
        ],
        "Label": "set",
        "Title": "X-Trace Task",
        "Host": "pinky20.mpi-sws.org",
        "HRT": 6569826533466793,
        "Operation": "set",
        "Timestamp": "1557750262114.710693",
        "TenantClass": 0,
        "Source": "Receiver.java:117",
        "ThreadID": 14680,
        "ThreadName": "",
        "EventID": "C1156A7A9F885852",
        "BaggageBytes": "[[248 5] [240 0] [0 166 51 163 206 242 136 81 69] [240 1] [0 157 232 46 178 200 187 197 57] [240 3] [0 2]]",
        "ProcessID": 13111
      },
      {
        "Cycles": 0,
        "Agent": "edu.brown.cs.systems.xtrace.logging.BaggageWrappers",
        "ProcessName": "Data",
        "TaskID": "A633A3CEF2885145",
        "ParentEventID": [
          "F2FDA54209150873"
        ],
        "Label": "Forking current baggage with Baggage.fork()",
        "Title": "X-Trace Task",
        "Host": "pinky20.mpi-sws.org",
        "HRT": 6569826533961667,
        "Operation": "fork",
        "Timestamp": "1557750262115.205566",
        "TenantClass": 0,
        "Source": "PacketHeader.java:95",
        "ThreadID": 14680,
        "ThreadName": "",
        "EventID": "1EB1EA0DC8C74CB6",
        "BaggageBytes": "[[248 5] [240 0] [0 166 51 163 206 242 136 81 69] [240 1] [0 242 253 165 66 9 21 8 115] [240 3] [0 2]]",
        "ProcessID": 13111
      },
      {
        "Cycles": 0,
        "Agent": "edu.brown.cs.systems.xtrace.logging.BaggageWrappers",
        "ProcessName": "Read",
        "TaskID": "A633A3CEF2885145",
        "ParentEventID": [
          "F2FDA54209150873",
          "214305954666514C"
        ],
        "Label": "Merged current baggage with other baggage",
        "Title": "X-Trace Task",
        "Host": "pinky19.mpi-sws.org",
        "HRT": 26966622174932438,
        "Operation": "join",
        "Timestamp": "1557750262115.109131",
        "TenantClass": 0,
        "Source": "RemoteBlockReader2.java:429",
        "ThreadID": 1,
        "ThreadName": "",
        "EventID": "D0A0BD9257E8A15C",
        "ProcessID": 2801
      },
      {
        "Cycles": 0,
        "Agent": "edu.brown.cs.systems.xtrace.logging.BaggageWrappers",
        "ProcessName": "Data",
        "TaskID": "A633A3CEF2885145",
        "ParentEventID": [
          "4D84B5376D0ABD5F"
        ],
        "Label": "Forking current baggage with Baggage.fork()",
        "Title": "X-Trace Task",
        "Host": "pinky20.mpi-sws.org",
        "HRT": 6569826534306188,
        "Operation": "fork",
        "Timestamp": "1557750262115.550049",
        "TenantClass": 0,
        "Source": "PacketHeader.java:95",
        "ThreadID": 14680,
        "ThreadName": "",
        "EventID": "C3C102150AA1AC5B",
        "BaggageBytes": "[[248 5] [240 0] [0 166 51 163 206 242 136 81 69] [240 1] [0 77 132 181 55 109 10 189 95] [240 3] [0 2]]",
        "ProcessID": 13111
      },
      {
        "Cycles": 0,
        "Agent": "Execution-Sleep",
        "ProcessName": "Data",
        "TaskID": "A633A3CEF2885145",
        "ParentEventID": [
          "1EB1EA0DC8C74CB6"
        ],
        "Label": "waited",
        "Title": "X-Trace Task",
        "Host": "pinky20.mpi-sws.org",
        "Duration": "14437",
        "HRT": 6569826534125141,
        "Operation": "waited",
        "Timestamp": "1557750262115.369141",
        "TenantClass": 0,
        "Source": "SocketIOWithTimeout.java:335",
        "ThreadID": 14680,
        "ThreadName": "",
        "EventID": "4D84B5376D0ABD5F",
        "BaggageBytes": "[[248 5] [240 0] [0 166 51 163 206 242 136 81 69] [240 1] [0 30 177 234 13 200 199 76 182] [240 3] [0 2]]",
        "ProcessID": 13111
      },
      {
        "Cycles": 0,
        "Agent": "Execution-Sleep",
        "ProcessName": "Read",
        "TaskID": "A633A3CEF2885145",
        "ParentEventID": [
          "D0A0BD9257E8A15C"
        ],
        "Label": "waited",
        "Title": "X-Trace Task",
        "Host": "pinky19.mpi-sws.org",
        "Duration": "373046",
        "HRT": 26966622175403032,
        "Operation": "waited",
        "Timestamp": "1557750262115.579590",
        "TenantClass": 0,
        "Source": "SocketIOWithTimeout.java:335",
        "ThreadID": 1,
        "ThreadName": "",
        "EventID": "CFB338DFF100AA48",
        "ProcessID": 2801
      },
      {
        "Cycles": 0,
        "Agent": "Execution-Sleep",
        "ProcessName": "Read",
        "TaskID": "A633A3CEF2885145",
        "ParentEventID": [
          "CFB338DFF100AA48"
        ],
        "Label": "waited",
        "Title": "X-Trace Task",
        "Host": "pinky19.mpi-sws.org",
        "Duration": "227832",
        "HRT": 26966622175689247,
        "Operation": "waited",
        "Timestamp": "1557750262115.865967",
        "TenantClass": 0,
        "Source": "SocketIOWithTimeout.java:335",
        "ThreadID": 1,
        "ThreadName": "",
        "EventID": "9B63D74D23514164",
        "ProcessID": 2801
      },
      {
        "Cycles": 0,
        "Agent": "edu.brown.cs.systems.xtrace.logging.BaggageWrappers",
        "ProcessName": "Read",
        "TaskID": "A633A3CEF2885145",
        "ParentEventID": [
          "1EB1EA0DC8C74CB6",
          "159BD0D223894F31"
        ],
        "Label": "Merged current baggage with other baggage",
        "Title": "X-Trace Task",
        "Host": "pinky19.mpi-sws.org",
        "HRT": 26966622175957367,
        "Operation": "join",
        "Timestamp": "1557750262116.134033",
        "TenantClass": 0,
        "Source": "PacketHeader.java:168",
        "ThreadID": 1,
        "ThreadName": "",
        "EventID": "77B754723B7EF7CA",
        "ProcessID": 2801
      },
      {
        "Cycles": 0,
        "Agent": "Execution-Sleep",
        "ProcessName": "Read",
        "TaskID": "A633A3CEF2885145",
        "ParentEventID": [
          "9B63D74D23514164"
        ],
        "Label": "waited",
        "Title": "X-Trace Task",
        "Host": "pinky19.mpi-sws.org",
        "Duration": "134251",
        "HRT": 26966622175888096,
        "Operation": "waited",
        "Timestamp": "1557750262116.064697",
        "TenantClass": 0,
        "Source": "SocketIOWithTimeout.java:335",
        "ThreadID": 1,
        "ThreadName": "",
        "EventID": "159BD0D223894F31",
        "ProcessID": 2801
      },
      {
        "Cycles": 0,
        "Agent": "edu.brown.cs.systems.xtrace.logging.BaggageWrappers",
        "ProcessName": "Read",
        "TaskID": "A633A3CEF2885145",
        "ParentEventID": [
          "77B754723B7EF7CA",
          "C3C102150AA1AC5B"
        ],
        "Label": "Merged current baggage with other baggage",
        "Title": "X-Trace Task",
        "Host": "pinky19.mpi-sws.org",
        "HRT": 26966622176054754,
        "Operation": "join",
        "Timestamp": "1557750262116.231445",
        "TenantClass": 0,
        "Source": "PacketHeader.java:168",
        "ThreadID": 1,
        "ThreadName": "",
        "EventID": "D90DAFB938D34943",
        "ProcessID": 2801
      },
      {
        "Cycles": 0,
        "Agent": "edu.brown.cs.systems.xtrace.logging.BaggageWrappers",
        "ProcessName": "Read",
        "TaskID": "A633A3CEF2885145",
        "ParentEventID": [
          "57D09D91C4B06D7D"
        ],
        "Label": "Forking current baggage with Baggage.fork()",
        "Title": "X-Trace Task",
        "Host": "pinky19.mpi-sws.org",
        "HRT": 26966622176130677,
        "Operation": "fork",
        "Timestamp": "1557750262116.307373",
        "TenantClass": 0,
        "Source": "DataTransferProtoUtil.java:94",
        "ThreadID": 1,
        "ThreadName": "",
        "EventID": "F193DF51936AAC51",
        "ProcessID": 2801
      },
      {
        "Cycles": 0,
        "Agent": "edu.brown.cs.systems.xtrace.logging.BaggageWrappers",
        "ProcessName": "Read",
        "TaskID": "A633A3CEF2885145",
        "ParentEventID": [
          "D90DAFB938D34943"
        ],
        "Label": "Forking current baggage with Baggage.fork()",
        "Title": "X-Trace Task",
        "Host": "pinky19.mpi-sws.org",
        "HRT": 26966622176065311,
        "Operation": "fork",
        "Timestamp": "1557750262116.241943",
        "TenantClass": 0,
        "Source": "RemoteBlockReader2.java:361",
        "ThreadID": 1,
        "ThreadName": "",
        "EventID": "57D09D91C4B06D7D",
        "ProcessID": 2801
      },
      {
        "Cycles": 0,
        "Agent": "Execution-Sleep",
        "ProcessName": "Data",
        "TaskID": "A633A3CEF2885145",
        "ParentEventID": [
          "C3C102150AA1AC5B"
        ],
        "Label": "waited",
        "Title": "X-Trace Task",
        "Host": "pinky20.mpi-sws.org",
        "Duration": "776351",
        "HRT": 6569826535287463,
        "Operation": "waited",
        "Timestamp": "1557750262116.531250",
        "TenantClass": 0,
        "Source": "SocketIOWithTimeout.java:335",
        "ThreadID": 14680,
        "ThreadName": "",
        "EventID": "14A5CA9E2C7EA60E",
        "BaggageBytes": "[[248 5] [240 0] [0 166 51 163 206 242 136 81 69] [240 1] [0 195 193 2 21 10 161 172 91] [240 3] [0 2]]",
        "ProcessID": 13111
      },
      {
        "Cycles": 0,
        "Agent": "Execution-CPU",
        "ProcessName": "Data",
        "TaskID": "A633A3CEF2885145",
        "ParentEventID": [
          "8FE51FD6B34455E0"
        ],
        "Label": "unset",
        "Title": "X-Trace Task",
        "Host": "pinky20.mpi-sws.org",
        "Duration": "2076330",
        "HRT": 6569826535616270,
        "Operation": "unset",
        "Timestamp": "1557750262116.860107",
        "TenantClass": 0,
        "Source": "DataXceiver.java:261",
        "ThreadID": 14680,
        "ThreadName": "",
        "EventID": "E535AB1D2373D1CA",
        "BaggageBytes": "[[248 5] [240 0] [0 166 51 163 206 242 136 81 69] [240 1] [0 143 229 31 214 179 68 85 224] [240 3] [0 2]]",
        "ProcessID": 13111
      },
      {
        "Cycles": 0,
        "Agent": "Execution-CPU",
        "ProcessName": "Data",
        "TaskID": "A633A3CEF2885145",
        "ParentEventID": [
          "F193DF51936AAC51"
        ],
        "Label": "set",
        "Title": "X-Trace Task",
        "Host": "pinky20.mpi-sws.org",
        "HRT": 6569826535691756,
        "Operation": "set",
        "Timestamp": "1557750262116.935547",
        "TenantClass": 0,
        "Source": "Receiver.java:117",
        "ThreadID": 14680,
        "ThreadName": "",
        "EventID": "EFE95716AC0905A6",
        "BaggageBytes": "[[248 5] [240 0] [0 166 51 163 206 242 136 81 69] [240 1] [0 241 147 223 81 147 106 172 81] [240 3] [0 2]]",
        "ProcessID": 13111
      },
      {
        "Cycles": 0,
        "Agent": "edu.brown.cs.systems.xtrace.logging.BaggageWrappers",
        "ProcessName": "Data",
        "TaskID": "A633A3CEF2885145",
        "ParentEventID": [
          "14A5CA9E2C7EA60E",
          "57D09D91C4B06D7D"
        ],
        "Label": "Merged current baggage with other baggage",
        "Title": "X-Trace Task",
        "Host": "pinky20.mpi-sws.org",
        "HRT": 6569826535548506,
        "Operation": "join",
        "Timestamp": "1557750262116.792480",
        "TenantClass": 0,
        "Source": "DataXceiver.java:574",
        "ThreadID": 14680,
        "ThreadName": "",
        "EventID": "8FE51FD6B34455E0",
        "BaggageBytes": "[[248 5] [240 0] [0 166 51 163 206 242 136 81 69] [240 1] [0 20 165 202 158 44 126 166 14] [0 87 208 157 145 196 176 109 125] [240 3] [0 2]]",
        "ProcessID": 13111
      },
      {
        "Cycles": 0,
        "Agent": "edu.brown.cs.systems.xtrace.logging.XTraceInit",
        "ProcessName": "Data",
        "TaskID": "A633A3CEF2885145",
        "ParentEventID": [
          "EFE95716AC0905A6"
        ],
        "Label": "Thread.setName: DataXceiver for client DFSClient_NONMAPREDUCE_310321604_1 at /139.19.171.63:46082 [Sending block BP-1633380353-139.19.171.63-1554193446451:blk_1073763827_23003]",
        "Title": "X-Trace Task",
        "Host": "pinky20.mpi-sws.org",
        "HRT": 6569826535798550,
        "Timestamp": "1557750262117.042480",
        "TenantClass": 0,
        "Source": "DataXceiver.java:168",
        "ThreadID": 14680,
        "ThreadName": "",
        "EventID": "198E7DA08D5FD84A",
        "BaggageBytes": "[[248 5] [240 0] [0 166 51 163 206 242 136 81 69] [240 1] [0 239 233 87 22 172 9 5 166] [240 3] [0 2]]",
        "ProcessID": 13111
      },
      {
        "Cycles": 0,
        "Agent": "Execution-Sleep",
        "ProcessName": "Read",
        "TaskID": "A633A3CEF2885145",
        "ParentEventID": [
          "F193DF51936AAC51"
        ],
        "Label": "waited",
        "Title": "X-Trace Task",
        "Host": "pinky19.mpi-sws.org",
        "Duration": "901707",
        "HRT": 26966622177113172,
        "Operation": "waited",
        "Timestamp": "1557750262117.289795",
        "TenantClass": 0,
        "Source": "SocketIOWithTimeout.java:335",
        "ThreadID": 1,
        "ThreadName": "",
        "EventID": "E42181249A2B8BF4",
        "ProcessID": 2801
      },
      {
        "Cycles": 0,
        "Agent": "edu.brown.cs.systems.xtrace.logging.BaggageWrappers",
        "ProcessName": "Read",
        "TaskID": "A633A3CEF2885145",
        "ParentEventID": [
          "E42181249A2B8BF4",
          "21725FE5A60F87BC"
        ],
        "Label": "Merged current baggage with other baggage",
        "Title": "X-Trace Task",
        "Host": "pinky19.mpi-sws.org",
        "HRT": 26966622177168965,
        "Operation": "join",
        "Timestamp": "1557750262117.345703",
        "TenantClass": 0,
        "Source": "RemoteBlockReader2.java:429",
        "ThreadID": 1,
        "ThreadName": "",
        "EventID": "6CD23346A4D260FC",
        "ProcessID": 2801
      },
      {
        "Cycles": 0,
        "Agent": "edu.brown.cs.systems.xtrace.logging.BaggageWrappers",
        "ProcessName": "Data",
        "TaskID": "A633A3CEF2885145",
        "ParentEventID": [
          "198E7DA08D5FD84A"
        ],
        "Label": "Forking current baggage with Baggage.fork()",
        "Title": "X-Trace Task",
        "Host": "pinky20.mpi-sws.org",
        "HRT": 6569826536052940,
        "Operation": "fork",
        "Timestamp": "1557750262117.296875",
        "TenantClass": 0,
        "Source": "DataXceiver.java:1257",
        "ThreadID": 14680,
        "ThreadName": "",
        "EventID": "21725FE5A60F87BC",
        "BaggageBytes": "[[248 5] [240 0] [0 166 51 163 206 242 136 81 69] [240 1] [0 25 142 125 160 141 95 216 74] [240 3] [0 2]]",
        "ProcessID": 13111
      },
      {
        "Cycles": 0,
        "Agent": "edu.brown.cs.systems.xtrace.logging.BaggageWrappers",
        "ProcessName": "Data",
        "TaskID": "A633A3CEF2885145",
        "ParentEventID": [
          "21725FE5A60F87BC"
        ],
        "Label": "Forking current baggage with Baggage.fork()",
        "Title": "X-Trace Task",
        "Host": "pinky20.mpi-sws.org",
        "HRT": 6569826536240474,
        "Operation": "fork",
        "Timestamp": "1557750262117.484375",
        "TenantClass": 0,
        "Source": "PacketHeader.java:95",
        "ThreadID": 14680,
        "ThreadName": "",
        "EventID": "40D1F0819BC96F00",
        "BaggageBytes": "[[248 5] [240 0] [0 166 51 163 206 242 136 81 69] [240 1] [0 33 114 95 229 166 15 135 188] [240 3] [0 2]]",
        "ProcessID": 13111
      },
      {
        "Cycles": 0,
        "Agent": "Execution-Sleep",
        "ProcessName": "Read",
        "TaskID": "A633A3CEF2885145",
        "ParentEventID": [
          "6CD23346A4D260FC"
        ],
        "Label": "waited",
        "Title": "X-Trace Task",
        "Host": "pinky19.mpi-sws.org",
        "Duration": "96056",
        "HRT": 26966622177305853,
        "Operation": "waited",
        "Timestamp": "1557750262117.482422",
        "TenantClass": 0,
        "Source": "SocketIOWithTimeout.java:335",
        "ThreadID": 1,
        "ThreadName": "",
        "EventID": "944203AA13FB7482",
        "ProcessID": 2801
      },
      {
        "Cycles": 0,
        "Agent": "Execution-Sleep",
        "ProcessName": "Data",
        "TaskID": "A633A3CEF2885145",
        "ParentEventID": [
          "40D1F0819BC96F00"
        ],
        "Label": "waited",
        "Title": "X-Trace Task",
        "Host": "pinky20.mpi-sws.org",
        "Duration": "12144",
        "HRT": 6569826536431851,
        "Operation": "waited",
        "Timestamp": "1557750262117.675781",
        "TenantClass": 0,
        "Source": "SocketIOWithTimeout.java:335",
        "ThreadID": 14680,
        "ThreadName": "",
        "EventID": "501DA36A229E3F4D",
        "BaggageBytes": "[[248 5] [240 0] [0 166 51 163 206 242 136 81 69] [240 1] [0 64 209 240 129 155 201 111 0] [240 3] [0 2]]",
        "ProcessID": 13111
      },
      {
        "Cycles": 0,
        "Agent": "edu.brown.cs.systems.xtrace.logging.BaggageWrappers",
        "ProcessName": "Data",
        "TaskID": "A633A3CEF2885145",
        "ParentEventID": [
          "501DA36A229E3F4D"
        ],
        "Label": "Forking current baggage with Baggage.fork()",
        "Title": "X-Trace Task",
        "Host": "pinky20.mpi-sws.org",
        "HRT": 6569826536638998,
        "Operation": "fork",
        "Timestamp": "1557750262117.882812",
        "TenantClass": 0,
        "Source": "PacketHeader.java:95",
        "ThreadID": 14680,
        "ThreadName": "",
        "EventID": "E0A51DE406AA7FAF",
        "BaggageBytes": "[[248 5] [240 0] [0 166 51 163 206 242 136 81 69] [240 1] [0 80 29 163 106 34 158 63 77] [240 3] [0 2]]",
        "ProcessID": 13111
      },
      {
        "Cycles": 0,
        "Agent": "Execution-Sleep",
        "ProcessName": "Read",
        "TaskID": "A633A3CEF2885145",
        "ParentEventID": [
          "944203AA13FB7482"
        ],
        "Label": "waited",
        "Title": "X-Trace Task",
        "Host": "pinky19.mpi-sws.org",
        "Duration": "375207",
        "HRT": 26966622177747155,
        "Operation": "waited",
        "Timestamp": "1557750262117.923828",
        "TenantClass": 0,
        "Source": "SocketIOWithTimeout.java:335",
        "ThreadID": 1,
        "ThreadName": "",
        "EventID": "460D0FF84397DE21",
        "ProcessID": 2801
      },
      {
        "Cycles": 0,
        "Agent": "Execution-Sleep",
        "ProcessName": "Read",
        "TaskID": "A633A3CEF2885145",
        "ParentEventID": [
          "460D0FF84397DE21"
        ],
        "Label": "waited",
        "Title": "X-Trace Task",
        "Host": "pinky19.mpi-sws.org",
        "Duration": "146025",
        "HRT": 26966622177961403,
        "Operation": "waited",
        "Timestamp": "1557750262118.138184",
        "TenantClass": 0,
        "Source": "SocketIOWithTimeout.java:335",
        "ThreadID": 1,
        "ThreadName": "",
        "EventID": "9CE48E1235C618ED",
        "ProcessID": 2801
      },
      {
        "Cycles": 0,
        "Agent": "Execution-Sleep",
        "ProcessName": "Read",
        "TaskID": "A633A3CEF2885145",
        "ParentEventID": [
          "9CE48E1235C618ED"
        ],
        "Label": "waited",
        "Title": "X-Trace Task",
        "Host": "pinky19.mpi-sws.org",
        "Duration": "81610",
        "HRT": 26966622178111722,
        "Operation": "waited",
        "Timestamp": "1557750262118.288330",
        "TenantClass": 0,
        "Source": "SocketIOWithTimeout.java:335",
        "ThreadID": 1,
        "ThreadName": "",
        "EventID": "3EA0597D80648593",
        "ProcessID": 2801
      },
      {
        "Cycles": 0,
        "Agent": "edu.brown.cs.systems.xtrace.logging.BaggageWrappers",
        "ProcessName": "Read",
        "TaskID": "A633A3CEF2885145",
        "ParentEventID": [
          "40D1F0819BC96F00",
          "3EA0597D80648593"
        ],
        "Label": "Merged current baggage with other baggage",
        "Title": "X-Trace Task",
        "Host": "pinky19.mpi-sws.org",
        "HRT": 26966622178153644,
        "Operation": "join",
        "Timestamp": "1557750262118.330322",
        "TenantClass": 0,
        "Source": "PacketHeader.java:168",
        "ThreadID": 1,
        "ThreadName": "",
        "EventID": "CF741E5E140A4940",
        "ProcessID": 2801
      },
      {
        "Cycles": 0,
        "Agent": "Execution-Sleep",
        "ProcessName": "Data",
        "TaskID": "A633A3CEF2885145",
        "ParentEventID": [
          "E0A51DE406AA7FAF"
        ],
        "Label": "waited",
        "Title": "X-Trace Task",
        "Host": "pinky20.mpi-sws.org",
        "Duration": "178644",
        "HRT": 6569826536942315,
        "Operation": "waited",
        "Timestamp": "1557750262118.186279",
        "TenantClass": 0,
        "Source": "SocketIOWithTimeout.java:335",
        "ThreadID": 14680,
        "ThreadName": "",
        "EventID": "57FDD0E007BF3159",
        "BaggageBytes": "[[248 5] [240 0] [0 166 51 163 206 242 136 81 69] [240 1] [0 224 165 29 228 6 170 127 175] [240 3] [0 2]]",
        "ProcessID": 13111
      },
      {
        "Cycles": 0,
        "Agent": "edu.brown.cs.systems.xtrace.logging.BaggageWrappers",
        "ProcessName": "Data",
        "TaskID": "A633A3CEF2885145",
        "ParentEventID": [
          "57FDD0E007BF3159"
        ],
        "Label": "Forking current baggage with Baggage.fork()",
        "Title": "X-Trace Task",
        "Host": "pinky20.mpi-sws.org",
        "HRT": 6569826537132799,
        "Operation": "fork",
        "Timestamp": "1557750262118.376709",
        "TenantClass": 0,
        "Source": "PacketHeader.java:95",
        "ThreadID": 14680,
        "ThreadName": "",
        "EventID": "C99BD25FB6C4943F",
        "BaggageBytes": "[[248 5] [240 0] [0 166 51 163 206 242 136 81 69] [240 1] [0 87 253 208 224 7 191 49 89] [240 3] [0 2]]",
        "ProcessID": 13111
      },
      {
        "Cycles": 0,
        "Agent": "Execution-CPU",
        "ProcessName": "Data",
        "TaskID": "A633A3CEF2885145",
        "ParentEventID": [
          "63DD3EE3489686A8"
        ],
        "Label": "unset",
        "Title": "X-Trace Task",
        "Host": "pinky20.mpi-sws.org",
        "Duration": "1993799",
        "HRT": 6569826537766689,
        "Operation": "unset",
        "Timestamp": "1557750262119.010498",
        "TenantClass": 0,
        "Source": "DataXceiver.java:261",
        "ThreadID": 14680,
        "ThreadName": "",
        "EventID": "E1BF19E47DAFABD4",
        "BaggageBytes": "[[248 5] [240 0] [0 166 51 163 206 242 136 81 69] [240 1] [0 99 221 62 227 72 150 134 168] [240 3] [0 2]]",
        "ProcessID": 13111
      },
      {
        "Cycles": 0,
        "Agent": "Execution-Sleep",
        "ProcessName": "Data",
        "TaskID": "A633A3CEF2885145",
        "ParentEventID": [
          "C99BD25FB6C4943F"
        ],
        "Label": "waited",
        "Title": "X-Trace Task",
        "Host": "pinky20.mpi-sws.org",
        "Duration": "10420",
        "HRT": 6569826537314282,
        "Operation": "waited",
        "Timestamp": "1557750262118.558105",
        "TenantClass": 0,
        "Source": "SocketIOWithTimeout.java:335",
        "ThreadID": 14680,
        "ThreadName": "",
        "EventID": "63DD3EE3489686A8",
        "BaggageBytes": "[[248 5] [240 0] [0 166 51 163 206 242 136 81 69] [240 1] [0 201 155 210 95 182 196 148 63] [240 3] [0 2]]",
        "ProcessID": 13111
      }
    ]
  }
]