[
  {
    "id": "CC1A991F0D5C7F6D",
    "reports": [
      {
        "Cycles": 0,
        "Agent": "edu.brown.cs.systems.retro.benchmarks.hdfs_client.Reader",
        "ProcessName": "Read",
        "TaskID": "CC1A991F0D5C7F6D",
        "ParentEventID": [
          "EB61C11BA7ECBE51"
        ],
        "Label": "Reading file",
        "Title": "X-Trace Task",
        "Host": "pinky19.mpi-sws.org",
        "HRT": 26966656811991184,
        "Timestamp": "1557750296752.259277",
        "TenantClass": 0,
        "ThreadID": 1,
        "ThreadName": "",
        "EventID": "47F9887A471A05B9",
        "ProcessID": 2801
      },
      {
        "Cycles": 0,
        "Agent": "Execution-CPU",
        "ProcessName": "Read",
        "TaskID": "CC1A991F0D5C7F6D",
        "ParentEventID": [
          "25F782F158EA86D5"
        ],
        "Label": "unset",
        "Title": "X-Trace Task",
        "Host": "pinky19.mpi-sws.org",
        "Duration": "25165388",
        "HRT": 26966656812039992,
        "Operation": "unset",
        "Timestamp": "1557750296752.308105",
        "TenantClass": 0,
        "Source": "Client.java:1027",
        "ThreadID": 1,
        "ThreadName": "",
        "EventID": "2B30E3FC48A1FB44",
        "ProcessID": 2801
      },
      {
        "Cycles": 0,
        "Agent": "org.apache.hadoop.ipc.ProtobufRpcEngine",
        "ProcessName": "Read",
        "TaskID": "CC1A991F0D5C7F6D",
        "ParentEventID": [
          "47F9887A471A05B9"
        ],
        "Label": "Invoking org.apache.hadoop.hdfs.protocol.ClientProtocol.getBlockLocations",
        "Title": "X-Trace Task",
        "Host": "pinky19.mpi-sws.org",
        "HRT": 26966656812018476,
        "Timestamp": "1557750296752.286621",
        "TenantClass": 0,
        "Source": "ProtobufRpcEngine.java:228",
        "ThreadID": 1,
        "ThreadName": "",
        "EventID": "25F782F158EA86D5",
        "ProcessID": 2801
      },
      {
        "Cycles": 0,
        "Agent": "edu.brown.cs.systems.xtrace.logging.BaggageWrappers",
        "ProcessName": "Read",
        "TaskID": "CC1A991F0D5C7F6D",
        "ParentEventID": [
          "2FCE85870384E12B"
        ],
        "Label": "Forking current baggage with Baggage.fork()",
        "Title": "X-Trace Task",
        "Host": "pinky19.mpi-sws.org",
        "HRT": 26966656812077844,
        "Operation": "fork",
        "Timestamp": "1557750296752.345947",
        "TenantClass": 0,
        "Source": "Client.java:1043",
        "ThreadID": 41,
        "ThreadName": "",
        "EventID": "DD4277D1F5912731",
        "ProcessID": 2801
      },
      {
        "Cycles": 0,
        "Agent": "Execution-CPU",
        "ProcessName": "Read",
        "TaskID": "CC1A991F0D5C7F6D",
        "ParentEventID": [
          "2B30E3FC48A1FB44"
        ],
        "Label": "set",
        "Title": "X-Trace Task",
        "Host": "pinky19.mpi-sws.org",
        "HRT": 26966656812061858,
        "Operation": "set",
        "Timestamp": "1557750296752.330078",
        "TenantClass": 0,
        "Source": "Client.java:1032",
        "ThreadID": 41,
        "ThreadName": "",
        "EventID": "2FCE85870384E12B",
        "ProcessID": 2801
      },
      {
        "Cycles": 0,
        "Agent": "Execution-CPU",
        "ProcessName": "Read",
        "TaskID": "CC1A991F0D5C7F6D",
        "ParentEventID": [
          "DD4277D1F5912731"
        ],
        "Label": "unset",
        "Title": "X-Trace Task",
        "Host": "pinky19.mpi-sws.org",
        "Duration": "63569",
        "HRT": 26966656812140694,
        "Operation": "unset",
        "Timestamp": "1557750296752.408936",
        "TenantClass": 0,
        "Source": "Client.java:1062",
        "ThreadID": 41,
        "ThreadName": "",
        "EventID": "A8FAC06227205C18",
        "ProcessID": 2801
      },
      {
        "Cycles": 0,
        "Agent": "Execution-CPU",
        "ProcessName": "Name",
        "TaskID": "CC1A991F0D5C7F6D",
        "ParentEventID": [
          "DD4277D1F5912731"
        ],
        "Label": "set",
        "Title": "X-Trace Task",
        "Host": "pinky19.mpi-sws.org",
        "HRT": 26966656812197995,
        "Operation": "set",
        "Timestamp": "1557750296752.487061",
        "TenantClass": 0,
        "Source": "Server.java:1840",
        "ThreadID": 48,
        "ThreadName": "",
        "EventID": "F4EC8514AF7CD509",
        "BaggageBytes": "[[248 5] [240 0] [0 204 26 153 31 13 92 127 109] [240 1] [0 221 66 119 209 245 145 39 49] [240 3] [0 2]]",
        "ProcessID": 2171
      },
      {
        "Cycles": 0,
        "Agent": "Execution-CPU",
        "ProcessName": "Read",
        "TaskID": "CC1A991F0D5C7F6D",
        "ParentEventID": [
          "A8FAC06227205C18"
        ],
        "Label": "set",
        "Title": "X-Trace Task",
        "Host": "pinky19.mpi-sws.org",
        "HRT": 26966656812161383,
        "Operation": "set",
        "Timestamp": "1557750296752.429443",
        "TenantClass": 0,
        "Source": "Client.java:1104",
        "ThreadID": 1,
        "ThreadName": "",
        "EventID": "10E364465B554F06",
        "ProcessID": 2801
      },
      {
        "Cycles": 0,
        "Agent": "edu.brown.cs.systems.xtrace.logging.BaggageWrappers",
        "ProcessName": "Name",
        "TaskID": "CC1A991F0D5C7F6D",
        "ParentEventID": [
          "F4EC8514AF7CD509"
        ],
        "Label": "Forking current baggage with Baggage.fork()",
        "Title": "X-Trace Task",
        "Host": "pinky19.mpi-sws.org",
        "HRT": 26966656812226600,
        "Operation": "fork",
        "Timestamp": "1557750296752.515625",
        "TenantClass": 0,
        "Source": "Server.java:550",
        "ThreadID": 48,
        "ThreadName": "",
        "EventID": "5EC86613A427951F",
        "BaggageBytes": "[[248 5] [240 0] [0 204 26 153 31 13 92 127 109] [240 1] [0 244 236 133 20 175 124 213 9] [240 3] [0 2]]",
        "ProcessID": 2171
      },
      {
        "Cycles": 0,
        "Agent": "Execution-CPU",
        "ProcessName": "Name",
        "TaskID": "CC1A991F0D5C7F6D",
        "ParentEventID": [
          "5EC86613A427951F"
        ],
        "Label": "unset",
        "Title": "X-Trace Task",
        "Host": "pinky19.mpi-sws.org",
        "Duration": "25329",
        "HRT": 26966656812247944,
        "Operation": "unset",
        "Timestamp": "1557750296752.537109",
        "TenantClass": 0,
        "Source": "Server.java:1828",
        "ThreadID": 48,
        "ThreadName": "",
        "EventID": "57026608CE563235",
        "BaggageBytes": "[[248 5] [240 0] [0 204 26 153 31 13 92 127 109] [240 1] [0 94 200 102 19 164 39 149 31] [240 3] [0 2]]",
        "ProcessID": 2171
      },
      {
        "Cycles": 0,
        "Agent": "Execution-CPU",
        "ProcessName": "Name",
        "TaskID": "CC1A991F0D5C7F6D",
        "ParentEventID": [
          "5EC86613A427951F"
        ],
        "Label": "set",
        "Title": "X-Trace Task",
        "Host": "pinky19.mpi-sws.org",
        "HRT": 26966656812256335,
        "Operation": "set",
        "Timestamp": "1557750296752.545410",
        "TenantClass": 0,
        "Source": "Server.java:2071",
        "ThreadID": 55,
        "ThreadName": "",
        "EventID": "9AECECF1EF377BB3",
        "BaggageBytes": "[[248 5] [240 0] [0 204 26 153 31 13 92 127 109] [240 1] [0 94 200 102 19 164 39 149 31] [240 3] [0 2]]",
        "ProcessID": 2171
      },
      {
        "Cycles": 0,
        "Agent": "org.apache.hadoop.ipc.Server",
        "ProcessName": "Name",
        "TaskID": "CC1A991F0D5C7F6D",
        "ParentEventID": [
          "9AECECF1EF377BB3"
        ],
        "Label": "getBlockLocations in org.apache.hadoop.hdfs.protocol.ClientProtocol",
        "Title": "X-Trace Task",
        "Host": "pinky19.mpi-sws.org",
        "HRT": 26966656812292645,
        "Timestamp": "1557750296752.581787",
        "TenantClass": 0,
        "Source": "ProtobufRpcEngine.java:601",
        "ThreadID": 55,
        "ThreadName": "",
        "EventID": "8E967FB8EAFBB9D7",
        "BaggageBytes": "[[248 5] [240 0] [0 204 26 153 31 13 92 127 109] [240 1] [0 154 236 236 241 239 55 123 179] [240 3] [0 2]]",
        "ProcessID": 2171
      },
      {
        "Cycles": 0,
        "Agent": "edu.brown.cs.systems.xtrace.logging.BaggageWrappers",
        "ProcessName": "Name",
        "TaskID": "CC1A991F0D5C7F6D",
        "ParentEventID": [
          "620026020451AA92"
        ],
        "Label": "Forking current baggage with Baggage.fork()",
        "Title": "X-Trace Task",
        "Host": "pinky19.mpi-sws.org",
        "HRT": 26966656812384064,
        "Operation": "fork",
        "Timestamp": "1557750296752.673096",
        "TenantClass": 0,
        "Source": "Server.java:2398",
        "ThreadID": 55,
        "ThreadName": "",
        "EventID": "7043723F0936C6A5",
        "BaggageBytes": "[[248 5] [240 0] [0 204 26 153 31 13 92 127 109] [240 1] [0 98 0 38 2 4 81 170 146] [240 3] [0 2]]",
        "ProcessID": 2171
      },
      {
        "Cycles": 0,
        "Agent": "org.apache.hadoop.hdfs.server.namenode.FSNamesystem.audit",
        "ProcessName": "Name",
        "TaskID": "CC1A991F0D5C7F6D",
        "ParentEventID": [
          "8E967FB8EAFBB9D7"
        ],
        "Label": "allowed=true\tugi=plascas (auth:SIMPLE)\tip=/139.19.171.63\tcmd=open\tsrc=/ds/yDz9Cyv4xDeb6VJK\tdst=null\tperm=null\tproto=rpc",
        "Title": "X-Trace Task",
        "Host": "pinky19.mpi-sws.org",
        "HRT": 26966656812339141,
        "Timestamp": "1557750296752.628174",
        "TenantClass": 0,
        "Source": "FSNamesystem.java:8313",
        "ThreadID": 55,
        "ThreadName": "",
        "EventID": "620026020451AA92",
        "BaggageBytes": "[[248 5] [240 0] [0 204 26 153 31 13 92 127 109] [240 1] [0 142 150 127 184 234 251 185 215] [240 3] [0 2]]",
        "ProcessID": 2171
      },
      {
        "Cycles": 0,
        "Agent": "Execution-CPU",
        "ProcessName": "Name",
        "TaskID": "CC1A991F0D5C7F6D",
        "ParentEventID": [
          "7043723F0936C6A5"
        ],
        "Label": "unset",
        "Title": "X-Trace Task",
        "Host": "pinky19.mpi-sws.org",
        "Duration": "209495",
        "HRT": 26966656812490642,
        "Operation": "unset",
        "Timestamp": "1557750296752.779785",
        "TenantClass": 0,
        "Source": "Server.java:1058",
        "ThreadID": 55,
        "ThreadName": "",
        "EventID": "A7B84D1A59A2DD12",
        "BaggageBytes": "[[248 5] [240 0] [0 204 26 153 31 13 92 127 109] [240 1] [0 112 67 114 63 9 54 198 165] [240 3] [0 2]]",
        "ProcessID": 2171
      },
      {
        "Cycles": 0,
        "Agent": "Execution-CPU",
        "ProcessName": "Read",
        "TaskID": "CC1A991F0D5C7F6D",
        "ParentEventID": [
          "DB3ED9ED5941A8C4"
        ],
        "Label": "unset",
        "Title": "X-Trace Task",
        "Host": "pinky19.mpi-sws.org",
        "Duration": "9492",
        "HRT": 26966656812570208,
        "Operation": "unset",
        "Timestamp": "1557750296752.838379",
        "TenantClass": 0,
        "Source": "Client.java:1168",
        "ThreadID": 40,
        "ThreadName": "",
        "EventID": "C85B99638A1A337B",
        "ProcessID": 2801
      },
      {
        "Cycles": 0,
        "Agent": "Execution-CPU",
        "ProcessName": "Read",
        "TaskID": "CC1A991F0D5C7F6D",
        "ParentEventID": [
          "7043723F0936C6A5"
        ],
        "Label": "set",
        "Title": "X-Trace Task",
        "Host": "pinky19.mpi-sws.org",
        "HRT": 26966656812545871,
        "Operation": "set",
        "Timestamp": "1557750296752.813965",
        "TenantClass": 0,
        "Source": "Client.java:302",
        "ThreadID": 40,
        "ThreadName": "",
        "EventID": "DB3ED9ED5941A8C4",
        "ProcessID": 2801
      },
      {
        "Cycles": 0,
        "Agent": "Execution-Sleep",
        "ProcessName": "Read",
        "TaskID": "CC1A991F0D5C7F6D",
        "ParentEventID": [
          "10E364465B554F06"
        ],
        "Label": "waited",
        "Title": "X-Trace Task",
        "Host": "pinky19.mpi-sws.org",
        "Duration": "419661",
        "HRT": 26966656812588507,
        "Operation": "waited",
        "Timestamp": "1557750296752.856689",
        "TenantClass": 0,
        "Source": "Client.java:1537",
        "ThreadID": 1,
        "ThreadName": "",
        "EventID": "ED8A45BE602195B1",
        "ProcessID": 2801
      },
      {
        "Cycles": 0,
        "Agent": "org.apache.hadoop.ipc.ProtobufRpcEngine",
        "ProcessName": "Read",
        "TaskID": "CC1A991F0D5C7F6D",
        "ParentEventID": [
          "8AEEE8E0EEC90695"
        ],
        "Label": "org.apache.hadoop.hdfs.protocol.ClientProtocol.getBlockLocations completed",
        "Title": "X-Trace Task",
        "Host": "pinky19.mpi-sws.org",
        "HRT": 26966656812636276,
        "Timestamp": "1557750296752.904297",
        "TenantClass": 0,
        "Source": "ProtobufRpcEngine.java:275",
        "ThreadID": 1,
        "ThreadName": "",
        "EventID": "EC44831E6E9144E8",
        "ProcessID": 2801
      },
      {
        "Cycles": 0,
        "Agent": "edu.brown.cs.systems.xtrace.logging.BaggageWrappers",
        "ProcessName": "Read",
        "TaskID": "CC1A991F0D5C7F6D",
        "ParentEventID": [
          "ED8A45BE602195B1",
          "C85B99638A1A337B"
        ],
        "Label": "Merged current baggage with other baggage",
        "Title": "X-Trace Task",
        "Host": "pinky19.mpi-sws.org",
        "HRT": 26966656812598786,
        "Operation": "join",
        "Timestamp": "1557750296752.866943",
        "TenantClass": 0,
        "Source": "Client.java:1545",
        "ThreadID": 1,
        "ThreadName": "",
        "EventID": "8AEEE8E0EEC90695",
        "ProcessID": 2801
      },
      {
        "Cycles": 0,
        "Agent": "Execution-Sleep",
        "ProcessName": "Read",
        "TaskID": "CC1A991F0D5C7F6D",
        "ParentEventID": [
          "EC44831E6E9144E8"
        ],
        "Label": "waited",
        "Title": "X-Trace Task",
        "Host": "pinky19.mpi-sws.org",
        "Duration": "4106",
        "HRT": 26966656812728048,
        "Operation": "waited",
        "Timestamp": "1557750296752.996094",
        "TenantClass": 0,
        "Source": "SocketIOWithTimeout.java:335",
        "ThreadID": 1,
        "ThreadName": "",
        "EventID": "FDAAD237B140AEF3",
        "ProcessID": 2801
      },
      {
        "Cycles": 0,
        "Agent": "edu.brown.cs.systems.xtrace.logging.BaggageWrappers",
        "ProcessName": "Read",
        "TaskID": "CC1A991F0D5C7F6D",
        "ParentEventID": [
          "FDAAD237B140AEF3"
        ],
        "Label": "Forking current baggage with Baggage.fork()",
        "Title": "X-Trace Task",
        "Host": "pinky19.mpi-sws.org",
        "HRT": 26966656812763926,
        "Operation": "fork",
        "Timestamp": "1557750296753.031982",
        "TenantClass": 0,
        "Source": "DataTransferProtoUtil.java:94",
        "ThreadID": 1,
        "ThreadName": "",
        "EventID": "5D2F3FC74B2F1174",
        "ProcessID": 2801
      },
      {
        "Cycles": 0,
        "Agent": "edu.brown.cs.systems.xtrace.logging.XTraceInit",
        "ProcessName": "Data",
        "TaskID": "CC1A991F0D5C7F6D",
        "ParentEventID": [
          "476C7EDABE0B8516"
        ],
        "Label": "Thread.setName: DataXceiver for client DFSClient_NONMAPREDUCE_310321604_1 at /139.19.171.63:51816 [Sending block BP-1633380353-139.19.171.63-1554193446451:blk_1073761123_20299]",
        "Title": "X-Trace Task",
        "Host": "pinky19.mpi-sws.org",
        "HRT": 26966656813006930,
        "Timestamp": "1557750296753.285400",
        "TenantClass": 0,
        "Source": "DataXceiver.java:168",
        "ThreadID": 37715,
        "ThreadName": "",
        "EventID": "199B891635B84589",
        "BaggageBytes": "[[248 5] [240 0] [0 204 26 153 31 13 92 127 109] [240 1] [0 71 108 126 218 190 11 133 22] [240 3] [0 2]]",
        "ProcessID": 2319
      },
      {
        "Cycles": 0,
        "Agent": "Execution-CPU",
        "ProcessName": "Data",
        "TaskID": "CC1A991F0D5C7F6D",
        "ParentEventID": [
          "5D2F3FC74B2F1174"
        ],
        "Label": "set",
        "Title": "X-Trace Task",
        "Host": "pinky19.mpi-sws.org",
        "HRT": 26966656812967940,
        "Operation": "set",
        "Timestamp": "1557750296753.246338",
        "TenantClass": 0,
        "Source": "Receiver.java:117",
        "ThreadID": 37715,
        "ThreadName": "",
        "EventID": "476C7EDABE0B8516",
        "BaggageBytes": "[[248 5] [240 0] [0 204 26 153 31 13 92 127 109] [240 1] [0 93 47 63 199 75 47 17 116] [240 3] [0 2]]",
        "ProcessID": 2319
      },
      {
        "Cycles": 0,
        "Agent": "edu.brown.cs.systems.xtrace.logging.BaggageWrappers",
        "ProcessName": "Data",
        "TaskID": "CC1A991F0D5C7F6D",
        "ParentEventID": [
          "199B891635B84589"
        ],
        "Label": "Forking current baggage with Baggage.fork()",
        "Title": "X-Trace Task",
        "Host": "pinky19.mpi-sws.org",
        "HRT": 26966656813082316,
        "Operation": "fork",
        "Timestamp": "1557750296753.360840",
        "TenantClass": 0,
        "Source": "DataXceiver.java:1257",
        "ThreadID": 37715,
        "ThreadName": "",
        "EventID": "8F021904E4890BF5",
        "BaggageBytes": "[[248 5] [240 0] [0 204 26 153 31 13 92 127 109] [240 1] [0 25 155 137 22 53 184 69 137] [240 3] [0 2]]",
        "ProcessID": 2319
      },
      {
        "Cycles": 0,
        "Agent": "edu.brown.cs.systems.xtrace.logging.BaggageWrappers",
        "ProcessName": "Data",
        "TaskID": "CC1A991F0D5C7F6D",
        "ParentEventID": [
          "8F021904E4890BF5"
        ],
        "Label": "Forking current baggage with Baggage.fork()",
        "Title": "X-Trace Task",
        "Host": "pinky19.mpi-sws.org",
        "HRT": 26966656813153540,
        "Operation": "fork",
        "Timestamp": "1557750296753.431885",
        "TenantClass": 0,
        "Source": "PacketHeader.java:95",
        "ThreadID": 37715,
        "ThreadName": "",
        "EventID": "4D7E940064F45D85",
        "BaggageBytes": "[[248 5] [240 0] [0 204 26 153 31 13 92 127 109] [240 1] [0 143 2 25 4 228 137 11 245] [240 3] [0 2]]",
        "ProcessID": 2319
      },
      {
        "Cycles": 0,
        "Agent": "Execution-Sleep",
        "ProcessName": "Read",
        "TaskID": "CC1A991F0D5C7F6D",
        "ParentEventID": [
          "5D2F3FC74B2F1174"
        ],
        "Label": "waited",
        "Title": "X-Trace Task",
        "Host": "pinky19.mpi-sws.org",
        "Duration": "308846",
        "HRT": 26966656813152057,
        "Operation": "waited",
        "Timestamp": "1557750296753.420166",
        "TenantClass": 0,
        "Source": "SocketIOWithTimeout.java:335",
        "ThreadID": 1,
        "ThreadName": "",
        "EventID": "3A026D16757E6C68",
        "ProcessID": 2801
      },
      {
        "Cycles": 0,
        "Agent": "edu.brown.cs.systems.xtrace.logging.BaggageWrappers",
        "ProcessName": "Read",
        "TaskID": "CC1A991F0D5C7F6D",
        "ParentEventID": [
          "3A026D16757E6C68",
          "8F021904E4890BF5"
        ],
        "Label": "Merged current baggage with other baggage",
        "Title": "X-Trace Task",
        "Host": "pinky19.mpi-sws.org",
        "HRT": 26966656813239323,
        "Operation": "join",
        "Timestamp": "1557750296753.507568",
        "TenantClass": 0,
        "Source": "RemoteBlockReader2.java:429",
        "ThreadID": 1,
        "ThreadName": "",
        "EventID": "120162EEE7FFD814",
        "ProcessID": 2801
      },
      {
        "Cycles": 0,
        "Agent": "Execution-Sleep",
        "ProcessName": "Data",
        "TaskID": "CC1A991F0D5C7F6D",
        "ParentEventID": [
          "4D7E940064F45D85"
        ],
        "Label": "waited",
        "Title": "X-Trace Task",
        "Host": "pinky19.mpi-sws.org",
        "Duration": "5094",
        "HRT": 26966656813220403,
        "Operation": "waited",
        "Timestamp": "1557750296753.498779",
        "TenantClass": 0,
        "Source": "SocketIOWithTimeout.java:335",
        "ThreadID": 37715,
        "ThreadName": "",
        "EventID": "1D7AFF659C5CB97C",
        "BaggageBytes": "[[248 5] [240 0] [0 204 26 153 31 13 92 127 109] [240 1] [0 77 126 148 0 100 244 93 133] [240 3] [0 2]]",
        "ProcessID": 2319
      },
      {
        "Cycles": 0,
        "Agent": "edu.brown.cs.systems.xtrace.logging.BaggageWrappers",
        "ProcessName": "Data",
        "TaskID": "CC1A991F0D5C7F6D",
        "ParentEventID": [
          "1D7AFF659C5CB97C"
        ],
        "Label": "Forking current baggage with Baggage.fork()",
        "Title": "X-Trace Task",
        "Host": "pinky19.mpi-sws.org",
        "HRT": 26966656813298574,
        "Operation": "fork",
        "Timestamp": "1557750296753.576904",
        "TenantClass": 0,
        "Source": "PacketHeader.java:95",
        "ThreadID": 37715,
        "ThreadName": "",
        "EventID": "6107A52BFBF69AA8",
        "BaggageBytes": "[[248 5] [240 0] [0 204 26 153 31 13 92 127 109] [240 1] [0 29 122 255 101 156 92 185 124] [240 3] [0 2]]",
        "ProcessID": 2319
      },
      {
        "Cycles": 0,
        "Agent": "edu.brown.cs.systems.xtrace.logging.BaggageWrappers",
        "ProcessName": "Read",
        "TaskID": "CC1A991F0D5C7F6D",
        "ParentEventID": [
          "4D7E940064F45D85",
          "120162EEE7FFD814"
        ],
        "Label": "Merged current baggage with other baggage",
        "Title": "X-Trace Task",
        "Host": "pinky19.mpi-sws.org",
        "HRT": 26966656813329911,
        "Operation": "join",
        "Timestamp": "1557750296753.598145",
        "TenantClass": 0,
        "Source": "PacketHeader.java:168",
        "ThreadID": 1,
        "ThreadName": "",
        "EventID": "2F5415F859D3B1C9",
        "ProcessID": 2801
      },
      {
        "Cycles": 0,
        "Agent": "edu.brown.cs.systems.xtrace.logging.BaggageWrappers",
        "ProcessName": "Read",
        "TaskID": "CC1A991F0D5C7F6D",
        "ParentEventID": [
          "6107A52BFBF69AA8",
          "2F5415F859D3B1C9"
        ],
        "Label": "Merged current baggage with other baggage",
        "Title": "X-Trace Task",
        "Host": "pinky19.mpi-sws.org",
        "HRT": 26966656813445520,
        "Operation": "join",
        "Timestamp": "1557750296753.713623",
        "TenantClass": 0,
        "Source": "PacketHeader.java:168",
        "ThreadID": 1,
        "ThreadName": "",
        "EventID": "6E7944848087972B",
        "ProcessID": 2801
      },
      {
        "Cycles": 0,
        "Agent": "edu.brown.cs.systems.xtrace.logging.BaggageWrappers",
        "ProcessName": "Read",
        "TaskID": "CC1A991F0D5C7F6D",
        "ParentEventID": [
          "6E7944848087972B"
        ],
        "Label": "Forking current baggage with Baggage.fork()",
        "Title": "X-Trace Task",
        "Host": "pinky19.mpi-sws.org",
        "HRT": 26966656813456709,
        "Operation": "fork",
        "Timestamp": "1557750296753.724854",
        "TenantClass": 0,
        "Source": "RemoteBlockReader2.java:361",
        "ThreadID": 1,
        "ThreadName": "",
        "EventID": "A00AC110D0BF4807",
        "ProcessID": 2801
      },
      {
        "Cycles": 0,
        "Agent": "edu.brown.cs.systems.xtrace.logging.BaggageWrappers",
        "ProcessName": "Read",
        "TaskID": "CC1A991F0D5C7F6D",
        "ParentEventID": [
          "A00AC110D0BF4807"
        ],
        "Label": "Forking current baggage with Baggage.fork()",
        "Title": "X-Trace Task",
        "Host": "pinky19.mpi-sws.org",
        "HRT": 26966656813527279,
        "Operation": "fork",
        "Timestamp": "1557750296753.795410",
        "TenantClass": 0,
        "Source": "DataTransferProtoUtil.java:94",
        "ThreadID": 1,
        "ThreadName": "",
        "EventID": "EDC494B9A6B799FB",
        "ProcessID": 2801
      },
      {
        "Cycles": 0,
        "Agent": "Execution-Sleep",
        "ProcessName": "Data",
        "TaskID": "CC1A991F0D5C7F6D",
        "ParentEventID": [
          "6107A52BFBF69AA8"
        ],
        "Label": "waited",
        "Title": "X-Trace Task",
        "Host": "pinky19.mpi-sws.org",
        "Duration": "104351",
        "HRT": 26966656813499626,
        "Operation": "waited",
        "Timestamp": "1557750296753.778076",
        "TenantClass": 0,
        "Source": "SocketIOWithTimeout.java:335",
        "ThreadID": 37715,
        "ThreadName": "",
        "EventID": "E4D26D830199A3AF",
        "BaggageBytes": "[[248 5] [240 0] [0 204 26 153 31 13 92 127 109] [240 1] [0 97 7 165 43 251 246 154 168] [240 3] [0 2]]",
        "ProcessID": 2319
      },
      {
        "Cycles": 0,
        "Agent": "edu.brown.cs.systems.xtrace.logging.BaggageWrappers",
        "ProcessName": "Data",
        "TaskID": "CC1A991F0D5C7F6D",
        "ParentEventID": [
          "A00AC110D0BF4807",
          "E4D26D830199A3AF"
        ],
        "Label": "Merged current baggage with other baggage",
        "Title": "X-Trace Task",
        "Host": "pinky19.mpi-sws.org",
        "HRT": 26966656813554352,
        "Operation": "join",
        "Timestamp": "1557750296753.832764",
        "TenantClass": 0,
        "Source": "DataXceiver.java:574",
        "ThreadID": 37715,
        "ThreadName": "",
        "EventID": "6316D31DF392AEB4",
        "BaggageBytes": "[[248 5] [240 0] [0 204 26 153 31 13 92 127 109] [240 1] [0 160 10 193 16 208 191 72 7] [0 228 210 109 131 1 153 163 175] [240 3] [0 2]]",
        "ProcessID": 2319
      },
      {
        "Cycles": 0,
        "Agent": "Execution-CPU",
        "ProcessName": "Data",
        "TaskID": "CC1A991F0D5C7F6D",
        "ParentEventID": [
          "EDC494B9A6B799FB"
        ],
        "Label": "set",
        "Title": "X-Trace Task",
        "Host": "pinky19.mpi-sws.org",
        "HRT": 26966656813629443,
        "Operation": "set",
        "Timestamp": "1557750296753.907959",
        "TenantClass": 0,
        "Source": "Receiver.java:117",
        "ThreadID": 37715,
        "ThreadName": "",
        "EventID": "E20217D4E81495AA",
        "BaggageBytes": "[[248 5] [240 0] [0 204 26 153 31 13 92 127 109] [240 1] [0 237 196 148 185 166 183 153 251] [240 3] [0 2]]",
        "ProcessID": 2319
      },
      {
        "Cycles": 0,
        "Agent": "Execution-CPU",
        "ProcessName": "Data",
        "TaskID": "CC1A991F0D5C7F6D",
        "ParentEventID": [
          "6316D31DF392AEB4"
        ],
        "Label": "unset",
        "Title": "X-Trace Task",
        "Host": "pinky19.mpi-sws.org",
        "Duration": "582946",
        "HRT": 26966656813578213,
        "Operation": "unset",
        "Timestamp": "1557750296753.856689",
        "TenantClass": 0,
        "Source": "DataXceiver.java:261",
        "ThreadID": 37715,
        "ThreadName": "",
        "EventID": "31F034257F94C022",
        "BaggageBytes": "[[248 5] [240 0] [0 204 26 153 31 13 92 127 109] [240 1] [0 99 22 211 29 243 146 174 180] [240 3] [0 2]]",
        "ProcessID": 2319
      },
      {
        "Cycles": 0,
        "Agent": "edu.brown.cs.systems.xtrace.logging.XTraceInit",
        "ProcessName": "Data",
        "TaskID": "CC1A991F0D5C7F6D",
        "ParentEventID": [
          "E20217D4E81495AA"
        ],
        "Label": "Thread.setName: DataXceiver for client DFSClient_NONMAPREDUCE_310321604_1 at /139.19.171.63:51816 [Sending block BP-1633380353-139.19.171.63-1554193446451:blk_1073761123_20299]",
        "Title": "X-Trace Task",
        "Host": "pinky19.mpi-sws.org",
        "HRT": 26966656813656203,
        "Timestamp": "1557750296753.934570",
        "TenantClass": 0,
        "Source": "DataXceiver.java:168",
        "ThreadID": 37715,
        "ThreadName": "",
        "EventID": "4851615BFA5805AC",
        "BaggageBytes": "[[248 5] [240 0] [0 204 26 153 31 13 92 127 109] [240 1] [0 226 2 23 212 232 20 149 170] [240 3] [0 2]]",
        "ProcessID": 2319
      },
      {
        "Cycles": 0,
        "Agent": "Execution-Sleep",
        "ProcessName": "Read",
        "TaskID": "CC1A991F0D5C7F6D",
        "ParentEventID": [
          "EDC494B9A6B799FB"
        ],
        "Label": "waited",
        "Title": "X-Trace Task",
        "Host": "pinky19.mpi-sws.org",
        "Duration": "176073",
        "HRT": 26966656813775044,
        "Operation": "waited",
        "Timestamp": "1557750296754.043213",
        "TenantClass": 0,
        "Source": "SocketIOWithTimeout.java:335",
        "ThreadID": 1,
        "ThreadName": "",
        "EventID": "89C7176FFFCD0E7F",
        "ProcessID": 2801
      },
      {
        "Cycles": 0,
        "Agent": "edu.brown.cs.systems.xtrace.logging.BaggageWrappers",
        "ProcessName": "Data",
        "TaskID": "CC1A991F0D5C7F6D",
        "ParentEventID": [
          "4851615BFA5805AC"
        ],
        "Label": "Forking current baggage with Baggage.fork()",
        "Title": "X-Trace Task",
        "Host": "pinky19.mpi-sws.org",
        "HRT": 26966656813717615,
        "Operation": "fork",
        "Timestamp": "1557750296753.996094",
        "TenantClass": 0,
        "Source": "DataXceiver.java:1257",
        "ThreadID": 37715,
        "ThreadName": "",
        "EventID": "2BD26274CC4A70A4",
        "BaggageBytes": "[[248 5] [240 0] [0 204 26 153 31 13 92 127 109] [240 1] [0 72 81 97 91 250 88 5 172] [240 3] [0 2]]",
        "ProcessID": 2319
      },
      {
        "Cycles": 0,
        "Agent": "edu.brown.cs.systems.xtrace.logging.BaggageWrappers",
        "ProcessName": "Data",
        "TaskID": "CC1A991F0D5C7F6D",
        "ParentEventID": [
          "2BD26274CC4A70A4"
        ],
        "Label": "Forking current baggage with Baggage.fork()",
        "Title": "X-Trace Task",
        "Host": "pinky19.mpi-sws.org",
        "HRT": 26966656813776526,
        "Operation": "fork",
        "Timestamp": "1557750296754.054932",
        "TenantClass": 0,
        "Source": "PacketHeader.java:95",
        "ThreadID": 37715,
        "ThreadName": "",
        "EventID": "0B44E4C6BFB9755B",
        "BaggageBytes": "[[248 5] [240 0] [0 204 26 153 31 13 92 127 109] [240 1] [0 43 210 98 116 204 74 112 164] [240 3] [0 2]]",
        "ProcessID": 2319
      },
      {
        "Cycles": 0,
        "Agent": "Execution-Sleep",
        "ProcessName": "Data",
        "TaskID": "CC1A991F0D5C7F6D",
        "ParentEventID": [
          "0B44E4C6BFB9755B"
        ],
        "Label": "waited",
        "Title": "X-Trace Task",
        "Host": "pinky19.mpi-sws.org",
        "Duration": "4478",
        "HRT": 26966656813832373,
        "Operation": "waited",
        "Timestamp": "1557750296754.110840",
        "TenantClass": 0,
        "Source": "SocketIOWithTimeout.java:335",
        "ThreadID": 37715,
        "ThreadName": "",
        "EventID": "800D9F249DD0B9E2",
        "BaggageBytes": "[[248 5] [240 0] [0 204 26 153 31 13 92 127 109] [240 1] [0 11 68 228 198 191 185 117 91] [240 3] [0 2]]",
        "ProcessID": 2319
      },
      {
        "Cycles": 0,
        "Agent": "edu.brown.cs.systems.xtrace.logging.BaggageWrappers",
        "ProcessName": "Read",
        "TaskID": "CC1A991F0D5C7F6D",
        "ParentEventID": [
          "89C7176FFFCD0E7F",
          "2BD26274CC4A70A4"
        ],
        "Label": "Merged current baggage with other baggage",
        "Title": "X-Trace Task",
        "Host": "pinky19.mpi-sws.org",
        "HRT": 26966656813835798,
        "Operation": "join",
        "Timestamp": "1557750296754.104004",
        "TenantClass": 0,
        "Source": "RemoteBlockReader2.java:429",
        "ThreadID": 1,
        "ThreadName": "",
        "EventID": "B400B7C219B7A312",
        "ProcessID": 2801
      },
      {
        "Cycles": 0,
        "Agent": "edu.brown.cs.systems.xtrace.logging.BaggageWrappers",
        "ProcessName": "Data",
        "TaskID": "CC1A991F0D5C7F6D",
        "ParentEventID": [
          "800D9F249DD0B9E2"
        ],
        "Label": "Forking current baggage with Baggage.fork()",
        "Title": "X-Trace Task",
        "Host": "pinky19.mpi-sws.org",
        "HRT": 26966656813900517,
        "Operation": "fork",
        "Timestamp": "1557750296754.178955",
        "TenantClass": 0,
        "Source": "PacketHeader.java:95",
        "ThreadID": 37715,
        "ThreadName": "",
        "EventID": "9397B4130C253EA7",
        "BaggageBytes": "[[248 5] [240 0] [0 204 26 153 31 13 92 127 109] [240 1] [0 128 13 159 36 157 208 185 226] [240 3] [0 2]]",
        "ProcessID": 2319
      },
      {
        "Cycles": 0,
        "Agent": "edu.brown.cs.systems.xtrace.logging.BaggageWrappers",
        "ProcessName": "Read",
        "TaskID": "CC1A991F0D5C7F6D",
        "ParentEventID": [
          "0B44E4C6BFB9755B",
          "B400B7C219B7A312"
        ],
        "Label": "Merged current baggage with other baggage",
        "Title": "X-Trace Task",
        "Host": "pinky19.mpi-sws.org",
        "HRT": 26966656813920681,
        "Operation": "join",
        "Timestamp": "1557750296754.188721",
        "TenantClass": 0,
        "Source": "PacketHeader.java:168",
        "ThreadID": 1,
        "ThreadName": "",
        "EventID": "101AC2622F40EC90",
        "ProcessID": 2801
      },
      {
        "Cycles": 0,
        "Agent": "Execution-Sleep",
        "ProcessName": "Data",
        "TaskID": "CC1A991F0D5C7F6D",
        "ParentEventID": [
          "9397B4130C253EA7"
        ],
        "Label": "waited",
        "Title": "X-Trace Task",
        "Host": "pinky19.mpi-sws.org",
        "Duration": "4500",
        "HRT": 26966656813955048,
        "Operation": "waited",
        "Timestamp": "1557750296754.233398",
        "TenantClass": 0,
        "Source": "SocketIOWithTimeout.java:335",
        "ThreadID": 37715,
        "ThreadName": "",
        "EventID": "AE3ED939E4E52621",
        "BaggageBytes": "[[248 5] [240 0] [0 204 26 153 31 13 92 127 109] [240 1] [0 147 151 180 19 12 37 62 167] [240 3] [0 2]]",
        "ProcessID": 2319
      },
      {
        "Cycles": 0,
        "Agent": "Execution-CPU",
        "ProcessName": "Data",
        "TaskID": "CC1A991F0D5C7F6D",
        "ParentEventID": [
          "A44033C0446972E9"
        ],
        "Label": "unset",
        "Title": "X-Trace Task",
        "Host": "pinky19.mpi-sws.org",
        "Duration": "492053",
        "HRT": 26966656814138985,
        "Operation": "unset",
        "Timestamp": "1557750296754.417480",
        "TenantClass": 0,
        "Source": "DataXceiver.java:261",
        "ThreadID": 37715,
        "ThreadName": "",
        "EventID": "BBDBDB953975C733",
        "BaggageBytes": "[[248 5] [240 0] [0 204 26 153 31 13 92 127 109] [240 1] [0 164 64 51 192 68 105 114 233] [240 3] [0 2]]",
        "ProcessID": 2319
      },
      {
        "Cycles": 0,
        "Agent": "edu.brown.cs.systems.xtrace.logging.BaggageWrappers",
        "ProcessName": "Data",
        "TaskID": "CC1A991F0D5C7F6D",
        "ParentEventID": [
          "AE3ED939E4E52621"
        ],
        "Label": "Forking current baggage with Baggage.fork()",
        "Title": "X-Trace Task",
        "Host": "pinky19.mpi-sws.org",
        "HRT": 26966656814022977,
        "Operation": "fork",
        "Timestamp": "1557750296754.301270",
        "TenantClass": 0,
        "Source": "PacketHeader.java:95",
        "ThreadID": 37715,
        "ThreadName": "",
        "EventID": "A44033C0446972E9",
        "BaggageBytes": "[[248 5] [240 0] [0 204 26 153 31 13 92 127 109] [240 1] [0 174 62 217 57 228 229 38 33] [240 3] [0 2]]",
        "ProcessID": 2319
      },
      {
        "Cycles": 0,
        "Agent": "edu.brown.cs.systems.retro.benchmarks.hdfs_client.Reader",
        "ProcessName": "Read",
        "TaskID": "CC1A991F0D5C7F6D",
        "ParentEventID": [
          "0"
        ],
        "Label": "Reading file",
        "Title": "X-Trace Task",
        "Host": "pinky19.mpi-sws.org",
        "HRT": 26966656811979052,
        "Timestamp": "1557750296752.247070",
        "TenantClass": 0,
        "ThreadID": 1,
        "ThreadName": "",
        "EventID": "EB61C11BA7ECBE51",
        "ProcessID": 2801,
        "Tag": [
          "reader_100kb",
          "Read Size: 102400"
        ]
      }
    ]
  }
]