[
  {
    "id": "4AD5E11A59A83C01",
    "reports": [
      {
        "Cycles": 0,
        "Agent": "Execution-CPU",
        "ProcessName": "Read",
        "TaskID": "4AD5E11A59A83C01",
        "ParentEventID": [
          "0560E81AC2FAC58A"
        ],
        "Label": "unset",
        "Title": "X-Trace Task",
        "Host": "pinky19.mpi-sws.org",
        "Duration": "21377244",
        "HRT": 26962512889117432,
        "Operation": "unset",
        "Timestamp": "1557746152829.881104",
        "TenantClass": 0,
        "Source": "Client.java:1027",
        "ThreadID": 1,
        "ThreadName": "",
        "EventID": "74E647B5A038393B",
        "ProcessID": 36430
      },
      {
        "Cycles": 0,
        "Agent": "org.apache.hadoop.ipc.ProtobufRpcEngine",
        "ProcessName": "Read",
        "TaskID": "4AD5E11A59A83C01",
        "ParentEventID": [
          "91FC0ED9D432D699"
        ],
        "Label": "Invoking org.apache.hadoop.hdfs.protocol.ClientProtocol.getBlockLocations",
        "Title": "X-Trace Task",
        "Host": "pinky19.mpi-sws.org",
        "HRT": 26962512889090192,
        "Timestamp": "1557746152829.854004",
        "TenantClass": 0,
        "Source": "ProtobufRpcEngine.java:228",
        "ThreadID": 1,
        "ThreadName": "",
        "EventID": "0560E81AC2FAC58A",
        "ProcessID": 36430
      },
      {
        "Cycles": 0,
        "Agent": "Execution-CPU",
        "ProcessName": "Read",
        "TaskID": "4AD5E11A59A83C01",
        "ParentEventID": [
          "74E647B5A038393B"
        ],
        "Label": "set",
        "Title": "X-Trace Task",
        "Host": "pinky19.mpi-sws.org",
        "HRT": 26962512889166007,
        "Operation": "set",
        "Timestamp": "1557746152829.929688",
        "TenantClass": 0,
        "Source": "Client.java:1032",
        "ThreadID": 41,
        "ThreadName": "",
        "EventID": "A611A34476D7A37B",
        "ProcessID": 36430
      },
      {
        "Cycles": 0,
        "Agent": "edu.brown.cs.systems.xtrace.logging.BaggageWrappers",
        "ProcessName": "Read",
        "TaskID": "4AD5E11A59A83C01",
        "ParentEventID": [
          "A611A34476D7A37B"
        ],
        "Label": "Forking current baggage with Baggage.fork()",
        "Title": "X-Trace Task",
        "Host": "pinky19.mpi-sws.org",
        "HRT": 26962512889185068,
        "Operation": "fork",
        "Timestamp": "1557746152829.948730",
        "TenantClass": 0,
        "Source": "Client.java:1043",
        "ThreadID": 41,
        "ThreadName": "",
        "EventID": "6B2265C0541C3533",
        "ProcessID": 36430
      },
      {
        "Cycles": 0,
        "Agent": "edu.brown.cs.systems.retro.benchmarks.hdfs_client.Reader",
        "ProcessName": "Read",
        "TaskID": "4AD5E11A59A83C01",
        "ParentEventID": [
          "DEC60A423D183CCE"
        ],
        "Label": "Reading file",
        "Title": "X-Trace Task",
        "Host": "pinky19.mpi-sws.org",
        "HRT": 26962512889060113,
        "Timestamp": "1557746152829.823975",
        "TenantClass": 0,
        "ThreadID": 1,
        "ThreadName": "",
        "EventID": "91FC0ED9D432D699",
        "ProcessID": 36430
      },
      {
        "Cycles": 0,
        "Agent": "Execution-CPU",
        "ProcessName": "Read",
        "TaskID": "4AD5E11A59A83C01",
        "ParentEventID": [
          "6B2265C0541C3533"
        ],
        "Label": "unset",
        "Title": "X-Trace Task",
        "Host": "pinky19.mpi-sws.org",
        "Duration": "65026",
        "HRT": 26962512889250094,
        "Operation": "unset",
        "Timestamp": "1557746152830.013916",
        "TenantClass": 0,
        "Source": "Client.java:1062",
        "ThreadID": 41,
        "ThreadName": "",
        "EventID": "EF36EB0BDDD210D7",
        "ProcessID": 36430
      },
      {
        "Cycles": 0,
        "Agent": "Execution-CPU",
        "ProcessName": "Read",
        "TaskID": "4AD5E11A59A83C01",
        "ParentEventID": [
          "EF36EB0BDDD210D7"
        ],
        "Label": "set",
        "Title": "X-Trace Task",
        "Host": "pinky19.mpi-sws.org",
        "HRT": 26962512889271200,
        "Operation": "set",
        "Timestamp": "1557746152830.034912",
        "TenantClass": 0,
        "Source": "Client.java:1104",
        "ThreadID": 1,
        "ThreadName": "",
        "EventID": "4FB6DCC794D94C04",
        "ProcessID": 36430
      },
      {
        "Cycles": 0,
        "Agent": "Execution-CPU",
        "ProcessName": "Name",
        "TaskID": "4AD5E11A59A83C01",
        "ParentEventID": [
          "6B2265C0541C3533"
        ],
        "Label": "set",
        "Title": "X-Trace Task",
        "Host": "pinky19.mpi-sws.org",
        "HRT": 26962512889296838,
        "Operation": "set",
        "Timestamp": "1557746152830.233887",
        "TenantClass": 0,
        "Source": "Server.java:1840",
        "ThreadID": 48,
        "ThreadName": "",
        "EventID": "78504273D90C4056",
        "BaggageBytes": "[[248 5] [240 0] [0 74 213 225 26 89 168 60 1] [240 1] [0 107 34 101 192 84 28 53 51] [240 3] [0 2]]",
        "ProcessID": 2171
      },
      {
        "Cycles": 0,
        "Agent": "Execution-CPU",
        "ProcessName": "Name",
        "TaskID": "4AD5E11A59A83C01",
        "ParentEventID": [
          "EEA7EDB7C42FE606"
        ],
        "Label": "unset",
        "Title": "X-Trace Task",
        "Host": "pinky19.mpi-sws.org",
        "Duration": "29807",
        "HRT": 26962512889347644,
        "Operation": "unset",
        "Timestamp": "1557746152830.284668",
        "TenantClass": 0,
        "Source": "Server.java:1828",
        "ThreadID": 48,
        "ThreadName": "",
        "EventID": "39E030A6E3A0FA40",
        "BaggageBytes": "[[248 5] [240 0] [0 74 213 225 26 89 168 60 1] [240 1] [0 238 167 237 183 196 47 230 6] [240 3] [0 2]]",
        "ProcessID": 2171
      },
      {
        "Cycles": 0,
        "Agent": "Execution-CPU",
        "ProcessName": "Name",
        "TaskID": "4AD5E11A59A83C01",
        "ParentEventID": [
          "EEA7EDB7C42FE606"
        ],
        "Label": "set",
        "Title": "X-Trace Task",
        "Host": "pinky19.mpi-sws.org",
        "HRT": 26962512889356637,
        "Operation": "set",
        "Timestamp": "1557746152830.293457",
        "TenantClass": 0,
        "Source": "Server.java:2071",
        "ThreadID": 56,
        "ThreadName": "",
        "EventID": "9657C88F8E1944A8",
        "BaggageBytes": "[[248 5] [240 0] [0 74 213 225 26 89 168 60 1] [240 1] [0 238 167 237 183 196 47 230 6] [240 3] [0 2]]",
        "ProcessID": 2171
      },
      {
        "Cycles": 0,
        "Agent": "org.apache.hadoop.ipc.Server",
        "ProcessName": "Name",
        "TaskID": "4AD5E11A59A83C01",
        "ParentEventID": [
          "9657C88F8E1944A8"
        ],
        "Label": "getBlockLocations in org.apache.hadoop.hdfs.protocol.ClientProtocol",
        "Title": "X-Trace Task",
        "Host": "pinky19.mpi-sws.org",
        "HRT": 26962512889390874,
        "Timestamp": "1557746152830.327881",
        "TenantClass": 0,
        "Source": "ProtobufRpcEngine.java:601",
        "ThreadID": 56,
        "ThreadName": "",
        "EventID": "D394CAAA3CC8A7F0",
        "BaggageBytes": "[[248 5] [240 0] [0 74 213 225 26 89 168 60 1] [240 1] [0 150 87 200 143 142 25 68 168] [240 3] [0 2]]",
        "ProcessID": 2171
      },
      {
        "Cycles": 0,
        "Agent": "org.apache.hadoop.hdfs.server.namenode.FSNamesystem.audit",
        "ProcessName": "Name",
        "TaskID": "4AD5E11A59A83C01",
        "ParentEventID": [
          "D394CAAA3CC8A7F0"
        ],
        "Label": "allowed=true\tugi=plascas (auth:SIMPLE)\tip=/139.19.171.63\tcmd=open\tsrc=/ds/wgjBGQXtctRBB7zi\tdst=null\tperm=null\tproto=rpc",
        "Title": "X-Trace Task",
        "Host": "pinky19.mpi-sws.org",
        "HRT": 26962512889441677,
        "Timestamp": "1557746152830.378662",
        "TenantClass": 0,
        "Source": "FSNamesystem.java:8313",
        "ThreadID": 56,
        "ThreadName": "",
        "EventID": "A0450DA22B0650CA",
        "BaggageBytes": "[[248 5] [240 0] [0 74 213 225 26 89 168 60 1] [240 1] [0 211 148 202 170 60 200 167 240] [240 3] [0 2]]",
        "ProcessID": 2171
      },
      {
        "Cycles": 0,
        "Agent": "edu.brown.cs.systems.xtrace.logging.BaggageWrappers",
        "ProcessName": "Name",
        "TaskID": "4AD5E11A59A83C01",
        "ParentEventID": [
          "A0450DA22B0650CA"
        ],
        "Label": "Forking current baggage with Baggage.fork()",
        "Title": "X-Trace Task",
        "Host": "pinky19.mpi-sws.org",
        "HRT": 26962512889484480,
        "Operation": "fork",
        "Timestamp": "1557746152830.421387",
        "TenantClass": 0,
        "Source": "Server.java:2398",
        "ThreadID": 56,
        "ThreadName": "",
        "EventID": "5E44C8E160DE2DFD",
        "BaggageBytes": "[[248 5] [240 0] [0 74 213 225 26 89 168 60 1] [240 1] [0 160 69 13 162 43 6 80 202] [240 3] [0 2]]",
        "ProcessID": 2171
      },
      {
        "Cycles": 0,
        "Agent": "edu.brown.cs.systems.xtrace.logging.BaggageWrappers",
        "ProcessName": "Name",
        "TaskID": "4AD5E11A59A83C01",
        "ParentEventID": [
          "78504273D90C4056"
        ],
        "Label": "Forking current baggage with Baggage.fork()",
        "Title": "X-Trace Task",
        "Host": "pinky19.mpi-sws.org",
        "HRT": 26962512889321145,
        "Operation": "fork",
        "Timestamp": "1557746152830.258057",
        "TenantClass": 0,
        "Source": "Server.java:550",
        "ThreadID": 48,
        "ThreadName": "",
        "EventID": "EEA7EDB7C42FE606",
        "BaggageBytes": "[[248 5] [240 0] [0 74 213 225 26 89 168 60 1] [240 1] [0 120 80 66 115 217 12 64 86] [240 3] [0 2]]",
        "ProcessID": 2171
      },
      {
        "Cycles": 0,
        "Agent": "Execution-CPU",
        "ProcessName": "Name",
        "TaskID": "4AD5E11A59A83C01",
        "ParentEventID": [
          "5E44C8E160DE2DFD"
        ],
        "Label": "unset",
        "Title": "X-Trace Task",
        "Host": "pinky19.mpi-sws.org",
        "Duration": "208447",
        "HRT": 26962512889587882,
        "Operation": "unset",
        "Timestamp": "1557746152830.524902",
        "TenantClass": 0,
        "Source": "Server.java:1058",
        "ThreadID": 56,
        "ThreadName": "",
        "EventID": "DBAACA0241B42DF5",
        "BaggageBytes": "[[248 5] [240 0] [0 74 213 225 26 89 168 60 1] [240 1] [0 94 68 200 225 96 222 45 253] [240 3] [0 2]]",
        "ProcessID": 2171
      },
      {
        "Cycles": 0,
        "Agent": "Execution-CPU",
        "ProcessName": "Read",
        "TaskID": "4AD5E11A59A83C01",
        "ParentEventID": [
          "E0DFCD0E6695D63A"
        ],
        "Label": "unset",
        "Title": "X-Trace Task",
        "Host": "pinky19.mpi-sws.org",
        "Duration": "8455",
        "HRT": 26962512889660924,
        "Operation": "unset",
        "Timestamp": "1557746152830.424805",
        "TenantClass": 0,
        "Source": "Client.java:1168",
        "ThreadID": 37,
        "ThreadName": "",
        "EventID": "90A7D2CA089450D1",
        "ProcessID": 36430
      },
      {
        "Cycles": 0,
        "Agent": "Execution-CPU",
        "ProcessName": "Read",
        "TaskID": "4AD5E11A59A83C01",
        "ParentEventID": [
          "5E44C8E160DE2DFD"
        ],
        "Label": "set",
        "Title": "X-Trace Task",
        "Host": "pinky19.mpi-sws.org",
        "HRT": 26962512889638169,
        "Operation": "set",
        "Timestamp": "1557746152830.401855",
        "TenantClass": 0,
        "Source": "Client.java:302",
        "ThreadID": 37,
        "ThreadName": "",
        "EventID": "E0DFCD0E6695D63A",
        "ProcessID": 36430
      },
      {
        "Cycles": 0,
        "Agent": "edu.brown.cs.systems.xtrace.logging.BaggageWrappers",
        "ProcessName": "Read",
        "TaskID": "4AD5E11A59A83C01",
        "ParentEventID": [
          "90A7D2CA089450D1",
          "B8D744C581B264A5"
        ],
        "Label": "Merged current baggage with other baggage",
        "Title": "X-Trace Task",
        "Host": "pinky19.mpi-sws.org",
        "HRT": 26962512889694532,
        "Operation": "join",
        "Timestamp": "1557746152830.458252",
        "TenantClass": 0,
        "Source": "Client.java:1545",
        "ThreadID": 1,
        "ThreadName": "",
        "EventID": "DAD0CBA7747E3BFF",
        "ProcessID": 36430
      },
      {
        "Cycles": 0,
        "Agent": "Execution-Sleep",
        "ProcessName": "Read",
        "TaskID": "4AD5E11A59A83C01",
        "ParentEventID": [
          "4FB6DCC794D94C04"
        ],
        "Label": "waited",
        "Title": "X-Trace Task",
        "Host": "pinky19.mpi-sws.org",
        "Duration": "398881",
        "HRT": 26962512889678277,
        "Operation": "waited",
        "Timestamp": "1557746152830.442139",
        "TenantClass": 0,
        "Source": "Client.java:1537",
        "ThreadID": 1,
        "ThreadName": "",
        "EventID": "B8D744C581B264A5",
        "ProcessID": 36430
      },
      {
        "Cycles": 0,
        "Agent": "org.apache.hadoop.ipc.ProtobufRpcEngine",
        "ProcessName": "Read",
        "TaskID": "4AD5E11A59A83C01",
        "ParentEventID": [
          "DAD0CBA7747E3BFF"
        ],
        "Label": "org.apache.hadoop.hdfs.protocol.ClientProtocol.getBlockLocations completed",
        "Title": "X-Trace Task",
        "Host": "pinky19.mpi-sws.org",
        "HRT": 26962512889734599,
        "Timestamp": "1557746152830.498291",
        "TenantClass": 0,
        "Source": "ProtobufRpcEngine.java:275",
        "ThreadID": 1,
        "ThreadName": "",
        "EventID": "E320B06862FF0BC8",
        "ProcessID": 36430
      },
      {
        "Cycles": 0,
        "Agent": "Execution-CPU",
        "ProcessName": "Data",
        "TaskID": "4AD5E11A59A83C01",
        "ParentEventID": [
          "7900DC18228D1517"
        ],
        "Label": "set",
        "Title": "X-Trace Task",
        "Host": "pinky26.mpi-sws.org",
        "HRT": 47512169619990715,
        "Operation": "set",
        "Timestamp": "1557746152830.937744",
        "TenantClass": 0,
        "Source": "Receiver.java:117",
        "ThreadID": 8227,
        "ThreadName": "",
        "EventID": "2C947DEB8D6D7FFF",
        "BaggageBytes": "[[248 5] [240 0] [0 74 213 225 26 89 168 60 1] [240 1] [0 121 0 220 24 34 141 21 23] [240 3] [0 2]]",
        "ProcessID": 17069
      },
      {
        "Cycles": 0,
        "Agent": "edu.brown.cs.systems.xtrace.logging.BaggageWrappers",
        "ProcessName": "Read",
        "TaskID": "4AD5E11A59A83C01",
        "ParentEventID": [
          "E320B06862FF0BC8"
        ],
        "Label": "Forking current baggage with Baggage.fork()",
        "Title": "X-Trace Task",
        "Host": "pinky19.mpi-sws.org",
        "HRT": 26962512889796955,
        "Operation": "fork",
        "Timestamp": "1557746152830.560791",
        "TenantClass": 0,
        "Source": "DataTransferProtoUtil.java:94",
        "ThreadID": 1,
        "ThreadName": "",
        "EventID": "7900DC18228D1517",
        "ProcessID": 36430
      },
      {
        "Cycles": 0,
        "Agent": "edu.brown.cs.systems.xtrace.logging.BaggageWrappers",
        "ProcessName": "Data",
        "TaskID": "4AD5E11A59A83C01",
        "ParentEventID": [
          "9BAD408454C26A7B"
        ],
        "Label": "Forking current baggage with Baggage.fork()",
        "Title": "X-Trace Task",
        "Host": "pinky26.mpi-sws.org",
        "HRT": 47512169620359540,
        "Operation": "fork",
        "Timestamp": "1557746152831.306396",
        "TenantClass": 0,
        "Source": "DataXceiver.java:1257",
        "ThreadID": 8227,
        "ThreadName": "",
        "EventID": "D180F8A821FC6E7C",
        "BaggageBytes": "[[248 5] [240 0] [0 74 213 225 26 89 168 60 1] [240 1] [0 155 173 64 132 84 194 106 123] [240 3] [0 2]]",
        "ProcessID": 17069
      },
      {
        "Cycles": 0,
        "Agent": "edu.brown.cs.systems.xtrace.logging.XTraceInit",
        "ProcessName": "Data",
        "TaskID": "4AD5E11A59A83C01",
        "ParentEventID": [
          "2C947DEB8D6D7FFF"
        ],
        "Label": "Thread.setName: DataXceiver for client DFSClient_NONMAPREDUCE_778905418_1 at /139.19.171.63:36880 [Sending block BP-1633380353-139.19.171.63-1554193446451:blk_1073760211_19387]",
        "Title": "X-Trace Task",
        "Host": "pinky26.mpi-sws.org",
        "HRT": 47512169620127311,
        "Timestamp": "1557746152831.074219",
        "TenantClass": 0,
        "Source": "DataXceiver.java:168",
        "ThreadID": 8227,
        "ThreadName": "",
        "EventID": "9BAD408454C26A7B",
        "BaggageBytes": "[[248 5] [240 0] [0 74 213 225 26 89 168 60 1] [240 1] [0 44 148 125 235 141 109 127 255] [240 3] [0 2]]",
        "ProcessID": 17069
      },
      {
        "Cycles": 0,
        "Agent": "Execution-Sleep",
        "ProcessName": "Read",
        "TaskID": "4AD5E11A59A83C01",
        "ParentEventID": [
          "7900DC18228D1517"
        ],
        "Label": "waited",
        "Title": "X-Trace Task",
        "Host": "pinky19.mpi-sws.org",
        "Duration": "701757",
        "HRT": 26962512890583081,
        "Operation": "waited",
        "Timestamp": "1557746152831.346924",
        "TenantClass": 0,
        "Source": "SocketIOWithTimeout.java:335",
        "ThreadID": 1,
        "ThreadName": "",
        "EventID": "C2063EEBF915D083",
        "ProcessID": 36430
      },
      {
        "Cycles": 0,
        "Agent": "Execution-Sleep",
        "ProcessName": "Data",
        "TaskID": "4AD5E11A59A83C01",
        "ParentEventID": [
          "C29506671FD3476E"
        ],
        "Label": "waited",
        "Title": "X-Trace Task",
        "Host": "pinky26.mpi-sws.org",
        "Duration": "4243",
        "HRT": 47512169620509133,
        "Operation": "waited",
        "Timestamp": "1557746152831.456055",
        "TenantClass": 0,
        "Source": "SocketIOWithTimeout.java:335",
        "ThreadID": 8227,
        "ThreadName": "",
        "EventID": "6A79CFFC5243BD1F",
        "BaggageBytes": "[[248 5] [240 0] [0 74 213 225 26 89 168 60 1] [240 1] [0 194 149 6 103 31 211 71 110] [240 3] [0 2]]",
        "ProcessID": 17069
      },
      {
        "Cycles": 0,
        "Agent": "edu.brown.cs.systems.xtrace.logging.BaggageWrappers",
        "ProcessName": "Data",
        "TaskID": "4AD5E11A59A83C01",
        "ParentEventID": [
          "D180F8A821FC6E7C"
        ],
        "Label": "Forking current baggage with Baggage.fork()",
        "Title": "X-Trace Task",
        "Host": "pinky26.mpi-sws.org",
        "HRT": 47512169620454716,
        "Operation": "fork",
        "Timestamp": "1557746152831.401611",
        "TenantClass": 0,
        "Source": "PacketHeader.java:95",
        "ThreadID": 8227,
        "ThreadName": "",
        "EventID": "C29506671FD3476E",
        "BaggageBytes": "[[248 5] [240 0] [0 74 213 225 26 89 168 60 1] [240 1] [0 209 128 248 168 33 252 110 124] [240 3] [0 2]]",
        "ProcessID": 17069
      },
      {
        "Cycles": 0,
        "Agent": "edu.brown.cs.systems.xtrace.logging.BaggageWrappers",
        "ProcessName": "Read",
        "TaskID": "4AD5E11A59A83C01",
        "ParentEventID": [
          "D180F8A821FC6E7C",
          "C2063EEBF915D083"
        ],
        "Label": "Merged current baggage with other baggage",
        "Title": "X-Trace Task",
        "Host": "pinky19.mpi-sws.org",
        "HRT": 26962512890674003,
        "Operation": "join",
        "Timestamp": "1557746152831.437744",
        "TenantClass": 0,
        "Source": "RemoteBlockReader2.java:429",
        "ThreadID": 1,
        "ThreadName": "",
        "EventID": "49B297DF70BF16F0",
        "ProcessID": 36430
      },
      {
        "Cycles": 0,
        "Agent": "edu.brown.cs.systems.xtrace.logging.BaggageWrappers",
        "ProcessName": "Data",
        "TaskID": "4AD5E11A59A83C01",
        "ParentEventID": [
          "6A79CFFC5243BD1F"
        ],
        "Label": "Forking current baggage with Baggage.fork()",
        "Title": "X-Trace Task",
        "Host": "pinky26.mpi-sws.org",
        "HRT": 47512169620569621,
        "Operation": "fork",
        "Timestamp": "1557746152831.516602",
        "TenantClass": 0,
        "Source": "PacketHeader.java:95",
        "ThreadID": 8227,
        "ThreadName": "",
        "EventID": "2C088F5EA7F0005E",
        "BaggageBytes": "[[248 5] [240 0] [0 74 213 225 26 89 168 60 1] [240 1] [0 106 121 207 252 82 67 189 31] [240 3] [0 2]]",
        "ProcessID": 17069
      },
      {
        "Cycles": 0,
        "Agent": "Execution-Sleep",
        "ProcessName": "Read",
        "TaskID": "4AD5E11A59A83C01",
        "ParentEventID": [
          "49B297DF70BF16F0"
        ],
        "Label": "waited",
        "Title": "X-Trace Task",
        "Host": "pinky19.mpi-sws.org",
        "Duration": "64874",
        "HRT": 26962512890831998,
        "Operation": "waited",
        "Timestamp": "1557746152831.595703",
        "TenantClass": 0,
        "Source": "SocketIOWithTimeout.java:335",
        "ThreadID": 1,
        "ThreadName": "",
        "EventID": "8957AB6D2CC6A7AA",
        "ProcessID": 36430
      },
      {
        "Cycles": 0,
        "Agent": "edu.brown.cs.systems.xtrace.logging.BaggageWrappers",
        "ProcessName": "Read",
        "TaskID": "4AD5E11A59A83C01",
        "ParentEventID": [
          "6E982F3E3129720C",
          "2C088F5EA7F0005E"
        ],
        "Label": "Merged current baggage with other baggage",
        "Title": "X-Trace Task",
        "Host": "pinky19.mpi-sws.org",
        "HRT": 26962512890933088,
        "Operation": "join",
        "Timestamp": "1557746152831.696777",
        "TenantClass": 0,
        "Source": "PacketHeader.java:168",
        "ThreadID": 1,
        "ThreadName": "",
        "EventID": "5388D9B3103D1908",
        "ProcessID": 36430
      },
      {
        "Cycles": 0,
        "Agent": "edu.brown.cs.systems.xtrace.logging.BaggageWrappers",
        "ProcessName": "Read",
        "TaskID": "4AD5E11A59A83C01",
        "ParentEventID": [
          "8957AB6D2CC6A7AA",
          "C29506671FD3476E"
        ],
        "Label": "Merged current baggage with other baggage",
        "Title": "X-Trace Task",
        "Host": "pinky19.mpi-sws.org",
        "HRT": 26962512890880020,
        "Operation": "join",
        "Timestamp": "1557746152831.643799",
        "TenantClass": 0,
        "Source": "PacketHeader.java:168",
        "ThreadID": 1,
        "ThreadName": "",
        "EventID": "6E982F3E3129720C",
        "ProcessID": 36430
      },
      {
        "Cycles": 0,
        "Agent": "edu.brown.cs.systems.xtrace.logging.BaggageWrappers",
        "ProcessName": "Read",
        "TaskID": "4AD5E11A59A83C01",
        "ParentEventID": [
          "5388D9B3103D1908"
        ],
        "Label": "Forking current baggage with Baggage.fork()",
        "Title": "X-Trace Task",
        "Host": "pinky19.mpi-sws.org",
        "HRT": 26962512890943007,
        "Operation": "fork",
        "Timestamp": "1557746152831.706787",
        "TenantClass": 0,
        "Source": "RemoteBlockReader2.java:361",
        "ThreadID": 1,
        "ThreadName": "",
        "EventID": "EFC76FAD6A465142",
        "ProcessID": 36430
      },
      {
        "Cycles": 0,
        "Agent": "Execution-Sleep",
        "ProcessName": "Data",
        "TaskID": "4AD5E11A59A83C01",
        "ParentEventID": [
          "2C088F5EA7F0005E"
        ],
        "Label": "waited",
        "Title": "X-Trace Task",
        "Host": "pinky26.mpi-sws.org",
        "Duration": "189960",
        "HRT": 47512169620873209,
        "Operation": "waited",
        "Timestamp": "1557746152831.820068",
        "TenantClass": 0,
        "Source": "SocketIOWithTimeout.java:335",
        "ThreadID": 8227,
        "ThreadName": "",
        "EventID": "AA001F2F30CFE9ED",
        "BaggageBytes": "[[248 5] [240 0] [0 74 213 225 26 89 168 60 1] [240 1] [0 44 8 143 94 167 240 0 94] [240 3] [0 2]]",
        "ProcessID": 17069
      },
      {
        "Cycles": 0,
        "Agent": "Execution-CPU",
        "ProcessName": "Data",
        "TaskID": "4AD5E11A59A83C01",
        "ParentEventID": [
          "ACF25069C25C0CFC"
        ],
        "Label": "unset",
        "Title": "X-Trace Task",
        "Host": "pinky26.mpi-sws.org",
        "Duration": "937318",
        "HRT": 47512169620979451,
        "Operation": "unset",
        "Timestamp": "1557746152831.926514",
        "TenantClass": 0,
        "Source": "DataXceiver.java:261",
        "ThreadID": 8227,
        "ThreadName": "",
        "EventID": "43F134936B3D63CD",
        "BaggageBytes": "[[248 5] [240 0] [0 74 213 225 26 89 168 60 1] [240 1] [0 172 242 80 105 194 92 12 252] [240 3] [0 2]]",
        "ProcessID": 17069
      },
      {
        "Cycles": 0,
        "Agent": "edu.brown.cs.systems.xtrace.logging.BaggageWrappers",
        "ProcessName": "Data",
        "TaskID": "4AD5E11A59A83C01",
        "ParentEventID": [
          "EFC76FAD6A465142",
          "AA001F2F30CFE9ED"
        ],
        "Label": "Merged current baggage with other baggage",
        "Title": "X-Trace Task",
        "Host": "pinky26.mpi-sws.org",
        "HRT": 47512169620933481,
        "Operation": "join",
        "Timestamp": "1557746152831.880371",
        "TenantClass": 0,
        "Source": "DataXceiver.java:574",
        "ThreadID": 8227,
        "ThreadName": "",
        "EventID": "ACF25069C25C0CFC",
        "BaggageBytes": "[[248 5] [240 0] [0 74 213 225 26 89 168 60 1] [240 1] [0 170 0 31 47 48 207 233 237] [0 239 199 111 173 106 70 81 66] [240 3] [0 2]]",
        "ProcessID": 17069
      },
      {
        "Cycles": 0,
        "Agent": "edu.brown.cs.systems.retro.benchmarks.hdfs_client.Reader",
        "ProcessName": "Read",
        "TaskID": "4AD5E11A59A83C01",
        "ParentEventID": [
          "0"
        ],
        "Label": "Reading file",
        "Title": "X-Trace Task",
        "Host": "pinky19.mpi-sws.org",
        "HRT": 26962512889044364,
        "Timestamp": "1557746152829.808105",
        "TenantClass": 0,
        "ThreadID": 1,
        "ThreadName": "",
        "EventID": "DEC60A423D183CCE",
        "ProcessID": 36430,
        "Tag": [
          "reader_10kb",
          "Read Size: 10240"
        ]
      }
    ]
  }
]