[
  {
    "id": "F1E9109DEE2995EC",
    "reports": [
      {
        "Cycles": 0,
        "Agent": "org.apache.hadoop.ipc.ProtobufRpcEngine",
        "ProcessName": "Read",
        "TaskID": "F1E9109DEE2995EC",
        "ParentEventID": [
          "49588881741C2D33"
        ],
        "Label": "Invoking org.apache.hadoop.hdfs.protocol.ClientProtocol.getBlockLocations",
        "Title": "X-Trace Task",
        "Host": "pinky19.mpi-sws.org",
        "HRT": 26966689557553600,
        "Timestamp": "1557750329497.613281",
        "TenantClass": 0,
        "Source": "ProtobufRpcEngine.java:228",
        "ThreadID": 1,
        "ThreadName": "",
        "EventID": "1F3B7657715E3D5C",
        "ProcessID": 2801
      },
      {
        "Cycles": 0,
        "Agent": "Execution-CPU",
        "ProcessName": "Read",
        "TaskID": "F1E9109DEE2995EC",
        "ParentEventID": [
          "1F3B7657715E3D5C"
        ],
        "Label": "unset",
        "Title": "X-Trace Task",
        "Host": "pinky19.mpi-sws.org",
        "Duration": "41395036",
        "HRT": 26966689557579546,
        "Operation": "unset",
        "Timestamp": "1557750329497.639160",
        "TenantClass": 0,
        "Source": "Client.java:1027",
        "ThreadID": 1,
        "ThreadName": "",
        "EventID": "C897D88D606E40F7",
        "ProcessID": 2801
      },
      {
        "Cycles": 0,
        "Agent": "Execution-CPU",
        "ProcessName": "Read",
        "TaskID": "F1E9109DEE2995EC",
        "ParentEventID": [
          "C897D88D606E40F7"
        ],
        "Label": "set",
        "Title": "X-Trace Task",
        "Host": "pinky19.mpi-sws.org",
        "HRT": 26966689557612241,
        "Operation": "set",
        "Timestamp": "1557750329497.671875",
        "TenantClass": 0,
        "Source": "Client.java:1032",
        "ThreadID": 41,
        "ThreadName": "",
        "EventID": "95352E63DD2AA568",
        "ProcessID": 2801
      },
      {
        "Cycles": 0,
        "Agent": "edu.brown.cs.systems.retro.benchmarks.hdfs_client.Reader",
        "ProcessName": "Read",
        "TaskID": "F1E9109DEE2995EC",
        "ParentEventID": [
          "4146DC74165BC400"
        ],
        "Label": "Reading file",
        "Title": "X-Trace Task",
        "Host": "pinky19.mpi-sws.org",
        "HRT": 26966689557498755,
        "Timestamp": "1557750329497.558350",
        "TenantClass": 0,
        "ThreadID": 1,
        "ThreadName": "",
        "EventID": "49588881741C2D33",
        "ProcessID": 2801
      },
      {
        "Cycles": 0,
        "Agent": "Execution-CPU",
        "ProcessName": "Read",
        "TaskID": "F1E9109DEE2995EC",
        "ParentEventID": [
          "6AF1BBDD188DD485"
        ],
        "Label": "unset",
        "Title": "X-Trace Task",
        "Host": "pinky19.mpi-sws.org",
        "Duration": "71542",
        "HRT": 26966689557701287,
        "Operation": "unset",
        "Timestamp": "1557750329497.760986",
        "TenantClass": 0,
        "Source": "Client.java:1062",
        "ThreadID": 41,
        "ThreadName": "",
        "EventID": "328F4F88C638C4B8",
        "ProcessID": 2801
      },
      {
        "Cycles": 0,
        "Agent": "Execution-CPU",
        "ProcessName": "Read",
        "TaskID": "F1E9109DEE2995EC",
        "ParentEventID": [
          "328F4F88C638C4B8"
        ],
        "Label": "set",
        "Title": "X-Trace Task",
        "Host": "pinky19.mpi-sws.org",
        "HRT": 26966689557726474,
        "Operation": "set",
        "Timestamp": "1557750329497.786133",
        "TenantClass": 0,
        "Source": "Client.java:1104",
        "ThreadID": 1,
        "ThreadName": "",
        "EventID": "9066C9D5FF356C43",
        "ProcessID": 2801
      },
      {
        "Cycles": 0,
        "Agent": "edu.brown.cs.systems.xtrace.logging.BaggageWrappers",
        "ProcessName": "Read",
        "TaskID": "F1E9109DEE2995EC",
        "ParentEventID": [
          "95352E63DD2AA568"
        ],
        "Label": "Forking current baggage with Baggage.fork()",
        "Title": "X-Trace Task",
        "Host": "pinky19.mpi-sws.org",
        "HRT": 26966689557630585,
        "Operation": "fork",
        "Timestamp": "1557750329497.690186",
        "TenantClass": 0,
        "Source": "Client.java:1043",
        "ThreadID": 41,
        "ThreadName": "",
        "EventID": "6AF1BBDD188DD485",
        "ProcessID": 2801
      },
      {
        "Cycles": 0,
        "Agent": "Execution-CPU",
        "ProcessName": "Name",
        "TaskID": "F1E9109DEE2995EC",
        "ParentEventID": [
          "6AF1BBDD188DD485"
        ],
        "Label": "set",
        "Title": "X-Trace Task",
        "Host": "pinky19.mpi-sws.org",
        "HRT": 26966689557758522,
        "Operation": "set",
        "Timestamp": "1557750329497.831299",
        "TenantClass": 0,
        "Source": "Server.java:1840",
        "ThreadID": 48,
        "ThreadName": "",
        "EventID": "BBAAB6C0DEF12E02",
        "BaggageBytes": "[[248 5] [240 0] [0 241 233 16 157 238 41 149 236] [240 1] [0 106 241 187 221 24 141 212 133] [240 3] [0 2]]",
        "ProcessID": 2171
      },
      {
        "Cycles": 0,
        "Agent": "Execution-CPU",
        "ProcessName": "Name",
        "TaskID": "F1E9109DEE2995EC",
        "ParentEventID": [
          "76188DC6C8EC972B"
        ],
        "Label": "unset",
        "Title": "X-Trace Task",
        "Host": "pinky19.mpi-sws.org",
        "Duration": "23908",
        "HRT": 26966689557807347,
        "Operation": "unset",
        "Timestamp": "1557750329497.880127",
        "TenantClass": 0,
        "Source": "Server.java:1828",
        "ThreadID": 48,
        "ThreadName": "",
        "EventID": "E5E55E6C476DFEBC",
        "BaggageBytes": "[[248 5] [240 0] [0 241 233 16 157 238 41 149 236] [240 1] [0 118 24 141 198 200 236 151 43] [240 3] [0 2]]",
        "ProcessID": 2171
      },
      {
        "Cycles": 0,
        "Agent": "Execution-CPU",
        "ProcessName": "Name",
        "TaskID": "F1E9109DEE2995EC",
        "ParentEventID": [
          "76188DC6C8EC972B"
        ],
        "Label": "set",
        "Title": "X-Trace Task",
        "Host": "pinky19.mpi-sws.org",
        "HRT": 26966689557814530,
        "Operation": "set",
        "Timestamp": "1557750329497.887207",
        "TenantClass": 0,
        "Source": "Server.java:2071",
        "ThreadID": 58,
        "ThreadName": "",
        "EventID": "A9C66D51BEB27B28",
        "BaggageBytes": "[[248 5] [240 0] [0 241 233 16 157 238 41 149 236] [240 1] [0 118 24 141 198 200 236 151 43] [240 3] [0 2]]",
        "ProcessID": 2171
      },
      {
        "Cycles": 0,
        "Agent": "edu.brown.cs.systems.xtrace.logging.BaggageWrappers",
        "ProcessName": "Name",
        "TaskID": "F1E9109DEE2995EC",
        "ParentEventID": [
          "BBAAB6C0DEF12E02"
        ],
        "Label": "Forking current baggage with Baggage.fork()",
        "Title": "X-Trace Task",
        "Host": "pinky19.mpi-sws.org",
        "HRT": 26966689557787091,
        "Operation": "fork",
        "Timestamp": "1557750329497.859863",
        "TenantClass": 0,
        "Source": "Server.java:550",
        "ThreadID": 48,
        "ThreadName": "",
        "EventID": "76188DC6C8EC972B",
        "BaggageBytes": "[[248 5] [240 0] [0 241 233 16 157 238 41 149 236] [240 1] [0 187 170 182 192 222 241 46 2] [240 3] [0 2]]",
        "ProcessID": 2171
      },
      {
        "Cycles": 0,
        "Agent": "org.apache.hadoop.ipc.Server",
        "ProcessName": "Name",
        "TaskID": "F1E9109DEE2995EC",
        "ParentEventID": [
          "A9C66D51BEB27B28"
        ],
        "Label": "getBlockLocations in org.apache.hadoop.hdfs.protocol.ClientProtocol",
        "Title": "X-Trace Task",
        "Host": "pinky19.mpi-sws.org",
        "HRT": 26966689557848288,
        "Timestamp": "1557750329497.921143",
        "TenantClass": 0,
        "Source": "ProtobufRpcEngine.java:601",
        "ThreadID": 58,
        "ThreadName": "",
        "EventID": "A21AAFECD9837BD4",
        "BaggageBytes": "[[248 5] [240 0] [0 241 233 16 157 238 41 149 236] [240 1] [0 169 198 109 81 190 178 123 40] [240 3] [0 2]]",
        "ProcessID": 2171
      },
      {
        "Cycles": 0,
        "Agent": "edu.brown.cs.systems.xtrace.logging.BaggageWrappers",
        "ProcessName": "Name",
        "TaskID": "F1E9109DEE2995EC",
        "ParentEventID": [
          "84A83570A16BC0FA"
        ],
        "Label": "Forking current baggage with Baggage.fork()",
        "Title": "X-Trace Task",
        "Host": "pinky19.mpi-sws.org",
        "HRT": 26966689557940733,
        "Operation": "fork",
        "Timestamp": "1557750329498.013428",
        "TenantClass": 0,
        "Source": "Server.java:2398",
        "ThreadID": 58,
        "ThreadName": "",
        "EventID": "37A1C16CABAC1B20",
        "BaggageBytes": "[[248 5] [240 0] [0 241 233 16 157 238 41 149 236] [240 1] [0 132 168 53 112 161 107 192 250] [240 3] [0 2]]",
        "ProcessID": 2171
      },
      {
        "Cycles": 0,
        "Agent": "org.apache.hadoop.hdfs.server.namenode.FSNamesystem.audit",
        "ProcessName": "Name",
        "TaskID": "F1E9109DEE2995EC",
        "ParentEventID": [
          "A21AAFECD9837BD4"
        ],
        "Label": "allowed=true\tugi=plascas (auth:SIMPLE)\tip=/139.19.171.63\tcmd=open\tsrc=/ds/QDXBYYkAHCS0ThMj\tdst=null\tperm=null\tproto=rpc",
        "Title": "X-Trace Task",
        "Host": "pinky19.mpi-sws.org",
        "HRT": 26966689557894275,
        "Timestamp": "1557750329497.967041",
        "TenantClass": 0,
        "Source": "FSNamesystem.java:8313",
        "ThreadID": 58,
        "ThreadName": "",
        "EventID": "84A83570A16BC0FA",
        "BaggageBytes": "[[248 5] [240 0] [0 241 233 16 157 238 41 149 236] [240 1] [0 162 26 175 236 217 131 123 212] [240 3] [0 2]]",
        "ProcessID": 2171
      },
      {
        "Cycles": 0,
        "Agent": "Execution-CPU",
        "ProcessName": "Name",
        "TaskID": "F1E9109DEE2995EC",
        "ParentEventID": [
          "37A1C16CABAC1B20"
        ],
        "Label": "unset",
        "Title": "X-Trace Task",
        "Host": "pinky19.mpi-sws.org",
        "Duration": "206888",
        "HRT": 26966689558043800,
        "Operation": "unset",
        "Timestamp": "1557750329498.116455",
        "TenantClass": 0,
        "Source": "Server.java:1058",
        "ThreadID": 58,
        "ThreadName": "",
        "EventID": "8B990B683F848564",
        "BaggageBytes": "[[248 5] [240 0] [0 241 233 16 157 238 41 149 236] [240 1] [0 55 161 193 108 171 172 27 32] [240 3] [0 2]]",
        "ProcessID": 2171
      },
      {
        "Cycles": 0,
        "Agent": "Execution-CPU",
        "ProcessName": "Read",
        "TaskID": "F1E9109DEE2995EC",
        "ParentEventID": [
          "C0AF65AB76647D5D"
        ],
        "Label": "unset",
        "Title": "X-Trace Task",
        "Host": "pinky19.mpi-sws.org",
        "Duration": "10055",
        "HRT": 26966689558116763,
        "Operation": "unset",
        "Timestamp": "1557750329498.176270",
        "TenantClass": 0,
        "Source": "Client.java:1168",
        "ThreadID": 40,
        "ThreadName": "",
        "EventID": "E64DC88C36E4FA4B",
        "ProcessID": 2801
      },
      {
        "Cycles": 0,
        "Agent": "Execution-CPU",
        "ProcessName": "Read",
        "TaskID": "F1E9109DEE2995EC",
        "ParentEventID": [
          "37A1C16CABAC1B20"
        ],
        "Label": "set",
        "Title": "X-Trace Task",
        "Host": "pinky19.mpi-sws.org",
        "HRT": 26966689558094838,
        "Operation": "set",
        "Timestamp": "1557750329498.154541",
        "TenantClass": 0,
        "Source": "Client.java:302",
        "ThreadID": 40,
        "ThreadName": "",
        "EventID": "C0AF65AB76647D5D",
        "ProcessID": 2801
      },
      {
        "Cycles": 0,
        "Agent": "Execution-Sleep",
        "ProcessName": "Read",
        "TaskID": "F1E9109DEE2995EC",
        "ParentEventID": [
          "9066C9D5FF356C43"
        ],
        "Label": "waited",
        "Title": "X-Trace Task",
        "Host": "pinky19.mpi-sws.org",
        "Duration": "400469",
        "HRT": 26966689558138087,
        "Operation": "waited",
        "Timestamp": "1557750329498.197754",
        "TenantClass": 0,
        "Source": "Client.java:1537",
        "ThreadID": 1,
        "ThreadName": "",
        "EventID": "257EF0A559449B9E",
        "ProcessID": 2801
      },
      {
        "Cycles": 0,
        "Agent": "edu.brown.cs.systems.xtrace.logging.BaggageWrappers",
        "ProcessName": "Read",
        "TaskID": "F1E9109DEE2995EC",
        "ParentEventID": [
          "257EF0A559449B9E",
          "E64DC88C36E4FA4B"
        ],
        "Label": "Merged current baggage with other baggage",
        "Title": "X-Trace Task",
        "Host": "pinky19.mpi-sws.org",
        "HRT": 26966689558149769,
        "Operation": "join",
        "Timestamp": "1557750329498.209473",
        "TenantClass": 0,
        "Source": "Client.java:1545",
        "ThreadID": 1,
        "ThreadName": "",
        "EventID": "FDBC4163E124803D",
        "ProcessID": 2801
      },
      {
        "Cycles": 0,
        "Agent": "org.apache.hadoop.ipc.ProtobufRpcEngine",
        "ProcessName": "Read",
        "TaskID": "F1E9109DEE2995EC",
        "ParentEventID": [
          "FDBC4163E124803D"
        ],
        "Label": "org.apache.hadoop.hdfs.protocol.ClientProtocol.getBlockLocations completed",
        "Title": "X-Trace Task",
        "Host": "pinky19.mpi-sws.org",
        "HRT": 26966689558196068,
        "Timestamp": "1557750329498.255615",
        "TenantClass": 0,
        "Source": "ProtobufRpcEngine.java:275",
        "ThreadID": 1,
        "ThreadName": "",
        "EventID": "379EC39048517DE8",
        "ProcessID": 2801
      },
      {
        "Cycles": 0,
        "Agent": "Execution-Sleep",
        "ProcessName": "Read",
        "TaskID": "F1E9109DEE2995EC",
        "ParentEventID": [
          "379EC39048517DE8"
        ],
        "Label": "waited",
        "Title": "X-Trace Task",
        "Host": "pinky19.mpi-sws.org",
        "Duration": "129292",
        "HRT": 26966689558422647,
        "Operation": "waited",
        "Timestamp": "1557750329498.482178",
        "TenantClass": 0,
        "Source": "SocketIOWithTimeout.java:335",
        "ThreadID": 1,
        "ThreadName": "",
        "EventID": "DFD13BFB686E7A50",
        "ProcessID": 2801
      },
      {
        "Cycles": 0,
        "Agent": "edu.brown.cs.systems.xtrace.logging.BaggageWrappers",
        "ProcessName": "Read",
        "TaskID": "F1E9109DEE2995EC",
        "ParentEventID": [
          "DFD13BFB686E7A50"
        ],
        "Label": "Forking current baggage with Baggage.fork()",
        "Title": "X-Trace Task",
        "Host": "pinky19.mpi-sws.org",
        "HRT": 26966689558466659,
        "Operation": "fork",
        "Timestamp": "1557750329498.526367",
        "TenantClass": 0,
        "Source": "DataTransferProtoUtil.java:94",
        "ThreadID": 1,
        "ThreadName": "",
        "EventID": "E1DA94453BB9C802",
        "ProcessID": 2801
      },
      {
        "Cycles": 0,
        "Agent": "edu.brown.cs.systems.xtrace.logging.XTraceInit",
        "ProcessName": "Data",
        "TaskID": "F1E9109DEE2995EC",
        "ParentEventID": [
          "2B7F1EA68E031AD6"
        ],
        "Label": "Thread.setName: DataXceiver for client DFSClient_NONMAPREDUCE_310321604_1 at /139.19.171.63:46438 [Sending block BP-1633380353-139.19.171.63-1554193446451:blk_1073760035_19211]",
        "Title": "X-Trace Task",
        "Host": "pinky21.mpi-sws.org",
        "HRT": 10812999265449325,
        "Timestamp": "1557750329499.312500",
        "TenantClass": 0,
        "Source": "DataXceiver.java:168",
        "ThreadID": 15520,
        "ThreadName": "",
        "EventID": "C2BB3771B8BBBB20",
        "BaggageBytes": "[[248 5] [240 0] [0 241 233 16 157 238 41 149 236] [240 1] [0 43 127 30 166 142 3 26 214] [240 3] [0 2]]",
        "ProcessID": 20775
      },
      {
        "Cycles": 0,
        "Agent": "Execution-CPU",
        "ProcessName": "Data",
        "TaskID": "F1E9109DEE2995EC",
        "ParentEventID": [
          "E1DA94453BB9C802"
        ],
        "Label": "set",
        "Title": "X-Trace Task",
        "Host": "pinky21.mpi-sws.org",
        "HRT": 10812999265240572,
        "Operation": "set",
        "Timestamp": "1557750329499.103760",
        "TenantClass": 0,
        "Source": "Receiver.java:117",
        "ThreadID": 15520,
        "ThreadName": "",
        "EventID": "2B7F1EA68E031AD6",
        "BaggageBytes": "[[248 5] [240 0] [0 241 233 16 157 238 41 149 236] [240 1] [0 225 218 148 69 59 185 200 2] [240 3] [0 2]]",
        "ProcessID": 20775
      },
      {
        "Cycles": 0,
        "Agent": "edu.brown.cs.systems.xtrace.logging.BaggageWrappers",
        "ProcessName": "Data",
        "TaskID": "F1E9109DEE2995EC",
        "ParentEventID": [
          "C2BB3771B8BBBB20"
        ],
        "Label": "Forking current baggage with Baggage.fork()",
        "Title": "X-Trace Task",
        "Host": "pinky21.mpi-sws.org",
        "HRT": 10812999265733027,
        "Operation": "fork",
        "Timestamp": "1557750329499.596191",
        "TenantClass": 0,
        "Source": "DataXceiver.java:1257",
        "ThreadID": 15520,
        "ThreadName": "",
        "EventID": "580985EEE189E242",
        "BaggageBytes": "[[248 5] [240 0] [0 241 233 16 157 238 41 149 236] [240 1] [0 194 187 55 113 184 187 187 32] [240 3] [0 2]]",
        "ProcessID": 20775
      },
      {
        "Cycles": 0,
        "Agent": "Execution-Sleep",
        "ProcessName": "Read",
        "TaskID": "F1E9109DEE2995EC",
        "ParentEventID": [
          "E1DA94453BB9C802"
        ],
        "Label": "waited",
        "Title": "X-Trace Task",
        "Host": "pinky19.mpi-sws.org",
        "Duration": "1256052",
        "HRT": 26966689559794028,
        "Operation": "waited",
        "Timestamp": "1557750329499.853760",
        "TenantClass": 0,
        "Source": "SocketIOWithTimeout.java:335",
        "ThreadID": 1,
        "ThreadName": "",
        "EventID": "BD36434619ED67AA",
        "ProcessID": 2801
      },
      {
        "Cycles": 0,
        "Agent": "edu.brown.cs.systems.xtrace.logging.BaggageWrappers",
        "ProcessName": "Data",
        "TaskID": "F1E9109DEE2995EC",
        "ParentEventID": [
          "580985EEE189E242"
        ],
        "Label": "Forking current baggage with Baggage.fork()",
        "Title": "X-Trace Task",
        "Host": "pinky21.mpi-sws.org",
        "HRT": 10812999265908721,
        "Operation": "fork",
        "Timestamp": "1557750329499.771973",
        "TenantClass": 0,
        "Source": "PacketHeader.java:95",
        "ThreadID": 15520,
        "ThreadName": "",
        "EventID": "2ACC3492E4B3C548",
        "BaggageBytes": "[[248 5] [240 0] [0 241 233 16 157 238 41 149 236] [240 1] [0 88 9 133 238 225 137 226 66] [240 3] [0 2]]",
        "ProcessID": 20775
      },
      {
        "Cycles": 0,
        "Agent": "edu.brown.cs.systems.xtrace.logging.BaggageWrappers",
        "ProcessName": "Read",
        "TaskID": "F1E9109DEE2995EC",
        "ParentEventID": [
          "BD36434619ED67AA",
          "580985EEE189E242"
        ],
        "Label": "Merged current baggage with other baggage",
        "Title": "X-Trace Task",
        "Host": "pinky19.mpi-sws.org",
        "HRT": 26966689559852899,
        "Operation": "join",
        "Timestamp": "1557750329499.912598",
        "TenantClass": 0,
        "Source": "RemoteBlockReader2.java:429",
        "ThreadID": 1,
        "ThreadName": "",
        "EventID": "66C77F1EEFF29584",
        "ProcessID": 2801
      },
      {
        "Cycles": 0,
        "Agent": "Execution-Sleep",
        "ProcessName": "Read",
        "TaskID": "F1E9109DEE2995EC",
        "ParentEventID": [
          "66C77F1EEFF29584"
        ],
        "Label": "waited",
        "Title": "X-Trace Task",
        "Host": "pinky19.mpi-sws.org",
        "Duration": "67610",
        "HRT": 26966689559963550,
        "Operation": "waited",
        "Timestamp": "1557750329500.023193",
        "TenantClass": 0,
        "Source": "SocketIOWithTimeout.java:335",
        "ThreadID": 1,
        "ThreadName": "",
        "EventID": "14C918FA2B1903F2",
        "ProcessID": 2801
      },
      {
        "Cycles": 0,
        "Agent": "Execution-Sleep",
        "ProcessName": "Data",
        "TaskID": "F1E9109DEE2995EC",
        "ParentEventID": [
          "2ACC3492E4B3C548"
        ],
        "Label": "waited",
        "Title": "X-Trace Task",
        "Host": "pinky21.mpi-sws.org",
        "Duration": "17600",
        "HRT": 10812999266073702,
        "Operation": "waited",
        "Timestamp": "1557750329499.936768",
        "TenantClass": 0,
        "Source": "SocketIOWithTimeout.java:335",
        "ThreadID": 15520,
        "ThreadName": "",
        "EventID": "75F96A2CB28E1FF4",
        "BaggageBytes": "[[248 5] [240 0] [0 241 233 16 157 238 41 149 236] [240 1] [0 42 204 52 146 228 179 197 72] [240 3] [0 2]]",
        "ProcessID": 20775
      },
      {
        "Cycles": 0,
        "Agent": "edu.brown.cs.systems.retro.benchmarks.hdfs_client.Reader",
        "ProcessName": "Read",
        "TaskID": "F1E9109DEE2995EC",
        "ParentEventID": [
          "0"
        ],
        "Label": "Reading file",
        "Title": "X-Trace Task",
        "Host": "pinky19.mpi-sws.org",
        "HRT": 26966689557477655,
        "Timestamp": "1557750329497.537354",
        "TenantClass": 0,
        "ThreadID": 1,
        "ThreadName": "",
        "EventID": "4146DC74165BC400",
        "ProcessID": 2801,
        "Tag": [
          "reader_100kb",
          "Read Size: 102400"
        ]
      },
      {
        "Cycles": 0,
        "Agent": "edu.brown.cs.systems.xtrace.logging.BaggageWrappers",
        "ProcessName": "Data",
        "TaskID": "F1E9109DEE2995EC",
        "ParentEventID": [
          "75F96A2CB28E1FF4"
        ],
        "Label": "Forking current baggage with Baggage.fork()",
        "Title": "X-Trace Task",
        "Host": "pinky21.mpi-sws.org",
        "HRT": 10812999285292433,
        "Operation": "fork",
        "Timestamp": "1557750329519.155518",
        "TenantClass": 0,
        "Source": "PacketHeader.java:95",
        "ThreadID": 15520,
        "ThreadName": "",
        "EventID": "4618CA26FF236CE8",
        "BaggageBytes": "[[248 5] [240 0] [0 241 233 16 157 238 41 149 236] [240 1] [0 117 249 106 44 178 142 31 244] [240 3] [0 2]]",
        "ProcessID": 20775
      },
      {
        "Cycles": 0,
        "Agent": "Execution-Sleep",
        "ProcessName": "Read",
        "TaskID": "F1E9109DEE2995EC",
        "ParentEventID": [
          "14C918FA2B1903F2"
        ],
        "Label": "waited",
        "Title": "X-Trace Task",
        "Host": "pinky19.mpi-sws.org",
        "Duration": "19408652",
        "HRT": 26966689579439565,
        "Operation": "waited",
        "Timestamp": "1557750329519.499268",
        "TenantClass": 0,
        "Source": "SocketIOWithTimeout.java:335",
        "ThreadID": 1,
        "ThreadName": "",
        "EventID": "72E08304FEF3DF89",
        "ProcessID": 2801
      },
      {
        "Cycles": 0,
        "Agent": "Execution-Sleep",
        "ProcessName": "Read",
        "TaskID": "F1E9109DEE2995EC",
        "ParentEventID": [
          "72E08304FEF3DF89"
        ],
        "Label": "waited",
        "Title": "X-Trace Task",
        "Host": "pinky19.mpi-sws.org",
        "Duration": "213533",
        "HRT": 26966689579717891,
        "Operation": "waited",
        "Timestamp": "1557750329519.777588",
        "TenantClass": 0,
        "Source": "SocketIOWithTimeout.java:335",
        "ThreadID": 1,
        "ThreadName": "",
        "EventID": "8FA2BB2E22F50622",
        "ProcessID": 2801
      },
      {
        "Cycles": 0,
        "Agent": "Execution-Sleep",
        "ProcessName": "Read",
        "TaskID": "F1E9109DEE2995EC",
        "ParentEventID": [
          "8FA2BB2E22F50622"
        ],
        "Label": "waited",
        "Title": "X-Trace Task",
        "Host": "pinky19.mpi-sws.org",
        "Duration": "137792",
        "HRT": 26966689579920400,
        "Operation": "waited",
        "Timestamp": "1557750329519.979980",
        "TenantClass": 0,
        "Source": "SocketIOWithTimeout.java:335",
        "ThreadID": 1,
        "ThreadName": "",
        "EventID": "0F2039A61DE909A3",
        "ProcessID": 2801
      },
      {
        "Cycles": 0,
        "Agent": "Execution-Sleep",
        "ProcessName": "Read",
        "TaskID": "F1E9109DEE2995EC",
        "ParentEventID": [
          "0F2039A61DE909A3"
        ],
        "Label": "waited",
        "Title": "X-Trace Task",
        "Host": "pinky19.mpi-sws.org",
        "Duration": "4733",
        "HRT": 26966689579980690,
        "Operation": "waited",
        "Timestamp": "1557750329520.040283",
        "TenantClass": 0,
        "Source": "SocketIOWithTimeout.java:335",
        "ThreadID": 1,
        "ThreadName": "",
        "EventID": "6CD6A03D787C78A1",
        "ProcessID": 2801
      },
      {
        "Cycles": 0,
        "Agent": "edu.brown.cs.systems.xtrace.logging.BaggageWrappers",
        "ProcessName": "Read",
        "TaskID": "F1E9109DEE2995EC",
        "ParentEventID": [
          "6CD6A03D787C78A1",
          "2ACC3492E4B3C548"
        ],
        "Label": "Merged current baggage with other baggage",
        "Title": "X-Trace Task",
        "Host": "pinky19.mpi-sws.org",
        "HRT": 26966689580027342,
        "Operation": "join",
        "Timestamp": "1557750329520.086914",
        "TenantClass": 0,
        "Source": "PacketHeader.java:168",
        "ThreadID": 1,
        "ThreadName": "",
        "EventID": "104750066028CA0F",
        "ProcessID": 2801
      },
      {
        "Cycles": 0,
        "Agent": "edu.brown.cs.systems.xtrace.logging.BaggageWrappers",
        "ProcessName": "Read",
        "TaskID": "F1E9109DEE2995EC",
        "ParentEventID": [
          "4618CA26FF236CE8",
          "104750066028CA0F"
        ],
        "Label": "Merged current baggage with other baggage",
        "Title": "X-Trace Task",
        "Host": "pinky19.mpi-sws.org",
        "HRT": 26966689580134704,
        "Operation": "join",
        "Timestamp": "1557750329520.194336",
        "TenantClass": 0,
        "Source": "PacketHeader.java:168",
        "ThreadID": 1,
        "ThreadName": "",
        "EventID": "E78F4CF15CE1FE90",
        "ProcessID": 2801
      },
      {
        "Cycles": 0,
        "Agent": "edu.brown.cs.systems.xtrace.logging.BaggageWrappers",
        "ProcessName": "Read",
        "TaskID": "F1E9109DEE2995EC",
        "ParentEventID": [
          "E78F4CF15CE1FE90"
        ],
        "Label": "Forking current baggage with Baggage.fork()",
        "Title": "X-Trace Task",
        "Host": "pinky19.mpi-sws.org",
        "HRT": 26966689580148667,
        "Operation": "fork",
        "Timestamp": "1557750329520.208252",
        "TenantClass": 0,
        "Source": "RemoteBlockReader2.java:361",
        "ThreadID": 1,
        "ThreadName": "",
        "EventID": "B3F38339BDC6E129",
        "ProcessID": 2801
      },
      {
        "Cycles": 0,
        "Agent": "edu.brown.cs.systems.xtrace.logging.BaggageWrappers",
        "ProcessName": "Read",
        "TaskID": "F1E9109DEE2995EC",
        "ParentEventID": [
          "B3F38339BDC6E129"
        ],
        "Label": "Forking current baggage with Baggage.fork()",
        "Title": "X-Trace Task",
        "Host": "pinky19.mpi-sws.org",
        "HRT": 26966689580214660,
        "Operation": "fork",
        "Timestamp": "1557750329520.274170",
        "TenantClass": 0,
        "Source": "DataTransferProtoUtil.java:94",
        "ThreadID": 1,
        "ThreadName": "",
        "EventID": "24DBA8DCF9FE9A63",
        "ProcessID": 2801
      },
      {
        "Cycles": 0,
        "Agent": "Execution-Sleep",
        "ProcessName": "Data",
        "TaskID": "F1E9109DEE2995EC",
        "ParentEventID": [
          "4618CA26FF236CE8"
        ],
        "Label": "waited",
        "Title": "X-Trace Task",
        "Host": "pinky21.mpi-sws.org",
        "Duration": "950411",
        "HRT": 10812999286362583,
        "Operation": "waited",
        "Timestamp": "1557750329520.225830",
        "TenantClass": 0,
        "Source": "SocketIOWithTimeout.java:335",
        "ThreadID": 15520,
        "ThreadName": "",
        "EventID": "D9ABC427AFF7C308",
        "BaggageBytes": "[[248 5] [240 0] [0 241 233 16 157 238 41 149 236] [240 1] [0 70 24 202 38 255 35 108 232] [240 3] [0 2]]",
        "ProcessID": 20775
      },
      {
        "Cycles": 0,
        "Agent": "edu.brown.cs.systems.xtrace.logging.BaggageWrappers",
        "ProcessName": "Data",
        "TaskID": "F1E9109DEE2995EC",
        "ParentEventID": [
          "B3F38339BDC6E129",
          "D9ABC427AFF7C308"
        ],
        "Label": "Merged current baggage with other baggage",
        "Title": "X-Trace Task",
        "Host": "pinky21.mpi-sws.org",
        "HRT": 10812999286604233,
        "Operation": "join",
        "Timestamp": "1557750329520.467285",
        "TenantClass": 0,
        "Source": "DataXceiver.java:574",
        "ThreadID": 15520,
        "ThreadName": "",
        "EventID": "775E3F80C8605DF3",
        "BaggageBytes": "[[248 5] [240 0] [0 241 233 16 157 238 41 149 236] [240 1] [0 179 243 131 57 189 198 225 41] [0 217 171 196 39 175 247 195 8] [240 3] [0 2]]",
        "ProcessID": 20775
      },
      {
        "Cycles": 0,
        "Agent": "Execution-CPU",
        "ProcessName": "Data",
        "TaskID": "F1E9109DEE2995EC",
        "ParentEventID": [
          "775E3F80C8605DF3"
        ],
        "Label": "unset",
        "Title": "X-Trace Task",
        "Host": "pinky21.mpi-sws.org",
        "Duration": "21300355",
        "HRT": 10812999286656364,
        "Operation": "unset",
        "Timestamp": "1557750329520.519531",
        "TenantClass": 0,
        "Source": "DataXceiver.java:261",
        "ThreadID": 15520,
        "ThreadName": "",
        "EventID": "3DDB9653C27B4DBA",
        "BaggageBytes": "[[248 5] [240 0] [0 241 233 16 157 238 41 149 236] [240 1] [0 119 94 63 128 200 96 93 243] [240 3] [0 2]]",
        "ProcessID": 20775
      },
      {
        "Cycles": 0,
        "Agent": "Execution-CPU",
        "ProcessName": "Data",
        "TaskID": "F1E9109DEE2995EC",
        "ParentEventID": [
          "24DBA8DCF9FE9A63"
        ],
        "Label": "set",
        "Title": "X-Trace Task",
        "Host": "pinky21.mpi-sws.org",
        "HRT": 10812999286722368,
        "Operation": "set",
        "Timestamp": "1557750329520.585449",
        "TenantClass": 0,
        "Source": "Receiver.java:117",
        "ThreadID": 15520,
        "ThreadName": "",
        "EventID": "A504AD5523BFCA45",
        "BaggageBytes": "[[248 5] [240 0] [0 241 233 16 157 238 41 149 236] [240 1] [0 36 219 168 220 249 254 154 99] [240 3] [0 2]]",
        "ProcessID": 20775
      },
      {
        "Cycles": 0,
        "Agent": "edu.brown.cs.systems.xtrace.logging.XTraceInit",
        "ProcessName": "Data",
        "TaskID": "F1E9109DEE2995EC",
        "ParentEventID": [
          "A504AD5523BFCA45"
        ],
        "Label": "Thread.setName: DataXceiver for client DFSClient_NONMAPREDUCE_310321604_1 at /139.19.171.63:46438 [Sending block BP-1633380353-139.19.171.63-1554193446451:blk_1073760035_19211]",
        "Title": "X-Trace Task",
        "Host": "pinky21.mpi-sws.org",
        "HRT": 10812999286801150,
        "Timestamp": "1557750329520.664307",
        "TenantClass": 0,
        "Source": "DataXceiver.java:168",
        "ThreadID": 15520,
        "ThreadName": "",
        "EventID": "EFF9908AACEE4106",
        "BaggageBytes": "[[248 5] [240 0] [0 241 233 16 157 238 41 149 236] [240 1] [0 165 4 173 85 35 191 202 69] [240 3] [0 2]]",
        "ProcessID": 20775
      },
      {
        "Cycles": 0,
        "Agent": "edu.brown.cs.systems.xtrace.logging.BaggageWrappers",
        "ProcessName": "Data",
        "TaskID": "F1E9109DEE2995EC",
        "ParentEventID": [
          "EFF9908AACEE4106"
        ],
        "Label": "Forking current baggage with Baggage.fork()",
        "Title": "X-Trace Task",
        "Host": "pinky21.mpi-sws.org",
        "HRT": 10812999286982911,
        "Operation": "fork",
        "Timestamp": "1557750329520.845947",
        "TenantClass": 0,
        "Source": "DataXceiver.java:1257",
        "ThreadID": 15520,
        "ThreadName": "",
        "EventID": "C8F62A8CD3EAF7E5",
        "BaggageBytes": "[[248 5] [240 0] [0 241 233 16 157 238 41 149 236] [240 1] [0 239 249 144 138 172 238 65 6] [240 3] [0 2]]",
        "ProcessID": 20775
      },
      {
        "Cycles": 0,
        "Agent": "Execution-Sleep",
        "ProcessName": "Read",
        "TaskID": "F1E9109DEE2995EC",
        "ParentEventID": [
          "24DBA8DCF9FE9A63"
        ],
        "Label": "waited",
        "Title": "X-Trace Task",
        "Host": "pinky19.mpi-sws.org",
        "Duration": "709304",
        "HRT": 26966689580990335,
        "Operation": "waited",
        "Timestamp": "1557750329521.050049",
        "TenantClass": 0,
        "Source": "SocketIOWithTimeout.java:335",
        "ThreadID": 1,
        "ThreadName": "",
        "EventID": "24A3256E8A455421",
        "ProcessID": 2801
      },
      {
        "Cycles": 0,
        "Agent": "edu.brown.cs.systems.xtrace.logging.BaggageWrappers",
        "ProcessName": "Read",
        "TaskID": "F1E9109DEE2995EC",
        "ParentEventID": [
          "C8F62A8CD3EAF7E5",
          "24A3256E8A455421"
        ],
        "Label": "Merged current baggage with other baggage",
        "Title": "X-Trace Task",
        "Host": "pinky19.mpi-sws.org",
        "HRT": 26966689581045282,
        "Operation": "join",
        "Timestamp": "1557750329521.104980",
        "TenantClass": 0,
        "Source": "RemoteBlockReader2.java:429",
        "ThreadID": 1,
        "ThreadName": "",
        "EventID": "2DD2B508A0CDC9B4",
        "ProcessID": 2801
      },
      {
        "Cycles": 0,
        "Agent": "edu.brown.cs.systems.xtrace.logging.BaggageWrappers",
        "ProcessName": "Data",
        "TaskID": "F1E9109DEE2995EC",
        "ParentEventID": [
          "C8F62A8CD3EAF7E5"
        ],
        "Label": "Forking current baggage with Baggage.fork()",
        "Title": "X-Trace Task",
        "Host": "pinky21.mpi-sws.org",
        "HRT": 10812999287106191,
        "Operation": "fork",
        "Timestamp": "1557750329520.969238",
        "TenantClass": 0,
        "Source": "PacketHeader.java:95",
        "ThreadID": 15520,
        "ThreadName": "",
        "EventID": "16ADBAFCC2041E8F",
        "BaggageBytes": "[[248 5] [240 0] [0 241 233 16 157 238 41 149 236] [240 1] [0 200 246 42 140 211 234 247 229] [240 3] [0 2]]",
        "ProcessID": 20775
      },
      {
        "Cycles": 0,
        "Agent": "Execution-Sleep",
        "ProcessName": "Read",
        "TaskID": "F1E9109DEE2995EC",
        "ParentEventID": [
          "2DD2B508A0CDC9B4"
        ],
        "Label": "waited",
        "Title": "X-Trace Task",
        "Host": "pinky19.mpi-sws.org",
        "Duration": "20262",
        "HRT": 26966689581114059,
        "Operation": "waited",
        "Timestamp": "1557750329521.173584",
        "TenantClass": 0,
        "Source": "SocketIOWithTimeout.java:335",
        "ThreadID": 1,
        "ThreadName": "",
        "EventID": "44FD6F2FDE121EEF",
        "ProcessID": 2801
      },
      {
        "Cycles": 0,
        "Agent": "Execution-Sleep",
        "ProcessName": "Data",
        "TaskID": "F1E9109DEE2995EC",
        "ParentEventID": [
          "16ADBAFCC2041E8F"
        ],
        "Label": "waited",
        "Title": "X-Trace Task",
        "Host": "pinky21.mpi-sws.org",
        "Duration": "7802",
        "HRT": 10812999287213664,
        "Operation": "waited",
        "Timestamp": "1557750329521.076904",
        "TenantClass": 0,
        "Source": "SocketIOWithTimeout.java:335",
        "ThreadID": 15520,
        "ThreadName": "",
        "EventID": "97FB725C6CF7EF8A",
        "BaggageBytes": "[[248 5] [240 0] [0 241 233 16 157 238 41 149 236] [240 1] [0 22 173 186 252 194 4 30 143] [240 3] [0 2]]",
        "ProcessID": 20775
      },
      {
        "Cycles": 0,
        "Agent": "edu.brown.cs.systems.xtrace.logging.BaggageWrappers",
        "ProcessName": "Data",
        "TaskID": "F1E9109DEE2995EC",
        "ParentEventID": [
          "97FB725C6CF7EF8A"
        ],
        "Label": "Forking current baggage with Baggage.fork()",
        "Title": "X-Trace Task",
        "Host": "pinky21.mpi-sws.org",
        "HRT": 10812999287358488,
        "Operation": "fork",
        "Timestamp": "1557750329521.221680",
        "TenantClass": 0,
        "Source": "PacketHeader.java:95",
        "ThreadID": 15520,
        "ThreadName": "",
        "EventID": "4CD45C6568BF24C1",
        "BaggageBytes": "[[248 5] [240 0] [0 241 233 16 157 238 41 149 236] [240 1] [0 151 251 114 92 108 247 239 138] [240 3] [0 2]]",
        "ProcessID": 20775
      },
      {
        "Cycles": 0,
        "Agent": "Execution-Sleep",
        "ProcessName": "Read",
        "TaskID": "F1E9109DEE2995EC",
        "ParentEventID": [
          "44FD6F2FDE121EEF"
        ],
        "Label": "waited",
        "Title": "X-Trace Task",
        "Host": "pinky19.mpi-sws.org",
        "Duration": "275721",
        "HRT": 26966689581477136,
        "Operation": "waited",
        "Timestamp": "1557750329521.536865",
        "TenantClass": 0,
        "Source": "SocketIOWithTimeout.java:335",
        "ThreadID": 1,
        "ThreadName": "",
        "EventID": "6CE988D4426F0A53",
        "ProcessID": 2801
      },
      {
        "Cycles": 0,
        "Agent": "Execution-Sleep",
        "ProcessName": "Data",
        "TaskID": "F1E9109DEE2995EC",
        "ParentEventID": [
          "4CD45C6568BF24C1"
        ],
        "Label": "waited",
        "Title": "X-Trace Task",
        "Host": "pinky21.mpi-sws.org",
        "Duration": "196786",
        "HRT": 10812999287641482,
        "Operation": "waited",
        "Timestamp": "1557750329521.504639",
        "TenantClass": 0,
        "Source": "SocketIOWithTimeout.java:335",
        "ThreadID": 15520,
        "ThreadName": "",
        "EventID": "D7F45791EB800F60",
        "BaggageBytes": "[[248 5] [240 0] [0 241 233 16 157 238 41 149 236] [240 1] [0 76 212 92 101 104 191 36 193] [240 3] [0 2]]",
        "ProcessID": 20775
      },
      {
        "Cycles": 0,
        "Agent": "edu.brown.cs.systems.xtrace.logging.BaggageWrappers",
        "ProcessName": "Data",
        "TaskID": "F1E9109DEE2995EC",
        "ParentEventID": [
          "D7F45791EB800F60"
        ],
        "Label": "Forking current baggage with Baggage.fork()",
        "Title": "X-Trace Task",
        "Host": "pinky21.mpi-sws.org",
        "HRT": 10812999287784894,
        "Operation": "fork",
        "Timestamp": "1557750329521.647949",
        "TenantClass": 0,
        "Source": "PacketHeader.java:95",
        "ThreadID": 15520,
        "ThreadName": "",
        "EventID": "82A68F7CCFEE2939",
        "BaggageBytes": "[[248 5] [240 0] [0 241 233 16 157 238 41 149 236] [240 1] [0 215 244 87 145 235 128 15 96] [240 3] [0 2]]",
        "ProcessID": 20775
      },
      {
        "Cycles": 0,
        "Agent": "Execution-Sleep",
        "ProcessName": "Read",
        "TaskID": "F1E9109DEE2995EC",
        "ParentEventID": [
          "6CE988D4426F0A53"
        ],
        "Label": "waited",
        "Title": "X-Trace Task",
        "Host": "pinky19.mpi-sws.org",
        "Duration": "173676",
        "HRT": 26966689581706266,
        "Operation": "waited",
        "Timestamp": "1557750329521.765869",
        "TenantClass": 0,
        "Source": "SocketIOWithTimeout.java:335",
        "ThreadID": 1,
        "ThreadName": "",
        "EventID": "997820E73ED99184",
        "ProcessID": 2801
      },
      {
        "Cycles": 0,
        "Agent": "Execution-Sleep",
        "ProcessName": "Read",
        "TaskID": "F1E9109DEE2995EC",
        "ParentEventID": [
          "997820E73ED99184"
        ],
        "Label": "waited",
        "Title": "X-Trace Task",
        "Host": "pinky19.mpi-sws.org",
        "Duration": "126211",
        "HRT": 26966689581892945,
        "Operation": "waited",
        "Timestamp": "1557750329521.952637",
        "TenantClass": 0,
        "Source": "SocketIOWithTimeout.java:335",
        "ThreadID": 1,
        "ThreadName": "",
        "EventID": "5CB1B91635121CA1",
        "ProcessID": 2801
      },
      {
        "Cycles": 0,
        "Agent": "Execution-Sleep",
        "ProcessName": "Data",
        "TaskID": "F1E9109DEE2995EC",
        "ParentEventID": [
          "82A68F7CCFEE2939"
        ],
        "Label": "waited",
        "Title": "X-Trace Task",
        "Host": "pinky21.mpi-sws.org",
        "Duration": "9042",
        "HRT": 10812999287906218,
        "Operation": "waited",
        "Timestamp": "1557750329521.769287",
        "TenantClass": 0,
        "Source": "SocketIOWithTimeout.java:335",
        "ThreadID": 15520,
        "ThreadName": "",
        "EventID": "EAD399327346860B",
        "BaggageBytes": "[[248 5] [240 0] [0 241 233 16 157 238 41 149 236] [240 1] [0 130 166 143 124 207 238 41 57] [240 3] [0 2]]",
        "ProcessID": 20775
      },
      {
        "Cycles": 0,
        "Agent": "Execution-Sleep",
        "ProcessName": "Read",
        "TaskID": "F1E9109DEE2995EC",
        "ParentEventID": [
          "5CB1B91635121CA1"
        ],
        "Label": "waited",
        "Title": "X-Trace Task",
        "Host": "pinky19.mpi-sws.org",
        "Duration": "146354",
        "HRT": 26966689582082955,
        "Operation": "waited",
        "Timestamp": "1557750329522.142578",
        "TenantClass": 0,
        "Source": "SocketIOWithTimeout.java:335",
        "ThreadID": 1,
        "ThreadName": "",
        "EventID": "61F738A38E84CC41",
        "ProcessID": 2801
      },
      {
        "Cycles": 0,
        "Agent": "edu.brown.cs.systems.xtrace.logging.BaggageWrappers",
        "ProcessName": "Read",
        "TaskID": "F1E9109DEE2995EC",
        "ParentEventID": [
          "16ADBAFCC2041E8F",
          "61F738A38E84CC41"
        ],
        "Label": "Merged current baggage with other baggage",
        "Title": "X-Trace Task",
        "Host": "pinky19.mpi-sws.org",
        "HRT": 26966689582128474,
        "Operation": "join",
        "Timestamp": "1557750329522.187988",
        "TenantClass": 0,
        "Source": "PacketHeader.java:168",
        "ThreadID": 1,
        "ThreadName": "",
        "EventID": "40F48D8466B4971D",
        "ProcessID": 2801
      },
      {
        "Cycles": 0,
        "Agent": "edu.brown.cs.systems.xtrace.logging.BaggageWrappers",
        "ProcessName": "Data",
        "TaskID": "F1E9109DEE2995EC",
        "ParentEventID": [
          "EAD399327346860B"
        ],
        "Label": "Forking current baggage with Baggage.fork()",
        "Title": "X-Trace Task",
        "Host": "pinky21.mpi-sws.org",
        "HRT": 10812999288105270,
        "Operation": "fork",
        "Timestamp": "1557750329521.968506",
        "TenantClass": 0,
        "Source": "PacketHeader.java:95",
        "ThreadID": 15520,
        "ThreadName": "",
        "EventID": "9CD23BB292C33563",
        "BaggageBytes": "[[248 5] [240 0] [0 241 233 16 157 238 41 149 236] [240 1] [0 234 211 153 50 115 70 134 11] [240 3] [0 2]]",
        "ProcessID": 20775
      },
      {
        "Cycles": 0,
        "Agent": "Execution-Sleep",
        "ProcessName": "Data",
        "TaskID": "F1E9109DEE2995EC",
        "ParentEventID": [
          "9CD23BB292C33563"
        ],
        "Label": "waited",
        "Title": "X-Trace Task",
        "Host": "pinky21.mpi-sws.org",
        "Duration": "80170",
        "HRT": 10812999288300562,
        "Operation": "waited",
        "Timestamp": "1557750329522.163818",
        "TenantClass": 0,
        "Source": "SocketIOWithTimeout.java:335",
        "ThreadID": 15520,
        "ThreadName": "",
        "EventID": "D2AAEC40C09CF9EC",
        "BaggageBytes": "[[248 5] [240 0] [0 241 233 16 157 238 41 149 236] [240 1] [0 156 210 59 178 146 195 53 99] [240 3] [0 2]]",
        "ProcessID": 20775
      },
      {
        "Cycles": 0,
        "Agent": "Execution-CPU",
        "ProcessName": "Data",
        "TaskID": "F1E9109DEE2995EC",
        "ParentEventID": [
          "D2AAEC40C09CF9EC"
        ],
        "Label": "unset",
        "Title": "X-Trace Task",
        "Host": "pinky21.mpi-sws.org",
        "Duration": "2072170",
        "HRT": 10812999288850526,
        "Operation": "unset",
        "Timestamp": "1557750329522.713623",
        "TenantClass": 0,
        "Source": "DataXceiver.java:261",
        "ThreadID": 15520,
        "ThreadName": "",
        "EventID": "554C651CB324C964",
        "BaggageBytes": "[[248 5] [240 0] [0 241 233 16 157 238 41 149 236] [240 1] [0 210 170 236 64 192 156 249 236] [240 3] [0 2]]",
        "ProcessID": 20775
      }
    ]
  }
]