[
  {
    "id": "ED419138C40A162A",
    "reports": [
      {
        "Cycles": 0,
        "Agent": "org.apache.hadoop.ipc.ProtobufRpcEngine",
        "ProcessName": "Read",
        "TaskID": "ED419138C40A162A",
        "ParentEventID": [
          "211F286791AE67E9"
        ],
        "Label": "Invoking org.apache.hadoop.hdfs.protocol.ClientProtocol.getBlockLocations",
        "Title": "X-Trace Task",
        "Host": "pinky19.mpi-sws.org",
        "HRT": 25491884627254938,
        "Timestamp": "1556275524567.534180",
        "TenantClass": 0,
        "Source": "ProtobufRpcEngine.java:228",
        "ThreadID": 1,
        "ThreadName": "",
        "EventID": "A096E1833A497497",
        "ProcessID": 21035
      },
      {
        "Cycles": 0,
        "Agent": "edu.brown.cs.systems.retro.benchmarks.hdfs_client.Reader",
        "ProcessName": "Read",
        "TaskID": "ED419138C40A162A",
        "ParentEventID": [
          "0"
        ],
        "Label": "Reading file",
        "Title": "X-Trace Task",
        "Host": "pinky19.mpi-sws.org",
        "HRT": 25491884627148359,
        "Timestamp": "1556275524567.427734",
        "TenantClass": 0,
        "ThreadID": 1,
        "ThreadName": "",
        "EventID": "ABE5D49D609CA90F",
        "ProcessID": 21035,
        "Tag": [
          "reader_1kb",
          "Read Size: 1024"
        ]
      },
      {
        "Cycles": 0,
        "Agent": "Execution-CPU",
        "ProcessName": "Read",
        "TaskID": "ED419138C40A162A",
        "ParentEventID": [
          "A096E1833A497497"
        ],
        "Label": "unset",
        "Title": "X-Trace Task",
        "Host": "pinky19.mpi-sws.org",
        "Duration": "21333941",
        "HRT": 25491884627284487,
        "Operation": "unset",
        "Timestamp": "1556275524567.563965",
        "TenantClass": 0,
        "Source": "Client.java:1027",
        "ThreadID": 1,
        "ThreadName": "",
        "EventID": "4AC160B1523B0926",
        "ProcessID": 21035
      },
      {
        "Cycles": 0,
        "Agent": "Execution-CPU",
        "ProcessName": "Read",
        "TaskID": "ED419138C40A162A",
        "ParentEventID": [
          "4AC160B1523B0926"
        ],
        "Label": "set",
        "Title": "X-Trace Task",
        "Host": "pinky19.mpi-sws.org",
        "HRT": 25491884627338187,
        "Operation": "set",
        "Timestamp": "1556275524567.617432",
        "TenantClass": 0,
        "Source": "Client.java:1032",
        "ThreadID": 41,
        "ThreadName": "",
        "EventID": "9F76DB9108BEB68F",
        "ProcessID": 21035
      },
      {
        "Cycles": 0,
        "Agent": "edu.brown.cs.systems.xtrace.logging.BaggageWrappers",
        "ProcessName": "Read",
        "TaskID": "ED419138C40A162A",
        "ParentEventID": [
          "9F76DB9108BEB68F"
        ],
        "Label": "Forking current baggage with Baggage.fork()",
        "Title": "X-Trace Task",
        "Host": "pinky19.mpi-sws.org",
        "HRT": 25491884627357848,
        "Operation": "fork",
        "Timestamp": "1556275524567.637207",
        "TenantClass": 0,
        "Source": "Client.java:1043",
        "ThreadID": 41,
        "ThreadName": "",
        "EventID": "38B3FDC4A8BA4F76",
        "ProcessID": 21035
      },
      {
        "Cycles": 0,
        "Agent": "Execution-CPU",
        "ProcessName": "Read",
        "TaskID": "ED419138C40A162A",
        "ParentEventID": [
          "38B3FDC4A8BA4F76"
        ],
        "Label": "unset",
        "Title": "X-Trace Task",
        "Host": "pinky19.mpi-sws.org",
        "Duration": "73619",
        "HRT": 25491884627431850,
        "Operation": "unset",
        "Timestamp": "1556275524567.711182",
        "TenantClass": 0,
        "Source": "Client.java:1062",
        "ThreadID": 41,
        "ThreadName": "",
        "EventID": "CC8379A430E8E64C",
        "ProcessID": 21035
      },
      {
        "Cycles": 0,
        "Agent": "Execution-CPU",
        "ProcessName": "Name",
        "TaskID": "ED419138C40A162A",
        "ParentEventID": [
          "38B3FDC4A8BA4F76"
        ],
        "Label": "set",
        "Title": "X-Trace Task",
        "Host": "pinky19.mpi-sws.org",
        "HRT": 25491884627493420,
        "Operation": "set",
        "Timestamp": "1556275524567.839844",
        "TenantClass": 0,
        "Source": "Server.java:1840",
        "ThreadID": 48,
        "ThreadName": "",
        "EventID": "9DA6536CC460ED00",
        "BaggageBytes": "[[248 5] [240 0] [0 237 65 145 56 196 10 22 42] [240 1] [0 56 179 253 196 168 186 79 118] [240 3] [0 2]]",
        "ProcessID": 2171
      },
      {
        "Cycles": 0,
        "Agent": "Execution-CPU",
        "ProcessName": "Read",
        "TaskID": "ED419138C40A162A",
        "ParentEventID": [
          "CC8379A430E8E64C"
        ],
        "Label": "set",
        "Title": "X-Trace Task",
        "Host": "pinky19.mpi-sws.org",
        "HRT": 25491884627451026,
        "Operation": "set",
        "Timestamp": "1556275524567.730469",
        "TenantClass": 0,
        "Source": "Client.java:1104",
        "ThreadID": 1,
        "ThreadName": "",
        "EventID": "1F6D321113B60B3D",
        "ProcessID": 21035
      },
      {
        "Cycles": 0,
        "Agent": "edu.brown.cs.systems.xtrace.logging.BaggageWrappers",
        "ProcessName": "Name",
        "TaskID": "ED419138C40A162A",
        "ParentEventID": [
          "9DA6536CC460ED00"
        ],
        "Label": "Forking current baggage with Baggage.fork()",
        "Title": "X-Trace Task",
        "Host": "pinky19.mpi-sws.org",
        "HRT": 25491884627523255,
        "Operation": "fork",
        "Timestamp": "1556275524567.869873",
        "TenantClass": 0,
        "Source": "Server.java:550",
        "ThreadID": 48,
        "ThreadName": "",
        "EventID": "752D0B148DA87E4B",
        "BaggageBytes": "[[248 5] [240 0] [0 237 65 145 56 196 10 22 42] [240 1] [0 157 166 83 108 196 96 237 0] [240 3] [0 2]]",
        "ProcessID": 2171
      },
      {
        "Cycles": 0,
        "Agent": "Execution-CPU",
        "ProcessName": "Name",
        "TaskID": "ED419138C40A162A",
        "ParentEventID": [
          "752D0B148DA87E4B"
        ],
        "Label": "unset",
        "Title": "X-Trace Task",
        "Host": "pinky19.mpi-sws.org",
        "Duration": "25343",
        "HRT": 25491884627545119,
        "Operation": "unset",
        "Timestamp": "1556275524567.891602",
        "TenantClass": 0,
        "Source": "Server.java:1828",
        "ThreadID": 48,
        "ThreadName": "",
        "EventID": "9D39627D8858FA36",
        "BaggageBytes": "[[248 5] [240 0] [0 237 65 145 56 196 10 22 42] [240 1] [0 117 45 11 20 141 168 126 75] [240 3] [0 2]]",
        "ProcessID": 2171
      },
      {
        "Cycles": 0,
        "Agent": "Execution-CPU",
        "ProcessName": "Name",
        "TaskID": "ED419138C40A162A",
        "ParentEventID": [
          "752D0B148DA87E4B"
        ],
        "Label": "set",
        "Title": "X-Trace Task",
        "Host": "pinky19.mpi-sws.org",
        "HRT": 25491884627552810,
        "Operation": "set",
        "Timestamp": "1556275524567.899414",
        "TenantClass": 0,
        "Source": "Server.java:2071",
        "ThreadID": 60,
        "ThreadName": "",
        "EventID": "4D217B20463061E5",
        "BaggageBytes": "[[248 5] [240 0] [0 237 65 145 56 196 10 22 42] [240 1] [0 117 45 11 20 141 168 126 75] [240 3] [0 2]]",
        "ProcessID": 2171
      },
      {
        "Cycles": 0,
        "Agent": "org.apache.hadoop.ipc.Server",
        "ProcessName": "Name",
        "TaskID": "ED419138C40A162A",
        "ParentEventID": [
          "4D217B20463061E5"
        ],
        "Label": "getBlockLocations in org.apache.hadoop.hdfs.protocol.ClientProtocol",
        "Title": "X-Trace Task",
        "Host": "pinky19.mpi-sws.org",
        "HRT": 25491884627592435,
        "Timestamp": "1556275524567.938965",
        "TenantClass": 0,
        "Source": "ProtobufRpcEngine.java:601",
        "ThreadID": 60,
        "ThreadName": "",
        "EventID": "8605B2393267E171",
        "BaggageBytes": "[[248 5] [240 0] [0 237 65 145 56 196 10 22 42] [240 1] [0 77 33 123 32 70 48 97 229] [240 3] [0 2]]",
        "ProcessID": 2171
      },
      {
        "Cycles": 0,
        "Agent": "edu.brown.cs.systems.xtrace.logging.BaggageWrappers",
        "ProcessName": "Name",
        "TaskID": "ED419138C40A162A",
        "ParentEventID": [
          "F9D8326E0CF620E3"
        ],
        "Label": "Forking current baggage with Baggage.fork()",
        "Title": "X-Trace Task",
        "Host": "pinky19.mpi-sws.org",
        "HRT": 25491884627688017,
        "Operation": "fork",
        "Timestamp": "1556275524568.034424",
        "TenantClass": 0,
        "Source": "Server.java:2398",
        "ThreadID": 60,
        "ThreadName": "",
        "EventID": "2003C0D7A3989DBF",
        "BaggageBytes": "[[248 5] [240 0] [0 237 65 145 56 196 10 22 42] [240 1] [0 249 216 50 110 12 246 32 227] [240 3] [0 2]]",
        "ProcessID": 2171
      },
      {
        "Cycles": 0,
        "Agent": "org.apache.hadoop.hdfs.server.namenode.FSNamesystem.audit",
        "ProcessName": "Name",
        "TaskID": "ED419138C40A162A",
        "ParentEventID": [
          "8605B2393267E171"
        ],
        "Label": "allowed=true\tugi=plascas (auth:SIMPLE)\tip=/139.19.171.63\tcmd=open\tsrc=/ds/u0ZrJ5hOmGcAEtkv\tdst=null\tperm=null\tproto=rpc",
        "Title": "X-Trace Task",
        "Host": "pinky19.mpi-sws.org",
        "HRT": 25491884627645798,
        "Timestamp": "1556275524567.992188",
        "TenantClass": 0,
        "Source": "FSNamesystem.java:8313",
        "ThreadID": 60,
        "ThreadName": "",
        "EventID": "F9D8326E0CF620E3",
        "BaggageBytes": "[[248 5] [240 0] [0 237 65 145 56 196 10 22 42] [240 1] [0 134 5 178 57 50 103 225 113] [240 3] [0 2]]",
        "ProcessID": 2171
      },
      {
        "Cycles": 0,
        "Agent": "Execution-CPU",
        "ProcessName": "Name",
        "TaskID": "ED419138C40A162A",
        "ParentEventID": [
          "2003C0D7A3989DBF"
        ],
        "Label": "unset",
        "Title": "X-Trace Task",
        "Host": "pinky19.mpi-sws.org",
        "Duration": "211640",
        "HRT": 25491884627792552,
        "Operation": "unset",
        "Timestamp": "1556275524568.139160",
        "TenantClass": 0,
        "Source": "Server.java:1058",
        "ThreadID": 60,
        "ThreadName": "",
        "EventID": "9A14A8BD5DB4B51C",
        "BaggageBytes": "[[248 5] [240 0] [0 237 65 145 56 196 10 22 42] [240 1] [0 32 3 192 215 163 152 157 191] [240 3] [0 2]]",
        "ProcessID": 2171
      },
      {
        "Cycles": 0,
        "Agent": "Execution-CPU",
        "ProcessName": "Read",
        "TaskID": "ED419138C40A162A",
        "ParentEventID": [
          "2003C0D7A3989DBF"
        ],
        "Label": "set",
        "Title": "X-Trace Task",
        "Host": "pinky19.mpi-sws.org",
        "HRT": 25491884627848986,
        "Operation": "set",
        "Timestamp": "1556275524568.128418",
        "TenantClass": 0,
        "Source": "Client.java:302",
        "ThreadID": 37,
        "ThreadName": "",
        "EventID": "BC0D237F77C1DDD4",
        "ProcessID": 21035
      },
      {
        "Cycles": 0,
        "Agent": "Execution-CPU",
        "ProcessName": "Read",
        "TaskID": "ED419138C40A162A",
        "ParentEventID": [
          "BC0D237F77C1DDD4"
        ],
        "Label": "unset",
        "Title": "X-Trace Task",
        "Host": "pinky19.mpi-sws.org",
        "Duration": "6671",
        "HRT": 25491884627887154,
        "Operation": "unset",
        "Timestamp": "1556275524568.166504",
        "TenantClass": 0,
        "Source": "Client.java:1168",
        "ThreadID": 37,
        "ThreadName": "",
        "EventID": "52CEA82037C85F3F",
        "ProcessID": 21035
      },
      {
        "Cycles": 0,
        "Agent": "Execution-Sleep",
        "ProcessName": "Read",
        "TaskID": "ED419138C40A162A",
        "ParentEventID": [
          "1F6D321113B60B3D"
        ],
        "Label": "waited",
        "Title": "X-Trace Task",
        "Host": "pinky19.mpi-sws.org",
        "Duration": "454009",
        "HRT": 25491884627927614,
        "Operation": "waited",
        "Timestamp": "1556275524568.207031",
        "TenantClass": 0,
        "Source": "Client.java:1537",
        "ThreadID": 1,
        "ThreadName": "",
        "EventID": "6881B3CE27A50D90",
        "ProcessID": 21035
      },
      {
        "Cycles": 0,
        "Agent": "org.apache.hadoop.ipc.ProtobufRpcEngine",
        "ProcessName": "Read",
        "TaskID": "ED419138C40A162A",
        "ParentEventID": [
          "93633E3D6CA9FD76"
        ],
        "Label": "org.apache.hadoop.hdfs.protocol.ClientProtocol.getBlockLocations completed",
        "Title": "X-Trace Task",
        "Host": "pinky19.mpi-sws.org",
        "HRT": 25491884628036281,
        "Timestamp": "1556275524568.315674",
        "TenantClass": 0,
        "Source": "ProtobufRpcEngine.java:275",
        "ThreadID": 1,
        "ThreadName": "",
        "EventID": "F792D6675906B73F",
        "ProcessID": 21035
      },
      {
        "Cycles": 0,
        "Agent": "edu.brown.cs.systems.xtrace.logging.BaggageWrappers",
        "ProcessName": "Read",
        "TaskID": "ED419138C40A162A",
        "ParentEventID": [
          "F792D6675906B73F"
        ],
        "Label": "Forking current baggage with Baggage.fork()",
        "Title": "X-Trace Task",
        "Host": "pinky19.mpi-sws.org",
        "HRT": 25491884628130963,
        "Operation": "fork",
        "Timestamp": "1556275524568.410400",
        "TenantClass": 0,
        "Source": "DataTransferProtoUtil.java:94",
        "ThreadID": 1,
        "ThreadName": "",
        "EventID": "944A585C6426DD25",
        "ProcessID": 21035
      },
      {
        "Cycles": 0,
        "Agent": "Execution-CPU",
        "ProcessName": "Data",
        "TaskID": "ED419138C40A162A",
        "ParentEventID": [
          "944A585C6426DD25"
        ],
        "Label": "set",
        "Title": "X-Trace Task",
        "Host": "pinky19.mpi-sws.org",
        "HRT": 25491884628256172,
        "Operation": "set",
        "Timestamp": "1556275524568.436035",
        "TenantClass": 0,
        "Source": "Receiver.java:117",
        "ThreadID": 9602,
        "ThreadName": "",
        "EventID": "DAA78089A259E6EE",
        "BaggageBytes": "[[248 5] [240 0] [0 237 65 145 56 196 10 22 42] [240 1] [0 148 74 88 92 100 38 221 37] [240 3] [0 2]]",
        "ProcessID": 2319
      },
      {
        "Cycles": 0,
        "Agent": "edu.brown.cs.systems.xtrace.logging.BaggageWrappers",
        "ProcessName": "Read",
        "TaskID": "ED419138C40A162A",
        "ParentEventID": [
          "52CEA82037C85F3F",
          "6881B3CE27A50D90"
        ],
        "Label": "Merged current baggage with other baggage",
        "Title": "X-Trace Task",
        "Host": "pinky19.mpi-sws.org",
        "HRT": 25491884627961613,
        "Operation": "join",
        "Timestamp": "1556275524568.240967",
        "TenantClass": 0,
        "Source": "Client.java:1545",
        "ThreadID": 1,
        "ThreadName": "",
        "EventID": "93633E3D6CA9FD76",
        "ProcessID": 21035
      },
      {
        "Cycles": 0,
        "Agent": "edu.brown.cs.systems.xtrace.logging.XTraceInit",
        "ProcessName": "Data",
        "TaskID": "ED419138C40A162A",
        "ParentEventID": [
          "DAA78089A259E6EE"
        ],
        "Label": "Thread.setName: DataXceiver for client DFSClient_NONMAPREDUCE_1377588049_1 at /139.19.171.63:36074 [Sending block BP-1633380353-139.19.171.63-1554193446451:blk_1073757091_16267]",
        "Title": "X-Trace Task",
        "Host": "pinky19.mpi-sws.org",
        "HRT": 25491884628288006,
        "Timestamp": "1556275524568.467773",
        "TenantClass": 0,
        "Source": "DataXceiver.java:168",
        "ThreadID": 9602,
        "ThreadName": "",
        "EventID": "C965FE954D2B5758",
        "BaggageBytes": "[[248 5] [240 0] [0 237 65 145 56 196 10 22 42] [240 1] [0 218 167 128 137 162 89 230 238] [240 3] [0 2]]",
        "ProcessID": 2319
      },
      {
        "Cycles": 0,
        "Agent": "edu.brown.cs.systems.xtrace.logging.BaggageWrappers",
        "ProcessName": "Data",
        "TaskID": "ED419138C40A162A",
        "ParentEventID": [
          "C965FE954D2B5758"
        ],
        "Label": "Forking current baggage with Baggage.fork()",
        "Title": "X-Trace Task",
        "Host": "pinky19.mpi-sws.org",
        "HRT": 25491884628356656,
        "Operation": "fork",
        "Timestamp": "1556275524568.536377",
        "TenantClass": 0,
        "Source": "DataXceiver.java:1257",
        "ThreadID": 9602,
        "ThreadName": "",
        "EventID": "CA1EEC674FA422C6",
        "BaggageBytes": "[[248 5] [240 0] [0 237 65 145 56 196 10 22 42] [240 1] [0 201 101 254 149 77 43 87 88] [240 3] [0 2]]",
        "ProcessID": 2319
      },
      {
        "Cycles": 0,
        "Agent": "edu.brown.cs.systems.xtrace.logging.BaggageWrappers",
        "ProcessName": "Data",
        "TaskID": "ED419138C40A162A",
        "ParentEventID": [
          "CA1EEC674FA422C6"
        ],
        "Label": "Forking current baggage with Baggage.fork()",
        "Title": "X-Trace Task",
        "Host": "pinky19.mpi-sws.org",
        "HRT": 25491884628415157,
        "Operation": "fork",
        "Timestamp": "1556275524568.594971",
        "TenantClass": 0,
        "Source": "PacketHeader.java:95",
        "ThreadID": 9602,
        "ThreadName": "",
        "EventID": "041C161A1150175F",
        "BaggageBytes": "[[248 5] [240 0] [0 237 65 145 56 196 10 22 42] [240 1] [0 202 30 236 103 79 164 34 198] [240 3] [0 2]]",
        "ProcessID": 2319
      },
      {
        "Cycles": 0,
        "Agent": "Execution-Sleep",
        "ProcessName": "Read",
        "TaskID": "ED419138C40A162A",
        "ParentEventID": [
          "944A585C6426DD25"
        ],
        "Label": "waited",
        "Title": "X-Trace Task",
        "Host": "pinky19.mpi-sws.org",
        "Duration": "187012",
        "HRT": 25491884628414923,
        "Operation": "waited",
        "Timestamp": "1556275524568.694336",
        "TenantClass": 0,
        "Source": "SocketIOWithTimeout.java:335",
        "ThreadID": 1,
        "ThreadName": "",
        "EventID": "DE6D86D3536F642E",
        "ProcessID": 21035
      },
      {
        "Cycles": 0,
        "Agent": "edu.brown.cs.systems.xtrace.logging.BaggageWrappers",
        "ProcessName": "Read",
        "TaskID": "ED419138C40A162A",
        "ParentEventID": [
          "CA1EEC674FA422C6",
          "DE6D86D3536F642E"
        ],
        "Label": "Merged current baggage with other baggage",
        "Title": "X-Trace Task",
        "Host": "pinky19.mpi-sws.org",
        "HRT": 25491884628488440,
        "Operation": "join",
        "Timestamp": "1556275524568.767822",
        "TenantClass": 0,
        "Source": "RemoteBlockReader2.java:429",
        "ThreadID": 1,
        "ThreadName": "",
        "EventID": "426BEC38A75FBE2D",
        "ProcessID": 21035
      },
      {
        "Cycles": 0,
        "Agent": "Execution-Sleep",
        "ProcessName": "Data",
        "TaskID": "ED419138C40A162A",
        "ParentEventID": [
          "041C161A1150175F"
        ],
        "Label": "waited",
        "Title": "X-Trace Task",
        "Host": "pinky19.mpi-sws.org",
        "Duration": "4011",
        "HRT": 25491884628471634,
        "Operation": "waited",
        "Timestamp": "1556275524568.651367",
        "TenantClass": 0,
        "Source": "SocketIOWithTimeout.java:335",
        "ThreadID": 9602,
        "ThreadName": "",
        "EventID": "840AB3F297A6FD8C",
        "BaggageBytes": "[[248 5] [240 0] [0 237 65 145 56 196 10 22 42] [240 1] [0 4 28 22 26 17 80 23 95] [240 3] [0 2]]",
        "ProcessID": 2319
      },
      {
        "Cycles": 0,
        "Agent": "edu.brown.cs.systems.xtrace.logging.BaggageWrappers",
        "ProcessName": "Data",
        "TaskID": "ED419138C40A162A",
        "ParentEventID": [
          "840AB3F297A6FD8C"
        ],
        "Label": "Forking current baggage with Baggage.fork()",
        "Title": "X-Trace Task",
        "Host": "pinky19.mpi-sws.org",
        "HRT": 25491884628531179,
        "Operation": "fork",
        "Timestamp": "1556275524568.710938",
        "TenantClass": 0,
        "Source": "PacketHeader.java:95",
        "ThreadID": 9602,
        "ThreadName": "",
        "EventID": "1E3E73E300284D2E",
        "BaggageBytes": "[[248 5] [240 0] [0 237 65 145 56 196 10 22 42] [240 1] [0 132 10 179 242 151 166 253 140] [240 3] [0 2]]",
        "ProcessID": 2319
      },
      {
        "Cycles": 0,
        "Agent": "edu.brown.cs.systems.xtrace.logging.BaggageWrappers",
        "ProcessName": "Read",
        "TaskID": "ED419138C40A162A",
        "ParentEventID": [
          "1E3E73E300284D2E",
          "FC0C730CCBFC0AA5"
        ],
        "Label": "Merged current baggage with other baggage",
        "Title": "X-Trace Task",
        "Host": "pinky19.mpi-sws.org",
        "HRT": 25491884628617689,
        "Operation": "join",
        "Timestamp": "1556275524568.896973",
        "TenantClass": 0,
        "Source": "PacketHeader.java:168",
        "ThreadID": 1,
        "ThreadName": "",
        "EventID": "A19EABC0D6500D9E",
        "ProcessID": 21035
      },
      {
        "Cycles": 0,
        "Agent": "edu.brown.cs.systems.xtrace.logging.BaggageWrappers",
        "ProcessName": "Read",
        "TaskID": "ED419138C40A162A",
        "ParentEventID": [
          "A19EABC0D6500D9E"
        ],
        "Label": "Forking current baggage with Baggage.fork()",
        "Title": "X-Trace Task",
        "Host": "pinky19.mpi-sws.org",
        "HRT": 25491884628627896,
        "Operation": "fork",
        "Timestamp": "1556275524568.907227",
        "TenantClass": 0,
        "Source": "RemoteBlockReader2.java:361",
        "ThreadID": 1,
        "ThreadName": "",
        "EventID": "01074688F5B696A4",
        "ProcessID": 21035
      },
      {
        "Cycles": 0,
        "Agent": "edu.brown.cs.systems.xtrace.logging.BaggageWrappers",
        "ProcessName": "Read",
        "TaskID": "ED419138C40A162A",
        "ParentEventID": [
          "426BEC38A75FBE2D",
          "041C161A1150175F"
        ],
        "Label": "Merged current baggage with other baggage",
        "Title": "X-Trace Task",
        "Host": "pinky19.mpi-sws.org",
        "HRT": 25491884628562416,
        "Operation": "join",
        "Timestamp": "1556275524568.841797",
        "TenantClass": 0,
        "Source": "PacketHeader.java:168",
        "ThreadID": 1,
        "ThreadName": "",
        "EventID": "FC0C730CCBFC0AA5",
        "ProcessID": 21035
      },
      {
        "Cycles": 0,
        "Agent": "Execution-Sleep",
        "ProcessName": "Data",
        "TaskID": "ED419138C40A162A",
        "ParentEventID": [
          "1E3E73E300284D2E"
        ],
        "Label": "waited",
        "Title": "X-Trace Task",
        "Host": "pinky19.mpi-sws.org",
        "Duration": "63199",
        "HRT": 25491884628673398,
        "Operation": "waited",
        "Timestamp": "1556275524568.853271",
        "TenantClass": 0,
        "Source": "SocketIOWithTimeout.java:335",
        "ThreadID": 9602,
        "ThreadName": "",
        "EventID": "ACCB8F301658B2E6",
        "BaggageBytes": "[[248 5] [240 0] [0 237 65 145 56 196 10 22 42] [240 1] [0 30 62 115 227 0 40 77 46] [240 3] [0 2]]",
        "ProcessID": 2319
      },
      {
        "Cycles": 0,
        "Agent": "Execution-CPU",
        "ProcessName": "Data",
        "TaskID": "ED419138C40A162A",
        "ParentEventID": [
          "1FAE239F545E6CAC"
        ],
        "Label": "unset",
        "Title": "X-Trace Task",
        "Host": "pinky19.mpi-sws.org",
        "Duration": "464016",
        "HRT": 25491884628742348,
        "Operation": "unset",
        "Timestamp": "1556275524568.922119",
        "TenantClass": 0,
        "Source": "DataXceiver.java:261",
        "ThreadID": 9602,
        "ThreadName": "",
        "EventID": "E06599D9570D4A48",
        "BaggageBytes": "[[248 5] [240 0] [0 237 65 145 56 196 10 22 42] [240 1] [0 31 174 35 159 84 94 108 172] [240 3] [0 2]]",
        "ProcessID": 2319
      },
      {
        "Cycles": 0,
        "Agent": "edu.brown.cs.systems.xtrace.logging.BaggageWrappers",
        "ProcessName": "Data",
        "TaskID": "ED419138C40A162A",
        "ParentEventID": [
          "ACCB8F301658B2E6",
          "01074688F5B696A4"
        ],
        "Label": "Merged current baggage with other baggage",
        "Title": "X-Trace Task",
        "Host": "pinky19.mpi-sws.org",
        "HRT": 25491884628722900,
        "Operation": "join",
        "Timestamp": "1556275524568.902588",
        "TenantClass": 0,
        "Source": "DataXceiver.java:574",
        "ThreadID": 9602,
        "ThreadName": "",
        "EventID": "1FAE239F545E6CAC",
        "BaggageBytes": "[[248 5] [240 0] [0 237 65 145 56 196 10 22 42] [240 1] [0 172 203 143 48 22 88 178 230] [0 1 7 70 136 245 182 150 164] [240 3] [0 2]]",
        "ProcessID": 2319
      },
      {
        "Cycles": 0,
        "Agent": "edu.brown.cs.systems.retro.benchmarks.hdfs_client.Reader",
        "ProcessName": "Read",
        "TaskID": "ED419138C40A162A",
        "ParentEventID": [
          "ABE5D49D609CA90F"
        ],
        "Label": "Reading file",
        "Title": "X-Trace Task",
        "Host": "pinky19.mpi-sws.org",
        "HRT": 25491884627166701,
        "Timestamp": "1556275524567.446045",
        "TenantClass": 0,
        "ThreadID": 1,
        "ThreadName": "",
        "EventID": "211F286791AE67E9",
        "ProcessID": 21035
      }
    ]
  }
]