[
  {
    "id": "0090C0E28101CE2F",
    "reports": [
      {
        "Cycles": 0,
        "Agent": "org.apache.hadoop.ipc.ProtobufRpcEngine",
        "ProcessName": "Read",
        "TaskID": "0090C0E28101CE2F",
        "ParentEventID": [
          "F57BE7D0E3BE6483"
        ],
        "Label": "Invoking org.apache.hadoop.hdfs.protocol.ClientProtocol.getBlockLocations",
        "Title": "X-Trace Task",
        "Host": "pinky19.mpi-sws.org",
        "HRT": 26966705939417330,
        "Timestamp": "1557750345879.700439",
        "TenantClass": 0,
        "Source": "ProtobufRpcEngine.java:228",
        "ThreadID": 1,
        "ThreadName": "",
        "EventID": "A1023C92AF6FA102",
        "ProcessID": 2801
      },
      {
        "Cycles": 0,
        "Agent": "Execution-CPU",
        "ProcessName": "Read",
        "TaskID": "0090C0E28101CE2F",
        "ParentEventID": [
          "A1023C92AF6FA102"
        ],
        "Label": "unset",
        "Title": "X-Trace Task",
        "Host": "pinky19.mpi-sws.org",
        "Duration": "24769412",
        "HRT": 26966705939437531,
        "Operation": "unset",
        "Timestamp": "1557750345879.720459",
        "TenantClass": 0,
        "Source": "Client.java:1027",
        "ThreadID": 1,
        "ThreadName": "",
        "EventID": "A8CDC0EB3C39A8D1",
        "ProcessID": 2801
      },
      {
        "Cycles": 0,
        "Agent": "edu.brown.cs.systems.retro.benchmarks.hdfs_client.Reader",
        "ProcessName": "Read",
        "TaskID": "0090C0E28101CE2F",
        "ParentEventID": [
          "2BAACA03843594F9"
        ],
        "Label": "Reading file",
        "Title": "X-Trace Task",
        "Host": "pinky19.mpi-sws.org",
        "HRT": 26966705939393022,
        "Timestamp": "1557750345879.676025",
        "TenantClass": 0,
        "ThreadID": 1,
        "ThreadName": "",
        "EventID": "F57BE7D0E3BE6483",
        "ProcessID": 2801
      },
      {
        "Cycles": 0,
        "Agent": "Execution-CPU",
        "ProcessName": "Read",
        "TaskID": "0090C0E28101CE2F",
        "ParentEventID": [
          "A8CDC0EB3C39A8D1"
        ],
        "Label": "set",
        "Title": "X-Trace Task",
        "Host": "pinky19.mpi-sws.org",
        "HRT": 26966705939457666,
        "Operation": "set",
        "Timestamp": "1557750345879.740723",
        "TenantClass": 0,
        "Source": "Client.java:1032",
        "ThreadID": 41,
        "ThreadName": "",
        "EventID": "9CC018E138F87C6B",
        "ProcessID": 2801
      },
      {
        "Cycles": 0,
        "Agent": "edu.brown.cs.systems.xtrace.logging.BaggageWrappers",
        "ProcessName": "Read",
        "TaskID": "0090C0E28101CE2F",
        "ParentEventID": [
          "9CC018E138F87C6B"
        ],
        "Label": "Forking current baggage with Baggage.fork()",
        "Title": "X-Trace Task",
        "Host": "pinky19.mpi-sws.org",
        "HRT": 26966705939473205,
        "Operation": "fork",
        "Timestamp": "1557750345879.756104",
        "TenantClass": 0,
        "Source": "Client.java:1043",
        "ThreadID": 41,
        "ThreadName": "",
        "EventID": "B0A9D205A032352D",
        "ProcessID": 2801
      },
      {
        "Cycles": 0,
        "Agent": "Execution-CPU",
        "ProcessName": "Read",
        "TaskID": "0090C0E28101CE2F",
        "ParentEventID": [
          "33321041FA25A385"
        ],
        "Label": "set",
        "Title": "X-Trace Task",
        "Host": "pinky19.mpi-sws.org",
        "HRT": 26966705939565066,
        "Operation": "set",
        "Timestamp": "1557750345879.848145",
        "TenantClass": 0,
        "Source": "Client.java:1104",
        "ThreadID": 1,
        "ThreadName": "",
        "EventID": "29F88B3AD822B439",
        "ProcessID": 2801
      },
      {
        "Cycles": 0,
        "Agent": "Execution-CPU",
        "ProcessName": "Name",
        "TaskID": "0090C0E28101CE2F",
        "ParentEventID": [
          "B0A9D205A032352D"
        ],
        "Label": "set",
        "Title": "X-Trace Task",
        "Host": "pinky19.mpi-sws.org",
        "HRT": 26966705939595837,
        "Operation": "set",
        "Timestamp": "1557750345879.897217",
        "TenantClass": 0,
        "Source": "Server.java:1840",
        "ThreadID": 48,
        "ThreadName": "",
        "EventID": "4E9CA651BBF02051",
        "BaggageBytes": "[[248 5] [240 0] [0 0 144 192 226 129 1 206 47] [240 1] [0 176 169 210 5 160 50 53 45] [240 3] [0 2]]",
        "ProcessID": 2171
      },
      {
        "Cycles": 0,
        "Agent": "Execution-CPU",
        "ProcessName": "Read",
        "TaskID": "0090C0E28101CE2F",
        "ParentEventID": [
          "B0A9D205A032352D"
        ],
        "Label": "unset",
        "Title": "X-Trace Task",
        "Host": "pinky19.mpi-sws.org",
        "Duration": "65402",
        "HRT": 26966705939539288,
        "Operation": "unset",
        "Timestamp": "1557750345879.822266",
        "TenantClass": 0,
        "Source": "Client.java:1062",
        "ThreadID": 41,
        "ThreadName": "",
        "EventID": "33321041FA25A385",
        "ProcessID": 2801
      },
      {
        "Cycles": 0,
        "Agent": "edu.brown.cs.systems.xtrace.logging.BaggageWrappers",
        "ProcessName": "Name",
        "TaskID": "0090C0E28101CE2F",
        "ParentEventID": [
          "4E9CA651BBF02051"
        ],
        "Label": "Forking current baggage with Baggage.fork()",
        "Title": "X-Trace Task",
        "Host": "pinky19.mpi-sws.org",
        "HRT": 26966705939624800,
        "Operation": "fork",
        "Timestamp": "1557750345879.926270",
        "TenantClass": 0,
        "Source": "Server.java:550",
        "ThreadID": 48,
        "ThreadName": "",
        "EventID": "AA0976D52F4098D8",
        "BaggageBytes": "[[248 5] [240 0] [0 0 144 192 226 129 1 206 47] [240 1] [0 78 156 166 81 187 240 32 81] [240 3] [0 2]]",
        "ProcessID": 2171
      },
      {
        "Cycles": 0,
        "Agent": "Execution-CPU",
        "ProcessName": "Name",
        "TaskID": "0090C0E28101CE2F",
        "ParentEventID": [
          "AA0976D52F4098D8"
        ],
        "Label": "unset",
        "Title": "X-Trace Task",
        "Host": "pinky19.mpi-sws.org",
        "Duration": "24182",
        "HRT": 26966705939645019,
        "Operation": "unset",
        "Timestamp": "1557750345879.946533",
        "TenantClass": 0,
        "Source": "Server.java:1828",
        "ThreadID": 48,
        "ThreadName": "",
        "EventID": "E0A20F554E5ADA17",
        "BaggageBytes": "[[248 5] [240 0] [0 0 144 192 226 129 1 206 47] [240 1] [0 170 9 118 213 47 64 152 216] [240 3] [0 2]]",
        "ProcessID": 2171
      },
      {
        "Cycles": 0,
        "Agent": "Execution-CPU",
        "ProcessName": "Name",
        "TaskID": "0090C0E28101CE2F",
        "ParentEventID": [
          "AA0976D52F4098D8"
        ],
        "Label": "set",
        "Title": "X-Trace Task",
        "Host": "pinky19.mpi-sws.org",
        "HRT": 26966705939653680,
        "Operation": "set",
        "Timestamp": "1557750345879.955078",
        "TenantClass": 0,
        "Source": "Server.java:2071",
        "ThreadID": 57,
        "ThreadName": "",
        "EventID": "5338370388EB7EEF",
        "BaggageBytes": "[[248 5] [240 0] [0 0 144 192 226 129 1 206 47] [240 1] [0 170 9 118 213 47 64 152 216] [240 3] [0 2]]",
        "ProcessID": 2171
      },
      {
        "Cycles": 0,
        "Agent": "org.apache.hadoop.hdfs.server.namenode.FSNamesystem.audit",
        "ProcessName": "Name",
        "TaskID": "0090C0E28101CE2F",
        "ParentEventID": [
          "DE776C1CD2C9012C"
        ],
        "Label": "allowed=true\tugi=plascas (auth:SIMPLE)\tip=/139.19.171.63\tcmd=open\tsrc=/ds/imvaJMr6biRsuuZs\tdst=null\tperm=null\tproto=rpc",
        "Title": "X-Trace Task",
        "Host": "pinky19.mpi-sws.org",
        "HRT": 26966705939735439,
        "Timestamp": "1557750345880.036865",
        "TenantClass": 0,
        "Source": "FSNamesystem.java:8313",
        "ThreadID": 57,
        "ThreadName": "",
        "EventID": "9DFF3E2724CF0384",
        "BaggageBytes": "[[248 5] [240 0] [0 0 144 192 226 129 1 206 47] [240 1] [0 222 119 108 28 210 201 1 44] [240 3] [0 2]]",
        "ProcessID": 2171
      },
      {
        "Cycles": 0,
        "Agent": "org.apache.hadoop.ipc.Server",
        "ProcessName": "Name",
        "TaskID": "0090C0E28101CE2F",
        "ParentEventID": [
          "5338370388EB7EEF"
        ],
        "Label": "getBlockLocations in org.apache.hadoop.hdfs.protocol.ClientProtocol",
        "Title": "X-Trace Task",
        "Host": "pinky19.mpi-sws.org",
        "HRT": 26966705939688324,
        "Timestamp": "1557750345879.989746",
        "TenantClass": 0,
        "Source": "ProtobufRpcEngine.java:601",
        "ThreadID": 57,
        "ThreadName": "",
        "EventID": "DE776C1CD2C9012C",
        "BaggageBytes": "[[248 5] [240 0] [0 0 144 192 226 129 1 206 47] [240 1] [0 83 56 55 3 136 235 126 239] [240 3] [0 2]]",
        "ProcessID": 2171
      },
      {
        "Cycles": 0,
        "Agent": "edu.brown.cs.systems.xtrace.logging.BaggageWrappers",
        "ProcessName": "Name",
        "TaskID": "0090C0E28101CE2F",
        "ParentEventID": [
          "9DFF3E2724CF0384"
        ],
        "Label": "Forking current baggage with Baggage.fork()",
        "Title": "X-Trace Task",
        "Host": "pinky19.mpi-sws.org",
        "HRT": 26966705939778623,
        "Operation": "fork",
        "Timestamp": "1557750345880.080078",
        "TenantClass": 0,
        "Source": "Server.java:2398",
        "ThreadID": 57,
        "ThreadName": "",
        "EventID": "2554B977A11F8DA9",
        "BaggageBytes": "[[248 5] [240 0] [0 0 144 192 226 129 1 206 47] [240 1] [0 157 255 62 39 36 207 3 132] [240 3] [0 2]]",
        "ProcessID": 2171
      },
      {
        "Cycles": 0,
        "Agent": "Execution-CPU",
        "ProcessName": "Read",
        "TaskID": "0090C0E28101CE2F",
        "ParentEventID": [
          "2554B977A11F8DA9"
        ],
        "Label": "set",
        "Title": "X-Trace Task",
        "Host": "pinky19.mpi-sws.org",
        "HRT": 26966705939938541,
        "Operation": "set",
        "Timestamp": "1557750345880.221436",
        "TenantClass": 0,
        "Source": "Client.java:302",
        "ThreadID": 40,
        "ThreadName": "",
        "EventID": "4728948562CCF5E3",
        "ProcessID": 2801
      },
      {
        "Cycles": 0,
        "Agent": "Execution-CPU",
        "ProcessName": "Name",
        "TaskID": "0090C0E28101CE2F",
        "ParentEventID": [
          "2554B977A11F8DA9"
        ],
        "Label": "unset",
        "Title": "X-Trace Task",
        "Host": "pinky19.mpi-sws.org",
        "Duration": "207660",
        "HRT": 26966705939884019,
        "Operation": "unset",
        "Timestamp": "1557750345880.185547",
        "TenantClass": 0,
        "Source": "Server.java:1058",
        "ThreadID": 57,
        "ThreadName": "",
        "EventID": "4416C3B0438964F6",
        "BaggageBytes": "[[248 5] [240 0] [0 0 144 192 226 129 1 206 47] [240 1] [0 37 84 185 119 161 31 141 169] [240 3] [0 2]]",
        "ProcessID": 2171
      },
      {
        "Cycles": 0,
        "Agent": "Execution-CPU",
        "ProcessName": "Read",
        "TaskID": "0090C0E28101CE2F",
        "ParentEventID": [
          "4728948562CCF5E3"
        ],
        "Label": "unset",
        "Title": "X-Trace Task",
        "Host": "pinky19.mpi-sws.org",
        "Duration": "6381",
        "HRT": 26966705939958257,
        "Operation": "unset",
        "Timestamp": "1557750345880.241211",
        "TenantClass": 0,
        "Source": "Client.java:1168",
        "ThreadID": 40,
        "ThreadName": "",
        "EventID": "F5203EEA848712DD",
        "ProcessID": 2801
      },
      {
        "Cycles": 0,
        "Agent": "Execution-Sleep",
        "ProcessName": "Read",
        "TaskID": "0090C0E28101CE2F",
        "ParentEventID": [
          "29F88B3AD822B439"
        ],
        "Label": "waited",
        "Title": "X-Trace Task",
        "Host": "pinky19.mpi-sws.org",
        "Duration": "397345",
        "HRT": 26966705939976392,
        "Operation": "waited",
        "Timestamp": "1557750345880.259521",
        "TenantClass": 0,
        "Source": "Client.java:1537",
        "ThreadID": 1,
        "ThreadName": "",
        "EventID": "7D04B99CAA17212D",
        "ProcessID": 2801
      },
      {
        "Cycles": 0,
        "Agent": "edu.brown.cs.systems.xtrace.logging.BaggageWrappers",
        "ProcessName": "Read",
        "TaskID": "0090C0E28101CE2F",
        "ParentEventID": [
          "7D04B99CAA17212D",
          "F5203EEA848712DD"
        ],
        "Label": "Merged current baggage with other baggage",
        "Title": "X-Trace Task",
        "Host": "pinky19.mpi-sws.org",
        "HRT": 26966705939986670,
        "Operation": "join",
        "Timestamp": "1557750345880.269775",
        "TenantClass": 0,
        "Source": "Client.java:1545",
        "ThreadID": 1,
        "ThreadName": "",
        "EventID": "DF0716047BD69936",
        "ProcessID": 2801
      },
      {
        "Cycles": 0,
        "Agent": "Execution-Sleep",
        "ProcessName": "Read",
        "TaskID": "0090C0E28101CE2F",
        "ParentEventID": [
          "89900D830A8D6534"
        ],
        "Label": "waited",
        "Title": "X-Trace Task",
        "Host": "pinky19.mpi-sws.org",
        "Duration": "4486",
        "HRT": 26966705940151359,
        "Operation": "waited",
        "Timestamp": "1557750345880.434326",
        "TenantClass": 0,
        "Source": "SocketIOWithTimeout.java:335",
        "ThreadID": 1,
        "ThreadName": "",
        "EventID": "AB8984808D521ECE",
        "ProcessID": 2801
      },
      {
        "Cycles": 0,
        "Agent": "org.apache.hadoop.ipc.ProtobufRpcEngine",
        "ProcessName": "Read",
        "TaskID": "0090C0E28101CE2F",
        "ParentEventID": [
          "DF0716047BD69936"
        ],
        "Label": "org.apache.hadoop.hdfs.protocol.ClientProtocol.getBlockLocations completed",
        "Title": "X-Trace Task",
        "Host": "pinky19.mpi-sws.org",
        "HRT": 26966705940054839,
        "Timestamp": "1557750345880.337891",
        "TenantClass": 0,
        "Source": "ProtobufRpcEngine.java:275",
        "ThreadID": 1,
        "ThreadName": "",
        "EventID": "89900D830A8D6534",
        "ProcessID": 2801
      },
      {
        "Cycles": 0,
        "Agent": "edu.brown.cs.systems.xtrace.logging.BaggageWrappers",
        "ProcessName": "Read",
        "TaskID": "0090C0E28101CE2F",
        "ParentEventID": [
          "AB8984808D521ECE"
        ],
        "Label": "Forking current baggage with Baggage.fork()",
        "Title": "X-Trace Task",
        "Host": "pinky19.mpi-sws.org",
        "HRT": 26966705940187790,
        "Operation": "fork",
        "Timestamp": "1557750345880.470703",
        "TenantClass": 0,
        "Source": "DataTransferProtoUtil.java:94",
        "ThreadID": 1,
        "ThreadName": "",
        "EventID": "9E9F8A5ADA370547",
        "ProcessID": 2801
      },
      {
        "Cycles": 0,
        "Agent": "edu.brown.cs.systems.xtrace.logging.XTraceInit",
        "ProcessName": "Data",
        "TaskID": "0090C0E28101CE2F",
        "ParentEventID": [
          "C7C611F5FA045BFD"
        ],
        "Label": "Thread.setName: DataXceiver for client DFSClient_NONMAPREDUCE_310321604_1 at /139.19.171.63:55458 [Sending block BP-1633380353-139.19.171.63-1554193446451:blk_1073761787_20963]",
        "Title": "X-Trace Task",
        "Host": "pinky19.mpi-sws.org",
        "HRT": 26966705940382324,
        "Timestamp": "1557750345880.675293",
        "TenantClass": 0,
        "Source": "DataXceiver.java:168",
        "ThreadID": 38120,
        "ThreadName": "",
        "EventID": "A5F6490D9C48FBBC",
        "BaggageBytes": "[[248 5] [240 0] [0 0 144 192 226 129 1 206 47] [240 1] [0 199 198 17 245 250 4 91 253] [240 3] [0 2]]",
        "ProcessID": 2319
      },
      {
        "Cycles": 0,
        "Agent": "Execution-CPU",
        "ProcessName": "Data",
        "TaskID": "0090C0E28101CE2F",
        "ParentEventID": [
          "9E9F8A5ADA370547"
        ],
        "Label": "set",
        "Title": "X-Trace Task",
        "Host": "pinky19.mpi-sws.org",
        "HRT": 26966705940344573,
        "Operation": "set",
        "Timestamp": "1557750345880.637451",
        "TenantClass": 0,
        "Source": "Receiver.java:117",
        "ThreadID": 38120,
        "ThreadName": "",
        "EventID": "C7C611F5FA045BFD",
        "BaggageBytes": "[[248 5] [240 0] [0 0 144 192 226 129 1 206 47] [240 1] [0 158 159 138 90 218 55 5 71] [240 3] [0 2]]",
        "ProcessID": 2319
      },
      {
        "Cycles": 0,
        "Agent": "edu.brown.cs.systems.xtrace.logging.BaggageWrappers",
        "ProcessName": "Data",
        "TaskID": "0090C0E28101CE2F",
        "ParentEventID": [
          "A5F6490D9C48FBBC"
        ],
        "Label": "Forking current baggage with Baggage.fork()",
        "Title": "X-Trace Task",
        "Host": "pinky19.mpi-sws.org",
        "HRT": 26966705940461288,
        "Operation": "fork",
        "Timestamp": "1557750345880.754150",
        "TenantClass": 0,
        "Source": "DataXceiver.java:1257",
        "ThreadID": 38120,
        "ThreadName": "",
        "EventID": "5D83A5D7A0F7A546",
        "BaggageBytes": "[[248 5] [240 0] [0 0 144 192 226 129 1 206 47] [240 1] [0 165 246 73 13 156 72 251 188] [240 3] [0 2]]",
        "ProcessID": 2319
      },
      {
        "Cycles": 0,
        "Agent": "edu.brown.cs.systems.xtrace.logging.BaggageWrappers",
        "ProcessName": "Data",
        "TaskID": "0090C0E28101CE2F",
        "ParentEventID": [
          "5D83A5D7A0F7A546"
        ],
        "Label": "Forking current baggage with Baggage.fork()",
        "Title": "X-Trace Task",
        "Host": "pinky19.mpi-sws.org",
        "HRT": 26966705940533159,
        "Operation": "fork",
        "Timestamp": "1557750345880.826172",
        "TenantClass": 0,
        "Source": "PacketHeader.java:95",
        "ThreadID": 38120,
        "ThreadName": "",
        "EventID": "7EF1F0EEC2DA4A11",
        "BaggageBytes": "[[248 5] [240 0] [0 0 144 192 226 129 1 206 47] [240 1] [0 93 131 165 215 160 247 165 70] [240 3] [0 2]]",
        "ProcessID": 2319
      },
      {
        "Cycles": 0,
        "Agent": "Execution-Sleep",
        "ProcessName": "Read",
        "TaskID": "0090C0E28101CE2F",
        "ParentEventID": [
          "9E9F8A5ADA370547"
        ],
        "Label": "waited",
        "Title": "X-Trace Task",
        "Host": "pinky19.mpi-sws.org",
        "Duration": "259873",
        "HRT": 26966705940531739,
        "Operation": "waited",
        "Timestamp": "1557750345880.814697",
        "TenantClass": 0,
        "Source": "SocketIOWithTimeout.java:335",
        "ThreadID": 1,
        "ThreadName": "",
        "EventID": "1F4502371B04CE0E",
        "ProcessID": 2801
      },
      {
        "Cycles": 0,
        "Agent": "edu.brown.cs.systems.xtrace.logging.BaggageWrappers",
        "ProcessName": "Read",
        "TaskID": "0090C0E28101CE2F",
        "ParentEventID": [
          "1F4502371B04CE0E",
          "5D83A5D7A0F7A546"
        ],
        "Label": "Merged current baggage with other baggage",
        "Title": "X-Trace Task",
        "Host": "pinky19.mpi-sws.org",
        "HRT": 26966705940621891,
        "Operation": "join",
        "Timestamp": "1557750345880.904785",
        "TenantClass": 0,
        "Source": "RemoteBlockReader2.java:429",
        "ThreadID": 1,
        "ThreadName": "",
        "EventID": "73F106D4980BFAC4",
        "ProcessID": 2801
      },
      {
        "Cycles": 0,
        "Agent": "edu.brown.cs.systems.xtrace.logging.BaggageWrappers",
        "ProcessName": "Data",
        "TaskID": "0090C0E28101CE2F",
        "ParentEventID": [
          "664EF60624E54058"
        ],
        "Label": "Forking current baggage with Baggage.fork()",
        "Title": "X-Trace Task",
        "Host": "pinky19.mpi-sws.org",
        "HRT": 26966705940680483,
        "Operation": "fork",
        "Timestamp": "1557750345880.973389",
        "TenantClass": 0,
        "Source": "PacketHeader.java:95",
        "ThreadID": 38120,
        "ThreadName": "",
        "EventID": "8900224A546F688D",
        "BaggageBytes": "[[248 5] [240 0] [0 0 144 192 226 129 1 206 47] [240 1] [0 102 78 246 6 36 229 64 88] [240 3] [0 2]]",
        "ProcessID": 2319
      },
      {
        "Cycles": 0,
        "Agent": "Execution-Sleep",
        "ProcessName": "Data",
        "TaskID": "0090C0E28101CE2F",
        "ParentEventID": [
          "7EF1F0EEC2DA4A11"
        ],
        "Label": "waited",
        "Title": "X-Trace Task",
        "Host": "pinky19.mpi-sws.org",
        "Duration": "4994",
        "HRT": 26966705940601921,
        "Operation": "waited",
        "Timestamp": "1557750345880.894775",
        "TenantClass": 0,
        "Source": "SocketIOWithTimeout.java:335",
        "ThreadID": 38120,
        "ThreadName": "",
        "EventID": "664EF60624E54058",
        "BaggageBytes": "[[248 5] [240 0] [0 0 144 192 226 129 1 206 47] [240 1] [0 126 241 240 238 194 218 74 17] [240 3] [0 2]]",
        "ProcessID": 2319
      },
      {
        "Cycles": 0,
        "Agent": "edu.brown.cs.systems.xtrace.logging.BaggageWrappers",
        "ProcessName": "Read",
        "TaskID": "0090C0E28101CE2F",
        "ParentEventID": [
          "7EF1F0EEC2DA4A11",
          "73F106D4980BFAC4"
        ],
        "Label": "Merged current baggage with other baggage",
        "Title": "X-Trace Task",
        "Host": "pinky19.mpi-sws.org",
        "HRT": 26966705940711844,
        "Operation": "join",
        "Timestamp": "1557750345880.994873",
        "TenantClass": 0,
        "Source": "PacketHeader.java:168",
        "ThreadID": 1,
        "ThreadName": "",
        "EventID": "BE4F0BCD20492AF0",
        "ProcessID": 2801
      },
      {
        "Cycles": 0,
        "Agent": "edu.brown.cs.systems.xtrace.logging.BaggageWrappers",
        "ProcessName": "Read",
        "TaskID": "0090C0E28101CE2F",
        "ParentEventID": [
          "D7C4C8D5DE47BCF1"
        ],
        "Label": "Forking current baggage with Baggage.fork()",
        "Title": "X-Trace Task",
        "Host": "pinky19.mpi-sws.org",
        "HRT": 26966705940827678,
        "Operation": "fork",
        "Timestamp": "1557750345881.110596",
        "TenantClass": 0,
        "Source": "RemoteBlockReader2.java:361",
        "ThreadID": 1,
        "ThreadName": "",
        "EventID": "686CB00AD10B50F8",
        "ProcessID": 2801
      },
      {
        "Cycles": 0,
        "Agent": "edu.brown.cs.systems.xtrace.logging.BaggageWrappers",
        "ProcessName": "Read",
        "TaskID": "0090C0E28101CE2F",
        "ParentEventID": [
          "8900224A546F688D",
          "BE4F0BCD20492AF0"
        ],
        "Label": "Merged current baggage with other baggage",
        "Title": "X-Trace Task",
        "Host": "pinky19.mpi-sws.org",
        "HRT": 26966705940818413,
        "Operation": "join",
        "Timestamp": "1557750345881.101318",
        "TenantClass": 0,
        "Source": "PacketHeader.java:168",
        "ThreadID": 1,
        "ThreadName": "",
        "EventID": "D7C4C8D5DE47BCF1",
        "ProcessID": 2801
      },
      {
        "Cycles": 0,
        "Agent": "Execution-Sleep",
        "ProcessName": "Data",
        "TaskID": "0090C0E28101CE2F",
        "ParentEventID": [
          "8900224A546F688D"
        ],
        "Label": "waited",
        "Title": "X-Trace Task",
        "Host": "pinky19.mpi-sws.org",
        "Duration": "105319",
        "HRT": 26966705940870993,
        "Operation": "waited",
        "Timestamp": "1557750345881.163818",
        "TenantClass": 0,
        "Source": "SocketIOWithTimeout.java:335",
        "ThreadID": 38120,
        "ThreadName": "",
        "EventID": "F6447EBDACFBFE6B",
        "BaggageBytes": "[[248 5] [240 0] [0 0 144 192 226 129 1 206 47] [240 1] [0 137 0 34 74 84 111 104 141] [240 3] [0 2]]",
        "ProcessID": 2319
      },
      {
        "Cycles": 0,
        "Agent": "edu.brown.cs.systems.xtrace.logging.BaggageWrappers",
        "ProcessName": "Read",
        "TaskID": "0090C0E28101CE2F",
        "ParentEventID": [
          "686CB00AD10B50F8"
        ],
        "Label": "Forking current baggage with Baggage.fork()",
        "Title": "X-Trace Task",
        "Host": "pinky19.mpi-sws.org",
        "HRT": 26966705940896343,
        "Operation": "fork",
        "Timestamp": "1557750345881.179443",
        "TenantClass": 0,
        "Source": "DataTransferProtoUtil.java:94",
        "ThreadID": 1,
        "ThreadName": "",
        "EventID": "B6AB1E561680320C",
        "ProcessID": 2801
      },
      {
        "Cycles": 0,
        "Agent": "Execution-CPU",
        "ProcessName": "Data",
        "TaskID": "0090C0E28101CE2F",
        "ParentEventID": [
          "9DA7CA6C3057EF65"
        ],
        "Label": "unset",
        "Title": "X-Trace Task",
        "Host": "pinky19.mpi-sws.org",
        "Duration": "574046",
        "HRT": 26966705940944933,
        "Operation": "unset",
        "Timestamp": "1557750345881.237793",
        "TenantClass": 0,
        "Source": "DataXceiver.java:261",
        "ThreadID": 38120,
        "ThreadName": "",
        "EventID": "B5FA1E90620ED98C",
        "BaggageBytes": "[[248 5] [240 0] [0 0 144 192 226 129 1 206 47] [240 1] [0 157 167 202 108 48 87 239 101] [240 3] [0 2]]",
        "ProcessID": 2319
      },
      {
        "Cycles": 0,
        "Agent": "edu.brown.cs.systems.xtrace.logging.BaggageWrappers",
        "ProcessName": "Data",
        "TaskID": "0090C0E28101CE2F",
        "ParentEventID": [
          "F6447EBDACFBFE6B",
          "686CB00AD10B50F8"
        ],
        "Label": "Merged current baggage with other baggage",
        "Title": "X-Trace Task",
        "Host": "pinky19.mpi-sws.org",
        "HRT": 26966705940922674,
        "Operation": "join",
        "Timestamp": "1557750345881.215576",
        "TenantClass": 0,
        "Source": "DataXceiver.java:574",
        "ThreadID": 38120,
        "ThreadName": "",
        "EventID": "9DA7CA6C3057EF65",
        "BaggageBytes": "[[248 5] [240 0] [0 0 144 192 226 129 1 206 47] [240 1] [0 246 68 126 189 172 251 254 107] [0 104 108 176 10 209 11 80 248] [240 3] [0 2]]",
        "ProcessID": 2319
      },
      {
        "Cycles": 0,
        "Agent": "Execution-CPU",
        "ProcessName": "Data",
        "TaskID": "0090C0E28101CE2F",
        "ParentEventID": [
          "B6AB1E561680320C"
        ],
        "Label": "set",
        "Title": "X-Trace Task",
        "Host": "pinky19.mpi-sws.org",
        "HRT": 26966705940995321,
        "Operation": "set",
        "Timestamp": "1557750345881.288330",
        "TenantClass": 0,
        "Source": "Receiver.java:117",
        "ThreadID": 38120,
        "ThreadName": "",
        "EventID": "1C683739BB486121",
        "BaggageBytes": "[[248 5] [240 0] [0 0 144 192 226 129 1 206 47] [240 1] [0 182 171 30 86 22 128 50 12] [240 3] [0 2]]",
        "ProcessID": 2319
      },
      {
        "Cycles": 0,
        "Agent": "edu.brown.cs.systems.xtrace.logging.XTraceInit",
        "ProcessName": "Data",
        "TaskID": "0090C0E28101CE2F",
        "ParentEventID": [
          "1C683739BB486121"
        ],
        "Label": "Thread.setName: DataXceiver for client DFSClient_NONMAPREDUCE_310321604_1 at /139.19.171.63:55458 [Sending block BP-1633380353-139.19.171.63-1554193446451:blk_1073761787_20963]",
        "Title": "X-Trace Task",
        "Host": "pinky19.mpi-sws.org",
        "HRT": 26966705941021824,
        "Timestamp": "1557750345881.314697",
        "TenantClass": 0,
        "Source": "DataXceiver.java:168",
        "ThreadID": 38120,
        "ThreadName": "",
        "EventID": "3AC344F97CB4286B",
        "BaggageBytes": "[[248 5] [240 0] [0 0 144 192 226 129 1 206 47] [240 1] [0 28 104 55 57 187 72 97 33] [240 3] [0 2]]",
        "ProcessID": 2319
      },
      {
        "Cycles": 0,
        "Agent": "edu.brown.cs.systems.xtrace.logging.BaggageWrappers",
        "ProcessName": "Data",
        "TaskID": "0090C0E28101CE2F",
        "ParentEventID": [
          "3AC344F97CB4286B"
        ],
        "Label": "Forking current baggage with Baggage.fork()",
        "Title": "X-Trace Task",
        "Host": "pinky19.mpi-sws.org",
        "HRT": 26966705941085863,
        "Operation": "fork",
        "Timestamp": "1557750345881.378906",
        "TenantClass": 0,
        "Source": "DataXceiver.java:1257",
        "ThreadID": 38120,
        "ThreadName": "",
        "EventID": "9602A07961ACB48F",
        "BaggageBytes": "[[248 5] [240 0] [0 0 144 192 226 129 1 206 47] [240 1] [0 58 195 68 249 124 180 40 107] [240 3] [0 2]]",
        "ProcessID": 2319
      },
      {
        "Cycles": 0,
        "Agent": "Execution-Sleep",
        "ProcessName": "Read",
        "TaskID": "0090C0E28101CE2F",
        "ParentEventID": [
          "B6AB1E561680320C"
        ],
        "Label": "waited",
        "Title": "X-Trace Task",
        "Host": "pinky19.mpi-sws.org",
        "Duration": "170504",
        "HRT": 26966705941140141,
        "Operation": "waited",
        "Timestamp": "1557750345881.423096",
        "TenantClass": 0,
        "Source": "SocketIOWithTimeout.java:335",
        "ThreadID": 1,
        "ThreadName": "",
        "EventID": "39DF2D57D41C9C64",
        "ProcessID": 2801
      },
      {
        "Cycles": 0,
        "Agent": "edu.brown.cs.systems.xtrace.logging.BaggageWrappers",
        "ProcessName": "Data",
        "TaskID": "0090C0E28101CE2F",
        "ParentEventID": [
          "9602A07961ACB48F"
        ],
        "Label": "Forking current baggage with Baggage.fork()",
        "Title": "X-Trace Task",
        "Host": "pinky19.mpi-sws.org",
        "HRT": 26966705941141861,
        "Operation": "fork",
        "Timestamp": "1557750345881.434814",
        "TenantClass": 0,
        "Source": "PacketHeader.java:95",
        "ThreadID": 38120,
        "ThreadName": "",
        "EventID": "70B6E7503E03BB73",
        "BaggageBytes": "[[248 5] [240 0] [0 0 144 192 226 129 1 206 47] [240 1] [0 150 2 160 121 97 172 180 143] [240 3] [0 2]]",
        "ProcessID": 2319
      },
      {
        "Cycles": 0,
        "Agent": "edu.brown.cs.systems.xtrace.logging.BaggageWrappers",
        "ProcessName": "Read",
        "TaskID": "0090C0E28101CE2F",
        "ParentEventID": [
          "9602A07961ACB48F",
          "39DF2D57D41C9C64"
        ],
        "Label": "Merged current baggage with other baggage",
        "Title": "X-Trace Task",
        "Host": "pinky19.mpi-sws.org",
        "HRT": 26966705941200963,
        "Operation": "join",
        "Timestamp": "1557750345881.483887",
        "TenantClass": 0,
        "Source": "RemoteBlockReader2.java:429",
        "ThreadID": 1,
        "ThreadName": "",
        "EventID": "2F18208AAE121DA0",
        "ProcessID": 2801
      },
      {
        "Cycles": 0,
        "Agent": "Execution-Sleep",
        "ProcessName": "Data",
        "TaskID": "0090C0E28101CE2F",
        "ParentEventID": [
          "70B6E7503E03BB73"
        ],
        "Label": "waited",
        "Title": "X-Trace Task",
        "Host": "pinky19.mpi-sws.org",
        "Duration": "3810",
        "HRT": 26966705941197968,
        "Operation": "waited",
        "Timestamp": "1557750345881.490967",
        "TenantClass": 0,
        "Source": "SocketIOWithTimeout.java:335",
        "ThreadID": 38120,
        "ThreadName": "",
        "EventID": "A9FC8149024509FA",
        "BaggageBytes": "[[248 5] [240 0] [0 0 144 192 226 129 1 206 47] [240 1] [0 112 182 231 80 62 3 187 115] [240 3] [0 2]]",
        "ProcessID": 2319
      },
      {
        "Cycles": 0,
        "Agent": "edu.brown.cs.systems.xtrace.logging.BaggageWrappers",
        "ProcessName": "Data",
        "TaskID": "0090C0E28101CE2F",
        "ParentEventID": [
          "A9FC8149024509FA"
        ],
        "Label": "Forking current baggage with Baggage.fork()",
        "Title": "X-Trace Task",
        "Host": "pinky19.mpi-sws.org",
        "HRT": 26966705941264094,
        "Operation": "fork",
        "Timestamp": "1557750345881.557129",
        "TenantClass": 0,
        "Source": "PacketHeader.java:95",
        "ThreadID": 38120,
        "ThreadName": "",
        "EventID": "EE255FE54C71371B",
        "BaggageBytes": "[[248 5] [240 0] [0 0 144 192 226 129 1 206 47] [240 1] [0 169 252 129 73 2 69 9 250] [240 3] [0 2]]",
        "ProcessID": 2319
      },
      {
        "Cycles": 0,
        "Agent": "Execution-Sleep",
        "ProcessName": "Data",
        "TaskID": "0090C0E28101CE2F",
        "ParentEventID": [
          "EE255FE54C71371B"
        ],
        "Label": "waited",
        "Title": "X-Trace Task",
        "Host": "pinky19.mpi-sws.org",
        "Duration": "3497",
        "HRT": 26966705941317691,
        "Operation": "waited",
        "Timestamp": "1557750345881.610596",
        "TenantClass": 0,
        "Source": "SocketIOWithTimeout.java:335",
        "ThreadID": 38120,
        "ThreadName": "",
        "EventID": "DA2F85F27ABBFF9C",
        "BaggageBytes": "[[248 5] [240 0] [0 0 144 192 226 129 1 206 47] [240 1] [0 238 37 95 229 76 113 55 27] [240 3] [0 2]]",
        "ProcessID": 2319
      },
      {
        "Cycles": 0,
        "Agent": "edu.brown.cs.systems.xtrace.logging.BaggageWrappers",
        "ProcessName": "Read",
        "TaskID": "0090C0E28101CE2F",
        "ParentEventID": [
          "70B6E7503E03BB73",
          "2F18208AAE121DA0"
        ],
        "Label": "Merged current baggage with other baggage",
        "Title": "X-Trace Task",
        "Host": "pinky19.mpi-sws.org",
        "HRT": 26966705941285228,
        "Operation": "join",
        "Timestamp": "1557750345881.568359",
        "TenantClass": 0,
        "Source": "PacketHeader.java:168",
        "ThreadID": 1,
        "ThreadName": "",
        "EventID": "D61E637D6F7C32A2",
        "ProcessID": 2801
      },
      {
        "Cycles": 0,
        "Agent": "Execution-Sleep",
        "ProcessName": "Data",
        "TaskID": "0090C0E28101CE2F",
        "ParentEventID": [
          "DA2F85F27ABBFF9C"
        ],
        "Label": "waited",
        "Title": "X-Trace Task",
        "Host": "pinky19.mpi-sws.org",
        "Duration": "3251",
        "HRT": 26966705941378439,
        "Operation": "waited",
        "Timestamp": "1557750345881.671387",
        "TenantClass": 0,
        "Source": "SocketIOWithTimeout.java:335",
        "ThreadID": 38120,
        "ThreadName": "",
        "EventID": "526A9B6678413F7B",
        "BaggageBytes": "[[248 5] [240 0] [0 0 144 192 226 129 1 206 47] [240 1] [0 218 47 133 242 122 187 255 156] [240 3] [0 2]]",
        "ProcessID": 2319
      },
      {
        "Cycles": 0,
        "Agent": "Execution-CPU",
        "ProcessName": "Data",
        "TaskID": "0090C0E28101CE2F",
        "ParentEventID": [
          "526A9B6678413F7B"
        ],
        "Label": "unset",
        "Title": "X-Trace Task",
        "Host": "pinky19.mpi-sws.org",
        "Duration": "479001",
        "HRT": 26966705941493147,
        "Operation": "unset",
        "Timestamp": "1557750345881.786133",
        "TenantClass": 0,
        "Source": "DataXceiver.java:261",
        "ThreadID": 38120,
        "ThreadName": "",
        "EventID": "FA4411E236E95950",
        "BaggageBytes": "[[248 5] [240 0] [0 0 144 192 226 129 1 206 47] [240 1] [0 82 106 155 102 120 65 63 123] [240 3] [0 2]]",
        "ProcessID": 2319
      },
      {
        "Cycles": 0,
        "Agent": "edu.brown.cs.systems.retro.benchmarks.hdfs_client.Reader",
        "ProcessName": "Read",
        "TaskID": "0090C0E28101CE2F",
        "ParentEventID": [
          "0"
        ],
        "Label": "Reading file",
        "Title": "X-Trace Task",
        "Host": "pinky19.mpi-sws.org",
        "HRT": 26966705939376722,
        "Timestamp": "1557750345879.659668",
        "TenantClass": 0,
        "ThreadID": 1,
        "ThreadName": "",
        "EventID": "2BAACA03843594F9",
        "ProcessID": 2801,
        "Tag": [
          "reader_100kb",
          "Read Size: 102400"
        ]
      }
    ]
  }
]