[
  {
    "id": "667673D203D8AD07",
    "reports": [
      {
        "Cycles": 0,
        "Agent": "edu.brown.cs.systems.retro.benchmarks.hdfs_client.Reader",
        "ProcessName": "Read",
        "TaskID": "667673D203D8AD07",
        "ParentEventID": [
          "0"
        ],
        "Label": "Reading file",
        "Title": "X-Trace Task",
        "Host": "pinky19.mpi-sws.org",
        "HRT": 25491744077444047,
        "Timestamp": "1556275384017.614014",
        "TenantClass": 0,
        "ThreadID": 1,
        "ThreadName": "",
        "EventID": "CFA4F907F82F9662",
        "ProcessID": 21035,
        "Tag": [
          "reader_1kb",
          "Read Size: 1024"
        ]
      },
      {
        "Cycles": 0,
        "Agent": "org.apache.hadoop.ipc.ProtobufRpcEngine",
        "ProcessName": "Read",
        "TaskID": "667673D203D8AD07",
        "ParentEventID": [
          "5DCAADB3169ED111"
        ],
        "Label": "Invoking org.apache.hadoop.hdfs.protocol.ClientProtocol.getBlockLocations",
        "Title": "X-Trace Task",
        "Host": "pinky19.mpi-sws.org",
        "HRT": 25491744077537018,
        "Timestamp": "1556275384017.707031",
        "TenantClass": 0,
        "Source": "ProtobufRpcEngine.java:228",
        "ThreadID": 1,
        "ThreadName": "",
        "EventID": "609F952399F2E79B",
        "ProcessID": 21035
      },
      {
        "Cycles": 0,
        "Agent": "edu.brown.cs.systems.retro.benchmarks.hdfs_client.Reader",
        "ProcessName": "Read",
        "TaskID": "667673D203D8AD07",
        "ParentEventID": [
          "CFA4F907F82F9662"
        ],
        "Label": "Reading file",
        "Title": "X-Trace Task",
        "Host": "pinky19.mpi-sws.org",
        "HRT": 25491744077458607,
        "Timestamp": "1556275384017.628418",
        "TenantClass": 0,
        "ThreadID": 1,
        "ThreadName": "",
        "EventID": "5DCAADB3169ED111",
        "ProcessID": 21035
      },
      {
        "Cycles": 0,
        "Agent": "Execution-CPU",
        "ProcessName": "Read",
        "TaskID": "667673D203D8AD07",
        "ParentEventID": [
          "D6999FA8E0889779"
        ],
        "Label": "set",
        "Title": "X-Trace Task",
        "Host": "pinky19.mpi-sws.org",
        "HRT": 25491744077608640,
        "Operation": "set",
        "Timestamp": "1556275384017.778564",
        "TenantClass": 0,
        "Source": "Client.java:1032",
        "ThreadID": 41,
        "ThreadName": "",
        "EventID": "B8DC5C9B51B67834",
        "ProcessID": 21035
      },
      {
        "Cycles": 0,
        "Agent": "edu.brown.cs.systems.xtrace.logging.BaggageWrappers",
        "ProcessName": "Read",
        "TaskID": "667673D203D8AD07",
        "ParentEventID": [
          "B8DC5C9B51B67834"
        ],
        "Label": "Forking current baggage with Baggage.fork()",
        "Title": "X-Trace Task",
        "Host": "pinky19.mpi-sws.org",
        "HRT": 25491744077632591,
        "Operation": "fork",
        "Timestamp": "1556275384017.802490",
        "TenantClass": 0,
        "Source": "Client.java:1043",
        "ThreadID": 41,
        "ThreadName": "",
        "EventID": "22B97FCAD935C8D6",
        "ProcessID": 21035
      },
      {
        "Cycles": 0,
        "Agent": "Execution-CPU",
        "ProcessName": "Read",
        "TaskID": "667673D203D8AD07",
        "ParentEventID": [
          "A839E3B96090F4EB"
        ],
        "Label": "set",
        "Title": "X-Trace Task",
        "Host": "pinky19.mpi-sws.org",
        "HRT": 25491744077757781,
        "Operation": "set",
        "Timestamp": "1556275384017.927734",
        "TenantClass": 0,
        "Source": "Client.java:1104",
        "ThreadID": 1,
        "ThreadName": "",
        "EventID": "6B61943A4DF6379D",
        "ProcessID": 21035
      },
      {
        "Cycles": 0,
        "Agent": "Execution-CPU",
        "ProcessName": "Read",
        "TaskID": "667673D203D8AD07",
        "ParentEventID": [
          "22B97FCAD935C8D6"
        ],
        "Label": "unset",
        "Title": "X-Trace Task",
        "Host": "pinky19.mpi-sws.org",
        "Duration": "96642",
        "HRT": 25491744077726439,
        "Operation": "unset",
        "Timestamp": "1556275384017.896240",
        "TenantClass": 0,
        "Source": "Client.java:1062",
        "ThreadID": 41,
        "ThreadName": "",
        "EventID": "A839E3B96090F4EB",
        "ProcessID": 21035
      },
      {
        "Cycles": 0,
        "Agent": "edu.brown.cs.systems.xtrace.logging.BaggageWrappers",
        "ProcessName": "Name",
        "TaskID": "667673D203D8AD07",
        "ParentEventID": [
          "F5829CEFC35C020B"
        ],
        "Label": "Forking current baggage with Baggage.fork()",
        "Title": "X-Trace Task",
        "Host": "pinky19.mpi-sws.org",
        "HRT": 25491744077809287,
        "Operation": "fork",
        "Timestamp": "1556275384017.989990",
        "TenantClass": 0,
        "Source": "Server.java:550",
        "ThreadID": 48,
        "ThreadName": "",
        "EventID": "0F8F9999DFDA47D7",
        "BaggageBytes": "[[248 5] [240 0] [0 102 118 115 210 3 216 173 7] [240 1] [0 245 130 156 239 195 92 2 11] [240 3] [0 2]]",
        "ProcessID": 2171
      },
      {
        "Cycles": 0,
        "Agent": "Execution-CPU",
        "ProcessName": "Name",
        "TaskID": "667673D203D8AD07",
        "ParentEventID": [
          "0F8F9999DFDA47D7"
        ],
        "Label": "unset",
        "Title": "X-Trace Task",
        "Host": "pinky19.mpi-sws.org",
        "Duration": "24232",
        "HRT": 25491744077830040,
        "Operation": "unset",
        "Timestamp": "1556275384018.010742",
        "TenantClass": 0,
        "Source": "Server.java:1828",
        "ThreadID": 48,
        "ThreadName": "",
        "EventID": "D5028BFDF469E210",
        "BaggageBytes": "[[248 5] [240 0] [0 102 118 115 210 3 216 173 7] [240 1] [0 15 143 153 153 223 218 71 215] [240 3] [0 2]]",
        "ProcessID": 2171
      },
      {
        "Cycles": 0,
        "Agent": "Execution-CPU",
        "ProcessName": "Read",
        "TaskID": "667673D203D8AD07",
        "ParentEventID": [
          "609F952399F2E79B"
        ],
        "Label": "unset",
        "Title": "X-Trace Task",
        "Host": "pinky19.mpi-sws.org",
        "Duration": "22268684",
        "HRT": 25491744077572309,
        "Operation": "unset",
        "Timestamp": "1556275384017.742188",
        "TenantClass": 0,
        "Source": "Client.java:1027",
        "ThreadID": 1,
        "ThreadName": "",
        "EventID": "D6999FA8E0889779",
        "ProcessID": 21035
      },
      {
        "Cycles": 0,
        "Agent": "Execution-CPU",
        "ProcessName": "Name",
        "TaskID": "667673D203D8AD07",
        "ParentEventID": [
          "0F8F9999DFDA47D7"
        ],
        "Label": "set",
        "Title": "X-Trace Task",
        "Host": "pinky19.mpi-sws.org",
        "HRT": 25491744077837972,
        "Operation": "set",
        "Timestamp": "1556275384018.018799",
        "TenantClass": 0,
        "Source": "Server.java:2071",
        "ThreadID": 59,
        "ThreadName": "",
        "EventID": "0C2F1D4E2034793A",
        "BaggageBytes": "[[248 5] [240 0] [0 102 118 115 210 3 216 173 7] [240 1] [0 15 143 153 153 223 218 71 215] [240 3] [0 2]]",
        "ProcessID": 2171
      },
      {
        "Cycles": 0,
        "Agent": "Execution-CPU",
        "ProcessName": "Name",
        "TaskID": "667673D203D8AD07",
        "ParentEventID": [
          "22B97FCAD935C8D6"
        ],
        "Label": "set",
        "Title": "X-Trace Task",
        "Host": "pinky19.mpi-sws.org",
        "HRT": 25491744077780329,
        "Operation": "set",
        "Timestamp": "1556275384017.961182",
        "TenantClass": 0,
        "Source": "Server.java:1840",
        "ThreadID": 48,
        "ThreadName": "",
        "EventID": "F5829CEFC35C020B",
        "BaggageBytes": "[[248 5] [240 0] [0 102 118 115 210 3 216 173 7] [240 1] [0 34 185 127 202 217 53 200 214] [240 3] [0 2]]",
        "ProcessID": 2171
      },
      {
        "Cycles": 0,
        "Agent": "org.apache.hadoop.hdfs.server.namenode.FSNamesystem.audit",
        "ProcessName": "Name",
        "TaskID": "667673D203D8AD07",
        "ParentEventID": [
          "6B240AF3B02EF216"
        ],
        "Label": "allowed=true\tugi=plascas (auth:SIMPLE)\tip=/139.19.171.63\tcmd=open\tsrc=/ds/J8qGi68RE0ieP5Iq\tdst=null\tperm=null\tproto=rpc",
        "Title": "X-Trace Task",
        "Host": "pinky19.mpi-sws.org",
        "HRT": 25491744077924969,
        "Timestamp": "1556275384018.105713",
        "TenantClass": 0,
        "Source": "FSNamesystem.java:8313",
        "ThreadID": 59,
        "ThreadName": "",
        "EventID": "D8D30EC648D3E0A8",
        "BaggageBytes": "[[248 5] [240 0] [0 102 118 115 210 3 216 173 7] [240 1] [0 107 36 10 243 176 46 242 22] [240 3] [0 2]]",
        "ProcessID": 2171
      },
      {
        "Cycles": 0,
        "Agent": "Execution-CPU",
        "ProcessName": "Name",
        "TaskID": "667673D203D8AD07",
        "ParentEventID": [
          "327D3FB1EB66C952"
        ],
        "Label": "unset",
        "Title": "X-Trace Task",
        "Host": "pinky19.mpi-sws.org",
        "Duration": "202279",
        "HRT": 25491744078069539,
        "Operation": "unset",
        "Timestamp": "1556275384018.250244",
        "TenantClass": 0,
        "Source": "Server.java:1058",
        "ThreadID": 59,
        "ThreadName": "",
        "EventID": "9C4942BF0D410DDE",
        "BaggageBytes": "[[248 5] [240 0] [0 102 118 115 210 3 216 173 7] [240 1] [0 50 125 63 177 235 102 201 82] [240 3] [0 2]]",
        "ProcessID": 2171
      },
      {
        "Cycles": 0,
        "Agent": "org.apache.hadoop.ipc.Server",
        "ProcessName": "Name",
        "TaskID": "667673D203D8AD07",
        "ParentEventID": [
          "0C2F1D4E2034793A"
        ],
        "Label": "getBlockLocations in org.apache.hadoop.hdfs.protocol.ClientProtocol",
        "Title": "X-Trace Task",
        "Host": "pinky19.mpi-sws.org",
        "HRT": 25491744077877565,
        "Timestamp": "1556275384018.058350",
        "TenantClass": 0,
        "Source": "ProtobufRpcEngine.java:601",
        "ThreadID": 59,
        "ThreadName": "",
        "EventID": "6B240AF3B02EF216",
        "BaggageBytes": "[[248 5] [240 0] [0 102 118 115 210 3 216 173 7] [240 1] [0 12 47 29 78 32 52 121 58] [240 3] [0 2]]",
        "ProcessID": 2171
      },
      {
        "Cycles": 0,
        "Agent": "Execution-CPU",
        "ProcessName": "Read",
        "TaskID": "667673D203D8AD07",
        "ParentEventID": [
          "327D3FB1EB66C952"
        ],
        "Label": "set",
        "Title": "X-Trace Task",
        "Host": "pinky19.mpi-sws.org",
        "HRT": 25491744078136128,
        "Operation": "set",
        "Timestamp": "1556275384018.306152",
        "TenantClass": 0,
        "Source": "Client.java:302",
        "ThreadID": 37,
        "ThreadName": "",
        "EventID": "58DEB97BD127BABE",
        "ProcessID": 21035
      },
      {
        "Cycles": 0,
        "Agent": "Execution-Sleep",
        "ProcessName": "Read",
        "TaskID": "667673D203D8AD07",
        "ParentEventID": [
          "6B61943A4DF6379D"
        ],
        "Label": "waited",
        "Title": "X-Trace Task",
        "Host": "pinky19.mpi-sws.org",
        "Duration": "413188",
        "HRT": 25491744078186136,
        "Operation": "waited",
        "Timestamp": "1556275384018.355957",
        "TenantClass": 0,
        "Source": "Client.java:1537",
        "ThreadID": 1,
        "ThreadName": "",
        "EventID": "4A7CF69F75A053A0",
        "ProcessID": 21035
      },
      {
        "Cycles": 0,
        "Agent": "edu.brown.cs.systems.xtrace.logging.BaggageWrappers",
        "ProcessName": "Name",
        "TaskID": "667673D203D8AD07",
        "ParentEventID": [
          "D8D30EC648D3E0A8"
        ],
        "Label": "Forking current baggage with Baggage.fork()",
        "Title": "X-Trace Task",
        "Host": "pinky19.mpi-sws.org",
        "HRT": 25491744077966939,
        "Operation": "fork",
        "Timestamp": "1556275384018.147705",
        "TenantClass": 0,
        "Source": "Server.java:2398",
        "ThreadID": 59,
        "ThreadName": "",
        "EventID": "327D3FB1EB66C952",
        "BaggageBytes": "[[248 5] [240 0] [0 102 118 115 210 3 216 173 7] [240 1] [0 216 211 14 198 72 211 224 168] [240 3] [0 2]]",
        "ProcessID": 2171
      },
      {
        "Cycles": 0,
        "Agent": "edu.brown.cs.systems.xtrace.logging.BaggageWrappers",
        "ProcessName": "Read",
        "TaskID": "667673D203D8AD07",
        "ParentEventID": [
          "4A7CF69F75A053A0",
          "71B201865B3A78B4"
        ],
        "Label": "Merged current baggage with other baggage",
        "Title": "X-Trace Task",
        "Host": "pinky19.mpi-sws.org",
        "HRT": 25491744078207554,
        "Operation": "join",
        "Timestamp": "1556275384018.377441",
        "TenantClass": 0,
        "Source": "Client.java:1545",
        "ThreadID": 1,
        "ThreadName": "",
        "EventID": "B27F9B4ED6FF1144",
        "ProcessID": 21035
      },
      {
        "Cycles": 0,
        "Agent": "edu.brown.cs.systems.xtrace.logging.BaggageWrappers",
        "ProcessName": "Read",
        "TaskID": "667673D203D8AD07",
        "ParentEventID": [
          "849138D37CE08A69"
        ],
        "Label": "Forking current baggage with Baggage.fork()",
        "Title": "X-Trace Task",
        "Host": "pinky19.mpi-sws.org",
        "HRT": 25491744078343927,
        "Operation": "fork",
        "Timestamp": "1556275384018.513916",
        "TenantClass": 0,
        "Source": "DataTransferProtoUtil.java:94",
        "ThreadID": 1,
        "ThreadName": "",
        "EventID": "81799B2F145C2DD3",
        "ProcessID": 21035
      },
      {
        "Cycles": 0,
        "Agent": "org.apache.hadoop.ipc.ProtobufRpcEngine",
        "ProcessName": "Read",
        "TaskID": "667673D203D8AD07",
        "ParentEventID": [
          "B27F9B4ED6FF1144"
        ],
        "Label": "org.apache.hadoop.hdfs.protocol.ClientProtocol.getBlockLocations completed",
        "Title": "X-Trace Task",
        "Host": "pinky19.mpi-sws.org",
        "HRT": 25491744078251081,
        "Timestamp": "1556275384018.420898",
        "TenantClass": 0,
        "Source": "ProtobufRpcEngine.java:275",
        "ThreadID": 1,
        "ThreadName": "",
        "EventID": "849138D37CE08A69",
        "ProcessID": 21035
      },
      {
        "Cycles": 0,
        "Agent": "Execution-CPU",
        "ProcessName": "Data",
        "TaskID": "667673D203D8AD07",
        "ParentEventID": [
          "81799B2F145C2DD3"
        ],
        "Label": "set",
        "Title": "X-Trace Task",
        "Host": "pinky23.mpi-sws.org",
        "HRT": 10893240052600046,
        "Operation": "set",
        "Timestamp": "1556275384018.739990",
        "TenantClass": 0,
        "Source": "Receiver.java:117",
        "ThreadID": 6296,
        "ThreadName": "",
        "EventID": "AB1CD901F3995F43",
        "BaggageBytes": "[[248 5] [240 0] [0 102 118 115 210 3 216 173 7] [240 1] [0 129 121 155 47 20 92 45 211] [240 3] [0 2]]",
        "ProcessID": 24612
      },
      {
        "Cycles": 0,
        "Agent": "edu.brown.cs.systems.xtrace.logging.BaggageWrappers",
        "ProcessName": "Data",
        "TaskID": "667673D203D8AD07",
        "ParentEventID": [
          "8EBA39B5C94EACCB"
        ],
        "Label": "Forking current baggage with Baggage.fork()",
        "Title": "X-Trace Task",
        "Host": "pinky23.mpi-sws.org",
        "HRT": 10893240052743760,
        "Operation": "fork",
        "Timestamp": "1556275384018.883789",
        "TenantClass": 0,
        "Source": "DataXceiver.java:1257",
        "ThreadID": 6296,
        "ThreadName": "",
        "EventID": "E78D1BCB10C0A3BD",
        "BaggageBytes": "[[248 5] [240 0] [0 102 118 115 210 3 216 173 7] [240 1] [0 142 186 57 181 201 78 172 203] [240 3] [0 2]]",
        "ProcessID": 24612
      },
      {
        "Cycles": 0,
        "Agent": "Execution-CPU",
        "ProcessName": "Read",
        "TaskID": "667673D203D8AD07",
        "ParentEventID": [
          "58DEB97BD127BABE"
        ],
        "Label": "unset",
        "Title": "X-Trace Task",
        "Host": "pinky19.mpi-sws.org",
        "Duration": "12171",
        "HRT": 25491744078162173,
        "Operation": "unset",
        "Timestamp": "1556275384018.332031",
        "TenantClass": 0,
        "Source": "Client.java:1168",
        "ThreadID": 37,
        "ThreadName": "",
        "EventID": "71B201865B3A78B4",
        "ProcessID": 21035
      },
      {
        "Cycles": 0,
        "Agent": "Execution-Sleep",
        "ProcessName": "Read",
        "TaskID": "667673D203D8AD07",
        "ParentEventID": [
          "81799B2F145C2DD3"
        ],
        "Label": "waited",
        "Title": "X-Trace Task",
        "Host": "pinky19.mpi-sws.org",
        "Duration": "334928",
        "HRT": 25491744078798360,
        "Operation": "waited",
        "Timestamp": "1556275384018.968262",
        "TenantClass": 0,
        "Source": "SocketIOWithTimeout.java:335",
        "ThreadID": 1,
        "ThreadName": "",
        "EventID": "177F8E4EFD274A0D",
        "ProcessID": 21035
      },
      {
        "Cycles": 0,
        "Agent": "edu.brown.cs.systems.xtrace.logging.BaggageWrappers",
        "ProcessName": "Read",
        "TaskID": "667673D203D8AD07",
        "ParentEventID": [
          "E78D1BCB10C0A3BD",
          "177F8E4EFD274A0D"
        ],
        "Label": "Merged current baggage with other baggage",
        "Title": "X-Trace Task",
        "Host": "pinky19.mpi-sws.org",
        "HRT": 25491744078881763,
        "Operation": "join",
        "Timestamp": "1556275384019.051758",
        "TenantClass": 0,
        "Source": "RemoteBlockReader2.java:429",
        "ThreadID": 1,
        "ThreadName": "",
        "EventID": "40B961D6F8713691",
        "ProcessID": 21035
      },
      {
        "Cycles": 0,
        "Agent": "edu.brown.cs.systems.xtrace.logging.XTraceInit",
        "ProcessName": "Data",
        "TaskID": "667673D203D8AD07",
        "ParentEventID": [
          "AB1CD901F3995F43"
        ],
        "Label": "Thread.setName: DataXceiver for client DFSClient_NONMAPREDUCE_1377588049_1 at /139.19.171.63:57972 [Sending block BP-1633380353-139.19.171.63-1554193446451:blk_1073764444_23620]",
        "Title": "X-Trace Task",
        "Host": "pinky23.mpi-sws.org",
        "HRT": 10893240052638558,
        "Timestamp": "1556275384018.778564",
        "TenantClass": 0,
        "Source": "DataXceiver.java:168",
        "ThreadID": 6296,
        "ThreadName": "",
        "EventID": "8EBA39B5C94EACCB",
        "BaggageBytes": "[[248 5] [240 0] [0 102 118 115 210 3 216 173 7] [240 1] [0 171 28 217 1 243 153 95 67] [240 3] [0 2]]",
        "ProcessID": 24612
      },
      {
        "Cycles": 0,
        "Agent": "Execution-Sleep",
        "ProcessName": "Data",
        "TaskID": "667673D203D8AD07",
        "ParentEventID": [
          "D5E8C0932D20230E"
        ],
        "Label": "waited",
        "Title": "X-Trace Task",
        "Host": "pinky23.mpi-sws.org",
        "Duration": "4239",
        "HRT": 10893240052877347,
        "Operation": "waited",
        "Timestamp": "1556275384019.017334",
        "TenantClass": 0,
        "Source": "SocketIOWithTimeout.java:335",
        "ThreadID": 6296,
        "ThreadName": "",
        "EventID": "25199405BA22E062",
        "BaggageBytes": "[[248 5] [240 0] [0 102 118 115 210 3 216 173 7] [240 1] [0 213 232 192 147 45 32 35 14] [240 3] [0 2]]",
        "ProcessID": 24612
      },
      {
        "Cycles": 0,
        "Agent": "edu.brown.cs.systems.xtrace.logging.BaggageWrappers",
        "ProcessName": "Read",
        "TaskID": "667673D203D8AD07",
        "ParentEventID": [
          "40B961D6F8713691",
          "D5E8C0932D20230E"
        ],
        "Label": "Merged current baggage with other baggage",
        "Title": "X-Trace Task",
        "Host": "pinky19.mpi-sws.org",
        "HRT": 25491744078987754,
        "Operation": "join",
        "Timestamp": "1556275384019.157715",
        "TenantClass": 0,
        "Source": "PacketHeader.java:168",
        "ThreadID": 1,
        "ThreadName": "",
        "EventID": "4195158B6BF7BC10",
        "ProcessID": 21035
      },
      {
        "Cycles": 0,
        "Agent": "edu.brown.cs.systems.xtrace.logging.BaggageWrappers",
        "ProcessName": "Data",
        "TaskID": "667673D203D8AD07",
        "ParentEventID": [
          "E78D1BCB10C0A3BD"
        ],
        "Label": "Forking current baggage with Baggage.fork()",
        "Title": "X-Trace Task",
        "Host": "pinky23.mpi-sws.org",
        "HRT": 10893240052805684,
        "Operation": "fork",
        "Timestamp": "1556275384018.945801",
        "TenantClass": 0,
        "Source": "PacketHeader.java:95",
        "ThreadID": 6296,
        "ThreadName": "",
        "EventID": "D5E8C0932D20230E",
        "BaggageBytes": "[[248 5] [240 0] [0 102 118 115 210 3 216 173 7] [240 1] [0 231 141 27 203 16 192 163 189] [240 3] [0 2]]",
        "ProcessID": 24612
      },
      {
        "Cycles": 0,
        "Agent": "edu.brown.cs.systems.xtrace.logging.BaggageWrappers",
        "ProcessName": "Read",
        "TaskID": "667673D203D8AD07",
        "ParentEventID": [
          "F8FE8043DCA50596",
          "4195158B6BF7BC10"
        ],
        "Label": "Merged current baggage with other baggage",
        "Title": "X-Trace Task",
        "Host": "pinky19.mpi-sws.org",
        "HRT": 25491744079055099,
        "Operation": "join",
        "Timestamp": "1556275384019.225098",
        "TenantClass": 0,
        "Source": "PacketHeader.java:168",
        "ThreadID": 1,
        "ThreadName": "",
        "EventID": "582AA6775484D4F1",
        "ProcessID": 21035
      },
      {
        "Cycles": 0,
        "Agent": "Execution-Sleep",
        "ProcessName": "Data",
        "TaskID": "667673D203D8AD07",
        "ParentEventID": [
          "F8FE8043DCA50596"
        ],
        "Label": "waited",
        "Title": "X-Trace Task",
        "Host": "pinky23.mpi-sws.org",
        "Duration": "136639",
        "HRT": 10893240053171916,
        "Operation": "waited",
        "Timestamp": "1556275384019.312012",
        "TenantClass": 0,
        "Source": "SocketIOWithTimeout.java:335",
        "ThreadID": 6296,
        "ThreadName": "",
        "EventID": "BFEB33929D25F528",
        "BaggageBytes": "[[248 5] [240 0] [0 102 118 115 210 3 216 173 7] [240 1] [0 248 254 128 67 220 165 5 150] [240 3] [0 2]]",
        "ProcessID": 24612
      },
      {
        "Cycles": 0,
        "Agent": "edu.brown.cs.systems.xtrace.logging.BaggageWrappers",
        "ProcessName": "Data",
        "TaskID": "667673D203D8AD07",
        "ParentEventID": [
          "25199405BA22E062"
        ],
        "Label": "Forking current baggage with Baggage.fork()",
        "Title": "X-Trace Task",
        "Host": "pinky23.mpi-sws.org",
        "HRT": 10893240052936359,
        "Operation": "fork",
        "Timestamp": "1556275384019.076416",
        "TenantClass": 0,
        "Source": "PacketHeader.java:95",
        "ThreadID": 6296,
        "ThreadName": "",
        "EventID": "F8FE8043DCA50596",
        "BaggageBytes": "[[248 5] [240 0] [0 102 118 115 210 3 216 173 7] [240 1] [0 37 25 148 5 186 34 224 98] [240 3] [0 2]]",
        "ProcessID": 24612
      },
      {
        "Cycles": 0,
        "Agent": "edu.brown.cs.systems.xtrace.logging.BaggageWrappers",
        "ProcessName": "Data",
        "TaskID": "667673D203D8AD07",
        "ParentEventID": [
          "101D5546FCF35A39",
          "BFEB33929D25F528"
        ],
        "Label": "Merged current baggage with other baggage",
        "Title": "X-Trace Task",
        "Host": "pinky23.mpi-sws.org",
        "HRT": 10893240053247185,
        "Operation": "join",
        "Timestamp": "1556275384019.387207",
        "TenantClass": 0,
        "Source": "DataXceiver.java:574",
        "ThreadID": 6296,
        "ThreadName": "",
        "EventID": "A44EE750198D47E5",
        "BaggageBytes": "[[248 5] [240 0] [0 102 118 115 210 3 216 173 7] [240 1] [0 191 235 51 146 157 37 245 40] [0 16 29 85 70 252 243 90 57] [240 3] [0 2]]",
        "ProcessID": 24612
      },
      {
        "Cycles": 0,
        "Agent": "edu.brown.cs.systems.xtrace.logging.BaggageWrappers",
        "ProcessName": "Read",
        "TaskID": "667673D203D8AD07",
        "ParentEventID": [
          "582AA6775484D4F1"
        ],
        "Label": "Forking current baggage with Baggage.fork()",
        "Title": "X-Trace Task",
        "Host": "pinky19.mpi-sws.org",
        "HRT": 25491744079068499,
        "Operation": "fork",
        "Timestamp": "1556275384019.238525",
        "TenantClass": 0,
        "Source": "RemoteBlockReader2.java:361",
        "ThreadID": 1,
        "ThreadName": "",
        "EventID": "101D5546FCF35A39",
        "ProcessID": 21035
      },
      {
        "Cycles": 0,
        "Agent": "Execution-CPU",
        "ProcessName": "Data",
        "TaskID": "667673D203D8AD07",
        "ParentEventID": [
          "A44EE750198D47E5"
        ],
        "Label": "unset",
        "Title": "X-Trace Task",
        "Host": "pinky23.mpi-sws.org",
        "Duration": "653553",
        "HRT": 10893240053281147,
        "Operation": "unset",
        "Timestamp": "1556275384019.421143",
        "TenantClass": 0,
        "Source": "DataXceiver.java:261",
        "ThreadID": 6296,
        "ThreadName": "",
        "EventID": "3E5D20628DAB5348",
        "BaggageBytes": "[[248 5] [240 0] [0 102 118 115 210 3 216 173 7] [240 1] [0 164 78 231 80 25 141 71 229] [240 3] [0 2]]",
        "ProcessID": 24612
      }
    ]
  }
]