[
  {
    "id": "56548934BFC76B51",
    "reports": [
      {
        "Cycles": 0,
        "Agent": "Execution-CPU",
        "ProcessName": "Read",
        "TaskID": "56548934BFC76B51",
        "ParentEventID": [
          "484883741706DC7D"
        ],
        "Label": "unset",
        "Title": "X-Trace Task",
        "Host": "pinky19.mpi-sws.org",
        "Duration": "22357521",
        "HRT": 25491773236299243,
        "Operation": "unset",
        "Timestamp": "1556275413176.683350",
        "TenantClass": 0,
        "Source": "Client.java:1027",
        "ThreadID": 1,
        "ThreadName": "",
        "EventID": "C12BA3C92CAEB75D",
        "ProcessID": 21035
      },
      {
        "Cycles": 0,
        "Agent": "org.apache.hadoop.ipc.ProtobufRpcEngine",
        "ProcessName": "Read",
        "TaskID": "56548934BFC76B51",
        "ParentEventID": [
          "3DFF54525B8E0262"
        ],
        "Label": "Invoking org.apache.hadoop.hdfs.protocol.ClientProtocol.getBlockLocations",
        "Title": "X-Trace Task",
        "Host": "pinky19.mpi-sws.org",
        "HRT": 25491773236257109,
        "Timestamp": "1556275413176.641357",
        "TenantClass": 0,
        "Source": "ProtobufRpcEngine.java:228",
        "ThreadID": 1,
        "ThreadName": "",
        "EventID": "484883741706DC7D",
        "ProcessID": 21035
      },
      {
        "Cycles": 0,
        "Agent": "Execution-CPU",
        "ProcessName": "Read",
        "TaskID": "56548934BFC76B51",
        "ParentEventID": [
          "C12BA3C92CAEB75D"
        ],
        "Label": "set",
        "Title": "X-Trace Task",
        "Host": "pinky19.mpi-sws.org",
        "HRT": 25491773236349791,
        "Operation": "set",
        "Timestamp": "1556275413176.734131",
        "TenantClass": 0,
        "Source": "Client.java:1032",
        "ThreadID": 41,
        "ThreadName": "",
        "EventID": "9869A4EB46144FD6",
        "ProcessID": 21035
      },
      {
        "Cycles": 0,
        "Agent": "edu.brown.cs.systems.retro.benchmarks.hdfs_client.Reader",
        "ProcessName": "Read",
        "TaskID": "56548934BFC76B51",
        "ParentEventID": [
          "0"
        ],
        "Label": "Reading file",
        "Title": "X-Trace Task",
        "Host": "pinky19.mpi-sws.org",
        "HRT": 25491773236104145,
        "Timestamp": "1556275413176.488281",
        "TenantClass": 0,
        "ThreadID": 1,
        "ThreadName": "",
        "EventID": "1D15B9BD78528682",
        "ProcessID": 21035,
        "Tag": [
          "reader_1kb",
          "Read Size: 1024"
        ]
      },
      {
        "Cycles": 0,
        "Agent": "edu.brown.cs.systems.xtrace.logging.BaggageWrappers",
        "ProcessName": "Read",
        "TaskID": "56548934BFC76B51",
        "ParentEventID": [
          "9869A4EB46144FD6"
        ],
        "Label": "Forking current baggage with Baggage.fork()",
        "Title": "X-Trace Task",
        "Host": "pinky19.mpi-sws.org",
        "HRT": 25491773236369015,
        "Operation": "fork",
        "Timestamp": "1556275413176.753174",
        "TenantClass": 0,
        "Source": "Client.java:1043",
        "ThreadID": 41,
        "ThreadName": "",
        "EventID": "F590C5FFC28C9CED",
        "ProcessID": 21035
      },
      {
        "Cycles": 0,
        "Agent": "Execution-CPU",
        "ProcessName": "Read",
        "TaskID": "56548934BFC76B51",
        "ParentEventID": [
          "F590C5FFC28C9CED"
        ],
        "Label": "unset",
        "Title": "X-Trace Task",
        "Host": "pinky19.mpi-sws.org",
        "Duration": "79202",
        "HRT": 25491773236447166,
        "Operation": "unset",
        "Timestamp": "1556275413176.831299",
        "TenantClass": 0,
        "Source": "Client.java:1062",
        "ThreadID": 41,
        "ThreadName": "",
        "EventID": "CE59D1BE949BB8CE",
        "ProcessID": 21035
      },
      {
        "Cycles": 0,
        "Agent": "Execution-CPU",
        "ProcessName": "Read",
        "TaskID": "56548934BFC76B51",
        "ParentEventID": [
          "CE59D1BE949BB8CE"
        ],
        "Label": "set",
        "Title": "X-Trace Task",
        "Host": "pinky19.mpi-sws.org",
        "HRT": 25491773236472411,
        "Operation": "set",
        "Timestamp": "1556275413176.856689",
        "TenantClass": 0,
        "Source": "Client.java:1104",
        "ThreadID": 1,
        "ThreadName": "",
        "EventID": "169A09D1ED4268BC",
        "ProcessID": 21035
      },
      {
        "Cycles": 0,
        "Agent": "edu.brown.cs.systems.xtrace.logging.BaggageWrappers",
        "ProcessName": "Name",
        "TaskID": "56548934BFC76B51",
        "ParentEventID": [
          "7BC90173831C9B39"
        ],
        "Label": "Forking current baggage with Baggage.fork()",
        "Title": "X-Trace Task",
        "Host": "pinky19.mpi-sws.org",
        "HRT": 25491773236547535,
        "Operation": "fork",
        "Timestamp": "1556275413176.928223",
        "TenantClass": 0,
        "Source": "Server.java:550",
        "ThreadID": 48,
        "ThreadName": "",
        "EventID": "BDED9341C002BFE8",
        "BaggageBytes": "[[248 5] [240 0] [0 86 84 137 52 191 199 107 81] [240 1] [0 123 201 1 115 131 28 155 57] [240 3] [0 2]]",
        "ProcessID": 2171
      },
      {
        "Cycles": 0,
        "Agent": "Execution-CPU",
        "ProcessName": "Name",
        "TaskID": "56548934BFC76B51",
        "ParentEventID": [
          "BDED9341C002BFE8"
        ],
        "Label": "unset",
        "Title": "X-Trace Task",
        "Host": "pinky19.mpi-sws.org",
        "Duration": "23898",
        "HRT": 25491773236567990,
        "Operation": "unset",
        "Timestamp": "1556275413176.948730",
        "TenantClass": 0,
        "Source": "Server.java:1828",
        "ThreadID": 48,
        "ThreadName": "",
        "EventID": "1C36EACAA351AE5F",
        "BaggageBytes": "[[248 5] [240 0] [0 86 84 137 52 191 199 107 81] [240 1] [0 189 237 147 65 192 2 191 232] [240 3] [0 2]]",
        "ProcessID": 2171
      },
      {
        "Cycles": 0,
        "Agent": "Execution-CPU",
        "ProcessName": "Name",
        "TaskID": "56548934BFC76B51",
        "ParentEventID": [
          "BDED9341C002BFE8"
        ],
        "Label": "set",
        "Title": "X-Trace Task",
        "Host": "pinky19.mpi-sws.org",
        "HRT": 25491773236575507,
        "Operation": "set",
        "Timestamp": "1556275413176.956299",
        "TenantClass": 0,
        "Source": "Server.java:2071",
        "ThreadID": 55,
        "ThreadName": "",
        "EventID": "DDC342205FE5114D",
        "BaggageBytes": "[[248 5] [240 0] [0 86 84 137 52 191 199 107 81] [240 1] [0 189 237 147 65 192 2 191 232] [240 3] [0 2]]",
        "ProcessID": 2171
      },
      {
        "Cycles": 0,
        "Agent": "Execution-CPU",
        "ProcessName": "Name",
        "TaskID": "56548934BFC76B51",
        "ParentEventID": [
          "F590C5FFC28C9CED"
        ],
        "Label": "set",
        "Title": "X-Trace Task",
        "Host": "pinky19.mpi-sws.org",
        "HRT": 25491773236518495,
        "Operation": "set",
        "Timestamp": "1556275413176.899170",
        "TenantClass": 0,
        "Source": "Server.java:1840",
        "ThreadID": 48,
        "ThreadName": "",
        "EventID": "7BC90173831C9B39",
        "BaggageBytes": "[[248 5] [240 0] [0 86 84 137 52 191 199 107 81] [240 1] [0 245 144 197 255 194 140 156 237] [240 3] [0 2]]",
        "ProcessID": 2171
      },
      {
        "Cycles": 0,
        "Agent": "org.apache.hadoop.ipc.Server",
        "ProcessName": "Name",
        "TaskID": "56548934BFC76B51",
        "ParentEventID": [
          "DDC342205FE5114D"
        ],
        "Label": "getBlockLocations in org.apache.hadoop.hdfs.protocol.ClientProtocol",
        "Title": "X-Trace Task",
        "Host": "pinky19.mpi-sws.org",
        "HRT": 25491773236607866,
        "Timestamp": "1556275413176.988525",
        "TenantClass": 0,
        "Source": "ProtobufRpcEngine.java:601",
        "ThreadID": 55,
        "ThreadName": "",
        "EventID": "9975FFC5DF5EDF91",
        "BaggageBytes": "[[248 5] [240 0] [0 86 84 137 52 191 199 107 81] [240 1] [0 221 195 66 32 95 229 17 77] [240 3] [0 2]]",
        "ProcessID": 2171
      },
      {
        "Cycles": 0,
        "Agent": "edu.brown.cs.systems.xtrace.logging.BaggageWrappers",
        "ProcessName": "Name",
        "TaskID": "56548934BFC76B51",
        "ParentEventID": [
          "6A4FD33389D3DB80"
        ],
        "Label": "Forking current baggage with Baggage.fork()",
        "Title": "X-Trace Task",
        "Host": "pinky19.mpi-sws.org",
        "HRT": 25491773236697876,
        "Operation": "fork",
        "Timestamp": "1556275413177.078613",
        "TenantClass": 0,
        "Source": "Server.java:2398",
        "ThreadID": 55,
        "ThreadName": "",
        "EventID": "DC4B4C9999F0262F",
        "BaggageBytes": "[[248 5] [240 0] [0 86 84 137 52 191 199 107 81] [240 1] [0 106 79 211 51 137 211 219 128] [240 3] [0 2]]",
        "ProcessID": 2171
      },
      {
        "Cycles": 0,
        "Agent": "org.apache.hadoop.hdfs.server.namenode.FSNamesystem.audit",
        "ProcessName": "Name",
        "TaskID": "56548934BFC76B51",
        "ParentEventID": [
          "9975FFC5DF5EDF91"
        ],
        "Label": "allowed=true\tugi=plascas (auth:SIMPLE)\tip=/139.19.171.63\tcmd=open\tsrc=/ds/zvGszBLXi6luLx7E\tdst=null\tperm=null\tproto=rpc",
        "Title": "X-Trace Task",
        "Host": "pinky19.mpi-sws.org",
        "HRT": 25491773236655928,
        "Timestamp": "1556275413177.036621",
        "TenantClass": 0,
        "Source": "FSNamesystem.java:8313",
        "ThreadID": 55,
        "ThreadName": "",
        "EventID": "6A4FD33389D3DB80",
        "BaggageBytes": "[[248 5] [240 0] [0 86 84 137 52 191 199 107 81] [240 1] [0 153 117 255 197 223 94 223 145] [240 3] [0 2]]",
        "ProcessID": 2171
      },
      {
        "Cycles": 0,
        "Agent": "Execution-CPU",
        "ProcessName": "Name",
        "TaskID": "56548934BFC76B51",
        "ParentEventID": [
          "DC4B4C9999F0262F"
        ],
        "Label": "unset",
        "Title": "X-Trace Task",
        "Host": "pinky19.mpi-sws.org",
        "Duration": "202756",
        "HRT": 25491773236800563,
        "Operation": "unset",
        "Timestamp": "1556275413177.181396",
        "TenantClass": 0,
        "Source": "Server.java:1058",
        "ThreadID": 55,
        "ThreadName": "",
        "EventID": "43C0DF980B04E168",
        "BaggageBytes": "[[248 5] [240 0] [0 86 84 137 52 191 199 107 81] [240 1] [0 220 75 76 153 153 240 38 47] [240 3] [0 2]]",
        "ProcessID": 2171
      },
      {
        "Cycles": 0,
        "Agent": "Execution-CPU",
        "ProcessName": "Read",
        "TaskID": "56548934BFC76B51",
        "ParentEventID": [
          "DC4B4C9999F0262F"
        ],
        "Label": "set",
        "Title": "X-Trace Task",
        "Host": "pinky19.mpi-sws.org",
        "HRT": 25491773236840289,
        "Operation": "set",
        "Timestamp": "1556275413177.224609",
        "TenantClass": 0,
        "Source": "Client.java:302",
        "ThreadID": 37,
        "ThreadName": "",
        "EventID": "126A77B9E225C2D6",
        "ProcessID": 21035
      },
      {
        "Cycles": 0,
        "Agent": "Execution-CPU",
        "ProcessName": "Read",
        "TaskID": "56548934BFC76B51",
        "ParentEventID": [
          "126A77B9E225C2D6"
        ],
        "Label": "unset",
        "Title": "X-Trace Task",
        "Host": "pinky19.mpi-sws.org",
        "Duration": "9731",
        "HRT": 25491773236861648,
        "Operation": "unset",
        "Timestamp": "1556275413177.245850",
        "TenantClass": 0,
        "Source": "Client.java:1168",
        "ThreadID": 37,
        "ThreadName": "",
        "EventID": "8A8CE99559385C28",
        "ProcessID": 21035
      },
      {
        "Cycles": 0,
        "Agent": "edu.brown.cs.systems.xtrace.logging.BaggageWrappers",
        "ProcessName": "Read",
        "TaskID": "56548934BFC76B51",
        "ParentEventID": [
          "80338B7BDDB66665",
          "8A8CE99559385C28"
        ],
        "Label": "Merged current baggage with other baggage",
        "Title": "X-Trace Task",
        "Host": "pinky19.mpi-sws.org",
        "HRT": 25491773236926591,
        "Operation": "join",
        "Timestamp": "1556275413177.310791",
        "TenantClass": 0,
        "Source": "Client.java:1545",
        "ThreadID": 1,
        "ThreadName": "",
        "EventID": "A4B8625830638436",
        "ProcessID": 21035
      },
      {
        "Cycles": 0,
        "Agent": "Execution-Sleep",
        "ProcessName": "Read",
        "TaskID": "56548934BFC76B51",
        "ParentEventID": [
          "169A09D1ED4268BC"
        ],
        "Label": "waited",
        "Title": "X-Trace Task",
        "Host": "pinky19.mpi-sws.org",
        "Duration": "413761",
        "HRT": 25491773236903792,
        "Operation": "waited",
        "Timestamp": "1556275413177.288086",
        "TenantClass": 0,
        "Source": "Client.java:1537",
        "ThreadID": 1,
        "ThreadName": "",
        "EventID": "80338B7BDDB66665",
        "ProcessID": 21035
      },
      {
        "Cycles": 0,
        "Agent": "org.apache.hadoop.ipc.ProtobufRpcEngine",
        "ProcessName": "Read",
        "TaskID": "56548934BFC76B51",
        "ParentEventID": [
          "A4B8625830638436"
        ],
        "Label": "org.apache.hadoop.hdfs.protocol.ClientProtocol.getBlockLocations completed",
        "Title": "X-Trace Task",
        "Host": "pinky19.mpi-sws.org",
        "HRT": 25491773236966747,
        "Timestamp": "1556275413177.351074",
        "TenantClass": 0,
        "Source": "ProtobufRpcEngine.java:275",
        "ThreadID": 1,
        "ThreadName": "",
        "EventID": "2EE6FB572CBDAC0B",
        "ProcessID": 21035
      },
      {
        "Cycles": 0,
        "Agent": "Execution-CPU",
        "ProcessName": "Data",
        "TaskID": "56548934BFC76B51",
        "ParentEventID": [
          "B7ABFB6BB22484C6"
        ],
        "Label": "set",
        "Title": "X-Trace Task",
        "Host": "pinky23.mpi-sws.org",
        "HRT": 10893269211429443,
        "Operation": "set",
        "Timestamp": "1556275413177.779785",
        "TenantClass": 0,
        "Source": "Receiver.java:117",
        "ThreadID": 6296,
        "ThreadName": "",
        "EventID": "85700E215EB04E51",
        "BaggageBytes": "[[248 5] [240 0] [0 86 84 137 52 191 199 107 81] [240 1] [0 183 171 251 107 178 36 132 198] [240 3] [0 2]]",
        "ProcessID": 24612
      },
      {
        "Cycles": 0,
        "Agent": "edu.brown.cs.systems.xtrace.logging.XTraceInit",
        "ProcessName": "Data",
        "TaskID": "56548934BFC76B51",
        "ParentEventID": [
          "85700E215EB04E51"
        ],
        "Label": "Thread.setName: DataXceiver for client DFSClient_NONMAPREDUCE_1377588049_1 at /139.19.171.63:57972 [Sending block BP-1633380353-139.19.171.63-1554193446451:blk_1073767198_26374]",
        "Title": "X-Trace Task",
        "Host": "pinky23.mpi-sws.org",
        "HRT": 10893269211529053,
        "Timestamp": "1556275413177.879395",
        "TenantClass": 0,
        "Source": "DataXceiver.java:168",
        "ThreadID": 6296,
        "ThreadName": "",
        "EventID": "2F64552DDFEBF465",
        "BaggageBytes": "[[248 5] [240 0] [0 86 84 137 52 191 199 107 81] [240 1] [0 133 112 14 33 94 176 78 81] [240 3] [0 2]]",
        "ProcessID": 24612
      },
      {
        "Cycles": 0,
        "Agent": "edu.brown.cs.systems.xtrace.logging.BaggageWrappers",
        "ProcessName": "Data",
        "TaskID": "56548934BFC76B51",
        "ParentEventID": [
          "2F64552DDFEBF465"
        ],
        "Label": "Forking current baggage with Baggage.fork()",
        "Title": "X-Trace Task",
        "Host": "pinky23.mpi-sws.org",
        "HRT": 10893269211737540,
        "Operation": "fork",
        "Timestamp": "1556275413178.087891",
        "TenantClass": 0,
        "Source": "DataXceiver.java:1257",
        "ThreadID": 6296,
        "ThreadName": "",
        "EventID": "0BDC58A2662892C4",
        "BaggageBytes": "[[248 5] [240 0] [0 86 84 137 52 191 199 107 81] [240 1] [0 47 100 85 45 223 235 244 101] [240 3] [0 2]]",
        "ProcessID": 24612
      },
      {
        "Cycles": 0,
        "Agent": "edu.brown.cs.systems.xtrace.logging.BaggageWrappers",
        "ProcessName": "Read",
        "TaskID": "56548934BFC76B51",
        "ParentEventID": [
          "2EE6FB572CBDAC0B"
        ],
        "Label": "Forking current baggage with Baggage.fork()",
        "Title": "X-Trace Task",
        "Host": "pinky19.mpi-sws.org",
        "HRT": 25491773237041250,
        "Operation": "fork",
        "Timestamp": "1556275413177.425537",
        "TenantClass": 0,
        "Source": "DataTransferProtoUtil.java:94",
        "ThreadID": 1,
        "ThreadName": "",
        "EventID": "B7ABFB6BB22484C6",
        "ProcessID": 21035
      },
      {
        "Cycles": 0,
        "Agent": "Execution-Sleep",
        "ProcessName": "Read",
        "TaskID": "56548934BFC76B51",
        "ParentEventID": [
          "B7ABFB6BB22484C6"
        ],
        "Label": "waited",
        "Title": "X-Trace Task",
        "Host": "pinky19.mpi-sws.org",
        "Duration": "762154",
        "HRT": 25491773237897691,
        "Operation": "waited",
        "Timestamp": "1556275413178.281982",
        "TenantClass": 0,
        "Source": "SocketIOWithTimeout.java:335",
        "ThreadID": 1,
        "ThreadName": "",
        "EventID": "71ADEC7B2CE90CC4",
        "ProcessID": 21035
      },
      {
        "Cycles": 0,
        "Agent": "edu.brown.cs.systems.xtrace.logging.BaggageWrappers",
        "ProcessName": "Data",
        "TaskID": "56548934BFC76B51",
        "ParentEventID": [
          "0BDC58A2662892C4"
        ],
        "Label": "Forking current baggage with Baggage.fork()",
        "Title": "X-Trace Task",
        "Host": "pinky23.mpi-sws.org",
        "HRT": 10893269211920027,
        "Operation": "fork",
        "Timestamp": "1556275413178.270508",
        "TenantClass": 0,
        "Source": "PacketHeader.java:95",
        "ThreadID": 6296,
        "ThreadName": "",
        "EventID": "055E95BB002BAD1E",
        "BaggageBytes": "[[248 5] [240 0] [0 86 84 137 52 191 199 107 81] [240 1] [0 11 220 88 162 102 40 146 196] [240 3] [0 2]]",
        "ProcessID": 24612
      },
      {
        "Cycles": 0,
        "Agent": "edu.brown.cs.systems.xtrace.logging.BaggageWrappers",
        "ProcessName": "Read",
        "TaskID": "56548934BFC76B51",
        "ParentEventID": [
          "0BDC58A2662892C4",
          "71ADEC7B2CE90CC4"
        ],
        "Label": "Merged current baggage with other baggage",
        "Title": "X-Trace Task",
        "Host": "pinky19.mpi-sws.org",
        "HRT": 25491773237964097,
        "Operation": "join",
        "Timestamp": "1556275413178.348389",
        "TenantClass": 0,
        "Source": "RemoteBlockReader2.java:429",
        "ThreadID": 1,
        "ThreadName": "",
        "EventID": "5D5942250F6B6308",
        "ProcessID": 21035
      },
      {
        "Cycles": 0,
        "Agent": "Execution-Sleep",
        "ProcessName": "Data",
        "TaskID": "56548934BFC76B51",
        "ParentEventID": [
          "055E95BB002BAD1E"
        ],
        "Label": "waited",
        "Title": "X-Trace Task",
        "Host": "pinky23.mpi-sws.org",
        "Duration": "11403",
        "HRT": 10893269212075328,
        "Operation": "waited",
        "Timestamp": "1556275413178.425781",
        "TenantClass": 0,
        "Source": "SocketIOWithTimeout.java:335",
        "ThreadID": 6296,
        "ThreadName": "",
        "EventID": "2500D8E7241E654D",
        "BaggageBytes": "[[248 5] [240 0] [0 86 84 137 52 191 199 107 81] [240 1] [0 5 94 149 187 0 43 173 30] [240 3] [0 2]]",
        "ProcessID": 24612
      },
      {
        "Cycles": 0,
        "Agent": "Execution-Sleep",
        "ProcessName": "Read",
        "TaskID": "56548934BFC76B51",
        "ParentEventID": [
          "5D5942250F6B6308"
        ],
        "Label": "waited",
        "Title": "X-Trace Task",
        "Host": "pinky19.mpi-sws.org",
        "Duration": "20874",
        "HRT": 25491773238046400,
        "Operation": "waited",
        "Timestamp": "1556275413178.430664",
        "TenantClass": 0,
        "Source": "SocketIOWithTimeout.java:335",
        "ThreadID": 1,
        "ThreadName": "",
        "EventID": "F5BA2652203A0391",
        "ProcessID": 21035
      },
      {
        "Cycles": 0,
        "Agent": "Execution-Sleep",
        "ProcessName": "Read",
        "TaskID": "56548934BFC76B51",
        "ParentEventID": [
          "F5BA2652203A0391"
        ],
        "Label": "waited",
        "Title": "X-Trace Task",
        "Host": "pinky19.mpi-sws.org",
        "Duration": "157037",
        "HRT": 25491773238269063,
        "Operation": "waited",
        "Timestamp": "1556275413178.653320",
        "TenantClass": 0,
        "Source": "SocketIOWithTimeout.java:335",
        "ThreadID": 1,
        "ThreadName": "",
        "EventID": "0FEABDE10929032E",
        "ProcessID": 21035
      },
      {
        "Cycles": 0,
        "Agent": "edu.brown.cs.systems.xtrace.logging.BaggageWrappers",
        "ProcessName": "Data",
        "TaskID": "56548934BFC76B51",
        "ParentEventID": [
          "2500D8E7241E654D"
        ],
        "Label": "Forking current baggage with Baggage.fork()",
        "Title": "X-Trace Task",
        "Host": "pinky23.mpi-sws.org",
        "HRT": 10893269212261758,
        "Operation": "fork",
        "Timestamp": "1556275413178.612305",
        "TenantClass": 0,
        "Source": "PacketHeader.java:95",
        "ThreadID": 6296,
        "ThreadName": "",
        "EventID": "4051A796208EC5E0",
        "BaggageBytes": "[[248 5] [240 0] [0 86 84 137 52 191 199 107 81] [240 1] [0 37 0 216 231 36 30 101 77] [240 3] [0 2]]",
        "ProcessID": 24612
      },
      {
        "Cycles": 0,
        "Agent": "edu.brown.cs.systems.xtrace.logging.BaggageWrappers",
        "ProcessName": "Read",
        "TaskID": "56548934BFC76B51",
        "ParentEventID": [
          "055E95BB002BAD1E",
          "0FEABDE10929032E"
        ],
        "Label": "Merged current baggage with other baggage",
        "Title": "X-Trace Task",
        "Host": "pinky19.mpi-sws.org",
        "HRT": 25491773238311368,
        "Operation": "join",
        "Timestamp": "1556275413178.695557",
        "TenantClass": 0,
        "Source": "PacketHeader.java:168",
        "ThreadID": 1,
        "ThreadName": "",
        "EventID": "2978502D4BFBA444",
        "ProcessID": 21035
      },
      {
        "Cycles": 0,
        "Agent": "Execution-Sleep",
        "ProcessName": "Read",
        "TaskID": "56548934BFC76B51",
        "ParentEventID": [
          "2978502D4BFBA444"
        ],
        "Label": "waited",
        "Title": "X-Trace Task",
        "Host": "pinky19.mpi-sws.org",
        "Duration": "34579",
        "HRT": 25491773238386038,
        "Operation": "waited",
        "Timestamp": "1556275413178.770264",
        "TenantClass": 0,
        "Source": "SocketIOWithTimeout.java:335",
        "ThreadID": 1,
        "ThreadName": "",
        "EventID": "E147A048DA6E4D62",
        "ProcessID": 21035
      },
      {
        "Cycles": 0,
        "Agent": "edu.brown.cs.systems.xtrace.logging.BaggageWrappers",
        "ProcessName": "Read",
        "TaskID": "56548934BFC76B51",
        "ParentEventID": [
          "E147A048DA6E4D62",
          "4051A796208EC5E0"
        ],
        "Label": "Merged current baggage with other baggage",
        "Title": "X-Trace Task",
        "Host": "pinky19.mpi-sws.org",
        "HRT": 25491773238439024,
        "Operation": "join",
        "Timestamp": "1556275413178.823242",
        "TenantClass": 0,
        "Source": "PacketHeader.java:168",
        "ThreadID": 1,
        "ThreadName": "",
        "EventID": "8FF5E51FA27A4B9B",
        "ProcessID": 21035
      },
      {
        "Cycles": 0,
        "Agent": "Execution-Sleep",
        "ProcessName": "Data",
        "TaskID": "56548934BFC76B51",
        "ParentEventID": [
          "4051A796208EC5E0"
        ],
        "Label": "waited",
        "Title": "X-Trace Task",
        "Host": "pinky23.mpi-sws.org",
        "Duration": "71843",
        "HRT": 10893269212563555,
        "Operation": "waited",
        "Timestamp": "1556275413178.914062",
        "TenantClass": 0,
        "Source": "SocketIOWithTimeout.java:335",
        "ThreadID": 6296,
        "ThreadName": "",
        "EventID": "B99315EE1B0CEE11",
        "BaggageBytes": "[[248 5] [240 0] [0 86 84 137 52 191 199 107 81] [240 1] [0 64 81 167 150 32 142 197 224] [240 3] [0 2]]",
        "ProcessID": 24612
      },
      {
        "Cycles": 0,
        "Agent": "edu.brown.cs.systems.xtrace.logging.BaggageWrappers",
        "ProcessName": "Read",
        "TaskID": "56548934BFC76B51",
        "ParentEventID": [
          "8FF5E51FA27A4B9B"
        ],
        "Label": "Forking current baggage with Baggage.fork()",
        "Title": "X-Trace Task",
        "Host": "pinky19.mpi-sws.org",
        "HRT": 25491773238449903,
        "Operation": "fork",
        "Timestamp": "1556275413178.834229",
        "TenantClass": 0,
        "Source": "RemoteBlockReader2.java:361",
        "ThreadID": 1,
        "ThreadName": "",
        "EventID": "70EBB5D719242DFA",
        "ProcessID": 21035
      },
      {
        "Cycles": 0,
        "Agent": "edu.brown.cs.systems.xtrace.logging.BaggageWrappers",
        "ProcessName": "Data",
        "TaskID": "56548934BFC76B51",
        "ParentEventID": [
          "B99315EE1B0CEE11",
          "70EBB5D719242DFA"
        ],
        "Label": "Merged current baggage with other baggage",
        "Title": "X-Trace Task",
        "Host": "pinky23.mpi-sws.org",
        "HRT": 10893269212694822,
        "Operation": "join",
        "Timestamp": "1556275413179.045166",
        "TenantClass": 0,
        "Source": "DataXceiver.java:574",
        "ThreadID": 6296,
        "ThreadName": "",
        "EventID": "F6F1527BC465A226",
        "BaggageBytes": "[[248 5] [240 0] [0 86 84 137 52 191 199 107 81] [240 1] [0 185 147 21 238 27 12 238 17] [0 112 235 181 215 25 36 45 250] [240 3] [0 2]]",
        "ProcessID": 24612
      },
      {
        "Cycles": 0,
        "Agent": "Execution-CPU",
        "ProcessName": "Data",
        "TaskID": "56548934BFC76B51",
        "ParentEventID": [
          "F6F1527BC465A226"
        ],
        "Label": "unset",
        "Title": "X-Trace Task",
        "Host": "pinky23.mpi-sws.org",
        "Duration": "1257892",
        "HRT": 10893269212758602,
        "Operation": "unset",
        "Timestamp": "1556275413179.109131",
        "TenantClass": 0,
        "Source": "DataXceiver.java:261",
        "ThreadID": 6296,
        "ThreadName": "",
        "EventID": "B072E24DFD374E87",
        "BaggageBytes": "[[248 5] [240 0] [0 86 84 137 52 191 199 107 81] [240 1] [0 246 241 82 123 196 101 162 38] [240 3] [0 2]]",
        "ProcessID": 24612
      },
      {
        "Cycles": 0,
        "Agent": "edu.brown.cs.systems.retro.benchmarks.hdfs_client.Reader",
        "ProcessName": "Read",
        "TaskID": "56548934BFC76B51",
        "ParentEventID": [
          "1D15B9BD78528682"
        ],
        "Label": "Reading file",
        "Title": "X-Trace Task",
        "Host": "pinky19.mpi-sws.org",
        "HRT": 25491773236126069,
        "Timestamp": "1556275413176.510254",
        "TenantClass": 0,
        "ThreadID": 1,
        "ThreadName": "",
        "EventID": "3DFF54525B8E0262",
        "ProcessID": 21035
      }
    ]
  }
]