[
  {
    "id": "378B64388CB68FB1",
    "reports": [
      {
        "Cycles": 0,
        "Agent": "edu.brown.cs.systems.retro.benchmarks.hdfs_client.Reader",
        "ProcessName": "Read",
        "TaskID": "378B64388CB68FB1",
        "ParentEventID": [
          "0"
        ],
        "Label": "Reading file",
        "Title": "X-Trace Task",
        "Host": "pinky19.mpi-sws.org",
        "HRT": 26966534951800223,
        "Timestamp": "1557750174892.162354",
        "TenantClass": 0,
        "ThreadID": 1,
        "ThreadName": "",
        "EventID": "F2086F1EEA99AB11",
        "ProcessID": 2801,
        "Tag": [
          "reader_100kb",
          "Read Size: 102400"
        ]
      },
      {
        "Cycles": 0,
        "Agent": "org.apache.hadoop.ipc.ProtobufRpcEngine",
        "ProcessName": "Read",
        "TaskID": "378B64388CB68FB1",
        "ParentEventID": [
          "F57F2BE01DC06719"
        ],
        "Label": "Invoking org.apache.hadoop.hdfs.protocol.ClientProtocol.getBlockLocations",
        "Title": "X-Trace Task",
        "Host": "pinky19.mpi-sws.org",
        "HRT": 26966534951934395,
        "Timestamp": "1557750174892.296631",
        "TenantClass": 0,
        "Source": "ProtobufRpcEngine.java:228",
        "ThreadID": 1,
        "ThreadName": "",
        "EventID": "1966B06E52706215",
        "ProcessID": 2801
      },
      {
        "Cycles": 0,
        "Agent": "edu.brown.cs.systems.retro.benchmarks.hdfs_client.Reader",
        "ProcessName": "Read",
        "TaskID": "378B64388CB68FB1",
        "ParentEventID": [
          "F2086F1EEA99AB11"
        ],
        "Label": "Reading file",
        "Title": "X-Trace Task",
        "Host": "pinky19.mpi-sws.org",
        "HRT": 26966534951826283,
        "Timestamp": "1557750174892.188477",
        "TenantClass": 0,
        "ThreadID": 1,
        "ThreadName": "",
        "EventID": "F57F2BE01DC06719",
        "ProcessID": 2801
      },
      {
        "Cycles": 0,
        "Agent": "Execution-CPU",
        "ProcessName": "Read",
        "TaskID": "378B64388CB68FB1",
        "ParentEventID": [
          "1966B06E52706215"
        ],
        "Label": "unset",
        "Title": "X-Trace Task",
        "Host": "pinky19.mpi-sws.org",
        "Duration": "25369878",
        "HRT": 26966534951996321,
        "Operation": "unset",
        "Timestamp": "1557750174892.358398",
        "TenantClass": 0,
        "Source": "Client.java:1027",
        "ThreadID": 1,
        "ThreadName": "",
        "EventID": "5F6AE536B9CE37E1",
        "ProcessID": 2801
      },
      {
        "Cycles": 0,
        "Agent": "Execution-CPU",
        "ProcessName": "Read",
        "TaskID": "378B64388CB68FB1",
        "ParentEventID": [
          "5F6AE536B9CE37E1"
        ],
        "Label": "set",
        "Title": "X-Trace Task",
        "Host": "pinky19.mpi-sws.org",
        "HRT": 26966534952058269,
        "Operation": "set",
        "Timestamp": "1557750174892.420410",
        "TenantClass": 0,
        "Source": "Client.java:1032",
        "ThreadID": 41,
        "ThreadName": "",
        "EventID": "D268515BF15BA2A1",
        "ProcessID": 2801
      },
      {
        "Cycles": 0,
        "Agent": "edu.brown.cs.systems.xtrace.logging.BaggageWrappers",
        "ProcessName": "Read",
        "TaskID": "378B64388CB68FB1",
        "ParentEventID": [
          "D268515BF15BA2A1"
        ],
        "Label": "Forking current baggage with Baggage.fork()",
        "Title": "X-Trace Task",
        "Host": "pinky19.mpi-sws.org",
        "HRT": 26966534952129978,
        "Operation": "fork",
        "Timestamp": "1557750174892.492188",
        "TenantClass": 0,
        "Source": "Client.java:1043",
        "ThreadID": 41,
        "ThreadName": "",
        "EventID": "A0292901B5C602B0",
        "ProcessID": 2801
      },
      {
        "Cycles": 0,
        "Agent": "Execution-CPU",
        "ProcessName": "Read",
        "TaskID": "378B64388CB68FB1",
        "ParentEventID": [
          "A0292901B5C602B0"
        ],
        "Label": "unset",
        "Title": "X-Trace Task",
        "Host": "pinky19.mpi-sws.org",
        "Duration": "164132",
        "HRT": 26966534952285935,
        "Operation": "unset",
        "Timestamp": "1557750174892.647949",
        "TenantClass": 0,
        "Source": "Client.java:1062",
        "ThreadID": 41,
        "ThreadName": "",
        "EventID": "935B1E903897A09A",
        "ProcessID": 2801
      },
      {
        "Cycles": 0,
        "Agent": "Execution-CPU",
        "ProcessName": "Name",
        "TaskID": "378B64388CB68FB1",
        "ParentEventID": [
          "A0292901B5C602B0"
        ],
        "Label": "set",
        "Title": "X-Trace Task",
        "Host": "pinky19.mpi-sws.org",
        "HRT": 26966534952343083,
        "Operation": "set",
        "Timestamp": "1557750174892.725098",
        "TenantClass": 0,
        "Source": "Server.java:1840",
        "ThreadID": 48,
        "ThreadName": "",
        "EventID": "7D608EBA4C57FCB7",
        "BaggageBytes": "[[248 5] [240 0] [0 55 139 100 56 140 182 143 177] [240 1] [0 160 41 41 1 181 198 2 176] [240 3] [0 2]]",
        "ProcessID": 2171
      },
      {
        "Cycles": 0,
        "Agent": "edu.brown.cs.systems.xtrace.logging.BaggageWrappers",
        "ProcessName": "Name",
        "TaskID": "378B64388CB68FB1",
        "ParentEventID": [
          "7D608EBA4C57FCB7"
        ],
        "Label": "Forking current baggage with Baggage.fork()",
        "Title": "X-Trace Task",
        "Host": "pinky19.mpi-sws.org",
        "HRT": 26966534952383777,
        "Operation": "fork",
        "Timestamp": "1557750174892.765869",
        "TenantClass": 0,
        "Source": "Server.java:550",
        "ThreadID": 48,
        "ThreadName": "",
        "EventID": "25604DBC7D879885",
        "BaggageBytes": "[[248 5] [240 0] [0 55 139 100 56 140 182 143 177] [240 1] [0 125 96 142 186 76 87 252 183] [240 3] [0 2]]",
        "ProcessID": 2171
      },
      {
        "Cycles": 0,
        "Agent": "Execution-CPU",
        "ProcessName": "Read",
        "TaskID": "378B64388CB68FB1",
        "ParentEventID": [
          "935B1E903897A09A"
        ],
        "Label": "set",
        "Title": "X-Trace Task",
        "Host": "pinky19.mpi-sws.org",
        "HRT": 26966534952364867,
        "Operation": "set",
        "Timestamp": "1557750174892.727051",
        "TenantClass": 0,
        "Source": "Client.java:1104",
        "ThreadID": 1,
        "ThreadName": "",
        "EventID": "6DCAE61B660B6D22",
        "ProcessID": 2801
      },
      {
        "Cycles": 0,
        "Agent": "Execution-CPU",
        "ProcessName": "Name",
        "TaskID": "378B64388CB68FB1",
        "ParentEventID": [
          "25604DBC7D879885"
        ],
        "Label": "set",
        "Title": "X-Trace Task",
        "Host": "pinky19.mpi-sws.org",
        "HRT": 26966534952429872,
        "Operation": "set",
        "Timestamp": "1557750174892.812012",
        "TenantClass": 0,
        "Source": "Server.java:2071",
        "ThreadID": 57,
        "ThreadName": "",
        "EventID": "56AD7F6802FE8225",
        "BaggageBytes": "[[248 5] [240 0] [0 55 139 100 56 140 182 143 177] [240 1] [0 37 96 77 188 125 135 152 133] [240 3] [0 2]]",
        "ProcessID": 2171
      },
      {
        "Cycles": 0,
        "Agent": "org.apache.hadoop.hdfs.server.namenode.FSNamesystem.audit",
        "ProcessName": "Name",
        "TaskID": "378B64388CB68FB1",
        "ParentEventID": [
          "B9A89C334A801E16"
        ],
        "Label": "allowed=true\tugi=plascas (auth:SIMPLE)\tip=/139.19.171.63\tcmd=open\tsrc=/ds/F34Q7bLxljILH1sD\tdst=null\tperm=null\tproto=rpc",
        "Title": "X-Trace Task",
        "Host": "pinky19.mpi-sws.org",
        "HRT": 26966534952515545,
        "Timestamp": "1557750174892.897705",
        "TenantClass": 0,
        "Source": "FSNamesystem.java:8313",
        "ThreadID": 57,
        "ThreadName": "",
        "EventID": "814021CA0B0A9C7A",
        "BaggageBytes": "[[248 5] [240 0] [0 55 139 100 56 140 182 143 177] [240 1] [0 185 168 156 51 74 128 30 22] [240 3] [0 2]]",
        "ProcessID": 2171
      },
      {
        "Cycles": 0,
        "Agent": "org.apache.hadoop.ipc.Server",
        "ProcessName": "Name",
        "TaskID": "378B64388CB68FB1",
        "ParentEventID": [
          "56AD7F6802FE8225"
        ],
        "Label": "getBlockLocations in org.apache.hadoop.hdfs.protocol.ClientProtocol",
        "Title": "X-Trace Task",
        "Host": "pinky19.mpi-sws.org",
        "HRT": 26966534952465597,
        "Timestamp": "1557750174892.847656",
        "TenantClass": 0,
        "Source": "ProtobufRpcEngine.java:601",
        "ThreadID": 57,
        "ThreadName": "",
        "EventID": "B9A89C334A801E16",
        "BaggageBytes": "[[248 5] [240 0] [0 55 139 100 56 140 182 143 177] [240 1] [0 86 173 127 104 2 254 130 37] [240 3] [0 2]]",
        "ProcessID": 2171
      },
      {
        "Cycles": 0,
        "Agent": "edu.brown.cs.systems.xtrace.logging.BaggageWrappers",
        "ProcessName": "Name",
        "TaskID": "378B64388CB68FB1",
        "ParentEventID": [
          "814021CA0B0A9C7A"
        ],
        "Label": "Forking current baggage with Baggage.fork()",
        "Title": "X-Trace Task",
        "Host": "pinky19.mpi-sws.org",
        "HRT": 26966534952572009,
        "Operation": "fork",
        "Timestamp": "1557750174892.954102",
        "TenantClass": 0,
        "Source": "Server.java:2398",
        "ThreadID": 57,
        "ThreadName": "",
        "EventID": "5233BCBF3438CBAE",
        "BaggageBytes": "[[248 5] [240 0] [0 55 139 100 56 140 182 143 177] [240 1] [0 129 64 33 202 11 10 156 122] [240 3] [0 2]]",
        "ProcessID": 2171
      },
      {
        "Cycles": 0,
        "Agent": "Execution-CPU",
        "ProcessName": "Read",
        "TaskID": "378B64388CB68FB1",
        "ParentEventID": [
          "5233BCBF3438CBAE"
        ],
        "Label": "set",
        "Title": "X-Trace Task",
        "Host": "pinky19.mpi-sws.org",
        "HRT": 26966534952824822,
        "Operation": "set",
        "Timestamp": "1557750174893.187012",
        "TenantClass": 0,
        "Source": "Client.java:302",
        "ThreadID": 40,
        "ThreadName": "",
        "EventID": "F88B12516AD2F69C",
        "ProcessID": 2801
      },
      {
        "Cycles": 0,
        "Agent": "Execution-CPU",
        "ProcessName": "Name",
        "TaskID": "378B64388CB68FB1",
        "ParentEventID": [
          "25604DBC7D879885"
        ],
        "Label": "unset",
        "Title": "X-Trace Task",
        "Host": "pinky19.mpi-sws.org",
        "Duration": "40384",
        "HRT": 26966534952419730,
        "Operation": "unset",
        "Timestamp": "1557750174892.801758",
        "TenantClass": 0,
        "Source": "Server.java:1828",
        "ThreadID": 48,
        "ThreadName": "",
        "EventID": "C4DFE56D1BD9AFA9",
        "BaggageBytes": "[[248 5] [240 0] [0 55 139 100 56 140 182 143 177] [240 1] [0 37 96 77 188 125 135 152 133] [240 3] [0 2]]",
        "ProcessID": 2171
      },
      {
        "Cycles": 0,
        "Agent": "Execution-CPU",
        "ProcessName": "Name",
        "TaskID": "378B64388CB68FB1",
        "ParentEventID": [
          "5233BCBF3438CBAE"
        ],
        "Label": "unset",
        "Title": "X-Trace Task",
        "Host": "pinky19.mpi-sws.org",
        "Duration": "228600",
        "HRT": 26966534952680754,
        "Operation": "unset",
        "Timestamp": "1557750174893.062744",
        "TenantClass": 0,
        "Source": "Server.java:1058",
        "ThreadID": 57,
        "ThreadName": "",
        "EventID": "528BC8CA5FDB3E80",
        "BaggageBytes": "[[248 5] [240 0] [0 55 139 100 56 140 182 143 177] [240 1] [0 82 51 188 191 52 56 203 174] [240 3] [0 2]]",
        "ProcessID": 2171
      },
      {
        "Cycles": 0,
        "Agent": "Execution-CPU",
        "ProcessName": "Read",
        "TaskID": "378B64388CB68FB1",
        "ParentEventID": [
          "F88B12516AD2F69C"
        ],
        "Label": "unset",
        "Title": "X-Trace Task",
        "Host": "pinky19.mpi-sws.org",
        "Duration": "26232",
        "HRT": 26966534952884631,
        "Operation": "unset",
        "Timestamp": "1557750174893.246826",
        "TenantClass": 0,
        "Source": "Client.java:1168",
        "ThreadID": 40,
        "ThreadName": "",
        "EventID": "CA820496AE299023",
        "ProcessID": 2801
      },
      {
        "Cycles": 0,
        "Agent": "edu.brown.cs.systems.xtrace.logging.BaggageWrappers",
        "ProcessName": "Read",
        "TaskID": "378B64388CB68FB1",
        "ParentEventID": [
          "CA820496AE299023",
          "8C5EA6479A638E76"
        ],
        "Label": "Merged current baggage with other baggage",
        "Title": "X-Trace Task",
        "Host": "pinky19.mpi-sws.org",
        "HRT": 26966534952972629,
        "Operation": "join",
        "Timestamp": "1557750174893.334717",
        "TenantClass": 0,
        "Source": "Client.java:1545",
        "ThreadID": 1,
        "ThreadName": "",
        "EventID": "ACF09728111AD780",
        "ProcessID": 2801
      },
      {
        "Cycles": 0,
        "Agent": "org.apache.hadoop.ipc.ProtobufRpcEngine",
        "ProcessName": "Read",
        "TaskID": "378B64388CB68FB1",
        "ParentEventID": [
          "ACF09728111AD780"
        ],
        "Label": "org.apache.hadoop.hdfs.protocol.ClientProtocol.getBlockLocations completed",
        "Title": "X-Trace Task",
        "Host": "pinky19.mpi-sws.org",
        "HRT": 26966534953077394,
        "Timestamp": "1557750174893.439453",
        "TenantClass": 0,
        "Source": "ProtobufRpcEngine.java:275",
        "ThreadID": 1,
        "ThreadName": "",
        "EventID": "BD3FFD890CFD1CD8",
        "ProcessID": 2801
      },
      {
        "Cycles": 0,
        "Agent": "Execution-Sleep",
        "ProcessName": "Read",
        "TaskID": "378B64388CB68FB1",
        "ParentEventID": [
          "BD3FFD890CFD1CD8"
        ],
        "Label": "waited",
        "Title": "X-Trace Task",
        "Host": "pinky19.mpi-sws.org",
        "Duration": "102452",
        "HRT": 26966534953396030,
        "Operation": "waited",
        "Timestamp": "1557750174893.758057",
        "TenantClass": 0,
        "Source": "SocketIOWithTimeout.java:335",
        "ThreadID": 1,
        "ThreadName": "",
        "EventID": "89EF3EC0AB76C6BB",
        "ProcessID": 2801
      },
      {
        "Cycles": 0,
        "Agent": "edu.brown.cs.systems.xtrace.logging.BaggageWrappers",
        "ProcessName": "Read",
        "TaskID": "378B64388CB68FB1",
        "ParentEventID": [
          "89EF3EC0AB76C6BB"
        ],
        "Label": "Forking current baggage with Baggage.fork()",
        "Title": "X-Trace Task",
        "Host": "pinky19.mpi-sws.org",
        "HRT": 26966534953600823,
        "Operation": "fork",
        "Timestamp": "1557750174893.962891",
        "TenantClass": 0,
        "Source": "DataTransferProtoUtil.java:94",
        "ThreadID": 1,
        "ThreadName": "",
        "EventID": "CD602AD381A7244B",
        "ProcessID": 2801
      },
      {
        "Cycles": 0,
        "Agent": "edu.brown.cs.systems.xtrace.logging.XTraceInit",
        "ProcessName": "Data",
        "TaskID": "378B64388CB68FB1",
        "ParentEventID": [
          "0A0124D53539FD6B"
        ],
        "Label": "Thread.setName: DataXceiver for client DFSClient_NONMAPREDUCE_310321604_1 at /139.19.171.63:45480 [Sending block BP-1633380353-139.19.171.63-1554193446451:blk_1073764564_23740]",
        "Title": "X-Trace Task",
        "Host": "pinky22.mpi-sws.org",
        "HRT": 47516507208295032,
        "Timestamp": "1557750174894.359375",
        "TenantClass": 0,
        "Source": "DataXceiver.java:168",
        "ThreadID": 15159,
        "ThreadName": "",
        "EventID": "95D851845DD61238",
        "BaggageBytes": "[[248 5] [240 0] [0 55 139 100 56 140 182 143 177] [240 1] [0 10 1 36 213 53 57 253 107] [240 3] [0 2]]",
        "ProcessID": 28841
      },
      {
        "Cycles": 0,
        "Agent": "Execution-Sleep",
        "ProcessName": "Read",
        "TaskID": "378B64388CB68FB1",
        "ParentEventID": [
          "6DCAE61B660B6D22"
        ],
        "Label": "waited",
        "Title": "X-Trace Task",
        "Host": "pinky19.mpi-sws.org",
        "Duration": "505278",
        "HRT": 26966534952921869,
        "Operation": "waited",
        "Timestamp": "1557750174893.283936",
        "TenantClass": 0,
        "Source": "Client.java:1537",
        "ThreadID": 1,
        "ThreadName": "",
        "EventID": "8C5EA6479A638E76",
        "ProcessID": 2801
      },
      {
        "Cycles": 0,
        "Agent": "edu.brown.cs.systems.xtrace.logging.BaggageWrappers",
        "ProcessName": "Data",
        "TaskID": "378B64388CB68FB1",
        "ParentEventID": [
          "95D851845DD61238"
        ],
        "Label": "Forking current baggage with Baggage.fork()",
        "Title": "X-Trace Task",
        "Host": "pinky22.mpi-sws.org",
        "HRT": 47516507208536946,
        "Operation": "fork",
        "Timestamp": "1557750174894.601318",
        "TenantClass": 0,
        "Source": "DataXceiver.java:1257",
        "ThreadID": 15159,
        "ThreadName": "",
        "EventID": "45CAE3343C7D9570",
        "BaggageBytes": "[[248 5] [240 0] [0 55 139 100 56 140 182 143 177] [240 1] [0 149 216 81 132 93 214 18 56] [240 3] [0 2]]",
        "ProcessID": 28841
      },
      {
        "Cycles": 0,
        "Agent": "Execution-Sleep",
        "ProcessName": "Read",
        "TaskID": "378B64388CB68FB1",
        "ParentEventID": [
          "CD602AD381A7244B"
        ],
        "Label": "waited",
        "Title": "X-Trace Task",
        "Host": "pinky19.mpi-sws.org",
        "Duration": "592705",
        "HRT": 26966534954431314,
        "Operation": "waited",
        "Timestamp": "1557750174894.793457",
        "TenantClass": 0,
        "Source": "SocketIOWithTimeout.java:335",
        "ThreadID": 1,
        "ThreadName": "",
        "EventID": "75E3A47F2CF6B71E",
        "ProcessID": 2801
      },
      {
        "Cycles": 0,
        "Agent": "edu.brown.cs.systems.xtrace.logging.BaggageWrappers",
        "ProcessName": "Data",
        "TaskID": "378B64388CB68FB1",
        "ParentEventID": [
          "45CAE3343C7D9570"
        ],
        "Label": "Forking current baggage with Baggage.fork()",
        "Title": "X-Trace Task",
        "Host": "pinky22.mpi-sws.org",
        "HRT": 47516507208693150,
        "Operation": "fork",
        "Timestamp": "1557750174894.757324",
        "TenantClass": 0,
        "Source": "PacketHeader.java:95",
        "ThreadID": 15159,
        "ThreadName": "",
        "EventID": "F949EC86DB921DED",
        "BaggageBytes": "[[248 5] [240 0] [0 55 139 100 56 140 182 143 177] [240 1] [0 69 202 227 52 60 125 149 112] [240 3] [0 2]]",
        "ProcessID": 28841
      },
      {
        "Cycles": 0,
        "Agent": "Execution-Sleep",
        "ProcessName": "Data",
        "TaskID": "378B64388CB68FB1",
        "ParentEventID": [
          "F949EC86DB921DED"
        ],
        "Label": "waited",
        "Title": "X-Trace Task",
        "Host": "pinky22.mpi-sws.org",
        "Duration": "12390",
        "HRT": 47516507208831097,
        "Operation": "waited",
        "Timestamp": "1557750174894.895264",
        "TenantClass": 0,
        "Source": "SocketIOWithTimeout.java:335",
        "ThreadID": 15159,
        "ThreadName": "",
        "EventID": "A2DEDFF62EA4BEA1",
        "BaggageBytes": "[[248 5] [240 0] [0 55 139 100 56 140 182 143 177] [240 1] [0 249 73 236 134 219 146 29 237] [240 3] [0 2]]",
        "ProcessID": 28841
      },
      {
        "Cycles": 0,
        "Agent": "Execution-CPU",
        "ProcessName": "Data",
        "TaskID": "378B64388CB68FB1",
        "ParentEventID": [
          "CD602AD381A7244B"
        ],
        "Label": "set",
        "Title": "X-Trace Task",
        "Host": "pinky22.mpi-sws.org",
        "HRT": 47516507208187419,
        "Operation": "set",
        "Timestamp": "1557750174894.251709",
        "TenantClass": 0,
        "Source": "Receiver.java:117",
        "ThreadID": 15159,
        "ThreadName": "",
        "EventID": "0A0124D53539FD6B",
        "BaggageBytes": "[[248 5] [240 0] [0 55 139 100 56 140 182 143 177] [240 1] [0 205 96 42 211 129 167 36 75] [240 3] [0 2]]",
        "ProcessID": 28841
      },
      {
        "Cycles": 0,
        "Agent": "edu.brown.cs.systems.xtrace.logging.BaggageWrappers",
        "ProcessName": "Read",
        "TaskID": "378B64388CB68FB1",
        "ParentEventID": [
          "75E3A47F2CF6B71E",
          "45CAE3343C7D9570"
        ],
        "Label": "Merged current baggage with other baggage",
        "Title": "X-Trace Task",
        "Host": "pinky19.mpi-sws.org",
        "HRT": 26966534954625467,
        "Operation": "join",
        "Timestamp": "1557750174894.987549",
        "TenantClass": 0,
        "Source": "RemoteBlockReader2.java:429",
        "ThreadID": 1,
        "ThreadName": "",
        "EventID": "E57217170F1BB360",
        "ProcessID": 2801
      },
      {
        "Cycles": 0,
        "Agent": "Execution-Sleep",
        "ProcessName": "Read",
        "TaskID": "378B64388CB68FB1",
        "ParentEventID": [
          "E57217170F1BB360"
        ],
        "Label": "waited",
        "Title": "X-Trace Task",
        "Host": "pinky19.mpi-sws.org",
        "Duration": "132998",
        "HRT": 26966534954935706,
        "Operation": "waited",
        "Timestamp": "1557750174895.297852",
        "TenantClass": 0,
        "Source": "SocketIOWithTimeout.java:335",
        "ThreadID": 1,
        "ThreadName": "",
        "EventID": "61EA2DC6A43FE312",
        "ProcessID": 2801
      },
      {
        "Cycles": 0,
        "Agent": "Execution-Sleep",
        "ProcessName": "Read",
        "TaskID": "378B64388CB68FB1",
        "ParentEventID": [
          "A94ECC36ED97522C"
        ],
        "Label": "waited",
        "Title": "X-Trace Task",
        "Host": "pinky19.mpi-sws.org",
        "Duration": "111301",
        "HRT": 26966534955425220,
        "Operation": "waited",
        "Timestamp": "1557750174895.787354",
        "TenantClass": 0,
        "Source": "SocketIOWithTimeout.java:335",
        "ThreadID": 1,
        "ThreadName": "",
        "EventID": "57A44EAAFFF252B0",
        "ProcessID": 2801
      },
      {
        "Cycles": 0,
        "Agent": "Execution-Sleep",
        "ProcessName": "Read",
        "TaskID": "378B64388CB68FB1",
        "ParentEventID": [
          "61EA2DC6A43FE312"
        ],
        "Label": "waited",
        "Title": "X-Trace Task",
        "Host": "pinky19.mpi-sws.org",
        "Duration": "197396",
        "HRT": 26966534955218293,
        "Operation": "waited",
        "Timestamp": "1557750174895.580322",
        "TenantClass": 0,
        "Source": "SocketIOWithTimeout.java:335",
        "ThreadID": 1,
        "ThreadName": "",
        "EventID": "A94ECC36ED97522C",
        "ProcessID": 2801
      },
      {
        "Cycles": 0,
        "Agent": "edu.brown.cs.systems.xtrace.logging.BaggageWrappers",
        "ProcessName": "Read",
        "TaskID": "378B64388CB68FB1",
        "ParentEventID": [
          "57A44EAAFFF252B0",
          "F949EC86DB921DED"
        ],
        "Label": "Merged current baggage with other baggage",
        "Title": "X-Trace Task",
        "Host": "pinky19.mpi-sws.org",
        "HRT": 26966534955583194,
        "Operation": "join",
        "Timestamp": "1557750174895.945312",
        "TenantClass": 0,
        "Source": "PacketHeader.java:168",
        "ThreadID": 1,
        "ThreadName": "",
        "EventID": "044D280EC2B5D2F3",
        "ProcessID": 2801
      },
      {
        "Cycles": 0,
        "Agent": "edu.brown.cs.systems.xtrace.logging.BaggageWrappers",
        "ProcessName": "Data",
        "TaskID": "378B64388CB68FB1",
        "ParentEventID": [
          "A2DEDFF62EA4BEA1"
        ],
        "Label": "Forking current baggage with Baggage.fork()",
        "Title": "X-Trace Task",
        "Host": "pinky22.mpi-sws.org",
        "HRT": 47516507208995317,
        "Operation": "fork",
        "Timestamp": "1557750174895.059570",
        "TenantClass": 0,
        "Source": "PacketHeader.java:95",
        "ThreadID": 15159,
        "ThreadName": "",
        "EventID": "4B0E51CBCCC8E3C1",
        "BaggageBytes": "[[248 5] [240 0] [0 55 139 100 56 140 182 143 177] [240 1] [0 162 222 223 246 46 164 190 161] [240 3] [0 2]]",
        "ProcessID": 28841
      },
      {
        "Cycles": 0,
        "Agent": "edu.brown.cs.systems.xtrace.logging.BaggageWrappers",
        "ProcessName": "Read",
        "TaskID": "378B64388CB68FB1",
        "ParentEventID": [
          "4B0E51CBCCC8E3C1",
          "044D280EC2B5D2F3"
        ],
        "Label": "Merged current baggage with other baggage",
        "Title": "X-Trace Task",
        "Host": "pinky19.mpi-sws.org",
        "HRT": 26966534955798242,
        "Operation": "join",
        "Timestamp": "1557750174896.160400",
        "TenantClass": 0,
        "Source": "PacketHeader.java:168",
        "ThreadID": 1,
        "ThreadName": "",
        "EventID": "A7AF1E909FE17D98",
        "ProcessID": 2801
      },
      {
        "Cycles": 0,
        "Agent": "Execution-Sleep",
        "ProcessName": "Data",
        "TaskID": "378B64388CB68FB1",
        "ParentEventID": [
          "4B0E51CBCCC8E3C1"
        ],
        "Label": "waited",
        "Title": "X-Trace Task",
        "Host": "pinky22.mpi-sws.org",
        "Duration": "1133836",
        "HRT": 47516507210299769,
        "Operation": "waited",
        "Timestamp": "1557750174896.364014",
        "TenantClass": 0,
        "Source": "SocketIOWithTimeout.java:335",
        "ThreadID": 15159,
        "ThreadName": "",
        "EventID": "E2E97BD92780AE4B",
        "BaggageBytes": "[[248 5] [240 0] [0 55 139 100 56 140 182 143 177] [240 1] [0 75 14 81 203 204 200 227 193] [240 3] [0 2]]",
        "ProcessID": 28841
      },
      {
        "Cycles": 0,
        "Agent": "edu.brown.cs.systems.xtrace.logging.BaggageWrappers",
        "ProcessName": "Read",
        "TaskID": "378B64388CB68FB1",
        "ParentEventID": [
          "E7333BB8277EFA22"
        ],
        "Label": "Forking current baggage with Baggage.fork()",
        "Title": "X-Trace Task",
        "Host": "pinky19.mpi-sws.org",
        "HRT": 26966534956071405,
        "Operation": "fork",
        "Timestamp": "1557750174896.433594",
        "TenantClass": 0,
        "Source": "DataTransferProtoUtil.java:94",
        "ThreadID": 1,
        "ThreadName": "",
        "EventID": "C8DC13165A54B602",
        "ProcessID": 2801
      },
      {
        "Cycles": 0,
        "Agent": "edu.brown.cs.systems.xtrace.logging.BaggageWrappers",
        "ProcessName": "Data",
        "TaskID": "378B64388CB68FB1",
        "ParentEventID": [
          "E2E97BD92780AE4B",
          "E7333BB8277EFA22"
        ],
        "Label": "Merged current baggage with other baggage",
        "Title": "X-Trace Task",
        "Host": "pinky22.mpi-sws.org",
        "HRT": 47516507210465775,
        "Operation": "join",
        "Timestamp": "1557750174896.530029",
        "TenantClass": 0,
        "Source": "DataXceiver.java:574",
        "ThreadID": 15159,
        "ThreadName": "",
        "EventID": "2F3E1CB7A26DC5B3",
        "BaggageBytes": "[[248 5] [240 0] [0 55 139 100 56 140 182 143 177] [240 1] [0 226 233 123 217 39 128 174 75] [0 231 51 59 184 39 126 250 34] [240 3] [0 2]]",
        "ProcessID": 28841
      },
      {
        "Cycles": 0,
        "Agent": "Execution-CPU",
        "ProcessName": "Data",
        "TaskID": "378B64388CB68FB1",
        "ParentEventID": [
          "2F3E1CB7A26DC5B3"
        ],
        "Label": "unset",
        "Title": "X-Trace Task",
        "Host": "pinky22.mpi-sws.org",
        "Duration": "2257628",
        "HRT": 47516507210530300,
        "Operation": "unset",
        "Timestamp": "1557750174896.594482",
        "TenantClass": 0,
        "Source": "DataXceiver.java:261",
        "ThreadID": 15159,
        "ThreadName": "",
        "EventID": "E9ADE2D8DA1410BD",
        "BaggageBytes": "[[248 5] [240 0] [0 55 139 100 56 140 182 143 177] [240 1] [0 47 62 28 183 162 109 197 179] [240 3] [0 2]]",
        "ProcessID": 28841
      },
      {
        "Cycles": 0,
        "Agent": "Execution-CPU",
        "ProcessName": "Data",
        "TaskID": "378B64388CB68FB1",
        "ParentEventID": [
          "C8DC13165A54B602"
        ],
        "Label": "set",
        "Title": "X-Trace Task",
        "Host": "pinky22.mpi-sws.org",
        "HRT": 47516507210655095,
        "Operation": "set",
        "Timestamp": "1557750174896.719238",
        "TenantClass": 0,
        "Source": "Receiver.java:117",
        "ThreadID": 15159,
        "ThreadName": "",
        "EventID": "2593B3B740DC01C7",
        "BaggageBytes": "[[248 5] [240 0] [0 55 139 100 56 140 182 143 177] [240 1] [0 200 220 19 22 90 84 182 2] [240 3] [0 2]]",
        "ProcessID": 28841
      },
      {
        "Cycles": 0,
        "Agent": "edu.brown.cs.systems.xtrace.logging.BaggageWrappers",
        "ProcessName": "Data",
        "TaskID": "378B64388CB68FB1",
        "ParentEventID": [
          "F251D9D527CAF01B"
        ],
        "Label": "Forking current baggage with Baggage.fork()",
        "Title": "X-Trace Task",
        "Host": "pinky22.mpi-sws.org",
        "HRT": 47516507210910164,
        "Operation": "fork",
        "Timestamp": "1557750174896.974365",
        "TenantClass": 0,
        "Source": "DataXceiver.java:1257",
        "ThreadID": 15159,
        "ThreadName": "",
        "EventID": "C90B0882D448A6F7",
        "BaggageBytes": "[[248 5] [240 0] [0 55 139 100 56 140 182 143 177] [240 1] [0 242 81 217 213 39 202 240 27] [240 3] [0 2]]",
        "ProcessID": 28841
      },
      {
        "Cycles": 0,
        "Agent": "edu.brown.cs.systems.xtrace.logging.BaggageWrappers",
        "ProcessName": "Data",
        "TaskID": "378B64388CB68FB1",
        "ParentEventID": [
          "C90B0882D448A6F7"
        ],
        "Label": "Forking current baggage with Baggage.fork()",
        "Title": "X-Trace Task",
        "Host": "pinky22.mpi-sws.org",
        "HRT": 47516507211038891,
        "Operation": "fork",
        "Timestamp": "1557750174897.103027",
        "TenantClass": 0,
        "Source": "PacketHeader.java:95",
        "ThreadID": 15159,
        "ThreadName": "",
        "EventID": "CEE642722249B471",
        "BaggageBytes": "[[248 5] [240 0] [0 55 139 100 56 140 182 143 177] [240 1] [0 201 11 8 130 212 72 166 247] [240 3] [0 2]]",
        "ProcessID": 28841
      },
      {
        "Cycles": 0,
        "Agent": "Execution-Sleep",
        "ProcessName": "Read",
        "TaskID": "378B64388CB68FB1",
        "ParentEventID": [
          "C8DC13165A54B602"
        ],
        "Label": "waited",
        "Title": "X-Trace Task",
        "Host": "pinky19.mpi-sws.org",
        "Duration": "494306",
        "HRT": 26966534956743943,
        "Operation": "waited",
        "Timestamp": "1557750174897.105957",
        "TenantClass": 0,
        "Source": "SocketIOWithTimeout.java:335",
        "ThreadID": 1,
        "ThreadName": "",
        "EventID": "7347DB098B813182",
        "ProcessID": 2801
      },
      {
        "Cycles": 0,
        "Agent": "Execution-Sleep",
        "ProcessName": "Data",
        "TaskID": "378B64388CB68FB1",
        "ParentEventID": [
          "CEE642722249B471"
        ],
        "Label": "waited",
        "Title": "X-Trace Task",
        "Host": "pinky22.mpi-sws.org",
        "Duration": "7648",
        "HRT": 47516507211146572,
        "Operation": "waited",
        "Timestamp": "1557750174897.210938",
        "TenantClass": 0,
        "Source": "SocketIOWithTimeout.java:335",
        "ThreadID": 15159,
        "ThreadName": "",
        "EventID": "F98698A4BC2A6566",
        "BaggageBytes": "[[248 5] [240 0] [0 55 139 100 56 140 182 143 177] [240 1] [0 206 230 66 114 34 73 180 113] [240 3] [0 2]]",
        "ProcessID": 28841
      },
      {
        "Cycles": 0,
        "Agent": "edu.brown.cs.systems.xtrace.logging.BaggageWrappers",
        "ProcessName": "Read",
        "TaskID": "378B64388CB68FB1",
        "ParentEventID": [
          "A7AF1E909FE17D98"
        ],
        "Label": "Forking current baggage with Baggage.fork()",
        "Title": "X-Trace Task",
        "Host": "pinky19.mpi-sws.org",
        "HRT": 26966534955826376,
        "Operation": "fork",
        "Timestamp": "1557750174896.188477",
        "TenantClass": 0,
        "Source": "RemoteBlockReader2.java:361",
        "ThreadID": 1,
        "ThreadName": "",
        "EventID": "E7333BB8277EFA22",
        "ProcessID": 2801
      },
      {
        "Cycles": 0,
        "Agent": "edu.brown.cs.systems.xtrace.logging.BaggageWrappers",
        "ProcessName": "Read",
        "TaskID": "378B64388CB68FB1",
        "ParentEventID": [
          "C90B0882D448A6F7",
          "7347DB098B813182"
        ],
        "Label": "Merged current baggage with other baggage",
        "Title": "X-Trace Task",
        "Host": "pinky19.mpi-sws.org",
        "HRT": 26966534956898159,
        "Operation": "join",
        "Timestamp": "1557750174897.260254",
        "TenantClass": 0,
        "Source": "RemoteBlockReader2.java:429",
        "ThreadID": 1,
        "ThreadName": "",
        "EventID": "5380052F707AB112",
        "ProcessID": 2801
      },
      {
        "Cycles": 0,
        "Agent": "edu.brown.cs.systems.xtrace.logging.BaggageWrappers",
        "ProcessName": "Data",
        "TaskID": "378B64388CB68FB1",
        "ParentEventID": [
          "F98698A4BC2A6566"
        ],
        "Label": "Forking current baggage with Baggage.fork()",
        "Title": "X-Trace Task",
        "Host": "pinky22.mpi-sws.org",
        "HRT": 47516507211281805,
        "Operation": "fork",
        "Timestamp": "1557750174897.345947",
        "TenantClass": 0,
        "Source": "PacketHeader.java:95",
        "ThreadID": 15159,
        "ThreadName": "",
        "EventID": "7099793F4AA3910A",
        "BaggageBytes": "[[248 5] [240 0] [0 55 139 100 56 140 182 143 177] [240 1] [0 249 134 152 164 188 42 101 102] [240 3] [0 2]]",
        "ProcessID": 28841
      },
      {
        "Cycles": 0,
        "Agent": "Execution-Sleep",
        "ProcessName": "Read",
        "TaskID": "378B64388CB68FB1",
        "ParentEventID": [
          "5380052F707AB112"
        ],
        "Label": "waited",
        "Title": "X-Trace Task",
        "Host": "pinky19.mpi-sws.org",
        "Duration": "125214",
        "HRT": 26966534957233757,
        "Operation": "waited",
        "Timestamp": "1557750174897.595947",
        "TenantClass": 0,
        "Source": "SocketIOWithTimeout.java:335",
        "ThreadID": 1,
        "ThreadName": "",
        "EventID": "616F20632B07BAAA",
        "ProcessID": 2801
      },
      {
        "Cycles": 0,
        "Agent": "Execution-Sleep",
        "ProcessName": "Data",
        "TaskID": "378B64388CB68FB1",
        "ParentEventID": [
          "7099793F4AA3910A"
        ],
        "Label": "waited",
        "Title": "X-Trace Task",
        "Host": "pinky22.mpi-sws.org",
        "Duration": "50393",
        "HRT": 47516507211417504,
        "Operation": "waited",
        "Timestamp": "1557750174897.481689",
        "TenantClass": 0,
        "Source": "SocketIOWithTimeout.java:335",
        "ThreadID": 15159,
        "ThreadName": "",
        "EventID": "4DA5723AA851ADDB",
        "BaggageBytes": "[[248 5] [240 0] [0 55 139 100 56 140 182 143 177] [240 1] [0 112 153 121 63 74 163 145 10] [240 3] [0 2]]",
        "ProcessID": 28841
      },
      {
        "Cycles": 0,
        "Agent": "edu.brown.cs.systems.xtrace.logging.XTraceInit",
        "ProcessName": "Data",
        "TaskID": "378B64388CB68FB1",
        "ParentEventID": [
          "2593B3B740DC01C7"
        ],
        "Label": "Thread.setName: DataXceiver for client DFSClient_NONMAPREDUCE_310321604_1 at /139.19.171.63:45480 [Sending block BP-1633380353-139.19.171.63-1554193446451:blk_1073764564_23740]",
        "Title": "X-Trace Task",
        "Host": "pinky22.mpi-sws.org",
        "HRT": 47516507210726754,
        "Timestamp": "1557750174896.791016",
        "TenantClass": 0,
        "Source": "DataXceiver.java:168",
        "ThreadID": 15159,
        "ThreadName": "",
        "EventID": "F251D9D527CAF01B",
        "BaggageBytes": "[[248 5] [240 0] [0 55 139 100 56 140 182 143 177] [240 1] [0 37 147 179 183 64 220 1 199] [240 3] [0 2]]",
        "ProcessID": 28841
      },
      {
        "Cycles": 0,
        "Agent": "Execution-Sleep",
        "ProcessName": "Read",
        "TaskID": "378B64388CB68FB1",
        "ParentEventID": [
          "A2CAE491241CC06F"
        ],
        "Label": "waited",
        "Title": "X-Trace Task",
        "Host": "pinky19.mpi-sws.org",
        "Duration": "115123",
        "HRT": 26966534957656015,
        "Operation": "waited",
        "Timestamp": "1557750174898.018066",
        "TenantClass": 0,
        "Source": "SocketIOWithTimeout.java:335",
        "ThreadID": 1,
        "ThreadName": "",
        "EventID": "31A4E8A61D5D14B6",
        "ProcessID": 2801
      },
      {
        "Cycles": 0,
        "Agent": "edu.brown.cs.systems.xtrace.logging.BaggageWrappers",
        "ProcessName": "Data",
        "TaskID": "378B64388CB68FB1",
        "ParentEventID": [
          "4DA5723AA851ADDB"
        ],
        "Label": "Forking current baggage with Baggage.fork()",
        "Title": "X-Trace Task",
        "Host": "pinky22.mpi-sws.org",
        "HRT": 47516507211517721,
        "Operation": "fork",
        "Timestamp": "1557750174897.582031",
        "TenantClass": 0,
        "Source": "PacketHeader.java:95",
        "ThreadID": 15159,
        "ThreadName": "",
        "EventID": "8E2EF219CCF9F302",
        "BaggageBytes": "[[248 5] [240 0] [0 55 139 100 56 140 182 143 177] [240 1] [0 77 165 114 58 168 81 173 219] [240 3] [0 2]]",
        "ProcessID": 28841
      },
      {
        "Cycles": 0,
        "Agent": "Execution-Sleep",
        "ProcessName": "Read",
        "TaskID": "378B64388CB68FB1",
        "ParentEventID": [
          "616F20632B07BAAA"
        ],
        "Label": "waited",
        "Title": "X-Trace Task",
        "Host": "pinky19.mpi-sws.org",
        "Duration": "123795",
        "HRT": 26966534957440128,
        "Operation": "waited",
        "Timestamp": "1557750174897.802246",
        "TenantClass": 0,
        "Source": "SocketIOWithTimeout.java:335",
        "ThreadID": 1,
        "ThreadName": "",
        "EventID": "A2CAE491241CC06F",
        "ProcessID": 2801
      },
      {
        "Cycles": 0,
        "Agent": "edu.brown.cs.systems.xtrace.logging.BaggageWrappers",
        "ProcessName": "Read",
        "TaskID": "378B64388CB68FB1",
        "ParentEventID": [
          "CEE642722249B471",
          "31A4E8A61D5D14B6"
        ],
        "Label": "Merged current baggage with other baggage",
        "Title": "X-Trace Task",
        "Host": "pinky19.mpi-sws.org",
        "HRT": 26966534957806662,
        "Operation": "join",
        "Timestamp": "1557750174898.168701",
        "TenantClass": 0,
        "Source": "PacketHeader.java:168",
        "ThreadID": 1,
        "ThreadName": "",
        "EventID": "685CBD52DC539115",
        "ProcessID": 2801
      },
      {
        "Cycles": 0,
        "Agent": "Execution-Sleep",
        "ProcessName": "Data",
        "TaskID": "378B64388CB68FB1",
        "ParentEventID": [
          "8E2EF219CCF9F302"
        ],
        "Label": "waited",
        "Title": "X-Trace Task",
        "Host": "pinky22.mpi-sws.org",
        "Duration": "5803",
        "HRT": 47516507211635156,
        "Operation": "waited",
        "Timestamp": "1557750174897.699463",
        "TenantClass": 0,
        "Source": "SocketIOWithTimeout.java:335",
        "ThreadID": 15159,
        "ThreadName": "",
        "EventID": "FB6E40FBCF1ED46C",
        "BaggageBytes": "[[248 5] [240 0] [0 55 139 100 56 140 182 143 177] [240 1] [0 142 46 242 25 204 249 243 2] [240 3] [0 2]]",
        "ProcessID": 28841
      },
      {
        "Cycles": 0,
        "Agent": "edu.brown.cs.systems.xtrace.logging.BaggageWrappers",
        "ProcessName": "Data",
        "TaskID": "378B64388CB68FB1",
        "ParentEventID": [
          "FB6E40FBCF1ED46C"
        ],
        "Label": "Forking current baggage with Baggage.fork()",
        "Title": "X-Trace Task",
        "Host": "pinky22.mpi-sws.org",
        "HRT": 47516507211769244,
        "Operation": "fork",
        "Timestamp": "1557750174897.833496",
        "TenantClass": 0,
        "Source": "PacketHeader.java:95",
        "ThreadID": 15159,
        "ThreadName": "",
        "EventID": "7229B6D16D8BC51A",
        "BaggageBytes": "[[248 5] [240 0] [0 55 139 100 56 140 182 143 177] [240 1] [0 251 110 64 251 207 30 212 108] [240 3] [0 2]]",
        "ProcessID": 28841
      },
      {
        "Cycles": 0,
        "Agent": "Execution-Sleep",
        "ProcessName": "Data",
        "TaskID": "378B64388CB68FB1",
        "ParentEventID": [
          "7229B6D16D8BC51A"
        ],
        "Label": "waited",
        "Title": "X-Trace Task",
        "Host": "pinky22.mpi-sws.org",
        "Duration": "5775",
        "HRT": 47516507211870397,
        "Operation": "waited",
        "Timestamp": "1557750174897.934570",
        "TenantClass": 0,
        "Source": "SocketIOWithTimeout.java:335",
        "ThreadID": 15159,
        "ThreadName": "",
        "EventID": "DE2FA77940EB2A79",
        "BaggageBytes": "[[248 5] [240 0] [0 55 139 100 56 140 182 143 177] [240 1] [0 114 41 182 209 109 139 197 26] [240 3] [0 2]]",
        "ProcessID": 28841
      },
      {
        "Cycles": 0,
        "Agent": "edu.brown.cs.systems.xtrace.logging.BaggageWrappers",
        "ProcessName": "Data",
        "TaskID": "378B64388CB68FB1",
        "ParentEventID": [
          "DE2FA77940EB2A79"
        ],
        "Label": "Forking current baggage with Baggage.fork()",
        "Title": "X-Trace Task",
        "Host": "pinky22.mpi-sws.org",
        "HRT": 47516507211981579,
        "Operation": "fork",
        "Timestamp": "1557750174898.045898",
        "TenantClass": 0,
        "Source": "PacketHeader.java:95",
        "ThreadID": 15159,
        "ThreadName": "",
        "EventID": "70CDAC0B25549CCB",
        "BaggageBytes": "[[248 5] [240 0] [0 55 139 100 56 140 182 143 177] [240 1] [0 222 47 167 121 64 235 42 121] [240 3] [0 2]]",
        "ProcessID": 28841
      },
      {
        "Cycles": 0,
        "Agent": "edu.brown.cs.systems.xtrace.logging.BaggageWrappers",
        "ProcessName": "Data",
        "TaskID": "378B64388CB68FB1",
        "ParentEventID": [
          "0F3668A5549543DC"
        ],
        "Label": "Forking current baggage with Baggage.fork()",
        "Title": "X-Trace Task",
        "Host": "pinky22.mpi-sws.org",
        "HRT": 47516507212185722,
        "Operation": "fork",
        "Timestamp": "1557750174898.250000",
        "TenantClass": 0,
        "Source": "PacketHeader.java:95",
        "ThreadID": 15159,
        "ThreadName": "",
        "EventID": "09F5C068A5C9249D",
        "BaggageBytes": "[[248 5] [240 0] [0 55 139 100 56 140 182 143 177] [240 1] [0 15 54 104 165 84 149 67 220] [240 3] [0 2]]",
        "ProcessID": 28841
      },
      {
        "Cycles": 0,
        "Agent": "Execution-Sleep",
        "ProcessName": "Data",
        "TaskID": "378B64388CB68FB1",
        "ParentEventID": [
          "70CDAC0B25549CCB"
        ],
        "Label": "waited",
        "Title": "X-Trace Task",
        "Host": "pinky22.mpi-sws.org",
        "Duration": "5533",
        "HRT": 47516507212079289,
        "Operation": "waited",
        "Timestamp": "1557750174898.143555",
        "TenantClass": 0,
        "Source": "SocketIOWithTimeout.java:335",
        "ThreadID": 15159,
        "ThreadName": "",
        "EventID": "0F3668A5549543DC",
        "BaggageBytes": "[[248 5] [240 0] [0 55 139 100 56 140 182 143 177] [240 1] [0 112 205 172 11 37 84 156 203] [240 3] [0 2]]",
        "ProcessID": 28841
      },
      {
        "Cycles": 0,
        "Agent": "Execution-Sleep",
        "ProcessName": "Data",
        "TaskID": "378B64388CB68FB1",
        "ParentEventID": [
          "09F5C068A5C9249D"
        ],
        "Label": "waited",
        "Title": "X-Trace Task",
        "Host": "pinky22.mpi-sws.org",
        "Duration": "68138",
        "HRT": 47516507212353915,
        "Operation": "waited",
        "Timestamp": "1557750174898.418213",
        "TenantClass": 0,
        "Source": "SocketIOWithTimeout.java:335",
        "ThreadID": 15159,
        "ThreadName": "",
        "EventID": "21FE2596FB6FDB5E",
        "BaggageBytes": "[[248 5] [240 0] [0 55 139 100 56 140 182 143 177] [240 1] [0 9 245 192 104 165 201 36 157] [240 3] [0 2]]",
        "ProcessID": 28841
      },
      {
        "Cycles": 0,
        "Agent": "Execution-CPU",
        "ProcessName": "Data",
        "TaskID": "378B64388CB68FB1",
        "ParentEventID": [
          "21FE2596FB6FDB5E"
        ],
        "Label": "unset",
        "Title": "X-Trace Task",
        "Host": "pinky22.mpi-sws.org",
        "Duration": "2059964",
        "HRT": 47516507212758297,
        "Operation": "unset",
        "Timestamp": "1557750174898.822510",
        "TenantClass": 0,
        "Source": "DataXceiver.java:261",
        "ThreadID": 15159,
        "ThreadName": "",
        "EventID": "79FB69E7563F57B8",
        "BaggageBytes": "[[248 5] [240 0] [0 55 139 100 56 140 182 143 177] [240 1] [0 33 254 37 150 251 111 219 94] [240 3] [0 2]]",
        "ProcessID": 28841
      }
    ]
  }
]