[
  {
    "id": "A85948F16433CD76",
    "reports": [
      {
        "Cycles": 0,
        "Agent": "edu.brown.cs.systems.retro.benchmarks.hdfs_client.Reader",
        "ProcessName": "Read",
        "TaskID": "A85948F16433CD76",
        "ParentEventID": [
          "368CDC8211EB7034"
        ],
        "Label": "Reading file",
        "Title": "X-Trace Task",
        "Host": "pinky19.mpi-sws.org",
        "HRT": 25491784217749586,
        "Timestamp": "1556275424158.052734",
        "TenantClass": 0,
        "ThreadID": 1,
        "ThreadName": "",
        "EventID": "0FAFE2131A0292D7",
        "ProcessID": 21035
      },
      {
        "Cycles": 0,
        "Agent": "org.apache.hadoop.ipc.ProtobufRpcEngine",
        "ProcessName": "Read",
        "TaskID": "A85948F16433CD76",
        "ParentEventID": [
          "0FAFE2131A0292D7"
        ],
        "Label": "Invoking org.apache.hadoop.hdfs.protocol.ClientProtocol.getBlockLocations",
        "Title": "X-Trace Task",
        "Host": "pinky19.mpi-sws.org",
        "HRT": 25491784217818296,
        "Timestamp": "1556275424158.121338",
        "TenantClass": 0,
        "Source": "ProtobufRpcEngine.java:228",
        "ThreadID": 1,
        "ThreadName": "",
        "EventID": "FC468AB8FCDF092D",
        "ProcessID": 21035
      },
      {
        "Cycles": 0,
        "Agent": "Execution-CPU",
        "ProcessName": "Read",
        "TaskID": "A85948F16433CD76",
        "ParentEventID": [
          "39753F359AC76D42"
        ],
        "Label": "set",
        "Title": "X-Trace Task",
        "Host": "pinky19.mpi-sws.org",
        "HRT": 25491784217946682,
        "Operation": "set",
        "Timestamp": "1556275424158.249756",
        "TenantClass": 0,
        "Source": "Client.java:1032",
        "ThreadID": 41,
        "ThreadName": "",
        "EventID": "B33979E8C6799A95",
        "ProcessID": 21035
      },
      {
        "Cycles": 0,
        "Agent": "Execution-CPU",
        "ProcessName": "Read",
        "TaskID": "A85948F16433CD76",
        "ParentEventID": [
          "FC468AB8FCDF092D"
        ],
        "Label": "unset",
        "Title": "X-Trace Task",
        "Host": "pinky19.mpi-sws.org",
        "Duration": "22308282",
        "HRT": 25491784217863617,
        "Operation": "unset",
        "Timestamp": "1556275424158.166748",
        "TenantClass": 0,
        "Source": "Client.java:1027",
        "ThreadID": 1,
        "ThreadName": "",
        "EventID": "39753F359AC76D42",
        "ProcessID": 21035
      },
      {
        "Cycles": 0,
        "Agent": "Execution-CPU",
        "ProcessName": "Read",
        "TaskID": "A85948F16433CD76",
        "ParentEventID": [
          "08FA90BF1FBF3FBA"
        ],
        "Label": "unset",
        "Title": "X-Trace Task",
        "Host": "pinky19.mpi-sws.org",
        "Duration": "77319",
        "HRT": 25491784218049594,
        "Operation": "unset",
        "Timestamp": "1556275424158.352783",
        "TenantClass": 0,
        "Source": "Client.java:1062",
        "ThreadID": 41,
        "ThreadName": "",
        "EventID": "B3EBF98F6EF9E4AD",
        "ProcessID": 21035
      },
      {
        "Cycles": 0,
        "Agent": "Execution-CPU",
        "ProcessName": "Read",
        "TaskID": "A85948F16433CD76",
        "ParentEventID": [
          "B3EBF98F6EF9E4AD"
        ],
        "Label": "set",
        "Title": "X-Trace Task",
        "Host": "pinky19.mpi-sws.org",
        "HRT": 25491784218078235,
        "Operation": "set",
        "Timestamp": "1556275424158.381348",
        "TenantClass": 0,
        "Source": "Client.java:1104",
        "ThreadID": 1,
        "ThreadName": "",
        "EventID": "F682DD85989CE168",
        "ProcessID": 21035
      },
      {
        "Cycles": 0,
        "Agent": "Execution-CPU",
        "ProcessName": "Name",
        "TaskID": "A85948F16433CD76",
        "ParentEventID": [
          "08FA90BF1FBF3FBA"
        ],
        "Label": "set",
        "Title": "X-Trace Task",
        "Host": "pinky19.mpi-sws.org",
        "HRT": 25491784218091834,
        "Operation": "set",
        "Timestamp": "1556275424158.416992",
        "TenantClass": 0,
        "Source": "Server.java:1840",
        "ThreadID": 48,
        "ThreadName": "",
        "EventID": "44FDE98F9CE915D7",
        "BaggageBytes": "[[248 5] [240 0] [0 168 89 72 241 100 51 205 118] [240 1] [0 8 250 144 191 31 191 63 186] [240 3] [0 2]]",
        "ProcessID": 2171
      },
      {
        "Cycles": 0,
        "Agent": "edu.brown.cs.systems.xtrace.logging.BaggageWrappers",
        "ProcessName": "Read",
        "TaskID": "A85948F16433CD76",
        "ParentEventID": [
          "B33979E8C6799A95"
        ],
        "Label": "Forking current baggage with Baggage.fork()",
        "Title": "X-Trace Task",
        "Host": "pinky19.mpi-sws.org",
        "HRT": 25491784217973769,
        "Operation": "fork",
        "Timestamp": "1556275424158.276855",
        "TenantClass": 0,
        "Source": "Client.java:1043",
        "ThreadID": 41,
        "ThreadName": "",
        "EventID": "08FA90BF1FBF3FBA",
        "ProcessID": 21035
      },
      {
        "Cycles": 0,
        "Agent": "Execution-CPU",
        "ProcessName": "Name",
        "TaskID": "A85948F16433CD76",
        "ParentEventID": [
          "055E486059F6B460"
        ],
        "Label": "unset",
        "Title": "X-Trace Task",
        "Host": "pinky19.mpi-sws.org",
        "Duration": "22567",
        "HRT": 25491784218136027,
        "Operation": "unset",
        "Timestamp": "1556275424158.461182",
        "TenantClass": 0,
        "Source": "Server.java:1828",
        "ThreadID": 48,
        "ThreadName": "",
        "EventID": "CA50439519D58A8F",
        "BaggageBytes": "[[248 5] [240 0] [0 168 89 72 241 100 51 205 118] [240 1] [0 5 94 72 96 89 246 180 96] [240 3] [0 2]]",
        "ProcessID": 2171
      },
      {
        "Cycles": 0,
        "Agent": "Execution-CPU",
        "ProcessName": "Name",
        "TaskID": "A85948F16433CD76",
        "ParentEventID": [
          "055E486059F6B460"
        ],
        "Label": "set",
        "Title": "X-Trace Task",
        "Host": "pinky19.mpi-sws.org",
        "HRT": 25491784218145315,
        "Operation": "set",
        "Timestamp": "1556275424158.470459",
        "TenantClass": 0,
        "Source": "Server.java:2071",
        "ThreadID": 63,
        "ThreadName": "",
        "EventID": "5EDB05F9F18923E0",
        "BaggageBytes": "[[248 5] [240 0] [0 168 89 72 241 100 51 205 118] [240 1] [0 5 94 72 96 89 246 180 96] [240 3] [0 2]]",
        "ProcessID": 2171
      },
      {
        "Cycles": 0,
        "Agent": "edu.brown.cs.systems.xtrace.logging.BaggageWrappers",
        "ProcessName": "Name",
        "TaskID": "A85948F16433CD76",
        "ParentEventID": [
          "44FDE98F9CE915D7"
        ],
        "Label": "Forking current baggage with Baggage.fork()",
        "Title": "X-Trace Task",
        "Host": "pinky19.mpi-sws.org",
        "HRT": 25491784218116978,
        "Operation": "fork",
        "Timestamp": "1556275424158.442139",
        "TenantClass": 0,
        "Source": "Server.java:550",
        "ThreadID": 48,
        "ThreadName": "",
        "EventID": "055E486059F6B460",
        "BaggageBytes": "[[248 5] [240 0] [0 168 89 72 241 100 51 205 118] [240 1] [0 68 253 233 143 156 233 21 215] [240 3] [0 2]]",
        "ProcessID": 2171
      },
      {
        "Cycles": 0,
        "Agent": "org.apache.hadoop.ipc.Server",
        "ProcessName": "Name",
        "TaskID": "A85948F16433CD76",
        "ParentEventID": [
          "5EDB05F9F18923E0"
        ],
        "Label": "getBlockLocations in org.apache.hadoop.hdfs.protocol.ClientProtocol",
        "Title": "X-Trace Task",
        "Host": "pinky19.mpi-sws.org",
        "HRT": 25491784218179299,
        "Timestamp": "1556275424158.504395",
        "TenantClass": 0,
        "Source": "ProtobufRpcEngine.java:601",
        "ThreadID": 63,
        "ThreadName": "",
        "EventID": "1D38FDD8E7D7D01A",
        "BaggageBytes": "[[248 5] [240 0] [0 168 89 72 241 100 51 205 118] [240 1] [0 94 219 5 249 241 137 35 224] [240 3] [0 2]]",
        "ProcessID": 2171
      },
      {
        "Cycles": 0,
        "Agent": "edu.brown.cs.systems.xtrace.logging.BaggageWrappers",
        "ProcessName": "Name",
        "TaskID": "A85948F16433CD76",
        "ParentEventID": [
          "67D7C1577AA0B00E"
        ],
        "Label": "Forking current baggage with Baggage.fork()",
        "Title": "X-Trace Task",
        "Host": "pinky19.mpi-sws.org",
        "HRT": 25491784218259705,
        "Operation": "fork",
        "Timestamp": "1556275424158.584961",
        "TenantClass": 0,
        "Source": "Server.java:2398",
        "ThreadID": 63,
        "ThreadName": "",
        "EventID": "58144C4AA75290DE",
        "BaggageBytes": "[[248 5] [240 0] [0 168 89 72 241 100 51 205 118] [240 1] [0 103 215 193 87 122 160 176 14] [240 3] [0 2]]",
        "ProcessID": 2171
      },
      {
        "Cycles": 0,
        "Agent": "org.apache.hadoop.hdfs.server.namenode.FSNamesystem.audit",
        "ProcessName": "Name",
        "TaskID": "A85948F16433CD76",
        "ParentEventID": [
          "1D38FDD8E7D7D01A"
        ],
        "Label": "allowed=true\tugi=plascas (auth:SIMPLE)\tip=/139.19.171.63\tcmd=open\tsrc=/ds/wxFy4iWgV2icit6R\tdst=null\tperm=null\tproto=rpc",
        "Title": "X-Trace Task",
        "Host": "pinky19.mpi-sws.org",
        "HRT": 25491784218219713,
        "Timestamp": "1556275424158.544922",
        "TenantClass": 0,
        "Source": "FSNamesystem.java:8313",
        "ThreadID": 63,
        "ThreadName": "",
        "EventID": "67D7C1577AA0B00E",
        "BaggageBytes": "[[248 5] [240 0] [0 168 89 72 241 100 51 205 118] [240 1] [0 29 56 253 216 231 215 208 26] [240 3] [0 2]]",
        "ProcessID": 2171
      },
      {
        "Cycles": 0,
        "Agent": "Execution-CPU",
        "ProcessName": "Name",
        "TaskID": "A85948F16433CD76",
        "ParentEventID": [
          "58144C4AA75290DE"
        ],
        "Label": "unset",
        "Title": "X-Trace Task",
        "Host": "pinky19.mpi-sws.org",
        "Duration": "188390",
        "HRT": 25491784218356862,
        "Operation": "unset",
        "Timestamp": "1556275424158.682129",
        "TenantClass": 0,
        "Source": "Server.java:1058",
        "ThreadID": 63,
        "ThreadName": "",
        "EventID": "7416AAACF9C8ADD8",
        "BaggageBytes": "[[248 5] [240 0] [0 168 89 72 241 100 51 205 118] [240 1] [0 88 20 76 74 167 82 144 222] [240 3] [0 2]]",
        "ProcessID": 2171
      },
      {
        "Cycles": 0,
        "Agent": "Execution-CPU",
        "ProcessName": "Read",
        "TaskID": "A85948F16433CD76",
        "ParentEventID": [
          "A04DC48727813F7A"
        ],
        "Label": "unset",
        "Title": "X-Trace Task",
        "Host": "pinky19.mpi-sws.org",
        "Duration": "12489",
        "HRT": 25491784218451908,
        "Operation": "unset",
        "Timestamp": "1556275424158.755127",
        "TenantClass": 0,
        "Source": "Client.java:1168",
        "ThreadID": 37,
        "ThreadName": "",
        "EventID": "D457CFB6DFA932AE",
        "ProcessID": 21035
      },
      {
        "Cycles": 0,
        "Agent": "Execution-CPU",
        "ProcessName": "Read",
        "TaskID": "A85948F16433CD76",
        "ParentEventID": [
          "58144C4AA75290DE"
        ],
        "Label": "set",
        "Title": "X-Trace Task",
        "Host": "pinky19.mpi-sws.org",
        "HRT": 25491784218422011,
        "Operation": "set",
        "Timestamp": "1556275424158.725098",
        "TenantClass": 0,
        "Source": "Client.java:302",
        "ThreadID": 37,
        "ThreadName": "",
        "EventID": "A04DC48727813F7A",
        "ProcessID": 21035
      },
      {
        "Cycles": 0,
        "Agent": "Execution-Sleep",
        "ProcessName": "Read",
        "TaskID": "A85948F16433CD76",
        "ParentEventID": [
          "F682DD85989CE168"
        ],
        "Label": "waited",
        "Title": "X-Trace Task",
        "Host": "pinky19.mpi-sws.org",
        "Duration": "372163",
        "HRT": 25491784218471791,
        "Operation": "waited",
        "Timestamp": "1556275424158.774902",
        "TenantClass": 0,
        "Source": "Client.java:1537",
        "ThreadID": 1,
        "ThreadName": "",
        "EventID": "2EC0F289EB8F0800",
        "ProcessID": 21035
      },
      {
        "Cycles": 0,
        "Agent": "org.apache.hadoop.ipc.ProtobufRpcEngine",
        "ProcessName": "Read",
        "TaskID": "A85948F16433CD76",
        "ParentEventID": [
          "D063EBFD0326EF7B"
        ],
        "Label": "org.apache.hadoop.hdfs.protocol.ClientProtocol.getBlockLocations completed",
        "Title": "X-Trace Task",
        "Host": "pinky19.mpi-sws.org",
        "HRT": 25491784218535905,
        "Timestamp": "1556275424158.839111",
        "TenantClass": 0,
        "Source": "ProtobufRpcEngine.java:275",
        "ThreadID": 1,
        "ThreadName": "",
        "EventID": "D601FDF770A92CB0",
        "ProcessID": 21035
      },
      {
        "Cycles": 0,
        "Agent": "edu.brown.cs.systems.xtrace.logging.BaggageWrappers",
        "ProcessName": "Read",
        "TaskID": "A85948F16433CD76",
        "ParentEventID": [
          "2EC0F289EB8F0800",
          "D457CFB6DFA932AE"
        ],
        "Label": "Merged current baggage with other baggage",
        "Title": "X-Trace Task",
        "Host": "pinky19.mpi-sws.org",
        "HRT": 25491784218488895,
        "Operation": "join",
        "Timestamp": "1556275424158.791992",
        "TenantClass": 0,
        "Source": "Client.java:1545",
        "ThreadID": 1,
        "ThreadName": "",
        "EventID": "D063EBFD0326EF7B",
        "ProcessID": 21035
      },
      {
        "Cycles": 0,
        "Agent": "edu.brown.cs.systems.xtrace.logging.BaggageWrappers",
        "ProcessName": "Read",
        "TaskID": "A85948F16433CD76",
        "ParentEventID": [
          "D601FDF770A92CB0"
        ],
        "Label": "Forking current baggage with Baggage.fork()",
        "Title": "X-Trace Task",
        "Host": "pinky19.mpi-sws.org",
        "HRT": 25491784218627387,
        "Operation": "fork",
        "Timestamp": "1556275424158.930420",
        "TenantClass": 0,
        "Source": "DataTransferProtoUtil.java:94",
        "ThreadID": 1,
        "ThreadName": "",
        "EventID": "001696DC6270D2E0",
        "ProcessID": 21035
      },
      {
        "Cycles": 0,
        "Agent": "edu.brown.cs.systems.xtrace.logging.XTraceInit",
        "ProcessName": "Data",
        "TaskID": "A85948F16433CD76",
        "ParentEventID": [
          "37C13C1CEDE41D28"
        ],
        "Label": "Thread.setName: DataXceiver for client DFSClient_NONMAPREDUCE_1377588049_1 at /139.19.171.63:38298 [Sending block BP-1633380353-139.19.171.63-1554193446451:blk_1073767526_26702]",
        "Title": "X-Trace Task",
        "Host": "pinky22.mpi-sws.org",
        "HRT": 46041756473987884,
        "Timestamp": "1556275424159.328369",
        "TenantClass": 0,
        "Source": "DataXceiver.java:168",
        "ThreadID": 5996,
        "ThreadName": "",
        "EventID": "439E792AA3F6A299",
        "BaggageBytes": "[[248 5] [240 0] [0 168 89 72 241 100 51 205 118] [240 1] [0 55 193 60 28 237 228 29 40] [240 3] [0 2]]",
        "ProcessID": 28841
      },
      {
        "Cycles": 0,
        "Agent": "edu.brown.cs.systems.xtrace.logging.BaggageWrappers",
        "ProcessName": "Data",
        "TaskID": "A85948F16433CD76",
        "ParentEventID": [
          "439E792AA3F6A299"
        ],
        "Label": "Forking current baggage with Baggage.fork()",
        "Title": "X-Trace Task",
        "Host": "pinky22.mpi-sws.org",
        "HRT": 46041756474202625,
        "Operation": "fork",
        "Timestamp": "1556275424159.543213",
        "TenantClass": 0,
        "Source": "DataXceiver.java:1257",
        "ThreadID": 5996,
        "ThreadName": "",
        "EventID": "288AB47B859901FA",
        "BaggageBytes": "[[248 5] [240 0] [0 168 89 72 241 100 51 205 118] [240 1] [0 67 158 121 42 163 246 162 153] [240 3] [0 2]]",
        "ProcessID": 28841
      },
      {
        "Cycles": 0,
        "Agent": "Execution-CPU",
        "ProcessName": "Data",
        "TaskID": "A85948F16433CD76",
        "ParentEventID": [
          "001696DC6270D2E0"
        ],
        "Label": "set",
        "Title": "X-Trace Task",
        "Host": "pinky22.mpi-sws.org",
        "HRT": 46041756473889854,
        "Operation": "set",
        "Timestamp": "1556275424159.230225",
        "TenantClass": 0,
        "Source": "Receiver.java:117",
        "ThreadID": 5996,
        "ThreadName": "",
        "EventID": "37C13C1CEDE41D28",
        "BaggageBytes": "[[248 5] [240 0] [0 168 89 72 241 100 51 205 118] [240 1] [0 0 22 150 220 98 112 210 224] [240 3] [0 2]]",
        "ProcessID": 28841
      },
      {
        "Cycles": 0,
        "Agent": "Execution-Sleep",
        "ProcessName": "Read",
        "TaskID": "A85948F16433CD76",
        "ParentEventID": [
          "001696DC6270D2E0"
        ],
        "Label": "waited",
        "Title": "X-Trace Task",
        "Host": "pinky19.mpi-sws.org",
        "Duration": "679200",
        "HRT": 25491784219395353,
        "Operation": "waited",
        "Timestamp": "1556275424159.698486",
        "TenantClass": 0,
        "Source": "SocketIOWithTimeout.java:335",
        "ThreadID": 1,
        "ThreadName": "",
        "EventID": "6B63E1D4AC9C8D1E",
        "ProcessID": 21035
      },
      {
        "Cycles": 0,
        "Agent": "edu.brown.cs.systems.xtrace.logging.BaggageWrappers",
        "ProcessName": "Read",
        "TaskID": "A85948F16433CD76",
        "ParentEventID": [
          "288AB47B859901FA",
          "6B63E1D4AC9C8D1E"
        ],
        "Label": "Merged current baggage with other baggage",
        "Title": "X-Trace Task",
        "Host": "pinky19.mpi-sws.org",
        "HRT": 25491784219462385,
        "Operation": "join",
        "Timestamp": "1556275424159.765381",
        "TenantClass": 0,
        "Source": "RemoteBlockReader2.java:429",
        "ThreadID": 1,
        "ThreadName": "",
        "EventID": "B1B88C5DB59DDFE3",
        "ProcessID": 21035
      },
      {
        "Cycles": 0,
        "Agent": "Execution-Sleep",
        "ProcessName": "Read",
        "TaskID": "A85948F16433CD76",
        "ParentEventID": [
          "B1B88C5DB59DDFE3"
        ],
        "Label": "waited",
        "Title": "X-Trace Task",
        "Host": "pinky19.mpi-sws.org",
        "Duration": "32769",
        "HRT": 25491784219548819,
        "Operation": "waited",
        "Timestamp": "1556275424159.851807",
        "TenantClass": 0,
        "Source": "SocketIOWithTimeout.java:335",
        "ThreadID": 1,
        "ThreadName": "",
        "EventID": "F8A19416C23720F6",
        "ProcessID": 21035
      },
      {
        "Cycles": 0,
        "Agent": "edu.brown.cs.systems.xtrace.logging.BaggageWrappers",
        "ProcessName": "Data",
        "TaskID": "A85948F16433CD76",
        "ParentEventID": [
          "288AB47B859901FA"
        ],
        "Label": "Forking current baggage with Baggage.fork()",
        "Title": "X-Trace Task",
        "Host": "pinky22.mpi-sws.org",
        "HRT": 46041756474357598,
        "Operation": "fork",
        "Timestamp": "1556275424159.697998",
        "TenantClass": 0,
        "Source": "PacketHeader.java:95",
        "ThreadID": 5996,
        "ThreadName": "",
        "EventID": "29ABDEAB51C5B187",
        "BaggageBytes": "[[248 5] [240 0] [0 168 89 72 241 100 51 205 118] [240 1] [0 40 138 180 123 133 153 1 250] [240 3] [0 2]]",
        "ProcessID": 28841
      },
      {
        "Cycles": 0,
        "Agent": "Execution-Sleep",
        "ProcessName": "Data",
        "TaskID": "A85948F16433CD76",
        "ParentEventID": [
          "29ABDEAB51C5B187"
        ],
        "Label": "waited",
        "Title": "X-Trace Task",
        "Host": "pinky22.mpi-sws.org",
        "Duration": "9770",
        "HRT": 46041756474508525,
        "Operation": "waited",
        "Timestamp": "1556275424159.849121",
        "TenantClass": 0,
        "Source": "SocketIOWithTimeout.java:335",
        "ThreadID": 5996,
        "ThreadName": "",
        "EventID": "72361FB35A0B322E",
        "BaggageBytes": "[[248 5] [240 0] [0 168 89 72 241 100 51 205 118] [240 1] [0 41 171 222 171 81 197 177 135] [240 3] [0 2]]",
        "ProcessID": 28841
      },
      {
        "Cycles": 0,
        "Agent": "Execution-Sleep",
        "ProcessName": "Read",
        "TaskID": "A85948F16433CD76",
        "ParentEventID": [
          "F8A19416C23720F6"
        ],
        "Label": "waited",
        "Title": "X-Trace Task",
        "Host": "pinky19.mpi-sws.org",
        "Duration": "93297",
        "HRT": 25491784219731875,
        "Operation": "waited",
        "Timestamp": "1556275424160.034912",
        "TenantClass": 0,
        "Source": "SocketIOWithTimeout.java:335",
        "ThreadID": 1,
        "ThreadName": "",
        "EventID": "F79DADF096E0E393",
        "ProcessID": 21035
      },
      {
        "Cycles": 0,
        "Agent": "edu.brown.cs.systems.xtrace.logging.BaggageWrappers",
        "ProcessName": "Data",
        "TaskID": "A85948F16433CD76",
        "ParentEventID": [
          "72361FB35A0B322E"
        ],
        "Label": "Forking current baggage with Baggage.fork()",
        "Title": "X-Trace Task",
        "Host": "pinky22.mpi-sws.org",
        "HRT": 46041756474657053,
        "Operation": "fork",
        "Timestamp": "1556275424159.997559",
        "TenantClass": 0,
        "Source": "PacketHeader.java:95",
        "ThreadID": 5996,
        "ThreadName": "",
        "EventID": "7B19A1D025CAF41F",
        "BaggageBytes": "[[248 5] [240 0] [0 168 89 72 241 100 51 205 118] [240 1] [0 114 54 31 179 90 11 50 46] [240 3] [0 2]]",
        "ProcessID": 28841
      },
      {
        "Cycles": 0,
        "Agent": "edu.brown.cs.systems.xtrace.logging.BaggageWrappers",
        "ProcessName": "Read",
        "TaskID": "A85948F16433CD76",
        "ParentEventID": [
          "4AD66021EC091A30",
          "7B19A1D025CAF41F"
        ],
        "Label": "Merged current baggage with other baggage",
        "Title": "X-Trace Task",
        "Host": "pinky19.mpi-sws.org",
        "HRT": 25491784219881639,
        "Operation": "join",
        "Timestamp": "1556275424160.184814",
        "TenantClass": 0,
        "Source": "PacketHeader.java:168",
        "ThreadID": 1,
        "ThreadName": "",
        "EventID": "C10B4A8EBA95845C",
        "ProcessID": 21035
      },
      {
        "Cycles": 0,
        "Agent": "edu.brown.cs.systems.xtrace.logging.BaggageWrappers",
        "ProcessName": "Read",
        "TaskID": "A85948F16433CD76",
        "ParentEventID": [
          "C10B4A8EBA95845C"
        ],
        "Label": "Forking current baggage with Baggage.fork()",
        "Title": "X-Trace Task",
        "Host": "pinky19.mpi-sws.org",
        "HRT": 25491784219895352,
        "Operation": "fork",
        "Timestamp": "1556275424160.198486",
        "TenantClass": 0,
        "Source": "RemoteBlockReader2.java:361",
        "ThreadID": 1,
        "ThreadName": "",
        "EventID": "8542E58CCBD97682",
        "ProcessID": 21035
      },
      {
        "Cycles": 0,
        "Agent": "edu.brown.cs.systems.xtrace.logging.BaggageWrappers",
        "ProcessName": "Read",
        "TaskID": "A85948F16433CD76",
        "ParentEventID": [
          "29ABDEAB51C5B187",
          "F79DADF096E0E393"
        ],
        "Label": "Merged current baggage with other baggage",
        "Title": "X-Trace Task",
        "Host": "pinky19.mpi-sws.org",
        "HRT": 25491784219815543,
        "Operation": "join",
        "Timestamp": "1556275424160.118652",
        "TenantClass": 0,
        "Source": "PacketHeader.java:168",
        "ThreadID": 1,
        "ThreadName": "",
        "EventID": "4AD66021EC091A30",
        "ProcessID": 21035
      },
      {
        "Cycles": 0,
        "Agent": "Execution-Sleep",
        "ProcessName": "Data",
        "TaskID": "A85948F16433CD76",
        "ParentEventID": [
          "7B19A1D025CAF41F"
        ],
        "Label": "waited",
        "Title": "X-Trace Task",
        "Host": "pinky22.mpi-sws.org",
        "Duration": "83067",
        "HRT": 46041756474933687,
        "Operation": "waited",
        "Timestamp": "1556275424160.274170",
        "TenantClass": 0,
        "Source": "SocketIOWithTimeout.java:335",
        "ThreadID": 5996,
        "ThreadName": "",
        "EventID": "2533790BAE3E78AD",
        "BaggageBytes": "[[248 5] [240 0] [0 168 89 72 241 100 51 205 118] [240 1] [0 123 25 161 208 37 202 244 31] [240 3] [0 2]]",
        "ProcessID": 28841
      },
      {
        "Cycles": 0,
        "Agent": "edu.brown.cs.systems.xtrace.logging.BaggageWrappers",
        "ProcessName": "Data",
        "TaskID": "A85948F16433CD76",
        "ParentEventID": [
          "2533790BAE3E78AD",
          "8542E58CCBD97682"
        ],
        "Label": "Merged current baggage with other baggage",
        "Title": "X-Trace Task",
        "Host": "pinky22.mpi-sws.org",
        "HRT": 46041756475045140,
        "Operation": "join",
        "Timestamp": "1556275424160.385498",
        "TenantClass": 0,
        "Source": "DataXceiver.java:574",
        "ThreadID": 5996,
        "ThreadName": "",
        "EventID": "32C4396A6911415D",
        "BaggageBytes": "[[248 5] [240 0] [0 168 89 72 241 100 51 205 118] [240 1] [0 133 66 229 140 203 217 118 130] [0 37 51 121 11 174 62 120 173] [240 3] [0 2]]",
        "ProcessID": 28841
      },
      {
        "Cycles": 0,
        "Agent": "Execution-CPU",
        "ProcessName": "Data",
        "TaskID": "A85948F16433CD76",
        "ParentEventID": [
          "32C4396A6911415D"
        ],
        "Label": "unset",
        "Title": "X-Trace Task",
        "Host": "pinky22.mpi-sws.org",
        "Duration": "1134223",
        "HRT": 46041756475094247,
        "Operation": "unset",
        "Timestamp": "1556275424160.434814",
        "TenantClass": 0,
        "Source": "DataXceiver.java:261",
        "ThreadID": 5996,
        "ThreadName": "",
        "EventID": "9AAD23CDCFE65521",
        "BaggageBytes": "[[248 5] [240 0] [0 168 89 72 241 100 51 205 118] [240 1] [0 50 196 57 106 105 17 65 93] [240 3] [0 2]]",
        "ProcessID": 28841
      },
      {
        "Cycles": 0,
        "Agent": "edu.brown.cs.systems.retro.benchmarks.hdfs_client.Reader",
        "ProcessName": "Read",
        "TaskID": "A85948F16433CD76",
        "ParentEventID": [
          "0"
        ],
        "Label": "Reading file",
        "Title": "X-Trace Task",
        "Host": "pinky19.mpi-sws.org",
        "HRT": 25491784217728883,
        "Timestamp": "1556275424158.031982",
        "TenantClass": 0,
        "ThreadID": 1,
        "ThreadName": "",
        "EventID": "368CDC8211EB7034",
        "ProcessID": 21035,
        "Tag": [
          "reader_1kb",
          "Read Size: 1024"
        ]
      }
    ]
  }
]