[
  {
    "id": "CD8F601699F358F4",
    "reports": [
      {
        "Cycles": 0,
        "Agent": "edu.brown.cs.systems.retro.benchmarks.hdfs_client.Reader",
        "ProcessName": "Read",
        "TaskID": "CD8F601699F358F4",
        "ParentEventID": [
          "49CB652A3F407814"
        ],
        "Label": "Reading file",
        "Title": "X-Trace Task",
        "Host": "pinky19.mpi-sws.org",
        "HRT": 25491842237649718,
        "Timestamp": "1556275482178.182373",
        "TenantClass": 0,
        "ThreadID": 1,
        "ThreadName": "",
        "EventID": "0C7C27FD8EA5ADA6",
        "ProcessID": 21035
      },
      {
        "Cycles": 0,
        "Agent": "Execution-CPU",
        "ProcessName": "Read",
        "TaskID": "CD8F601699F358F4",
        "ParentEventID": [
          "CE7BDE19A57E2C77"
        ],
        "Label": "unset",
        "Title": "X-Trace Task",
        "Host": "pinky19.mpi-sws.org",
        "Duration": "22169748",
        "HRT": 25491842237709030,
        "Operation": "unset",
        "Timestamp": "1556275482178.241699",
        "TenantClass": 0,
        "Source": "Client.java:1027",
        "ThreadID": 1,
        "ThreadName": "",
        "EventID": "5D5951B0E728933E",
        "ProcessID": 21035
      },
      {
        "Cycles": 0,
        "Agent": "org.apache.hadoop.ipc.ProtobufRpcEngine",
        "ProcessName": "Read",
        "TaskID": "CD8F601699F358F4",
        "ParentEventID": [
          "0C7C27FD8EA5ADA6"
        ],
        "Label": "Invoking org.apache.hadoop.hdfs.protocol.ClientProtocol.getBlockLocations",
        "Title": "X-Trace Task",
        "Host": "pinky19.mpi-sws.org",
        "HRT": 25491842237684911,
        "Timestamp": "1556275482178.217529",
        "TenantClass": 0,
        "Source": "ProtobufRpcEngine.java:228",
        "ThreadID": 1,
        "ThreadName": "",
        "EventID": "CE7BDE19A57E2C77",
        "ProcessID": 21035
      },
      {
        "Cycles": 0,
        "Agent": "Execution-CPU",
        "ProcessName": "Read",
        "TaskID": "CD8F601699F358F4",
        "ParentEventID": [
          "5D5951B0E728933E"
        ],
        "Label": "set",
        "Title": "X-Trace Task",
        "Host": "pinky19.mpi-sws.org",
        "HRT": 25491842237747083,
        "Operation": "set",
        "Timestamp": "1556275482178.279785",
        "TenantClass": 0,
        "Source": "Client.java:1032",
        "ThreadID": 41,
        "ThreadName": "",
        "EventID": "A9684A4F01594940",
        "ProcessID": 21035
      },
      {
        "Cycles": 0,
        "Agent": "edu.brown.cs.systems.xtrace.logging.BaggageWrappers",
        "ProcessName": "Read",
        "TaskID": "CD8F601699F358F4",
        "ParentEventID": [
          "A9684A4F01594940"
        ],
        "Label": "Forking current baggage with Baggage.fork()",
        "Title": "X-Trace Task",
        "Host": "pinky19.mpi-sws.org",
        "HRT": 25491842237769224,
        "Operation": "fork",
        "Timestamp": "1556275482178.301758",
        "TenantClass": 0,
        "Source": "Client.java:1043",
        "ThreadID": 41,
        "ThreadName": "",
        "EventID": "72CF8D30DF0D1089",
        "ProcessID": 21035
      },
      {
        "Cycles": 0,
        "Agent": "Execution-CPU",
        "ProcessName": "Read",
        "TaskID": "CD8F601699F358F4",
        "ParentEventID": [
          "24E658A4F62910EE"
        ],
        "Label": "set",
        "Title": "X-Trace Task",
        "Host": "pinky19.mpi-sws.org",
        "HRT": 25491842237869774,
        "Operation": "set",
        "Timestamp": "1556275482178.402344",
        "TenantClass": 0,
        "Source": "Client.java:1104",
        "ThreadID": 1,
        "ThreadName": "",
        "EventID": "4259B017A0D9C47F",
        "ProcessID": 21035
      },
      {
        "Cycles": 0,
        "Agent": "Execution-CPU",
        "ProcessName": "Name",
        "TaskID": "CD8F601699F358F4",
        "ParentEventID": [
          "72CF8D30DF0D1089"
        ],
        "Label": "set",
        "Title": "X-Trace Task",
        "Host": "pinky19.mpi-sws.org",
        "HRT": 25491842237900686,
        "Operation": "set",
        "Timestamp": "1556275482178.453857",
        "TenantClass": 0,
        "Source": "Server.java:1840",
        "ThreadID": 48,
        "ThreadName": "",
        "EventID": "35BDBC65AC7FBC11",
        "BaggageBytes": "[[248 5] [240 0] [0 205 143 96 22 153 243 88 244] [240 1] [0 114 207 141 48 223 13 16 137] [240 3] [0 2]]",
        "ProcessID": 2171
      },
      {
        "Cycles": 0,
        "Agent": "Execution-CPU",
        "ProcessName": "Read",
        "TaskID": "CD8F601699F358F4",
        "ParentEventID": [
          "72CF8D30DF0D1089"
        ],
        "Label": "unset",
        "Title": "X-Trace Task",
        "Host": "pinky19.mpi-sws.org",
        "Duration": "75537",
        "HRT": 25491842237843082,
        "Operation": "unset",
        "Timestamp": "1556275482178.375732",
        "TenantClass": 0,
        "Source": "Client.java:1062",
        "ThreadID": 41,
        "ThreadName": "",
        "EventID": "24E658A4F62910EE",
        "ProcessID": 21035
      },
      {
        "Cycles": 0,
        "Agent": "edu.brown.cs.systems.xtrace.logging.BaggageWrappers",
        "ProcessName": "Name",
        "TaskID": "CD8F601699F358F4",
        "ParentEventID": [
          "35BDBC65AC7FBC11"
        ],
        "Label": "Forking current baggage with Baggage.fork()",
        "Title": "X-Trace Task",
        "Host": "pinky19.mpi-sws.org",
        "HRT": 25491842237928506,
        "Operation": "fork",
        "Timestamp": "1556275482178.481689",
        "TenantClass": 0,
        "Source": "Server.java:550",
        "ThreadID": 48,
        "ThreadName": "",
        "EventID": "7049422CBA79C7C0",
        "BaggageBytes": "[[248 5] [240 0] [0 205 143 96 22 153 243 88 244] [240 1] [0 53 189 188 101 172 127 188 17] [240 3] [0 2]]",
        "ProcessID": 2171
      },
      {
        "Cycles": 0,
        "Agent": "Execution-CPU",
        "ProcessName": "Name",
        "TaskID": "CD8F601699F358F4",
        "ParentEventID": [
          "7049422CBA79C7C0"
        ],
        "Label": "set",
        "Title": "X-Trace Task",
        "Host": "pinky19.mpi-sws.org",
        "HRT": 25491842237956575,
        "Operation": "set",
        "Timestamp": "1556275482178.509766",
        "TenantClass": 0,
        "Source": "Server.java:2071",
        "ThreadID": 60,
        "ThreadName": "",
        "EventID": "FF602E150776E0E1",
        "BaggageBytes": "[[248 5] [240 0] [0 205 143 96 22 153 243 88 244] [240 1] [0 112 73 66 44 186 121 199 192] [240 3] [0 2]]",
        "ProcessID": 2171
      },
      {
        "Cycles": 0,
        "Agent": "org.apache.hadoop.ipc.Server",
        "ProcessName": "Name",
        "TaskID": "CD8F601699F358F4",
        "ParentEventID": [
          "FF602E150776E0E1"
        ],
        "Label": "getBlockLocations in org.apache.hadoop.hdfs.protocol.ClientProtocol",
        "Title": "X-Trace Task",
        "Host": "pinky19.mpi-sws.org",
        "HRT": 25491842237990489,
        "Timestamp": "1556275482178.543701",
        "TenantClass": 0,
        "Source": "ProtobufRpcEngine.java:601",
        "ThreadID": 60,
        "ThreadName": "",
        "EventID": "C25FA1F89821FED2",
        "BaggageBytes": "[[248 5] [240 0] [0 205 143 96 22 153 243 88 244] [240 1] [0 255 96 46 21 7 118 224 225] [240 3] [0 2]]",
        "ProcessID": 2171
      },
      {
        "Cycles": 0,
        "Agent": "Execution-CPU",
        "ProcessName": "Name",
        "TaskID": "CD8F601699F358F4",
        "ParentEventID": [
          "7049422CBA79C7C0"
        ],
        "Label": "unset",
        "Title": "X-Trace Task",
        "Host": "pinky19.mpi-sws.org",
        "Duration": "23712",
        "HRT": 25491842237948595,
        "Operation": "unset",
        "Timestamp": "1556275482178.501709",
        "TenantClass": 0,
        "Source": "Server.java:1828",
        "ThreadID": 48,
        "ThreadName": "",
        "EventID": "BC28D68F71A5DCE5",
        "BaggageBytes": "[[248 5] [240 0] [0 205 143 96 22 153 243 88 244] [240 1] [0 112 73 66 44 186 121 199 192] [240 3] [0 2]]",
        "ProcessID": 2171
      },
      {
        "Cycles": 0,
        "Agent": "org.apache.hadoop.hdfs.server.namenode.FSNamesystem.audit",
        "ProcessName": "Name",
        "TaskID": "CD8F601699F358F4",
        "ParentEventID": [
          "C25FA1F89821FED2"
        ],
        "Label": "allowed=true\tugi=plascas (auth:SIMPLE)\tip=/139.19.171.63\tcmd=open\tsrc=/ds/92MbyOZRNpIoxq1Y\tdst=null\tperm=null\tproto=rpc",
        "Title": "X-Trace Task",
        "Host": "pinky19.mpi-sws.org",
        "HRT": 25491842238040364,
        "Timestamp": "1556275482178.593506",
        "TenantClass": 0,
        "Source": "FSNamesystem.java:8313",
        "ThreadID": 60,
        "ThreadName": "",
        "EventID": "E81F6FFC78CFA9CE",
        "BaggageBytes": "[[248 5] [240 0] [0 205 143 96 22 153 243 88 244] [240 1] [0 194 95 161 248 152 33 254 210] [240 3] [0 2]]",
        "ProcessID": 2171
      },
      {
        "Cycles": 0,
        "Agent": "Execution-CPU",
        "ProcessName": "Name",
        "TaskID": "CD8F601699F358F4",
        "ParentEventID": [
          "A0A77FC3E37829AF"
        ],
        "Label": "unset",
        "Title": "X-Trace Task",
        "Host": "pinky19.mpi-sws.org",
        "Duration": "204181",
        "HRT": 25491842238183625,
        "Operation": "unset",
        "Timestamp": "1556275482178.736816",
        "TenantClass": 0,
        "Source": "Server.java:1058",
        "ThreadID": 60,
        "ThreadName": "",
        "EventID": "B0B0A0C593652A67",
        "BaggageBytes": "[[248 5] [240 0] [0 205 143 96 22 153 243 88 244] [240 1] [0 160 167 127 195 227 120 41 175] [240 3] [0 2]]",
        "ProcessID": 2171
      },
      {
        "Cycles": 0,
        "Agent": "edu.brown.cs.systems.xtrace.logging.BaggageWrappers",
        "ProcessName": "Name",
        "TaskID": "CD8F601699F358F4",
        "ParentEventID": [
          "E81F6FFC78CFA9CE"
        ],
        "Label": "Forking current baggage with Baggage.fork()",
        "Title": "X-Trace Task",
        "Host": "pinky19.mpi-sws.org",
        "HRT": 25491842238082940,
        "Operation": "fork",
        "Timestamp": "1556275482178.635986",
        "TenantClass": 0,
        "Source": "Server.java:2398",
        "ThreadID": 60,
        "ThreadName": "",
        "EventID": "A0A77FC3E37829AF",
        "BaggageBytes": "[[248 5] [240 0] [0 205 143 96 22 153 243 88 244] [240 1] [0 232 31 111 252 120 207 169 206] [240 3] [0 2]]",
        "ProcessID": 2171
      },
      {
        "Cycles": 0,
        "Agent": "Execution-CPU",
        "ProcessName": "Read",
        "TaskID": "CD8F601699F358F4",
        "ParentEventID": [
          "A0A77FC3E37829AF"
        ],
        "Label": "set",
        "Title": "X-Trace Task",
        "Host": "pinky19.mpi-sws.org",
        "HRT": 25491842238255467,
        "Operation": "set",
        "Timestamp": "1556275482178.788086",
        "TenantClass": 0,
        "Source": "Client.java:302",
        "ThreadID": 37,
        "ThreadName": "",
        "EventID": "B7CD2ABDA3E9F50B",
        "ProcessID": 21035
      },
      {
        "Cycles": 0,
        "Agent": "Execution-Sleep",
        "ProcessName": "Read",
        "TaskID": "CD8F601699F358F4",
        "ParentEventID": [
          "4259B017A0D9C47F"
        ],
        "Label": "waited",
        "Title": "X-Trace Task",
        "Host": "pinky19.mpi-sws.org",
        "Duration": "413708",
        "HRT": 25491842238301537,
        "Operation": "waited",
        "Timestamp": "1556275482178.834229",
        "TenantClass": 0,
        "Source": "Client.java:1537",
        "ThreadID": 1,
        "ThreadName": "",
        "EventID": "8A9E5501AB662FE7",
        "ProcessID": 21035
      },
      {
        "Cycles": 0,
        "Agent": "edu.brown.cs.systems.xtrace.logging.BaggageWrappers",
        "ProcessName": "Read",
        "TaskID": "CD8F601699F358F4",
        "ParentEventID": [
          "8A9E5501AB662FE7",
          "179E4CFE496433DD"
        ],
        "Label": "Merged current baggage with other baggage",
        "Title": "X-Trace Task",
        "Host": "pinky19.mpi-sws.org",
        "HRT": 25491842238322920,
        "Operation": "join",
        "Timestamp": "1556275482178.855469",
        "TenantClass": 0,
        "Source": "Client.java:1545",
        "ThreadID": 1,
        "ThreadName": "",
        "EventID": "9DC0DD1E65F8DBF1",
        "ProcessID": 21035
      },
      {
        "Cycles": 0,
        "Agent": "Execution-CPU",
        "ProcessName": "Read",
        "TaskID": "CD8F601699F358F4",
        "ParentEventID": [
          "B7CD2ABDA3E9F50B"
        ],
        "Label": "unset",
        "Title": "X-Trace Task",
        "Host": "pinky19.mpi-sws.org",
        "Duration": "10538",
        "HRT": 25491842238282301,
        "Operation": "unset",
        "Timestamp": "1556275482178.814941",
        "TenantClass": 0,
        "Source": "Client.java:1168",
        "ThreadID": 37,
        "ThreadName": "",
        "EventID": "179E4CFE496433DD",
        "ProcessID": 21035
      },
      {
        "Cycles": 0,
        "Agent": "org.apache.hadoop.ipc.ProtobufRpcEngine",
        "ProcessName": "Read",
        "TaskID": "CD8F601699F358F4",
        "ParentEventID": [
          "9DC0DD1E65F8DBF1"
        ],
        "Label": "org.apache.hadoop.hdfs.protocol.ClientProtocol.getBlockLocations completed",
        "Title": "X-Trace Task",
        "Host": "pinky19.mpi-sws.org",
        "HRT": 25491842238376901,
        "Timestamp": "1556275482178.909668",
        "TenantClass": 0,
        "Source": "ProtobufRpcEngine.java:275",
        "ThreadID": 1,
        "ThreadName": "",
        "EventID": "62F05AE69CE1C586",
        "ProcessID": 21035
      },
      {
        "Cycles": 0,
        "Agent": "edu.brown.cs.systems.xtrace.logging.BaggageWrappers",
        "ProcessName": "Read",
        "TaskID": "CD8F601699F358F4",
        "ParentEventID": [
          "62F05AE69CE1C586"
        ],
        "Label": "Forking current baggage with Baggage.fork()",
        "Title": "X-Trace Task",
        "Host": "pinky19.mpi-sws.org",
        "HRT": 25491842238455636,
        "Operation": "fork",
        "Timestamp": "1556275482178.988281",
        "TenantClass": 0,
        "Source": "DataTransferProtoUtil.java:94",
        "ThreadID": 1,
        "ThreadName": "",
        "EventID": "00696037FC711EB4",
        "ProcessID": 21035
      },
      {
        "Cycles": 0,
        "Agent": "Execution-CPU",
        "ProcessName": "Data",
        "TaskID": "CD8F601699F358F4",
        "ParentEventID": [
          "00696037FC711EB4"
        ],
        "Label": "set",
        "Title": "X-Trace Task",
        "Host": "pinky22.mpi-sws.org",
        "HRT": 46041814493776725,
        "Operation": "set",
        "Timestamp": "1556275482179.345459",
        "TenantClass": 0,
        "Source": "Receiver.java:117",
        "ThreadID": 5996,
        "ThreadName": "",
        "EventID": "0639E7E036B6DD8B",
        "BaggageBytes": "[[248 5] [240 0] [0 205 143 96 22 153 243 88 244] [240 1] [0 0 105 96 55 252 113 30 180] [240 3] [0 2]]",
        "ProcessID": 28841
      },
      {
        "Cycles": 0,
        "Agent": "Execution-Sleep",
        "ProcessName": "Read",
        "TaskID": "CD8F601699F358F4",
        "ParentEventID": [
          "00696037FC711EB4"
        ],
        "Label": "waited",
        "Title": "X-Trace Task",
        "Host": "pinky19.mpi-sws.org",
        "Duration": "722300",
        "HRT": 25491842239278309,
        "Operation": "waited",
        "Timestamp": "1556275482179.811035",
        "TenantClass": 0,
        "Source": "SocketIOWithTimeout.java:335",
        "ThreadID": 1,
        "ThreadName": "",
        "EventID": "C14E2B71BBD11FDB",
        "ProcessID": 21035
      },
      {
        "Cycles": 0,
        "Agent": "edu.brown.cs.systems.xtrace.logging.XTraceInit",
        "ProcessName": "Data",
        "TaskID": "CD8F601699F358F4",
        "ParentEventID": [
          "0639E7E036B6DD8B"
        ],
        "Label": "Thread.setName: DataXceiver for client DFSClient_NONMAPREDUCE_1377588049_1 at /139.19.171.63:38298 [Sending block BP-1633380353-139.19.171.63-1554193446451:blk_1073761779_20955]",
        "Title": "X-Trace Task",
        "Host": "pinky22.mpi-sws.org",
        "HRT": 46041814493882582,
        "Timestamp": "1556275482179.451416",
        "TenantClass": 0,
        "Source": "DataXceiver.java:168",
        "ThreadID": 5996,
        "ThreadName": "",
        "EventID": "9483BF42C876A74B",
        "BaggageBytes": "[[248 5] [240 0] [0 205 143 96 22 153 243 88 244] [240 1] [0 6 57 231 224 54 182 221 139] [240 3] [0 2]]",
        "ProcessID": 28841
      },
      {
        "Cycles": 0,
        "Agent": "edu.brown.cs.systems.xtrace.logging.BaggageWrappers",
        "ProcessName": "Data",
        "TaskID": "CD8F601699F358F4",
        "ParentEventID": [
          "9483BF42C876A74B"
        ],
        "Label": "Forking current baggage with Baggage.fork()",
        "Title": "X-Trace Task",
        "Host": "pinky22.mpi-sws.org",
        "HRT": 46041814494086533,
        "Operation": "fork",
        "Timestamp": "1556275482179.655273",
        "TenantClass": 0,
        "Source": "DataXceiver.java:1257",
        "ThreadID": 5996,
        "ThreadName": "",
        "EventID": "622EC29409C5469B",
        "BaggageBytes": "[[248 5] [240 0] [0 205 143 96 22 153 243 88 244] [240 1] [0 148 131 191 66 200 118 167 75] [240 3] [0 2]]",
        "ProcessID": 28841
      },
      {
        "Cycles": 0,
        "Agent": "edu.brown.cs.systems.xtrace.logging.BaggageWrappers",
        "ProcessName": "Data",
        "TaskID": "CD8F601699F358F4",
        "ParentEventID": [
          "622EC29409C5469B"
        ],
        "Label": "Forking current baggage with Baggage.fork()",
        "Title": "X-Trace Task",
        "Host": "pinky22.mpi-sws.org",
        "HRT": 46041814494228450,
        "Operation": "fork",
        "Timestamp": "1556275482179.797119",
        "TenantClass": 0,
        "Source": "PacketHeader.java:95",
        "ThreadID": 5996,
        "ThreadName": "",
        "EventID": "64F782C552666AD7",
        "BaggageBytes": "[[248 5] [240 0] [0 205 143 96 22 153 243 88 244] [240 1] [0 98 46 194 148 9 197 70 155] [240 3] [0 2]]",
        "ProcessID": 28841
      },
      {
        "Cycles": 0,
        "Agent": "edu.brown.cs.systems.xtrace.logging.BaggageWrappers",
        "ProcessName": "Read",
        "TaskID": "CD8F601699F358F4",
        "ParentEventID": [
          "622EC29409C5469B",
          "C14E2B71BBD11FDB"
        ],
        "Label": "Merged current baggage with other baggage",
        "Title": "X-Trace Task",
        "Host": "pinky19.mpi-sws.org",
        "HRT": 25491842239368024,
        "Operation": "join",
        "Timestamp": "1556275482179.900635",
        "TenantClass": 0,
        "Source": "RemoteBlockReader2.java:429",
        "ThreadID": 1,
        "ThreadName": "",
        "EventID": "68CB96B816B35C1D",
        "ProcessID": 21035
      },
      {
        "Cycles": 0,
        "Agent": "Execution-Sleep",
        "ProcessName": "Data",
        "TaskID": "CD8F601699F358F4",
        "ParentEventID": [
          "64F782C552666AD7"
        ],
        "Label": "waited",
        "Title": "X-Trace Task",
        "Host": "pinky22.mpi-sws.org",
        "Duration": "9417",
        "HRT": 46041814494411341,
        "Operation": "waited",
        "Timestamp": "1556275482179.979980",
        "TenantClass": 0,
        "Source": "SocketIOWithTimeout.java:335",
        "ThreadID": 5996,
        "ThreadName": "",
        "EventID": "C022EF9A8C03AF0C",
        "BaggageBytes": "[[248 5] [240 0] [0 205 143 96 22 153 243 88 244] [240 1] [0 100 247 130 197 82 102 106 215] [240 3] [0 2]]",
        "ProcessID": 28841
      },
      {
        "Cycles": 0,
        "Agent": "Execution-Sleep",
        "ProcessName": "Read",
        "TaskID": "CD8F601699F358F4",
        "ParentEventID": [
          "68CB96B816B35C1D"
        ],
        "Label": "waited",
        "Title": "X-Trace Task",
        "Host": "pinky19.mpi-sws.org",
        "Duration": "152624",
        "HRT": 25491842239631149,
        "Operation": "waited",
        "Timestamp": "1556275482180.163818",
        "TenantClass": 0,
        "Source": "SocketIOWithTimeout.java:335",
        "ThreadID": 1,
        "ThreadName": "",
        "EventID": "8EF361FBC6E0BA35",
        "ProcessID": 21035
      },
      {
        "Cycles": 0,
        "Agent": "edu.brown.cs.systems.xtrace.logging.BaggageWrappers",
        "ProcessName": "Read",
        "TaskID": "CD8F601699F358F4",
        "ParentEventID": [
          "64F782C552666AD7",
          "8EF361FBC6E0BA35"
        ],
        "Label": "Merged current baggage with other baggage",
        "Title": "X-Trace Task",
        "Host": "pinky19.mpi-sws.org",
        "HRT": 25491842239670333,
        "Operation": "join",
        "Timestamp": "1556275482180.202881",
        "TenantClass": 0,
        "Source": "PacketHeader.java:168",
        "ThreadID": 1,
        "ThreadName": "",
        "EventID": "B3E53A15F60ACCB3",
        "ProcessID": 21035
      },
      {
        "Cycles": 0,
        "Agent": "edu.brown.cs.systems.xtrace.logging.BaggageWrappers",
        "ProcessName": "Data",
        "TaskID": "CD8F601699F358F4",
        "ParentEventID": [
          "C022EF9A8C03AF0C"
        ],
        "Label": "Forking current baggage with Baggage.fork()",
        "Title": "X-Trace Task",
        "Host": "pinky22.mpi-sws.org",
        "HRT": 46041814494569458,
        "Operation": "fork",
        "Timestamp": "1556275482180.138184",
        "TenantClass": 0,
        "Source": "PacketHeader.java:95",
        "ThreadID": 5996,
        "ThreadName": "",
        "EventID": "529264E33804E7D3",
        "BaggageBytes": "[[248 5] [240 0] [0 205 143 96 22 153 243 88 244] [240 1] [0 192 34 239 154 140 3 175 12] [240 3] [0 2]]",
        "ProcessID": 28841
      },
      {
        "Cycles": 0,
        "Agent": "edu.brown.cs.systems.xtrace.logging.BaggageWrappers",
        "ProcessName": "Read",
        "TaskID": "CD8F601699F358F4",
        "ParentEventID": [
          "C1054F397D078FF8",
          "529264E33804E7D3"
        ],
        "Label": "Merged current baggage with other baggage",
        "Title": "X-Trace Task",
        "Host": "pinky19.mpi-sws.org",
        "HRT": 25491842239796320,
        "Operation": "join",
        "Timestamp": "1556275482180.328857",
        "TenantClass": 0,
        "Source": "PacketHeader.java:168",
        "ThreadID": 1,
        "ThreadName": "",
        "EventID": "D0BCD7807389F164",
        "ProcessID": 21035
      },
      {
        "Cycles": 0,
        "Agent": "Execution-Sleep",
        "ProcessName": "Read",
        "TaskID": "CD8F601699F358F4",
        "ParentEventID": [
          "B3E53A15F60ACCB3"
        ],
        "Label": "waited",
        "Title": "X-Trace Task",
        "Host": "pinky19.mpi-sws.org",
        "Duration": "48094",
        "HRT": 25491842239747685,
        "Operation": "waited",
        "Timestamp": "1556275482180.280273",
        "TenantClass": 0,
        "Source": "SocketIOWithTimeout.java:335",
        "ThreadID": 1,
        "ThreadName": "",
        "EventID": "C1054F397D078FF8",
        "ProcessID": 21035
      },
      {
        "Cycles": 0,
        "Agent": "edu.brown.cs.systems.xtrace.logging.BaggageWrappers",
        "ProcessName": "Read",
        "TaskID": "CD8F601699F358F4",
        "ParentEventID": [
          "D0BCD7807389F164"
        ],
        "Label": "Forking current baggage with Baggage.fork()",
        "Title": "X-Trace Task",
        "Host": "pinky19.mpi-sws.org",
        "HRT": 25491842239805805,
        "Operation": "fork",
        "Timestamp": "1556275482180.338379",
        "TenantClass": 0,
        "Source": "RemoteBlockReader2.java:361",
        "ThreadID": 1,
        "ThreadName": "",
        "EventID": "C2650E75FDC54290",
        "ProcessID": 21035
      },
      {
        "Cycles": 0,
        "Agent": "Execution-Sleep",
        "ProcessName": "Data",
        "TaskID": "CD8F601699F358F4",
        "ParentEventID": [
          "529264E33804E7D3"
        ],
        "Label": "waited",
        "Title": "X-Trace Task",
        "Host": "pinky22.mpi-sws.org",
        "Duration": "87317",
        "HRT": 46041814494852355,
        "Operation": "waited",
        "Timestamp": "1556275482180.421143",
        "TenantClass": 0,
        "Source": "SocketIOWithTimeout.java:335",
        "ThreadID": 5996,
        "ThreadName": "",
        "EventID": "79DD95D3BB7E77CE",
        "BaggageBytes": "[[248 5] [240 0] [0 205 143 96 22 153 243 88 244] [240 1] [0 82 146 100 227 56 4 231 211] [240 3] [0 2]]",
        "ProcessID": 28841
      },
      {
        "Cycles": 0,
        "Agent": "edu.brown.cs.systems.xtrace.logging.BaggageWrappers",
        "ProcessName": "Data",
        "TaskID": "CD8F601699F358F4",
        "ParentEventID": [
          "79DD95D3BB7E77CE",
          "C2650E75FDC54290"
        ],
        "Label": "Merged current baggage with other baggage",
        "Title": "X-Trace Task",
        "Host": "pinky22.mpi-sws.org",
        "HRT": 46041814494960409,
        "Operation": "join",
        "Timestamp": "1556275482180.529053",
        "TenantClass": 0,
        "Source": "DataXceiver.java:574",
        "ThreadID": 5996,
        "ThreadName": "",
        "EventID": "ACE18AA2C84ACFCF",
        "BaggageBytes": "[[248 5] [240 0] [0 205 143 96 22 153 243 88 244] [240 1] [0 194 101 14 117 253 197 66 144] [0 121 221 149 211 187 126 119 206] [240 3] [0 2]]",
        "ProcessID": 28841
      },
      {
        "Cycles": 0,
        "Agent": "Execution-CPU",
        "ProcessName": "Data",
        "TaskID": "CD8F601699F358F4",
        "ParentEventID": [
          "ACE18AA2C84ACFCF"
        ],
        "Label": "unset",
        "Title": "X-Trace Task",
        "Host": "pinky22.mpi-sws.org",
        "Duration": "1159857",
        "HRT": 46041814495012592,
        "Operation": "unset",
        "Timestamp": "1556275482180.581299",
        "TenantClass": 0,
        "Source": "DataXceiver.java:261",
        "ThreadID": 5996,
        "ThreadName": "",
        "EventID": "946AA4C7716D9AF6",
        "BaggageBytes": "[[248 5] [240 0] [0 205 143 96 22 153 243 88 244] [240 1] [0 172 225 138 162 200 74 207 207] [240 3] [0 2]]",
        "ProcessID": 28841
      },
      {
        "Cycles": 0,
        "Agent": "edu.brown.cs.systems.retro.benchmarks.hdfs_client.Reader",
        "ProcessName": "Read",
        "TaskID": "CD8F601699F358F4",
        "ParentEventID": [
          "0"
        ],
        "Label": "Reading file",
        "Title": "X-Trace Task",
        "Host": "pinky19.mpi-sws.org",
        "HRT": 25491842237633354,
        "Timestamp": "1556275482178.166016",
        "TenantClass": 0,
        "ThreadID": 1,
        "ThreadName": "",
        "EventID": "49CB652A3F407814",
        "ProcessID": 21035,
        "Tag": [
          "reader_1kb",
          "Read Size: 1024"
        ]
      }
    ]
  }
]