[
  {
    "id": "4701A64B05292E2D",
    "reports": [
      {
        "Cycles": 0,
        "Agent": "org.apache.hadoop.ipc.ProtobufRpcEngine",
        "ProcessName": "Read",
        "TaskID": "4701A64B05292E2D",
        "ParentEventID": [
          "169E0646C852B8BE"
        ],
        "Label": "Invoking org.apache.hadoop.hdfs.protocol.ClientProtocol.getBlockLocations",
        "Title": "X-Trace Task",
        "Host": "pinky19.mpi-sws.org",
        "HRT": 26962499107692050,
        "Timestamp": "1557746139047.961426",
        "TenantClass": 0,
        "Source": "ProtobufRpcEngine.java:228",
        "ThreadID": 1,
        "ThreadName": "",
        "EventID": "E8E7D3780214AAD7",
        "ProcessID": 36430
      },
      {
        "Cycles": 0,
        "Agent": "Execution-CPU",
        "ProcessName": "Read",
        "TaskID": "4701A64B05292E2D",
        "ParentEventID": [
          "E8E7D3780214AAD7"
        ],
        "Label": "unset",
        "Title": "X-Trace Task",
        "Host": "pinky19.mpi-sws.org",
        "Duration": "21999331",
        "HRT": 26962499107721315,
        "Operation": "unset",
        "Timestamp": "1557746139047.990723",
        "TenantClass": 0,
        "Source": "Client.java:1027",
        "ThreadID": 1,
        "ThreadName": "",
        "EventID": "E83C7E9D4675A324",
        "ProcessID": 36430
      },
      {
        "Cycles": 0,
        "Agent": "Execution-CPU",
        "ProcessName": "Read",
        "TaskID": "4701A64B05292E2D",
        "ParentEventID": [
          "E83C7E9D4675A324"
        ],
        "Label": "set",
        "Title": "X-Trace Task",
        "Host": "pinky19.mpi-sws.org",
        "HRT": 26962499107750125,
        "Operation": "set",
        "Timestamp": "1557746139048.019531",
        "TenantClass": 0,
        "Source": "Client.java:1032",
        "ThreadID": 41,
        "ThreadName": "",
        "EventID": "964A6FC6E80B0AF8",
        "ProcessID": 36430
      },
      {
        "Cycles": 0,
        "Agent": "edu.brown.cs.systems.xtrace.logging.BaggageWrappers",
        "ProcessName": "Read",
        "TaskID": "4701A64B05292E2D",
        "ParentEventID": [
          "964A6FC6E80B0AF8"
        ],
        "Label": "Forking current baggage with Baggage.fork()",
        "Title": "X-Trace Task",
        "Host": "pinky19.mpi-sws.org",
        "HRT": 26962499107776129,
        "Operation": "fork",
        "Timestamp": "1557746139048.045410",
        "TenantClass": 0,
        "Source": "Client.java:1043",
        "ThreadID": 41,
        "ThreadName": "",
        "EventID": "A924413301F3D587",
        "ProcessID": 36430
      },
      {
        "Cycles": 0,
        "Agent": "Execution-CPU",
        "ProcessName": "Read",
        "TaskID": "4701A64B05292E2D",
        "ParentEventID": [
          "A924413301F3D587"
        ],
        "Label": "unset",
        "Title": "X-Trace Task",
        "Host": "pinky19.mpi-sws.org",
        "Duration": "87543",
        "HRT": 26962499107862520,
        "Operation": "unset",
        "Timestamp": "1557746139048.131836",
        "TenantClass": 0,
        "Source": "Client.java:1062",
        "ThreadID": 41,
        "ThreadName": "",
        "EventID": "B3063EA4E0D0B223",
        "ProcessID": 36430
      },
      {
        "Cycles": 0,
        "Agent": "edu.brown.cs.systems.retro.benchmarks.hdfs_client.Reader",
        "ProcessName": "Read",
        "TaskID": "4701A64B05292E2D",
        "ParentEventID": [
          "C97469DE64F63D7A"
        ],
        "Label": "Reading file",
        "Title": "X-Trace Task",
        "Host": "pinky19.mpi-sws.org",
        "HRT": 26962499107654256,
        "Timestamp": "1557746139047.923584",
        "TenantClass": 0,
        "ThreadID": 1,
        "ThreadName": "",
        "EventID": "169E0646C852B8BE",
        "ProcessID": 36430
      },
      {
        "Cycles": 0,
        "Agent": "Execution-CPU",
        "ProcessName": "Name",
        "TaskID": "4701A64B05292E2D",
        "ParentEventID": [
          "A924413301F3D587"
        ],
        "Label": "set",
        "Title": "X-Trace Task",
        "Host": "pinky19.mpi-sws.org",
        "HRT": 26962499107914869,
        "Operation": "set",
        "Timestamp": "1557746139048.193359",
        "TenantClass": 0,
        "Source": "Server.java:1840",
        "ThreadID": 48,
        "ThreadName": "",
        "EventID": "AC74DDF54412A077",
        "BaggageBytes": "[[248 5] [240 0] [0 71 1 166 75 5 41 46 45] [240 1] [0 169 36 65 51 1 243 213 135] [240 3] [0 2]]",
        "ProcessID": 2171
      },
      {
        "Cycles": 0,
        "Agent": "edu.brown.cs.systems.xtrace.logging.BaggageWrappers",
        "ProcessName": "Name",
        "TaskID": "4701A64B05292E2D",
        "ParentEventID": [
          "AC74DDF54412A077"
        ],
        "Label": "Forking current baggage with Baggage.fork()",
        "Title": "X-Trace Task",
        "Host": "pinky19.mpi-sws.org",
        "HRT": 26962499107943708,
        "Operation": "fork",
        "Timestamp": "1557746139048.222412",
        "TenantClass": 0,
        "Source": "Server.java:550",
        "ThreadID": 48,
        "ThreadName": "",
        "EventID": "A5C271E1E753A815",
        "BaggageBytes": "[[248 5] [240 0] [0 71 1 166 75 5 41 46 45] [240 1] [0 172 116 221 245 68 18 160 119] [240 3] [0 2]]",
        "ProcessID": 2171
      },
      {
        "Cycles": 0,
        "Agent": "Execution-CPU",
        "ProcessName": "Read",
        "TaskID": "4701A64B05292E2D",
        "ParentEventID": [
          "B3063EA4E0D0B223"
        ],
        "Label": "set",
        "Title": "X-Trace Task",
        "Host": "pinky19.mpi-sws.org",
        "HRT": 26962499107892459,
        "Operation": "set",
        "Timestamp": "1557746139048.161865",
        "TenantClass": 0,
        "Source": "Client.java:1104",
        "ThreadID": 1,
        "ThreadName": "",
        "EventID": "4F7D5AB00B432EFF",
        "ProcessID": 36430
      },
      {
        "Cycles": 0,
        "Agent": "Execution-CPU",
        "ProcessName": "Name",
        "TaskID": "4701A64B05292E2D",
        "ParentEventID": [
          "A5C271E1E753A815"
        ],
        "Label": "unset",
        "Title": "X-Trace Task",
        "Host": "pinky19.mpi-sws.org",
        "Duration": "33174",
        "HRT": 26962499107973251,
        "Operation": "unset",
        "Timestamp": "1557746139048.251953",
        "TenantClass": 0,
        "Source": "Server.java:1828",
        "ThreadID": 48,
        "ThreadName": "",
        "EventID": "A12B6856A33C53F9",
        "BaggageBytes": "[[248 5] [240 0] [0 71 1 166 75 5 41 46 45] [240 1] [0 165 194 113 225 231 83 168 21] [240 3] [0 2]]",
        "ProcessID": 2171
      },
      {
        "Cycles": 0,
        "Agent": "Execution-CPU",
        "ProcessName": "Name",
        "TaskID": "4701A64B05292E2D",
        "ParentEventID": [
          "A5C271E1E753A815"
        ],
        "Label": "set",
        "Title": "X-Trace Task",
        "Host": "pinky19.mpi-sws.org",
        "HRT": 26962499107980743,
        "Operation": "set",
        "Timestamp": "1557746139048.259277",
        "TenantClass": 0,
        "Source": "Server.java:2071",
        "ThreadID": 62,
        "ThreadName": "",
        "EventID": "78B831CFCD8272C8",
        "BaggageBytes": "[[248 5] [240 0] [0 71 1 166 75 5 41 46 45] [240 1] [0 165 194 113 225 231 83 168 21] [240 3] [0 2]]",
        "ProcessID": 2171
      },
      {
        "Cycles": 0,
        "Agent": "org.apache.hadoop.ipc.Server",
        "ProcessName": "Name",
        "TaskID": "4701A64B05292E2D",
        "ParentEventID": [
          "78B831CFCD8272C8"
        ],
        "Label": "getBlockLocations in org.apache.hadoop.hdfs.protocol.ClientProtocol",
        "Title": "X-Trace Task",
        "Host": "pinky19.mpi-sws.org",
        "HRT": 26962499108018420,
        "Timestamp": "1557746139048.297119",
        "TenantClass": 0,
        "Source": "ProtobufRpcEngine.java:601",
        "ThreadID": 62,
        "ThreadName": "",
        "EventID": "1340B89CE71C6ACD",
        "BaggageBytes": "[[248 5] [240 0] [0 71 1 166 75 5 41 46 45] [240 1] [0 120 184 49 207 205 130 114 200] [240 3] [0 2]]",
        "ProcessID": 2171
      },
      {
        "Cycles": 0,
        "Agent": "org.apache.hadoop.hdfs.server.namenode.FSNamesystem.audit",
        "ProcessName": "Name",
        "TaskID": "4701A64B05292E2D",
        "ParentEventID": [
          "1340B89CE71C6ACD"
        ],
        "Label": "allowed=true\tugi=plascas (auth:SIMPLE)\tip=/139.19.171.63\tcmd=open\tsrc=/ds/N2YNoo0MoRPkZZOx\tdst=null\tperm=null\tproto=rpc",
        "Title": "X-Trace Task",
        "Host": "pinky19.mpi-sws.org",
        "HRT": 26962499108066367,
        "Timestamp": "1557746139048.344971",
        "TenantClass": 0,
        "Source": "FSNamesystem.java:8313",
        "ThreadID": 62,
        "ThreadName": "",
        "EventID": "9B99A1F5A3AEDDF2",
        "BaggageBytes": "[[248 5] [240 0] [0 71 1 166 75 5 41 46 45] [240 1] [0 19 64 184 156 231 28 106 205] [240 3] [0 2]]",
        "ProcessID": 2171
      },
      {
        "Cycles": 0,
        "Agent": "Execution-CPU",
        "ProcessName": "Name",
        "TaskID": "4701A64B05292E2D",
        "ParentEventID": [
          "834AD81B14587C86"
        ],
        "Label": "unset",
        "Title": "X-Trace Task",
        "Host": "pinky19.mpi-sws.org",
        "Duration": "230432",
        "HRT": 26962499108237370,
        "Operation": "unset",
        "Timestamp": "1557746139048.515869",
        "TenantClass": 0,
        "Source": "Server.java:1058",
        "ThreadID": 62,
        "ThreadName": "",
        "EventID": "14CF632655D35F65",
        "BaggageBytes": "[[248 5] [240 0] [0 71 1 166 75 5 41 46 45] [240 1] [0 131 74 216 27 20 88 124 134] [240 3] [0 2]]",
        "ProcessID": 2171
      },
      {
        "Cycles": 0,
        "Agent": "Execution-CPU",
        "ProcessName": "Read",
        "TaskID": "4701A64B05292E2D",
        "ParentEventID": [
          "834AD81B14587C86"
        ],
        "Label": "set",
        "Title": "X-Trace Task",
        "Host": "pinky19.mpi-sws.org",
        "HRT": 26962499108282165,
        "Operation": "set",
        "Timestamp": "1557746139048.551514",
        "TenantClass": 0,
        "Source": "Client.java:302",
        "ThreadID": 37,
        "ThreadName": "",
        "EventID": "0E0270E0E28A8AD9",
        "ProcessID": 36430
      },
      {
        "Cycles": 0,
        "Agent": "Execution-CPU",
        "ProcessName": "Read",
        "TaskID": "4701A64B05292E2D",
        "ParentEventID": [
          "0E0270E0E28A8AD9"
        ],
        "Label": "unset",
        "Title": "X-Trace Task",
        "Host": "pinky19.mpi-sws.org",
        "Duration": "8973",
        "HRT": 26962499108306775,
        "Operation": "unset",
        "Timestamp": "1557746139048.576172",
        "TenantClass": 0,
        "Source": "Client.java:1168",
        "ThreadID": 37,
        "ThreadName": "",
        "EventID": "192A572E3B825E36",
        "ProcessID": 36430
      },
      {
        "Cycles": 0,
        "Agent": "edu.brown.cs.systems.xtrace.logging.BaggageWrappers",
        "ProcessName": "Name",
        "TaskID": "4701A64B05292E2D",
        "ParentEventID": [
          "9B99A1F5A3AEDDF2"
        ],
        "Label": "Forking current baggage with Baggage.fork()",
        "Title": "X-Trace Task",
        "Host": "pinky19.mpi-sws.org",
        "HRT": 26962499108124863,
        "Operation": "fork",
        "Timestamp": "1557746139048.403564",
        "TenantClass": 0,
        "Source": "Server.java:2398",
        "ThreadID": 62,
        "ThreadName": "",
        "EventID": "834AD81B14587C86",
        "BaggageBytes": "[[248 5] [240 0] [0 71 1 166 75 5 41 46 45] [240 1] [0 155 153 161 245 163 174 221 242] [240 3] [0 2]]",
        "ProcessID": 2171
      },
      {
        "Cycles": 0,
        "Agent": "Execution-Sleep",
        "ProcessName": "Read",
        "TaskID": "4701A64B05292E2D",
        "ParentEventID": [
          "4F7D5AB00B432EFF"
        ],
        "Label": "waited",
        "Title": "X-Trace Task",
        "Host": "pinky19.mpi-sws.org",
        "Duration": "425137",
        "HRT": 26962499108327198,
        "Operation": "waited",
        "Timestamp": "1557746139048.596680",
        "TenantClass": 0,
        "Source": "Client.java:1537",
        "ThreadID": 1,
        "ThreadName": "",
        "EventID": "FED6FE0E748E5916",
        "ProcessID": 36430
      },
      {
        "Cycles": 0,
        "Agent": "org.apache.hadoop.ipc.ProtobufRpcEngine",
        "ProcessName": "Read",
        "TaskID": "4701A64B05292E2D",
        "ParentEventID": [
          "774AFE2CCCF0204B"
        ],
        "Label": "org.apache.hadoop.hdfs.protocol.ClientProtocol.getBlockLocations completed",
        "Title": "X-Trace Task",
        "Host": "pinky19.mpi-sws.org",
        "HRT": 26962499108397547,
        "Timestamp": "1557746139048.666992",
        "TenantClass": 0,
        "Source": "ProtobufRpcEngine.java:275",
        "ThreadID": 1,
        "ThreadName": "",
        "EventID": "25434397C6406DD6",
        "ProcessID": 36430
      },
      {
        "Cycles": 0,
        "Agent": "edu.brown.cs.systems.xtrace.logging.BaggageWrappers",
        "ProcessName": "Read",
        "TaskID": "4701A64B05292E2D",
        "ParentEventID": [
          "192A572E3B825E36",
          "FED6FE0E748E5916"
        ],
        "Label": "Merged current baggage with other baggage",
        "Title": "X-Trace Task",
        "Host": "pinky19.mpi-sws.org",
        "HRT": 26962499108344037,
        "Operation": "join",
        "Timestamp": "1557746139048.613281",
        "TenantClass": 0,
        "Source": "Client.java:1545",
        "ThreadID": 1,
        "ThreadName": "",
        "EventID": "774AFE2CCCF0204B",
        "ProcessID": 36430
      },
      {
        "Cycles": 0,
        "Agent": "edu.brown.cs.systems.xtrace.logging.BaggageWrappers",
        "ProcessName": "Read",
        "TaskID": "4701A64B05292E2D",
        "ParentEventID": [
          "25434397C6406DD6"
        ],
        "Label": "Forking current baggage with Baggage.fork()",
        "Title": "X-Trace Task",
        "Host": "pinky19.mpi-sws.org",
        "HRT": 26962499108471010,
        "Operation": "fork",
        "Timestamp": "1557746139048.740479",
        "TenantClass": 0,
        "Source": "DataTransferProtoUtil.java:94",
        "ThreadID": 1,
        "ThreadName": "",
        "EventID": "EF9A59CA865D09F9",
        "ProcessID": 36430
      },
      {
        "Cycles": 0,
        "Agent": "Execution-CPU",
        "ProcessName": "Data",
        "TaskID": "4701A64B05292E2D",
        "ParentEventID": [
          "EF9A59CA865D09F9"
        ],
        "Label": "set",
        "Title": "X-Trace Task",
        "Host": "pinky19.mpi-sws.org",
        "HRT": 26962499108637568,
        "Operation": "set",
        "Timestamp": "1557746139048.923828",
        "TenantClass": 0,
        "Source": "Receiver.java:117",
        "ThreadID": 36633,
        "ThreadName": "",
        "EventID": "F6082779BFFB2794",
        "BaggageBytes": "[[248 5] [240 0] [0 71 1 166 75 5 41 46 45] [240 1] [0 239 154 89 202 134 93 9 249] [240 3] [0 2]]",
        "ProcessID": 2319
      },
      {
        "Cycles": 0,
        "Agent": "edu.brown.cs.systems.xtrace.logging.BaggageWrappers",
        "ProcessName": "Data",
        "TaskID": "4701A64B05292E2D",
        "ParentEventID": [
          "38059A22C31E7113"
        ],
        "Label": "Forking current baggage with Baggage.fork()",
        "Title": "X-Trace Task",
        "Host": "pinky19.mpi-sws.org",
        "HRT": 26962499108772343,
        "Operation": "fork",
        "Timestamp": "1557746139049.058594",
        "TenantClass": 0,
        "Source": "DataXceiver.java:1257",
        "ThreadID": 36633,
        "ThreadName": "",
        "EventID": "546561CAAA74B0CA",
        "BaggageBytes": "[[248 5] [240 0] [0 71 1 166 75 5 41 46 45] [240 1] [0 56 5 154 34 195 30 113 19] [240 3] [0 2]]",
        "ProcessID": 2319
      },
      {
        "Cycles": 0,
        "Agent": "edu.brown.cs.systems.xtrace.logging.XTraceInit",
        "ProcessName": "Data",
        "TaskID": "4701A64B05292E2D",
        "ParentEventID": [
          "F6082779BFFB2794"
        ],
        "Label": "Thread.setName: DataXceiver for client DFSClient_NONMAPREDUCE_778905418_1 at /139.19.171.63:43130 [Sending block BP-1633380353-139.19.171.63-1554193446451:blk_1073762099_21275]",
        "Title": "X-Trace Task",
        "Host": "pinky19.mpi-sws.org",
        "HRT": 26962499108685758,
        "Timestamp": "1557746139048.971924",
        "TenantClass": 0,
        "Source": "DataXceiver.java:168",
        "ThreadID": 36633,
        "ThreadName": "",
        "EventID": "38059A22C31E7113",
        "BaggageBytes": "[[248 5] [240 0] [0 71 1 166 75 5 41 46 45] [240 1] [0 246 8 39 121 191 251 39 148] [240 3] [0 2]]",
        "ProcessID": 2319
      },
      {
        "Cycles": 0,
        "Agent": "Execution-Sleep",
        "ProcessName": "Read",
        "TaskID": "4701A64B05292E2D",
        "ParentEventID": [
          "EF9A59CA865D09F9"
        ],
        "Label": "waited",
        "Title": "X-Trace Task",
        "Host": "pinky19.mpi-sws.org",
        "Duration": "254634",
        "HRT": 26962499108836248,
        "Operation": "waited",
        "Timestamp": "1557746139049.105713",
        "TenantClass": 0,
        "Source": "SocketIOWithTimeout.java:335",
        "ThreadID": 1,
        "ThreadName": "",
        "EventID": "C8870116B01A8EDB",
        "ProcessID": 36430
      },
      {
        "Cycles": 0,
        "Agent": "edu.brown.cs.systems.xtrace.logging.BaggageWrappers",
        "ProcessName": "Data",
        "TaskID": "4701A64B05292E2D",
        "ParentEventID": [
          "546561CAAA74B0CA"
        ],
        "Label": "Forking current baggage with Baggage.fork()",
        "Title": "X-Trace Task",
        "Host": "pinky19.mpi-sws.org",
        "HRT": 26962499108841090,
        "Operation": "fork",
        "Timestamp": "1557746139049.127441",
        "TenantClass": 0,
        "Source": "PacketHeader.java:95",
        "ThreadID": 36633,
        "ThreadName": "",
        "EventID": "B01B505C24D4E3F1",
        "BaggageBytes": "[[248 5] [240 0] [0 71 1 166 75 5 41 46 45] [240 1] [0 84 101 97 202 170 116 176 202] [240 3] [0 2]]",
        "ProcessID": 2319
      },
      {
        "Cycles": 0,
        "Agent": "Execution-Sleep",
        "ProcessName": "Data",
        "TaskID": "4701A64B05292E2D",
        "ParentEventID": [
          "B01B505C24D4E3F1"
        ],
        "Label": "waited",
        "Title": "X-Trace Task",
        "Host": "pinky19.mpi-sws.org",
        "Duration": "4132",
        "HRT": 26962499108903251,
        "Operation": "waited",
        "Timestamp": "1557746139049.189453",
        "TenantClass": 0,
        "Source": "SocketIOWithTimeout.java:335",
        "ThreadID": 36633,
        "ThreadName": "",
        "EventID": "214BFA5A5450CFCB",
        "BaggageBytes": "[[248 5] [240 0] [0 71 1 166 75 5 41 46 45] [240 1] [0 176 27 80 92 36 212 227 241] [240 3] [0 2]]",
        "ProcessID": 2319
      },
      {
        "Cycles": 0,
        "Agent": "edu.brown.cs.systems.xtrace.logging.BaggageWrappers",
        "ProcessName": "Read",
        "TaskID": "4701A64B05292E2D",
        "ParentEventID": [
          "C8870116B01A8EDB",
          "546561CAAA74B0CA"
        ],
        "Label": "Merged current baggage with other baggage",
        "Title": "X-Trace Task",
        "Host": "pinky19.mpi-sws.org",
        "HRT": 26962499108917896,
        "Operation": "join",
        "Timestamp": "1557746139049.187256",
        "TenantClass": 0,
        "Source": "RemoteBlockReader2.java:429",
        "ThreadID": 1,
        "ThreadName": "",
        "EventID": "61497D31258E3EF8",
        "ProcessID": 36430
      },
      {
        "Cycles": 0,
        "Agent": "edu.brown.cs.systems.xtrace.logging.BaggageWrappers",
        "ProcessName": "Read",
        "TaskID": "4701A64B05292E2D",
        "ParentEventID": [
          "B01B505C24D4E3F1",
          "61497D31258E3EF8"
        ],
        "Label": "Merged current baggage with other baggage",
        "Title": "X-Trace Task",
        "Host": "pinky19.mpi-sws.org",
        "HRT": 26962499109017553,
        "Operation": "join",
        "Timestamp": "1557746139049.286865",
        "TenantClass": 0,
        "Source": "PacketHeader.java:168",
        "ThreadID": 1,
        "ThreadName": "",
        "EventID": "9C5E45E746D316AD",
        "ProcessID": 36430
      },
      {
        "Cycles": 0,
        "Agent": "edu.brown.cs.systems.xtrace.logging.BaggageWrappers",
        "ProcessName": "Data",
        "TaskID": "4701A64B05292E2D",
        "ParentEventID": [
          "214BFA5A5450CFCB"
        ],
        "Label": "Forking current baggage with Baggage.fork()",
        "Title": "X-Trace Task",
        "Host": "pinky19.mpi-sws.org",
        "HRT": 26962499108970097,
        "Operation": "fork",
        "Timestamp": "1557746139049.256348",
        "TenantClass": 0,
        "Source": "PacketHeader.java:95",
        "ThreadID": 36633,
        "ThreadName": "",
        "EventID": "70C364EF56A627EA",
        "BaggageBytes": "[[248 5] [240 0] [0 71 1 166 75 5 41 46 45] [240 1] [0 33 75 250 90 84 80 207 203] [240 3] [0 2]]",
        "ProcessID": 2319
      },
      {
        "Cycles": 0,
        "Agent": "edu.brown.cs.systems.xtrace.logging.BaggageWrappers",
        "ProcessName": "Read",
        "TaskID": "4701A64B05292E2D",
        "ParentEventID": [
          "9C5E45E746D316AD",
          "70C364EF56A627EA"
        ],
        "Label": "Merged current baggage with other baggage",
        "Title": "X-Trace Task",
        "Host": "pinky19.mpi-sws.org",
        "HRT": 26962499109105070,
        "Operation": "join",
        "Timestamp": "1557746139049.374512",
        "TenantClass": 0,
        "Source": "PacketHeader.java:168",
        "ThreadID": 1,
        "ThreadName": "",
        "EventID": "CF1BBE501309BBA2",
        "ProcessID": 36430
      },
      {
        "Cycles": 0,
        "Agent": "Execution-Sleep",
        "ProcessName": "Data",
        "TaskID": "4701A64B05292E2D",
        "ParentEventID": [
          "70C364EF56A627EA"
        ],
        "Label": "waited",
        "Title": "X-Trace Task",
        "Host": "pinky19.mpi-sws.org",
        "Duration": "114839",
        "HRT": 26962499109165277,
        "Operation": "waited",
        "Timestamp": "1557746139049.451416",
        "TenantClass": 0,
        "Source": "SocketIOWithTimeout.java:335",
        "ThreadID": 36633,
        "ThreadName": "",
        "EventID": "D2EAD28A4FF1FE34",
        "BaggageBytes": "[[248 5] [240 0] [0 71 1 166 75 5 41 46 45] [240 1] [0 112 195 100 239 86 166 39 234] [240 3] [0 2]]",
        "ProcessID": 2319
      },
      {
        "Cycles": 0,
        "Agent": "edu.brown.cs.systems.xtrace.logging.BaggageWrappers",
        "ProcessName": "Data",
        "TaskID": "4701A64B05292E2D",
        "ParentEventID": [
          "D2EAD28A4FF1FE34",
          "F45623F7828790E2"
        ],
        "Label": "Merged current baggage with other baggage",
        "Title": "X-Trace Task",
        "Host": "pinky19.mpi-sws.org",
        "HRT": 26962499109218082,
        "Operation": "join",
        "Timestamp": "1557746139049.504395",
        "TenantClass": 0,
        "Source": "DataXceiver.java:574",
        "ThreadID": 36633,
        "ThreadName": "",
        "EventID": "4573C2F20455D36B",
        "BaggageBytes": "[[248 5] [240 0] [0 71 1 166 75 5 41 46 45] [240 1] [0 210 234 210 138 79 241 254 52] [0 244 86 35 247 130 135 144 226] [240 3] [0 2]]",
        "ProcessID": 2319
      },
      {
        "Cycles": 0,
        "Agent": "Execution-CPU",
        "ProcessName": "Data",
        "TaskID": "4701A64B05292E2D",
        "ParentEventID": [
          "4573C2F20455D36B"
        ],
        "Label": "unset",
        "Title": "X-Trace Task",
        "Host": "pinky19.mpi-sws.org",
        "Duration": "569622",
        "HRT": 26962499109238642,
        "Operation": "unset",
        "Timestamp": "1557746139049.524902",
        "TenantClass": 0,
        "Source": "DataXceiver.java:261",
        "ThreadID": 36633,
        "ThreadName": "",
        "EventID": "30B7C9F938DCB040",
        "BaggageBytes": "[[248 5] [240 0] [0 71 1 166 75 5 41 46 45] [240 1] [0 69 115 194 242 4 85 211 107] [240 3] [0 2]]",
        "ProcessID": 2319
      },
      {
        "Cycles": 0,
        "Agent": "edu.brown.cs.systems.xtrace.logging.BaggageWrappers",
        "ProcessName": "Read",
        "TaskID": "4701A64B05292E2D",
        "ParentEventID": [
          "CF1BBE501309BBA2"
        ],
        "Label": "Forking current baggage with Baggage.fork()",
        "Title": "X-Trace Task",
        "Host": "pinky19.mpi-sws.org",
        "HRT": 26962499109116977,
        "Operation": "fork",
        "Timestamp": "1557746139049.386230",
        "TenantClass": 0,
        "Source": "RemoteBlockReader2.java:361",
        "ThreadID": 1,
        "ThreadName": "",
        "EventID": "F45623F7828790E2",
        "ProcessID": 36430
      },
      {
        "Cycles": 0,
        "Agent": "edu.brown.cs.systems.retro.benchmarks.hdfs_client.Reader",
        "ProcessName": "Read",
        "TaskID": "4701A64B05292E2D",
        "ParentEventID": [
          "0"
        ],
        "Label": "Reading file",
        "Title": "X-Trace Task",
        "Host": "pinky19.mpi-sws.org",
        "HRT": 26962499107634448,
        "Timestamp": "1557746139047.903809",
        "TenantClass": 0,
        "ThreadID": 1,
        "ThreadName": "",
        "EventID": "C97469DE64F63D7A",
        "ProcessID": 36430,
        "Tag": [
          "reader_10kb",
          "Read Size: 10240"
        ]
      }
    ]
  }
]