[
  {
    "id": "1727041D9D9B5F0F",
    "reports": [
      {
        "Cycles": 0,
        "Agent": "Execution-CPU",
        "ProcessName": "Read",
        "TaskID": "1727041D9D9B5F0F",
        "ParentEventID": [
          "15D10FF4C16400DA"
        ],
        "Label": "unset",
        "Title": "X-Trace Task",
        "Host": "pinky19.mpi-sws.org",
        "Duration": "22026689",
        "HRT": 26962595314263437,
        "Operation": "unset",
        "Timestamp": "1557746235254.778564",
        "TenantClass": 0,
        "Source": "Client.java:1027",
        "ThreadID": 1,
        "ThreadName": "",
        "EventID": "CAA02329A96E6D41",
        "ProcessID": 36430
      },
      {
        "Cycles": 0,
        "Agent": "Execution-CPU",
        "ProcessName": "Read",
        "TaskID": "1727041D9D9B5F0F",
        "ParentEventID": [
          "CAA02329A96E6D41"
        ],
        "Label": "set",
        "Title": "X-Trace Task",
        "Host": "pinky19.mpi-sws.org",
        "HRT": 26962595314305698,
        "Operation": "set",
        "Timestamp": "1557746235254.820801",
        "TenantClass": 0,
        "Source": "Client.java:1032",
        "ThreadID": 41,
        "ThreadName": "",
        "EventID": "4F6FF579C1A9F734",
        "ProcessID": 36430
      },
      {
        "Cycles": 0,
        "Agent": "edu.brown.cs.systems.xtrace.logging.BaggageWrappers",
        "ProcessName": "Read",
        "TaskID": "1727041D9D9B5F0F",
        "ParentEventID": [
          "4F6FF579C1A9F734"
        ],
        "Label": "Forking current baggage with Baggage.fork()",
        "Title": "X-Trace Task",
        "Host": "pinky19.mpi-sws.org",
        "HRT": 26962595314324486,
        "Operation": "fork",
        "Timestamp": "1557746235254.839600",
        "TenantClass": 0,
        "Source": "Client.java:1043",
        "ThreadID": 41,
        "ThreadName": "",
        "EventID": "923CDD9AAED45C9A",
        "ProcessID": 36430
      },
      {
        "Cycles": 0,
        "Agent": "edu.brown.cs.systems.retro.benchmarks.hdfs_client.Reader",
        "ProcessName": "Read",
        "TaskID": "1727041D9D9B5F0F",
        "ParentEventID": [
          "0"
        ],
        "Label": "Reading file",
        "Title": "X-Trace Task",
        "Host": "pinky19.mpi-sws.org",
        "HRT": 26962595314204725,
        "Timestamp": "1557746235254.719971",
        "TenantClass": 0,
        "ThreadID": 1,
        "ThreadName": "",
        "EventID": "33748CB69C3EC774",
        "ProcessID": 36430,
        "Tag": [
          "reader_10kb",
          "Read Size: 10240"
        ]
      },
      {
        "Cycles": 0,
        "Agent": "org.apache.hadoop.ipc.ProtobufRpcEngine",
        "ProcessName": "Read",
        "TaskID": "1727041D9D9B5F0F",
        "ParentEventID": [
          "505BB5A5957A62F5"
        ],
        "Label": "Invoking org.apache.hadoop.hdfs.protocol.ClientProtocol.getBlockLocations",
        "Title": "X-Trace Task",
        "Host": "pinky19.mpi-sws.org",
        "HRT": 26962595314244830,
        "Timestamp": "1557746235254.760010",
        "TenantClass": 0,
        "Source": "ProtobufRpcEngine.java:228",
        "ThreadID": 1,
        "ThreadName": "",
        "EventID": "15D10FF4C16400DA",
        "ProcessID": 36430
      },
      {
        "Cycles": 0,
        "Agent": "Execution-CPU",
        "ProcessName": "Read",
        "TaskID": "1727041D9D9B5F0F",
        "ParentEventID": [
          "923CDD9AAED45C9A"
        ],
        "Label": "unset",
        "Title": "X-Trace Task",
        "Host": "pinky19.mpi-sws.org",
        "Duration": "65922",
        "HRT": 26962595314389992,
        "Operation": "unset",
        "Timestamp": "1557746235254.905029",
        "TenantClass": 0,
        "Source": "Client.java:1062",
        "ThreadID": 41,
        "ThreadName": "",
        "EventID": "FDADA7F34CD3F628",
        "ProcessID": 36430
      },
      {
        "Cycles": 0,
        "Agent": "Execution-CPU",
        "ProcessName": "Read",
        "TaskID": "1727041D9D9B5F0F",
        "ParentEventID": [
          "FDADA7F34CD3F628"
        ],
        "Label": "set",
        "Title": "X-Trace Task",
        "Host": "pinky19.mpi-sws.org",
        "HRT": 26962595314412200,
        "Operation": "set",
        "Timestamp": "1557746235254.927246",
        "TenantClass": 0,
        "Source": "Client.java:1104",
        "ThreadID": 1,
        "ThreadName": "",
        "EventID": "107FE23C86102DBE",
        "ProcessID": 36430
      },
      {
        "Cycles": 0,
        "Agent": "Execution-CPU",
        "ProcessName": "Name",
        "TaskID": "1727041D9D9B5F0F",
        "ParentEventID": [
          "923CDD9AAED45C9A"
        ],
        "Label": "set",
        "Title": "X-Trace Task",
        "Host": "pinky19.mpi-sws.org",
        "HRT": 26962595314470671,
        "Operation": "set",
        "Timestamp": "1557746235255.002686",
        "TenantClass": 0,
        "Source": "Server.java:1840",
        "ThreadID": 48,
        "ThreadName": "",
        "EventID": "EC427A299DCB3D81",
        "BaggageBytes": "[[248 5] [240 0] [0 23 39 4 29 157 155 95 15] [240 1] [0 146 60 221 154 174 212 92 154] [240 3] [0 2]]",
        "ProcessID": 2171
      },
      {
        "Cycles": 0,
        "Agent": "edu.brown.cs.systems.xtrace.logging.BaggageWrappers",
        "ProcessName": "Name",
        "TaskID": "1727041D9D9B5F0F",
        "ParentEventID": [
          "EC427A299DCB3D81"
        ],
        "Label": "Forking current baggage with Baggage.fork()",
        "Title": "X-Trace Task",
        "Host": "pinky19.mpi-sws.org",
        "HRT": 26962595314505812,
        "Operation": "fork",
        "Timestamp": "1557746235255.037842",
        "TenantClass": 0,
        "Source": "Server.java:550",
        "ThreadID": 48,
        "ThreadName": "",
        "EventID": "EE512EE17A859ED0",
        "BaggageBytes": "[[248 5] [240 0] [0 23 39 4 29 157 155 95 15] [240 1] [0 236 66 122 41 157 203 61 129] [240 3] [0 2]]",
        "ProcessID": 2171
      },
      {
        "Cycles": 0,
        "Agent": "Execution-CPU",
        "ProcessName": "Name",
        "TaskID": "1727041D9D9B5F0F",
        "ParentEventID": [
          "EE512EE17A859ED0"
        ],
        "Label": "set",
        "Title": "X-Trace Task",
        "Host": "pinky19.mpi-sws.org",
        "HRT": 26962595314537951,
        "Operation": "set",
        "Timestamp": "1557746235255.070068",
        "TenantClass": 0,
        "Source": "Server.java:2071",
        "ThreadID": 63,
        "ThreadName": "",
        "EventID": "FBA6C7BF8E676DBB",
        "BaggageBytes": "[[248 5] [240 0] [0 23 39 4 29 157 155 95 15] [240 1] [0 238 81 46 225 122 133 158 208] [240 3] [0 2]]",
        "ProcessID": 2171
      },
      {
        "Cycles": 0,
        "Agent": "Execution-CPU",
        "ProcessName": "Name",
        "TaskID": "1727041D9D9B5F0F",
        "ParentEventID": [
          "EE512EE17A859ED0"
        ],
        "Label": "unset",
        "Title": "X-Trace Task",
        "Host": "pinky19.mpi-sws.org",
        "Duration": "26614",
        "HRT": 26962595314528345,
        "Operation": "unset",
        "Timestamp": "1557746235255.060547",
        "TenantClass": 0,
        "Source": "Server.java:1828",
        "ThreadID": 48,
        "ThreadName": "",
        "EventID": "555E82C4A9AFCEFC",
        "BaggageBytes": "[[248 5] [240 0] [0 23 39 4 29 157 155 95 15] [240 1] [0 238 81 46 225 122 133 158 208] [240 3] [0 2]]",
        "ProcessID": 2171
      },
      {
        "Cycles": 0,
        "Agent": "org.apache.hadoop.ipc.Server",
        "ProcessName": "Name",
        "TaskID": "1727041D9D9B5F0F",
        "ParentEventID": [
          "FBA6C7BF8E676DBB"
        ],
        "Label": "getBlockLocations in org.apache.hadoop.hdfs.protocol.ClientProtocol",
        "Title": "X-Trace Task",
        "Host": "pinky19.mpi-sws.org",
        "HRT": 26962595314571907,
        "Timestamp": "1557746235255.104004",
        "TenantClass": 0,
        "Source": "ProtobufRpcEngine.java:601",
        "ThreadID": 63,
        "ThreadName": "",
        "EventID": "022C3528711CC20D",
        "BaggageBytes": "[[248 5] [240 0] [0 23 39 4 29 157 155 95 15] [240 1] [0 251 166 199 191 142 103 109 187] [240 3] [0 2]]",
        "ProcessID": 2171
      },
      {
        "Cycles": 0,
        "Agent": "org.apache.hadoop.hdfs.server.namenode.FSNamesystem.audit",
        "ProcessName": "Name",
        "TaskID": "1727041D9D9B5F0F",
        "ParentEventID": [
          "022C3528711CC20D"
        ],
        "Label": "allowed=true\tugi=plascas (auth:SIMPLE)\tip=/139.19.171.63\tcmd=open\tsrc=/ds/vF75rfS6e0RNGIuL\tdst=null\tperm=null\tproto=rpc",
        "Title": "X-Trace Task",
        "Host": "pinky19.mpi-sws.org",
        "HRT": 26962595314619813,
        "Timestamp": "1557746235255.151855",
        "TenantClass": 0,
        "Source": "FSNamesystem.java:8313",
        "ThreadID": 63,
        "ThreadName": "",
        "EventID": "3987AE058FB71A51",
        "BaggageBytes": "[[248 5] [240 0] [0 23 39 4 29 157 155 95 15] [240 1] [0 2 44 53 40 113 28 194 13] [240 3] [0 2]]",
        "ProcessID": 2171
      },
      {
        "Cycles": 0,
        "Agent": "Execution-CPU",
        "ProcessName": "Name",
        "TaskID": "1727041D9D9B5F0F",
        "ParentEventID": [
          "56053E74564CFDC4"
        ],
        "Label": "unset",
        "Title": "X-Trace Task",
        "Host": "pinky19.mpi-sws.org",
        "Duration": "209753",
        "HRT": 26962595314769659,
        "Operation": "unset",
        "Timestamp": "1557746235255.301758",
        "TenantClass": 0,
        "Source": "Server.java:1058",
        "ThreadID": 63,
        "ThreadName": "",
        "EventID": "CF54B24D2F8B85BC",
        "BaggageBytes": "[[248 5] [240 0] [0 23 39 4 29 157 155 95 15] [240 1] [0 86 5 62 116 86 76 253 196] [240 3] [0 2]]",
        "ProcessID": 2171
      },
      {
        "Cycles": 0,
        "Agent": "edu.brown.cs.systems.xtrace.logging.BaggageWrappers",
        "ProcessName": "Name",
        "TaskID": "1727041D9D9B5F0F",
        "ParentEventID": [
          "3987AE058FB71A51"
        ],
        "Label": "Forking current baggage with Baggage.fork()",
        "Title": "X-Trace Task",
        "Host": "pinky19.mpi-sws.org",
        "HRT": 26962595314662587,
        "Operation": "fork",
        "Timestamp": "1557746235255.194824",
        "TenantClass": 0,
        "Source": "Server.java:2398",
        "ThreadID": 63,
        "ThreadName": "",
        "EventID": "56053E74564CFDC4",
        "BaggageBytes": "[[248 5] [240 0] [0 23 39 4 29 157 155 95 15] [240 1] [0 57 135 174 5 143 183 26 81] [240 3] [0 2]]",
        "ProcessID": 2171
      },
      {
        "Cycles": 0,
        "Agent": "Execution-CPU",
        "ProcessName": "Read",
        "TaskID": "1727041D9D9B5F0F",
        "ParentEventID": [
          "56053E74564CFDC4"
        ],
        "Label": "set",
        "Title": "X-Trace Task",
        "Host": "pinky19.mpi-sws.org",
        "HRT": 26962595314843072,
        "Operation": "set",
        "Timestamp": "1557746235255.358154",
        "TenantClass": 0,
        "Source": "Client.java:302",
        "ThreadID": 37,
        "ThreadName": "",
        "EventID": "5AD32BDE35D593CE",
        "ProcessID": 36430
      },
      {
        "Cycles": 0,
        "Agent": "Execution-CPU",
        "ProcessName": "Read",
        "TaskID": "1727041D9D9B5F0F",
        "ParentEventID": [
          "5AD32BDE35D593CE"
        ],
        "Label": "unset",
        "Title": "X-Trace Task",
        "Host": "pinky19.mpi-sws.org",
        "Duration": "5142",
        "HRT": 26962595314864903,
        "Operation": "unset",
        "Timestamp": "1557746235255.380127",
        "TenantClass": 0,
        "Source": "Client.java:1168",
        "ThreadID": 37,
        "ThreadName": "",
        "EventID": "01FC8678A114DCC6",
        "ProcessID": 36430
      },
      {
        "Cycles": 0,
        "Agent": "Execution-Sleep",
        "ProcessName": "Read",
        "TaskID": "1727041D9D9B5F0F",
        "ParentEventID": [
          "107FE23C86102DBE"
        ],
        "Label": "waited",
        "Title": "X-Trace Task",
        "Host": "pinky19.mpi-sws.org",
        "Duration": "452651",
        "HRT": 26962595314884155,
        "Operation": "waited",
        "Timestamp": "1557746235255.399414",
        "TenantClass": 0,
        "Source": "Client.java:1537",
        "ThreadID": 1,
        "ThreadName": "",
        "EventID": "BD04218438DABD93",
        "ProcessID": 36430
      },
      {
        "Cycles": 0,
        "Agent": "org.apache.hadoop.ipc.ProtobufRpcEngine",
        "ProcessName": "Read",
        "TaskID": "1727041D9D9B5F0F",
        "ParentEventID": [
          "9DBDCCF0B2B296AE"
        ],
        "Label": "org.apache.hadoop.hdfs.protocol.ClientProtocol.getBlockLocations completed",
        "Title": "X-Trace Task",
        "Host": "pinky19.mpi-sws.org",
        "HRT": 26962595314933285,
        "Timestamp": "1557746235255.448486",
        "TenantClass": 0,
        "Source": "ProtobufRpcEngine.java:275",
        "ThreadID": 1,
        "ThreadName": "",
        "EventID": "98B6722651C92F60",
        "ProcessID": 36430
      },
      {
        "Cycles": 0,
        "Agent": "edu.brown.cs.systems.xtrace.logging.BaggageWrappers",
        "ProcessName": "Read",
        "TaskID": "1727041D9D9B5F0F",
        "ParentEventID": [
          "BD04218438DABD93",
          "01FC8678A114DCC6"
        ],
        "Label": "Merged current baggage with other baggage",
        "Title": "X-Trace Task",
        "Host": "pinky19.mpi-sws.org",
        "HRT": 26962595314898774,
        "Operation": "join",
        "Timestamp": "1557746235255.413818",
        "TenantClass": 0,
        "Source": "Client.java:1545",
        "ThreadID": 1,
        "ThreadName": "",
        "EventID": "9DBDCCF0B2B296AE",
        "ProcessID": 36430
      },
      {
        "Cycles": 0,
        "Agent": "edu.brown.cs.systems.xtrace.logging.BaggageWrappers",
        "ProcessName": "Read",
        "TaskID": "1727041D9D9B5F0F",
        "ParentEventID": [
          "98B6722651C92F60"
        ],
        "Label": "Forking current baggage with Baggage.fork()",
        "Title": "X-Trace Task",
        "Host": "pinky19.mpi-sws.org",
        "HRT": 26962595314983501,
        "Operation": "fork",
        "Timestamp": "1557746235255.498535",
        "TenantClass": 0,
        "Source": "DataTransferProtoUtil.java:94",
        "ThreadID": 1,
        "ThreadName": "",
        "EventID": "C8A077D535D7FF15",
        "ProcessID": 36430
      },
      {
        "Cycles": 0,
        "Agent": "Execution-CPU",
        "ProcessName": "Data",
        "TaskID": "1727041D9D9B5F0F",
        "ParentEventID": [
          "C8A077D535D7FF15"
        ],
        "Label": "set",
        "Title": "X-Trace Task",
        "Host": "pinky20.mpi-sws.org",
        "HRT": 6565799674265143,
        "Operation": "set",
        "Timestamp": "1557746235255.823242",
        "TenantClass": 0,
        "Source": "Receiver.java:117",
        "ThreadID": 14317,
        "ThreadName": "",
        "EventID": "D350399B42F5080F",
        "BaggageBytes": "[[248 5] [240 0] [0 23 39 4 29 157 155 95 15] [240 1] [0 200 160 119 213 53 215 255 21] [240 3] [0 2]]",
        "ProcessID": 13111
      },
      {
        "Cycles": 0,
        "Agent": "edu.brown.cs.systems.xtrace.logging.BaggageWrappers",
        "ProcessName": "Data",
        "TaskID": "1727041D9D9B5F0F",
        "ParentEventID": [
          "7FB7408BF33C0685"
        ],
        "Label": "Forking current baggage with Baggage.fork()",
        "Title": "X-Trace Task",
        "Host": "pinky20.mpi-sws.org",
        "HRT": 6565799674604911,
        "Operation": "fork",
        "Timestamp": "1557746235256.163086",
        "TenantClass": 0,
        "Source": "DataXceiver.java:1257",
        "ThreadID": 14317,
        "ThreadName": "",
        "EventID": "9EACC5804182A48E",
        "BaggageBytes": "[[248 5] [240 0] [0 23 39 4 29 157 155 95 15] [240 1] [0 127 183 64 139 243 60 6 133] [240 3] [0 2]]",
        "ProcessID": 13111
      },
      {
        "Cycles": 0,
        "Agent": "edu.brown.cs.systems.xtrace.logging.XTraceInit",
        "ProcessName": "Data",
        "TaskID": "1727041D9D9B5F0F",
        "ParentEventID": [
          "D350399B42F5080F"
        ],
        "Label": "Thread.setName: DataXceiver for client DFSClient_NONMAPREDUCE_778905418_1 at /139.19.171.63:39908 [Sending block BP-1633380353-139.19.171.63-1554193446451:blk_1073765188_24364]",
        "Title": "X-Trace Task",
        "Host": "pinky20.mpi-sws.org",
        "HRT": 6565799674365190,
        "Timestamp": "1557746235255.923340",
        "TenantClass": 0,
        "Source": "DataXceiver.java:168",
        "ThreadID": 14317,
        "ThreadName": "",
        "EventID": "7FB7408BF33C0685",
        "BaggageBytes": "[[248 5] [240 0] [0 23 39 4 29 157 155 95 15] [240 1] [0 211 80 57 155 66 245 8 15] [240 3] [0 2]]",
        "ProcessID": 13111
      },
      {
        "Cycles": 0,
        "Agent": "Execution-Sleep",
        "ProcessName": "Read",
        "TaskID": "1727041D9D9B5F0F",
        "ParentEventID": [
          "C8A077D535D7FF15"
        ],
        "Label": "waited",
        "Title": "X-Trace Task",
        "Host": "pinky19.mpi-sws.org",
        "Duration": "756922",
        "HRT": 26962595315810565,
        "Operation": "waited",
        "Timestamp": "1557746235256.325684",
        "TenantClass": 0,
        "Source": "SocketIOWithTimeout.java:335",
        "ThreadID": 1,
        "ThreadName": "",
        "EventID": "04DB1C75BC3FB8FA",
        "ProcessID": 36430
      },
      {
        "Cycles": 0,
        "Agent": "edu.brown.cs.systems.xtrace.logging.BaggageWrappers",
        "ProcessName": "Data",
        "TaskID": "1727041D9D9B5F0F",
        "ParentEventID": [
          "9EACC5804182A48E"
        ],
        "Label": "Forking current baggage with Baggage.fork()",
        "Title": "X-Trace Task",
        "Host": "pinky20.mpi-sws.org",
        "HRT": 6565799674765767,
        "Operation": "fork",
        "Timestamp": "1557746235256.323975",
        "TenantClass": 0,
        "Source": "PacketHeader.java:95",
        "ThreadID": 14317,
        "ThreadName": "",
        "EventID": "7E477A3B5CE7E413",
        "BaggageBytes": "[[248 5] [240 0] [0 23 39 4 29 157 155 95 15] [240 1] [0 158 172 197 128 65 130 164 142] [240 3] [0 2]]",
        "ProcessID": 13111
      },
      {
        "Cycles": 0,
        "Agent": "edu.brown.cs.systems.xtrace.logging.BaggageWrappers",
        "ProcessName": "Read",
        "TaskID": "1727041D9D9B5F0F",
        "ParentEventID": [
          "9EACC5804182A48E",
          "04DB1C75BC3FB8FA"
        ],
        "Label": "Merged current baggage with other baggage",
        "Title": "X-Trace Task",
        "Host": "pinky19.mpi-sws.org",
        "HRT": 26962595315880326,
        "Operation": "join",
        "Timestamp": "1557746235256.395508",
        "TenantClass": 0,
        "Source": "RemoteBlockReader2.java:429",
        "ThreadID": 1,
        "ThreadName": "",
        "EventID": "1D8B6C73BB7B8E40",
        "ProcessID": 36430
      },
      {
        "Cycles": 0,
        "Agent": "Execution-Sleep",
        "ProcessName": "Read",
        "TaskID": "1727041D9D9B5F0F",
        "ParentEventID": [
          "1D8B6C73BB7B8E40"
        ],
        "Label": "waited",
        "Title": "X-Trace Task",
        "Host": "pinky19.mpi-sws.org",
        "Duration": "44584",
        "HRT": 26962595315965964,
        "Operation": "waited",
        "Timestamp": "1557746235256.481201",
        "TenantClass": 0,
        "Source": "SocketIOWithTimeout.java:335",
        "ThreadID": 1,
        "ThreadName": "",
        "EventID": "B562D4481779F5AB",
        "ProcessID": 36430
      },
      {
        "Cycles": 0,
        "Agent": "edu.brown.cs.systems.xtrace.logging.BaggageWrappers",
        "ProcessName": "Data",
        "TaskID": "1727041D9D9B5F0F",
        "ParentEventID": [
          "E7C5615DB3BF4D16"
        ],
        "Label": "Forking current baggage with Baggage.fork()",
        "Title": "X-Trace Task",
        "Host": "pinky20.mpi-sws.org",
        "HRT": 6565799675145741,
        "Operation": "fork",
        "Timestamp": "1557746235256.703857",
        "TenantClass": 0,
        "Source": "PacketHeader.java:95",
        "ThreadID": 14317,
        "ThreadName": "",
        "EventID": "2E02CE40DC8BFCB3",
        "BaggageBytes": "[[248 5] [240 0] [0 23 39 4 29 157 155 95 15] [240 1] [0 231 197 97 93 179 191 77 22] [240 3] [0 2]]",
        "ProcessID": 13111
      },
      {
        "Cycles": 0,
        "Agent": "Execution-Sleep",
        "ProcessName": "Read",
        "TaskID": "1727041D9D9B5F0F",
        "ParentEventID": [
          "B562D4481779F5AB"
        ],
        "Label": "waited",
        "Title": "X-Trace Task",
        "Host": "pinky19.mpi-sws.org",
        "Duration": "271538",
        "HRT": 26962595316299611,
        "Operation": "waited",
        "Timestamp": "1557746235256.814697",
        "TenantClass": 0,
        "Source": "SocketIOWithTimeout.java:335",
        "ThreadID": 1,
        "ThreadName": "",
        "EventID": "4F923C14B5AE4B64",
        "ProcessID": 36430
      },
      {
        "Cycles": 0,
        "Agent": "Execution-Sleep",
        "ProcessName": "Data",
        "TaskID": "1727041D9D9B5F0F",
        "ParentEventID": [
          "7E477A3B5CE7E413"
        ],
        "Label": "waited",
        "Title": "X-Trace Task",
        "Host": "pinky20.mpi-sws.org",
        "Duration": "11813",
        "HRT": 6565799674958634,
        "Operation": "waited",
        "Timestamp": "1557746235256.516846",
        "TenantClass": 0,
        "Source": "SocketIOWithTimeout.java:335",
        "ThreadID": 14317,
        "ThreadName": "",
        "EventID": "E7C5615DB3BF4D16",
        "BaggageBytes": "[[248 5] [240 0] [0 23 39 4 29 157 155 95 15] [240 1] [0 126 71 122 59 92 231 228 19] [240 3] [0 2]]",
        "ProcessID": 13111
      },
      {
        "Cycles": 0,
        "Agent": "edu.brown.cs.systems.xtrace.logging.BaggageWrappers",
        "ProcessName": "Read",
        "TaskID": "1727041D9D9B5F0F",
        "ParentEventID": [
          "4F923C14B5AE4B64",
          "7E477A3B5CE7E413"
        ],
        "Label": "Merged current baggage with other baggage",
        "Title": "X-Trace Task",
        "Host": "pinky19.mpi-sws.org",
        "HRT": 26962595316352528,
        "Operation": "join",
        "Timestamp": "1557746235256.867676",
        "TenantClass": 0,
        "Source": "PacketHeader.java:168",
        "ThreadID": 1,
        "ThreadName": "",
        "EventID": "F440698915C55A22",
        "ProcessID": 36430
      },
      {
        "Cycles": 0,
        "Agent": "edu.brown.cs.systems.xtrace.logging.BaggageWrappers",
        "ProcessName": "Read",
        "TaskID": "1727041D9D9B5F0F",
        "ParentEventID": [
          "8F76E60786A96724"
        ],
        "Label": "Forking current baggage with Baggage.fork()",
        "Title": "X-Trace Task",
        "Host": "pinky19.mpi-sws.org",
        "HRT": 26962595316411641,
        "Operation": "fork",
        "Timestamp": "1557746235256.926758",
        "TenantClass": 0,
        "Source": "RemoteBlockReader2.java:361",
        "ThreadID": 1,
        "ThreadName": "",
        "EventID": "2CB62A6EF29EBC97",
        "ProcessID": 36430
      },
      {
        "Cycles": 0,
        "Agent": "edu.brown.cs.systems.xtrace.logging.BaggageWrappers",
        "ProcessName": "Read",
        "TaskID": "1727041D9D9B5F0F",
        "ParentEventID": [
          "2E02CE40DC8BFCB3",
          "F440698915C55A22"
        ],
        "Label": "Merged current baggage with other baggage",
        "Title": "X-Trace Task",
        "Host": "pinky19.mpi-sws.org",
        "HRT": 26962595316403039,
        "Operation": "join",
        "Timestamp": "1557746235256.918213",
        "TenantClass": 0,
        "Source": "PacketHeader.java:168",
        "ThreadID": 1,
        "ThreadName": "",
        "EventID": "8F76E60786A96724",
        "ProcessID": 36430
      },
      {
        "Cycles": 0,
        "Agent": "Execution-Sleep",
        "ProcessName": "Data",
        "TaskID": "1727041D9D9B5F0F",
        "ParentEventID": [
          "2E02CE40DC8BFCB3"
        ],
        "Label": "waited",
        "Title": "X-Trace Task",
        "Host": "pinky20.mpi-sws.org",
        "Duration": "78060",
        "HRT": 6565799675458852,
        "Operation": "waited",
        "Timestamp": "1557746235257.017090",
        "TenantClass": 0,
        "Source": "SocketIOWithTimeout.java:335",
        "ThreadID": 14317,
        "ThreadName": "",
        "EventID": "0403CB0AD89BA3C6",
        "BaggageBytes": "[[248 5] [240 0] [0 23 39 4 29 157 155 95 15] [240 1] [0 46 2 206 64 220 139 252 179] [240 3] [0 2]]",
        "ProcessID": 13111
      },
      {
        "Cycles": 0,
        "Agent": "Execution-CPU",
        "ProcessName": "Data",
        "TaskID": "1727041D9D9B5F0F",
        "ParentEventID": [
          "2767F974DD77958A"
        ],
        "Label": "unset",
        "Title": "X-Trace Task",
        "Host": "pinky20.mpi-sws.org",
        "Duration": "1295822",
        "HRT": 6565799675632905,
        "Operation": "unset",
        "Timestamp": "1557746235257.191162",
        "TenantClass": 0,
        "Source": "DataXceiver.java:261",
        "ThreadID": 14317,
        "ThreadName": "",
        "EventID": "F2355CDF08A1F3B5",
        "BaggageBytes": "[[248 5] [240 0] [0 23 39 4 29 157 155 95 15] [240 1] [0 39 103 249 116 221 119 149 138] [240 3] [0 2]]",
        "ProcessID": 13111
      },
      {
        "Cycles": 0,
        "Agent": "edu.brown.cs.systems.xtrace.logging.BaggageWrappers",
        "ProcessName": "Data",
        "TaskID": "1727041D9D9B5F0F",
        "ParentEventID": [
          "0403CB0AD89BA3C6",
          "2CB62A6EF29EBC97"
        ],
        "Label": "Merged current baggage with other baggage",
        "Title": "X-Trace Task",
        "Host": "pinky20.mpi-sws.org",
        "HRT": 6565799675582748,
        "Operation": "join",
        "Timestamp": "1557746235257.140869",
        "TenantClass": 0,
        "Source": "DataXceiver.java:574",
        "ThreadID": 14317,
        "ThreadName": "",
        "EventID": "2767F974DD77958A",
        "BaggageBytes": "[[248 5] [240 0] [0 23 39 4 29 157 155 95 15] [240 1] [0 4 3 203 10 216 155 163 198] [0 44 182 42 110 242 158 188 151] [240 3] [0 2]]",
        "ProcessID": 13111
      },
      {
        "Cycles": 0,
        "Agent": "edu.brown.cs.systems.retro.benchmarks.hdfs_client.Reader",
        "ProcessName": "Read",
        "TaskID": "1727041D9D9B5F0F",
        "ParentEventID": [
          "33748CB69C3EC774"
        ],
        "Label": "Reading file",
        "Title": "X-Trace Task",
        "Host": "pinky19.mpi-sws.org",
        "HRT": 26962595314220212,
        "Timestamp": "1557746235254.735352",
        "TenantClass": 0,
        "ThreadID": 1,
        "ThreadName": "",
        "EventID": "505BB5A5957A62F5",
        "ProcessID": 36430
      }
    ]
  }
]