[
  {
    "id": "E413872FA3A24057",
    "reports": [
      {
        "Cycles": 0,
        "Agent": "Execution-CPU",
        "ProcessName": "Read",
        "TaskID": "E413872FA3A24057",
        "ParentEventID": [
          "4E19C58B8D278C41"
        ],
        "Label": "unset",
        "Title": "X-Trace Task",
        "Host": "pinky19.mpi-sws.org",
        "Duration": "22156048",
        "HRT": 26962649027424005,
        "Operation": "unset",
        "Timestamp": "1557746288967.703857",
        "TenantClass": 0,
        "Source": "Client.java:1027",
        "ThreadID": 1,
        "ThreadName": "",
        "EventID": "D352BA13DEC48219",
        "ProcessID": 36430
      },
      {
        "Cycles": 0,
        "Agent": "org.apache.hadoop.ipc.ProtobufRpcEngine",
        "ProcessName": "Read",
        "TaskID": "E413872FA3A24057",
        "ParentEventID": [
          "1FE1E29908D45F6C"
        ],
        "Label": "Invoking org.apache.hadoop.hdfs.protocol.ClientProtocol.getBlockLocations",
        "Title": "X-Trace Task",
        "Host": "pinky19.mpi-sws.org",
        "HRT": 26962649027410968,
        "Timestamp": "1557746288967.690674",
        "TenantClass": 0,
        "Source": "ProtobufRpcEngine.java:228",
        "ThreadID": 1,
        "ThreadName": "",
        "EventID": "4E19C58B8D278C41",
        "ProcessID": 36430
      },
      {
        "Cycles": 0,
        "Agent": "edu.brown.cs.systems.retro.benchmarks.hdfs_client.Reader",
        "ProcessName": "Read",
        "TaskID": "E413872FA3A24057",
        "ParentEventID": [
          "63E1D7D5AD5F6B7D"
        ],
        "Label": "Reading file",
        "Title": "X-Trace Task",
        "Host": "pinky19.mpi-sws.org",
        "HRT": 26962649027389625,
        "Timestamp": "1557746288967.669434",
        "TenantClass": 0,
        "ThreadID": 1,
        "ThreadName": "",
        "EventID": "1FE1E29908D45F6C",
        "ProcessID": 36430
      },
      {
        "Cycles": 0,
        "Agent": "edu.brown.cs.systems.xtrace.logging.BaggageWrappers",
        "ProcessName": "Read",
        "TaskID": "E413872FA3A24057",
        "ParentEventID": [
          "89F103956BAE681D"
        ],
        "Label": "Forking current baggage with Baggage.fork()",
        "Title": "X-Trace Task",
        "Host": "pinky19.mpi-sws.org",
        "HRT": 26962649027492024,
        "Operation": "fork",
        "Timestamp": "1557746288967.771729",
        "TenantClass": 0,
        "Source": "Client.java:1043",
        "ThreadID": 41,
        "ThreadName": "",
        "EventID": "584344640FF563C5",
        "ProcessID": 36430
      },
      {
        "Cycles": 0,
        "Agent": "Execution-CPU",
        "ProcessName": "Read",
        "TaskID": "E413872FA3A24057",
        "ParentEventID": [
          "D352BA13DEC48219"
        ],
        "Label": "set",
        "Title": "X-Trace Task",
        "Host": "pinky19.mpi-sws.org",
        "HRT": 26962649027469745,
        "Operation": "set",
        "Timestamp": "1557746288967.749512",
        "TenantClass": 0,
        "Source": "Client.java:1032",
        "ThreadID": 41,
        "ThreadName": "",
        "EventID": "89F103956BAE681D",
        "ProcessID": 36430
      },
      {
        "Cycles": 0,
        "Agent": "Execution-CPU",
        "ProcessName": "Read",
        "TaskID": "E413872FA3A24057",
        "ParentEventID": [
          "584344640FF563C5"
        ],
        "Label": "unset",
        "Title": "X-Trace Task",
        "Host": "pinky19.mpi-sws.org",
        "Duration": "79978",
        "HRT": 26962649027571009,
        "Operation": "unset",
        "Timestamp": "1557746288967.850830",
        "TenantClass": 0,
        "Source": "Client.java:1062",
        "ThreadID": 41,
        "ThreadName": "",
        "EventID": "2CAA1DA194426E2E",
        "ProcessID": 36430
      },
      {
        "Cycles": 0,
        "Agent": "Execution-CPU",
        "ProcessName": "Name",
        "TaskID": "E413872FA3A24057",
        "ParentEventID": [
          "584344640FF563C5"
        ],
        "Label": "set",
        "Title": "X-Trace Task",
        "Host": "pinky19.mpi-sws.org",
        "HRT": 26962649027621326,
        "Operation": "set",
        "Timestamp": "1557746288967.927002",
        "TenantClass": 0,
        "Source": "Server.java:1840",
        "ThreadID": 48,
        "ThreadName": "",
        "EventID": "E4B473E1E4F3C83D",
        "BaggageBytes": "[[248 5] [240 0] [0 228 19 135 47 163 162 64 87] [240 1] [0 88 67 68 100 15 245 99 197] [240 3] [0 2]]",
        "ProcessID": 2171
      },
      {
        "Cycles": 0,
        "Agent": "Execution-CPU",
        "ProcessName": "Read",
        "TaskID": "E413872FA3A24057",
        "ParentEventID": [
          "2CAA1DA194426E2E"
        ],
        "Label": "set",
        "Title": "X-Trace Task",
        "Host": "pinky19.mpi-sws.org",
        "HRT": 26962649027617476,
        "Operation": "set",
        "Timestamp": "1557746288967.897217",
        "TenantClass": 0,
        "Source": "Client.java:1104",
        "ThreadID": 1,
        "ThreadName": "",
        "EventID": "294325B95D434BB7",
        "ProcessID": 36430
      },
      {
        "Cycles": 0,
        "Agent": "edu.brown.cs.systems.xtrace.logging.BaggageWrappers",
        "ProcessName": "Name",
        "TaskID": "E413872FA3A24057",
        "ParentEventID": [
          "E4B473E1E4F3C83D"
        ],
        "Label": "Forking current baggage with Baggage.fork()",
        "Title": "X-Trace Task",
        "Host": "pinky19.mpi-sws.org",
        "HRT": 26962649027652614,
        "Operation": "fork",
        "Timestamp": "1557746288967.958252",
        "TenantClass": 0,
        "Source": "Server.java:550",
        "ThreadID": 48,
        "ThreadName": "",
        "EventID": "4C6FD336B637F2A0",
        "BaggageBytes": "[[248 5] [240 0] [0 228 19 135 47 163 162 64 87] [240 1] [0 228 180 115 225 228 243 200 61] [240 3] [0 2]]",
        "ProcessID": 2171
      },
      {
        "Cycles": 0,
        "Agent": "Execution-CPU",
        "ProcessName": "Name",
        "TaskID": "E413872FA3A24057",
        "ParentEventID": [
          "4C6FD336B637F2A0"
        ],
        "Label": "set",
        "Title": "X-Trace Task",
        "Host": "pinky19.mpi-sws.org",
        "HRT": 26962649027682182,
        "Operation": "set",
        "Timestamp": "1557746288967.987793",
        "TenantClass": 0,
        "Source": "Server.java:2071",
        "ThreadID": 63,
        "ThreadName": "",
        "EventID": "D2E7BE4790A45061",
        "BaggageBytes": "[[248 5] [240 0] [0 228 19 135 47 163 162 64 87] [240 1] [0 76 111 211 54 182 55 242 160] [240 3] [0 2]]",
        "ProcessID": 2171
      },
      {
        "Cycles": 0,
        "Agent": "org.apache.hadoop.ipc.Server",
        "ProcessName": "Name",
        "TaskID": "E413872FA3A24057",
        "ParentEventID": [
          "D2E7BE4790A45061"
        ],
        "Label": "getBlockLocations in org.apache.hadoop.hdfs.protocol.ClientProtocol",
        "Title": "X-Trace Task",
        "Host": "pinky19.mpi-sws.org",
        "HRT": 26962649027716319,
        "Timestamp": "1557746288968.021973",
        "TenantClass": 0,
        "Source": "ProtobufRpcEngine.java:601",
        "ThreadID": 63,
        "ThreadName": "",
        "EventID": "C0568687CD63873B",
        "BaggageBytes": "[[248 5] [240 0] [0 228 19 135 47 163 162 64 87] [240 1] [0 210 231 190 71 144 164 80 97] [240 3] [0 2]]",
        "ProcessID": 2171
      },
      {
        "Cycles": 0,
        "Agent": "Execution-CPU",
        "ProcessName": "Name",
        "TaskID": "E413872FA3A24057",
        "ParentEventID": [
          "4C6FD336B637F2A0"
        ],
        "Label": "unset",
        "Title": "X-Trace Task",
        "Host": "pinky19.mpi-sws.org",
        "Duration": "25170",
        "HRT": 26962649027674394,
        "Operation": "unset",
        "Timestamp": "1557746288967.979980",
        "TenantClass": 0,
        "Source": "Server.java:1828",
        "ThreadID": 48,
        "ThreadName": "",
        "EventID": "325054518C31F8DE",
        "BaggageBytes": "[[248 5] [240 0] [0 228 19 135 47 163 162 64 87] [240 1] [0 76 111 211 54 182 55 242 160] [240 3] [0 2]]",
        "ProcessID": 2171
      },
      {
        "Cycles": 0,
        "Agent": "org.apache.hadoop.hdfs.server.namenode.FSNamesystem.audit",
        "ProcessName": "Name",
        "TaskID": "E413872FA3A24057",
        "ParentEventID": [
          "C0568687CD63873B"
        ],
        "Label": "allowed=true\tugi=plascas (auth:SIMPLE)\tip=/139.19.171.63\tcmd=open\tsrc=/ds/epI6nrbmEJFFFwrJ\tdst=null\tperm=null\tproto=rpc",
        "Title": "X-Trace Task",
        "Host": "pinky19.mpi-sws.org",
        "HRT": 26962649027758313,
        "Timestamp": "1557746288968.063965",
        "TenantClass": 0,
        "Source": "FSNamesystem.java:8313",
        "ThreadID": 63,
        "ThreadName": "",
        "EventID": "46838A5674FA3611",
        "BaggageBytes": "[[248 5] [240 0] [0 228 19 135 47 163 162 64 87] [240 1] [0 192 86 134 135 205 99 135 59] [240 3] [0 2]]",
        "ProcessID": 2171
      },
      {
        "Cycles": 0,
        "Agent": "Execution-CPU",
        "ProcessName": "Name",
        "TaskID": "E413872FA3A24057",
        "ParentEventID": [
          "6852353C5A46A747"
        ],
        "Label": "unset",
        "Title": "X-Trace Task",
        "Host": "pinky19.mpi-sws.org",
        "Duration": "203034",
        "HRT": 26962649027908431,
        "Operation": "unset",
        "Timestamp": "1557746288968.214111",
        "TenantClass": 0,
        "Source": "Server.java:1058",
        "ThreadID": 63,
        "ThreadName": "",
        "EventID": "38D46D00A577E2DC",
        "BaggageBytes": "[[248 5] [240 0] [0 228 19 135 47 163 162 64 87] [240 1] [0 104 82 53 60 90 70 167 71] [240 3] [0 2]]",
        "ProcessID": 2171
      },
      {
        "Cycles": 0,
        "Agent": "Execution-CPU",
        "ProcessName": "Read",
        "TaskID": "E413872FA3A24057",
        "ParentEventID": [
          "6852353C5A46A747"
        ],
        "Label": "set",
        "Title": "X-Trace Task",
        "Host": "pinky19.mpi-sws.org",
        "HRT": 26962649027982701,
        "Operation": "set",
        "Timestamp": "1557746288968.262451",
        "TenantClass": 0,
        "Source": "Client.java:302",
        "ThreadID": 37,
        "ThreadName": "",
        "EventID": "EFB4DA8374BB1A3D",
        "ProcessID": 36430
      },
      {
        "Cycles": 0,
        "Agent": "Execution-CPU",
        "ProcessName": "Read",
        "TaskID": "E413872FA3A24057",
        "ParentEventID": [
          "EFB4DA8374BB1A3D"
        ],
        "Label": "unset",
        "Title": "X-Trace Task",
        "Host": "pinky19.mpi-sws.org",
        "Duration": "5173",
        "HRT": 26962649028004128,
        "Operation": "unset",
        "Timestamp": "1557746288968.283936",
        "TenantClass": 0,
        "Source": "Client.java:1168",
        "ThreadID": 37,
        "ThreadName": "",
        "EventID": "69368F69185744B7",
        "ProcessID": 36430
      },
      {
        "Cycles": 0,
        "Agent": "Execution-Sleep",
        "ProcessName": "Read",
        "TaskID": "E413872FA3A24057",
        "ParentEventID": [
          "294325B95D434BB7"
        ],
        "Label": "waited",
        "Title": "X-Trace Task",
        "Host": "pinky19.mpi-sws.org",
        "Duration": "385309",
        "HRT": 26962649028021561,
        "Operation": "waited",
        "Timestamp": "1557746288968.301270",
        "TenantClass": 0,
        "Source": "Client.java:1537",
        "ThreadID": 1,
        "ThreadName": "",
        "EventID": "9AEA44FDC4672EFD",
        "ProcessID": 36430
      },
      {
        "Cycles": 0,
        "Agent": "edu.brown.cs.systems.xtrace.logging.BaggageWrappers",
        "ProcessName": "Read",
        "TaskID": "E413872FA3A24057",
        "ParentEventID": [
          "9AEA44FDC4672EFD",
          "69368F69185744B7"
        ],
        "Label": "Merged current baggage with other baggage",
        "Title": "X-Trace Task",
        "Host": "pinky19.mpi-sws.org",
        "HRT": 26962649028033329,
        "Operation": "join",
        "Timestamp": "1557746288968.312988",
        "TenantClass": 0,
        "Source": "Client.java:1545",
        "ThreadID": 1,
        "ThreadName": "",
        "EventID": "2DCE26DF1323AAF5",
        "ProcessID": 36430
      },
      {
        "Cycles": 0,
        "Agent": "org.apache.hadoop.ipc.ProtobufRpcEngine",
        "ProcessName": "Read",
        "TaskID": "E413872FA3A24057",
        "ParentEventID": [
          "2DCE26DF1323AAF5"
        ],
        "Label": "org.apache.hadoop.hdfs.protocol.ClientProtocol.getBlockLocations completed",
        "Title": "X-Trace Task",
        "Host": "pinky19.mpi-sws.org",
        "HRT": 26962649028069061,
        "Timestamp": "1557746288968.348877",
        "TenantClass": 0,
        "Source": "ProtobufRpcEngine.java:275",
        "ThreadID": 1,
        "ThreadName": "",
        "EventID": "6A3FEDE2212DD090",
        "ProcessID": 36430
      },
      {
        "Cycles": 0,
        "Agent": "edu.brown.cs.systems.xtrace.logging.BaggageWrappers",
        "ProcessName": "Name",
        "TaskID": "E413872FA3A24057",
        "ParentEventID": [
          "46838A5674FA3611"
        ],
        "Label": "Forking current baggage with Baggage.fork()",
        "Title": "X-Trace Task",
        "Host": "pinky19.mpi-sws.org",
        "HRT": 26962649027801445,
        "Operation": "fork",
        "Timestamp": "1557746288968.106934",
        "TenantClass": 0,
        "Source": "Server.java:2398",
        "ThreadID": 63,
        "ThreadName": "",
        "EventID": "6852353C5A46A747",
        "BaggageBytes": "[[248 5] [240 0] [0 228 19 135 47 163 162 64 87] [240 1] [0 70 131 138 86 116 250 54 17] [240 3] [0 2]]",
        "ProcessID": 2171
      },
      {
        "Cycles": 0,
        "Agent": "edu.brown.cs.systems.xtrace.logging.BaggageWrappers",
        "ProcessName": "Read",
        "TaskID": "E413872FA3A24057",
        "ParentEventID": [
          "6A3FEDE2212DD090"
        ],
        "Label": "Forking current baggage with Baggage.fork()",
        "Title": "X-Trace Task",
        "Host": "pinky19.mpi-sws.org",
        "HRT": 26962649028119848,
        "Operation": "fork",
        "Timestamp": "1557746288968.399658",
        "TenantClass": 0,
        "Source": "DataTransferProtoUtil.java:94",
        "ThreadID": 1,
        "ThreadName": "",
        "EventID": "0E21E7D31F01342A",
        "ProcessID": 36430
      },
      {
        "Cycles": 0,
        "Agent": "Execution-CPU",
        "ProcessName": "Data",
        "TaskID": "E413872FA3A24057",
        "ParentEventID": [
          "0E21E7D31F01342A"
        ],
        "Label": "set",
        "Title": "X-Trace Task",
        "Host": "pinky22.mpi-sws.org",
        "HRT": 47512621282854131,
        "Operation": "set",
        "Timestamp": "1557746288968.603027",
        "TenantClass": 0,
        "Source": "Receiver.java:117",
        "ThreadID": 15142,
        "ThreadName": "",
        "EventID": "C28539F8898A8CC0",
        "BaggageBytes": "[[248 5] [240 0] [0 228 19 135 47 163 162 64 87] [240 1] [0 14 33 231 211 31 1 52 42] [240 3] [0 2]]",
        "ProcessID": 28841
      },
      {
        "Cycles": 0,
        "Agent": "edu.brown.cs.systems.xtrace.logging.BaggageWrappers",
        "ProcessName": "Data",
        "TaskID": "E413872FA3A24057",
        "ParentEventID": [
          "C2D59778D1C13FE7"
        ],
        "Label": "Forking current baggage with Baggage.fork()",
        "Title": "X-Trace Task",
        "Host": "pinky22.mpi-sws.org",
        "HRT": 47512621283139552,
        "Operation": "fork",
        "Timestamp": "1557746288968.888428",
        "TenantClass": 0,
        "Source": "DataXceiver.java:1257",
        "ThreadID": 15142,
        "ThreadName": "",
        "EventID": "5730759A0CA628AF",
        "BaggageBytes": "[[248 5] [240 0] [0 228 19 135 47 163 162 64 87] [240 1] [0 194 213 151 120 209 193 63 231] [240 3] [0 2]]",
        "ProcessID": 28841
      },
      {
        "Cycles": 0,
        "Agent": "edu.brown.cs.systems.xtrace.logging.XTraceInit",
        "ProcessName": "Data",
        "TaskID": "E413872FA3A24057",
        "ParentEventID": [
          "C28539F8898A8CC0"
        ],
        "Label": "Thread.setName: DataXceiver for client DFSClient_NONMAPREDUCE_778905418_1 at /139.19.171.63:45362 [Sending block BP-1633380353-139.19.171.63-1554193446451:blk_1073770686_29862]",
        "Title": "X-Trace Task",
        "Host": "pinky22.mpi-sws.org",
        "HRT": 47512621282926815,
        "Timestamp": "1557746288968.675537",
        "TenantClass": 0,
        "Source": "DataXceiver.java:168",
        "ThreadID": 15142,
        "ThreadName": "",
        "EventID": "C2D59778D1C13FE7",
        "BaggageBytes": "[[248 5] [240 0] [0 228 19 135 47 163 162 64 87] [240 1] [0 194 133 57 248 137 138 140 192] [240 3] [0 2]]",
        "ProcessID": 28841
      },
      {
        "Cycles": 0,
        "Agent": "edu.brown.cs.systems.xtrace.logging.BaggageWrappers",
        "ProcessName": "Data",
        "TaskID": "E413872FA3A24057",
        "ParentEventID": [
          "5730759A0CA628AF"
        ],
        "Label": "Forking current baggage with Baggage.fork()",
        "Title": "X-Trace Task",
        "Host": "pinky22.mpi-sws.org",
        "HRT": 47512621283278056,
        "Operation": "fork",
        "Timestamp": "1557746288969.026855",
        "TenantClass": 0,
        "Source": "PacketHeader.java:95",
        "ThreadID": 15142,
        "ThreadName": "",
        "EventID": "C0D9B9D959EBC4D5",
        "BaggageBytes": "[[248 5] [240 0] [0 228 19 135 47 163 162 64 87] [240 1] [0 87 48 117 154 12 166 40 175] [240 3] [0 2]]",
        "ProcessID": 28841
      },
      {
        "Cycles": 0,
        "Agent": "Execution-Sleep",
        "ProcessName": "Read",
        "TaskID": "E413872FA3A24057",
        "ParentEventID": [
          "0E21E7D31F01342A"
        ],
        "Label": "waited",
        "Title": "X-Trace Task",
        "Host": "pinky19.mpi-sws.org",
        "Duration": "547473",
        "HRT": 26962649028741538,
        "Operation": "waited",
        "Timestamp": "1557746288969.021240",
        "TenantClass": 0,
        "Source": "SocketIOWithTimeout.java:335",
        "ThreadID": 1,
        "ThreadName": "",
        "EventID": "FBA4BB59B248434F",
        "ProcessID": 36430
      },
      {
        "Cycles": 0,
        "Agent": "edu.brown.cs.systems.xtrace.logging.BaggageWrappers",
        "ProcessName": "Read",
        "TaskID": "E413872FA3A24057",
        "ParentEventID": [
          "FBA4BB59B248434F",
          "5730759A0CA628AF"
        ],
        "Label": "Merged current baggage with other baggage",
        "Title": "X-Trace Task",
        "Host": "pinky19.mpi-sws.org",
        "HRT": 26962649028812175,
        "Operation": "join",
        "Timestamp": "1557746288969.092041",
        "TenantClass": 0,
        "Source": "RemoteBlockReader2.java:429",
        "ThreadID": 1,
        "ThreadName": "",
        "EventID": "21DB75BB65D1D5FD",
        "ProcessID": 36430
      },
      {
        "Cycles": 0,
        "Agent": "edu.brown.cs.systems.xtrace.logging.BaggageWrappers",
        "ProcessName": "Data",
        "TaskID": "E413872FA3A24057",
        "ParentEventID": [
          "86EEF1C22549BDEE"
        ],
        "Label": "Forking current baggage with Baggage.fork()",
        "Title": "X-Trace Task",
        "Host": "pinky22.mpi-sws.org",
        "HRT": 47512621283568023,
        "Operation": "fork",
        "Timestamp": "1557746288969.316895",
        "TenantClass": 0,
        "Source": "PacketHeader.java:95",
        "ThreadID": 15142,
        "ThreadName": "",
        "EventID": "7539749CC134A4C4",
        "BaggageBytes": "[[248 5] [240 0] [0 228 19 135 47 163 162 64 87] [240 1] [0 134 238 241 194 37 73 189 238] [240 3] [0 2]]",
        "ProcessID": 28841
      },
      {
        "Cycles": 0,
        "Agent": "Execution-Sleep",
        "ProcessName": "Data",
        "TaskID": "E413872FA3A24057",
        "ParentEventID": [
          "C0D9B9D959EBC4D5"
        ],
        "Label": "waited",
        "Title": "X-Trace Task",
        "Host": "pinky22.mpi-sws.org",
        "Duration": "19400",
        "HRT": 47512621283410059,
        "Operation": "waited",
        "Timestamp": "1557746288969.158936",
        "TenantClass": 0,
        "Source": "SocketIOWithTimeout.java:335",
        "ThreadID": 15142,
        "ThreadName": "",
        "EventID": "86EEF1C22549BDEE",
        "BaggageBytes": "[[248 5] [240 0] [0 228 19 135 47 163 162 64 87] [240 1] [0 192 217 185 217 89 235 196 213] [240 3] [0 2]]",
        "ProcessID": 28841
      },
      {
        "Cycles": 0,
        "Agent": "edu.brown.cs.systems.xtrace.logging.BaggageWrappers",
        "ProcessName": "Read",
        "TaskID": "E413872FA3A24057",
        "ParentEventID": [
          "BA0AD985CA1252CA",
          "C0D9B9D959EBC4D5"
        ],
        "Label": "Merged current baggage with other baggage",
        "Title": "X-Trace Task",
        "Host": "pinky19.mpi-sws.org",
        "HRT": 26962649029190439,
        "Operation": "join",
        "Timestamp": "1557746288969.470215",
        "TenantClass": 0,
        "Source": "PacketHeader.java:168",
        "ThreadID": 1,
        "ThreadName": "",
        "EventID": "932F90815E012EA7",
        "ProcessID": 36430
      },
      {
        "Cycles": 0,
        "Agent": "edu.brown.cs.systems.xtrace.logging.BaggageWrappers",
        "ProcessName": "Read",
        "TaskID": "E413872FA3A24057",
        "ParentEventID": [
          "7539749CC134A4C4",
          "932F90815E012EA7"
        ],
        "Label": "Merged current baggage with other baggage",
        "Title": "X-Trace Task",
        "Host": "pinky19.mpi-sws.org",
        "HRT": 26962649029250392,
        "Operation": "join",
        "Timestamp": "1557746288969.530029",
        "TenantClass": 0,
        "Source": "PacketHeader.java:168",
        "ThreadID": 1,
        "ThreadName": "",
        "EventID": "CEC7A0468BCBA50D",
        "ProcessID": 36430
      },
      {
        "Cycles": 0,
        "Agent": "edu.brown.cs.systems.xtrace.logging.BaggageWrappers",
        "ProcessName": "Read",
        "TaskID": "E413872FA3A24057",
        "ParentEventID": [
          "CEC7A0468BCBA50D"
        ],
        "Label": "Forking current baggage with Baggage.fork()",
        "Title": "X-Trace Task",
        "Host": "pinky19.mpi-sws.org",
        "HRT": 26962649029262335,
        "Operation": "fork",
        "Timestamp": "1557746288969.541992",
        "TenantClass": 0,
        "Source": "RemoteBlockReader2.java:361",
        "ThreadID": 1,
        "ThreadName": "",
        "EventID": "9DADA0755D9053D9",
        "ProcessID": 36430
      },
      {
        "Cycles": 0,
        "Agent": "Execution-Sleep",
        "ProcessName": "Read",
        "TaskID": "E413872FA3A24057",
        "ParentEventID": [
          "21DB75BB65D1D5FD"
        ],
        "Label": "waited",
        "Title": "X-Trace Task",
        "Host": "pinky19.mpi-sws.org",
        "Duration": "240163",
        "HRT": 26962649029132790,
        "Operation": "waited",
        "Timestamp": "1557746288969.412598",
        "TenantClass": 0,
        "Source": "SocketIOWithTimeout.java:335",
        "ThreadID": 1,
        "ThreadName": "",
        "EventID": "BA0AD985CA1252CA",
        "ProcessID": 36430
      },
      {
        "Cycles": 0,
        "Agent": "Execution-Sleep",
        "ProcessName": "Data",
        "TaskID": "E413872FA3A24057",
        "ParentEventID": [
          "7539749CC134A4C4"
        ],
        "Label": "waited",
        "Title": "X-Trace Task",
        "Host": "pinky22.mpi-sws.org",
        "Duration": "137847",
        "HRT": 47512621283886094,
        "Operation": "waited",
        "Timestamp": "1557746288969.634766",
        "TenantClass": 0,
        "Source": "SocketIOWithTimeout.java:335",
        "ThreadID": 15142,
        "ThreadName": "",
        "EventID": "CB6B6E731297635A",
        "BaggageBytes": "[[248 5] [240 0] [0 228 19 135 47 163 162 64 87] [240 1] [0 117 57 116 156 193 52 164 196] [240 3] [0 2]]",
        "ProcessID": 28841
      },
      {
        "Cycles": 0,
        "Agent": "Execution-CPU",
        "ProcessName": "Data",
        "TaskID": "E413872FA3A24057",
        "ParentEventID": [
          "A1B320A86C435DF3"
        ],
        "Label": "unset",
        "Title": "X-Trace Task",
        "Host": "pinky22.mpi-sws.org",
        "Duration": "1156629",
        "HRT": 47512621284059341,
        "Operation": "unset",
        "Timestamp": "1557746288969.808105",
        "TenantClass": 0,
        "Source": "DataXceiver.java:261",
        "ThreadID": 15142,
        "ThreadName": "",
        "EventID": "7F22BEF3FF03E885",
        "BaggageBytes": "[[248 5] [240 0] [0 228 19 135 47 163 162 64 87] [240 1] [0 161 179 32 168 108 67 93 243] [240 3] [0 2]]",
        "ProcessID": 28841
      },
      {
        "Cycles": 0,
        "Agent": "edu.brown.cs.systems.xtrace.logging.BaggageWrappers",
        "ProcessName": "Data",
        "TaskID": "E413872FA3A24057",
        "ParentEventID": [
          "9DADA0755D9053D9",
          "CB6B6E731297635A"
        ],
        "Label": "Merged current baggage with other baggage",
        "Title": "X-Trace Task",
        "Host": "pinky22.mpi-sws.org",
        "HRT": 47512621284008714,
        "Operation": "join",
        "Timestamp": "1557746288969.757568",
        "TenantClass": 0,
        "Source": "DataXceiver.java:574",
        "ThreadID": 15142,
        "ThreadName": "",
        "EventID": "A1B320A86C435DF3",
        "BaggageBytes": "[[248 5] [240 0] [0 228 19 135 47 163 162 64 87] [240 1] [0 157 173 160 117 93 144 83 217] [0 203 107 110 115 18 151 99 90] [240 3] [0 2]]",
        "ProcessID": 28841
      },
      {
        "Cycles": 0,
        "Agent": "edu.brown.cs.systems.retro.benchmarks.hdfs_client.Reader",
        "ProcessName": "Read",
        "TaskID": "E413872FA3A24057",
        "ParentEventID": [
          "0"
        ],
        "Label": "Reading file",
        "Title": "X-Trace Task",
        "Host": "pinky19.mpi-sws.org",
        "HRT": 26962649027378616,
        "Timestamp": "1557746288967.658447",
        "TenantClass": 0,
        "ThreadID": 1,
        "ThreadName": "",
        "EventID": "63E1D7D5AD5F6B7D",
        "ProcessID": 36430,
        "Tag": [
          "reader_10kb",
          "Read Size: 10240"
        ]
      }
    ]
  }
]