[
  {
    "id": "9928D6191EB74B41",
    "reports": [
      {
        "Cycles": 0,
        "Agent": "org.apache.hadoop.ipc.ProtobufRpcEngine",
        "ProcessName": "Read",
        "TaskID": "9928D6191EB74B41",
        "ParentEventID": [
          "08B09E8F485D75F2"
        ],
        "Label": "Invoking org.apache.hadoop.hdfs.protocol.ClientProtocol.getBlockLocations",
        "Title": "X-Trace Task",
        "Host": "pinky19.mpi-sws.org",
        "HRT": 25491926979650428,
        "Timestamp": "1556275566920.015137",
        "TenantClass": 0,
        "Source": "ProtobufRpcEngine.java:228",
        "ThreadID": 1,
        "ThreadName": "",
        "EventID": "B4D8FAF3D08256C6",
        "ProcessID": 21035
      },
      {
        "Cycles": 0,
        "Agent": "edu.brown.cs.systems.retro.benchmarks.hdfs_client.Reader",
        "ProcessName": "Read",
        "TaskID": "9928D6191EB74B41",
        "ParentEventID": [
          "3D170C85C7C9BFD8"
        ],
        "Label": "Reading file",
        "Title": "X-Trace Task",
        "Host": "pinky19.mpi-sws.org",
        "HRT": 25491926979620177,
        "Timestamp": "1556275566919.984863",
        "TenantClass": 0,
        "ThreadID": 1,
        "ThreadName": "",
        "EventID": "08B09E8F485D75F2",
        "ProcessID": 21035
      },
      {
        "Cycles": 0,
        "Agent": "Execution-CPU",
        "ProcessName": "Read",
        "TaskID": "9928D6191EB74B41",
        "ParentEventID": [
          "B4D8FAF3D08256C6"
        ],
        "Label": "unset",
        "Title": "X-Trace Task",
        "Host": "pinky19.mpi-sws.org",
        "Duration": "22131704",
        "HRT": 25491926979670405,
        "Operation": "unset",
        "Timestamp": "1556275566920.034912",
        "TenantClass": 0,
        "Source": "Client.java:1027",
        "ThreadID": 1,
        "ThreadName": "",
        "EventID": "1F0782F33AE9D5FA",
        "ProcessID": 21035
      },
      {
        "Cycles": 0,
        "Agent": "Execution-CPU",
        "ProcessName": "Read",
        "TaskID": "9928D6191EB74B41",
        "ParentEventID": [
          "1F0782F33AE9D5FA"
        ],
        "Label": "set",
        "Title": "X-Trace Task",
        "Host": "pinky19.mpi-sws.org",
        "HRT": 25491926979694347,
        "Operation": "set",
        "Timestamp": "1556275566920.059082",
        "TenantClass": 0,
        "Source": "Client.java:1032",
        "ThreadID": 41,
        "ThreadName": "",
        "EventID": "E06078554EC724CA",
        "ProcessID": 21035
      },
      {
        "Cycles": 0,
        "Agent": "edu.brown.cs.systems.xtrace.logging.BaggageWrappers",
        "ProcessName": "Read",
        "TaskID": "9928D6191EB74B41",
        "ParentEventID": [
          "E06078554EC724CA"
        ],
        "Label": "Forking current baggage with Baggage.fork()",
        "Title": "X-Trace Task",
        "Host": "pinky19.mpi-sws.org",
        "HRT": 25491926979707248,
        "Operation": "fork",
        "Timestamp": "1556275566920.071777",
        "TenantClass": 0,
        "Source": "Client.java:1043",
        "ThreadID": 41,
        "ThreadName": "",
        "EventID": "65771EDA494F6B6F",
        "ProcessID": 21035
      },
      {
        "Cycles": 0,
        "Agent": "Execution-CPU",
        "ProcessName": "Read",
        "TaskID": "9928D6191EB74B41",
        "ParentEventID": [
          "65771EDA494F6B6F"
        ],
        "Label": "unset",
        "Title": "X-Trace Task",
        "Host": "pinky19.mpi-sws.org",
        "Duration": "55296",
        "HRT": 25491926979762258,
        "Operation": "unset",
        "Timestamp": "1556275566920.126953",
        "TenantClass": 0,
        "Source": "Client.java:1062",
        "ThreadID": 41,
        "ThreadName": "",
        "EventID": "DFD7BA7388FB9A24",
        "ProcessID": 21035
      },
      {
        "Cycles": 0,
        "Agent": "Execution-CPU",
        "ProcessName": "Name",
        "TaskID": "9928D6191EB74B41",
        "ParentEventID": [
          "65771EDA494F6B6F"
        ],
        "Label": "set",
        "Title": "X-Trace Task",
        "Host": "pinky19.mpi-sws.org",
        "HRT": 25491926979861728,
        "Operation": "set",
        "Timestamp": "1556275566920.205811",
        "TenantClass": 0,
        "Source": "Server.java:1840",
        "ThreadID": 48,
        "ThreadName": "",
        "EventID": "DDC90DD61B360B99",
        "BaggageBytes": "[[248 5] [240 0] [0 153 40 214 25 30 183 75 65] [240 1] [0 101 119 30 218 73 79 107 111] [240 3] [0 2]]",
        "ProcessID": 2171
      },
      {
        "Cycles": 0,
        "Agent": "edu.brown.cs.systems.xtrace.logging.BaggageWrappers",
        "ProcessName": "Name",
        "TaskID": "9928D6191EB74B41",
        "ParentEventID": [
          "DDC90DD61B360B99"
        ],
        "Label": "Forking current baggage with Baggage.fork()",
        "Title": "X-Trace Task",
        "Host": "pinky19.mpi-sws.org",
        "HRT": 25491926979896067,
        "Operation": "fork",
        "Timestamp": "1556275566920.240234",
        "TenantClass": 0,
        "Source": "Server.java:550",
        "ThreadID": 48,
        "ThreadName": "",
        "EventID": "5A376C33F303D069",
        "BaggageBytes": "[[248 5] [240 0] [0 153 40 214 25 30 183 75 65] [240 1] [0 221 201 13 214 27 54 11 153] [240 3] [0 2]]",
        "ProcessID": 2171
      },
      {
        "Cycles": 0,
        "Agent": "Execution-CPU",
        "ProcessName": "Read",
        "TaskID": "9928D6191EB74B41",
        "ParentEventID": [
          "DFD7BA7388FB9A24"
        ],
        "Label": "set",
        "Title": "X-Trace Task",
        "Host": "pinky19.mpi-sws.org",
        "HRT": 25491926979783118,
        "Operation": "set",
        "Timestamp": "1556275566920.147705",
        "TenantClass": 0,
        "Source": "Client.java:1104",
        "ThreadID": 1,
        "ThreadName": "",
        "EventID": "788AF5E73CFD3845",
        "ProcessID": 21035
      },
      {
        "Cycles": 0,
        "Agent": "Execution-CPU",
        "ProcessName": "Name",
        "TaskID": "9928D6191EB74B41",
        "ParentEventID": [
          "5A376C33F303D069"
        ],
        "Label": "unset",
        "Title": "X-Trace Task",
        "Host": "pinky19.mpi-sws.org",
        "Duration": "24083",
        "HRT": 25491926979916824,
        "Operation": "unset",
        "Timestamp": "1556275566920.260986",
        "TenantClass": 0,
        "Source": "Server.java:1828",
        "ThreadID": 48,
        "ThreadName": "",
        "EventID": "55C4D02B9C382E1E",
        "BaggageBytes": "[[248 5] [240 0] [0 153 40 214 25 30 183 75 65] [240 1] [0 90 55 108 51 243 3 208 105] [240 3] [0 2]]",
        "ProcessID": 2171
      },
      {
        "Cycles": 0,
        "Agent": "Execution-CPU",
        "ProcessName": "Name",
        "TaskID": "9928D6191EB74B41",
        "ParentEventID": [
          "5A376C33F303D069"
        ],
        "Label": "set",
        "Title": "X-Trace Task",
        "Host": "pinky19.mpi-sws.org",
        "HRT": 25491926979923747,
        "Operation": "set",
        "Timestamp": "1556275566920.267822",
        "TenantClass": 0,
        "Source": "Server.java:2071",
        "ThreadID": 56,
        "ThreadName": "",
        "EventID": "DB540E14D04E167A",
        "BaggageBytes": "[[248 5] [240 0] [0 153 40 214 25 30 183 75 65] [240 1] [0 90 55 108 51 243 3 208 105] [240 3] [0 2]]",
        "ProcessID": 2171
      },
      {
        "Cycles": 0,
        "Agent": "org.apache.hadoop.hdfs.server.namenode.FSNamesystem.audit",
        "ProcessName": "Name",
        "TaskID": "9928D6191EB74B41",
        "ParentEventID": [
          "AAD2AE6854E279FD"
        ],
        "Label": "allowed=true\tugi=plascas (auth:SIMPLE)\tip=/139.19.171.63\tcmd=open\tsrc=/ds/Wht9LQM4lEt6kKrp\tdst=null\tperm=null\tproto=rpc",
        "Title": "X-Trace Task",
        "Host": "pinky19.mpi-sws.org",
        "HRT": 25491926980002563,
        "Timestamp": "1556275566920.346680",
        "TenantClass": 0,
        "Source": "FSNamesystem.java:8313",
        "ThreadID": 56,
        "ThreadName": "",
        "EventID": "481CB672989A9E5F",
        "BaggageBytes": "[[248 5] [240 0] [0 153 40 214 25 30 183 75 65] [240 1] [0 170 210 174 104 84 226 121 253] [240 3] [0 2]]",
        "ProcessID": 2171
      },
      {
        "Cycles": 0,
        "Agent": "org.apache.hadoop.ipc.Server",
        "ProcessName": "Name",
        "TaskID": "9928D6191EB74B41",
        "ParentEventID": [
          "DB540E14D04E167A"
        ],
        "Label": "getBlockLocations in org.apache.hadoop.hdfs.protocol.ClientProtocol",
        "Title": "X-Trace Task",
        "Host": "pinky19.mpi-sws.org",
        "HRT": 25491926979954151,
        "Timestamp": "1556275566920.298340",
        "TenantClass": 0,
        "Source": "ProtobufRpcEngine.java:601",
        "ThreadID": 56,
        "ThreadName": "",
        "EventID": "AAD2AE6854E279FD",
        "BaggageBytes": "[[248 5] [240 0] [0 153 40 214 25 30 183 75 65] [240 1] [0 219 84 14 20 208 78 22 122] [240 3] [0 2]]",
        "ProcessID": 2171
      },
      {
        "Cycles": 0,
        "Agent": "edu.brown.cs.systems.xtrace.logging.BaggageWrappers",
        "ProcessName": "Name",
        "TaskID": "9928D6191EB74B41",
        "ParentEventID": [
          "481CB672989A9E5F"
        ],
        "Label": "Forking current baggage with Baggage.fork()",
        "Title": "X-Trace Task",
        "Host": "pinky19.mpi-sws.org",
        "HRT": 25491926980043529,
        "Operation": "fork",
        "Timestamp": "1556275566920.387695",
        "TenantClass": 0,
        "Source": "Server.java:2398",
        "ThreadID": 56,
        "ThreadName": "",
        "EventID": "97DD6667766A7B22",
        "BaggageBytes": "[[248 5] [240 0] [0 153 40 214 25 30 183 75 65] [240 1] [0 72 28 182 114 152 154 158 95] [240 3] [0 2]]",
        "ProcessID": 2171
      },
      {
        "Cycles": 0,
        "Agent": "Execution-CPU",
        "ProcessName": "Read",
        "TaskID": "9928D6191EB74B41",
        "ParentEventID": [
          "97DD6667766A7B22"
        ],
        "Label": "set",
        "Title": "X-Trace Task",
        "Host": "pinky19.mpi-sws.org",
        "HRT": 25491926980183514,
        "Operation": "set",
        "Timestamp": "1556275566920.548096",
        "TenantClass": 0,
        "Source": "Client.java:302",
        "ThreadID": 37,
        "ThreadName": "",
        "EventID": "855989D17A6A8F53",
        "ProcessID": 21035
      },
      {
        "Cycles": 0,
        "Agent": "Execution-CPU",
        "ProcessName": "Read",
        "TaskID": "9928D6191EB74B41",
        "ParentEventID": [
          "855989D17A6A8F53"
        ],
        "Label": "unset",
        "Title": "X-Trace Task",
        "Host": "pinky19.mpi-sws.org",
        "Duration": "5822",
        "HRT": 25491926980200946,
        "Operation": "unset",
        "Timestamp": "1556275566920.565674",
        "TenantClass": 0,
        "Source": "Client.java:1168",
        "ThreadID": 37,
        "ThreadName": "",
        "EventID": "16CDC227AD1678E3",
        "ProcessID": 21035
      },
      {
        "Cycles": 0,
        "Agent": "Execution-CPU",
        "ProcessName": "Name",
        "TaskID": "9928D6191EB74B41",
        "ParentEventID": [
          "97DD6667766A7B22"
        ],
        "Label": "unset",
        "Title": "X-Trace Task",
        "Host": "pinky19.mpi-sws.org",
        "Duration": "199474",
        "HRT": 25491926980140910,
        "Operation": "unset",
        "Timestamp": "1556275566920.485107",
        "TenantClass": 0,
        "Source": "Server.java:1058",
        "ThreadID": 56,
        "ThreadName": "",
        "EventID": "EA256C4E825A66C5",
        "BaggageBytes": "[[248 5] [240 0] [0 153 40 214 25 30 183 75 65] [240 1] [0 151 221 102 103 118 106 123 34] [240 3] [0 2]]",
        "ProcessID": 2171
      },
      {
        "Cycles": 0,
        "Agent": "Execution-Sleep",
        "ProcessName": "Read",
        "TaskID": "9928D6191EB74B41",
        "ParentEventID": [
          "788AF5E73CFD3845"
        ],
        "Label": "waited",
        "Title": "X-Trace Task",
        "Host": "pinky19.mpi-sws.org",
        "Duration": "440295",
        "HRT": 25491926980232338,
        "Operation": "waited",
        "Timestamp": "1556275566920.596924",
        "TenantClass": 0,
        "Source": "Client.java:1537",
        "ThreadID": 1,
        "ThreadName": "",
        "EventID": "7B2650A5130B41C8",
        "ProcessID": 21035
      },
      {
        "Cycles": 0,
        "Agent": "org.apache.hadoop.ipc.ProtobufRpcEngine",
        "ProcessName": "Read",
        "TaskID": "9928D6191EB74B41",
        "ParentEventID": [
          "50A2C4BF2B9D51F3"
        ],
        "Label": "org.apache.hadoop.hdfs.protocol.ClientProtocol.getBlockLocations completed",
        "Title": "X-Trace Task",
        "Host": "pinky19.mpi-sws.org",
        "HRT": 25491926980279152,
        "Timestamp": "1556275566920.643799",
        "TenantClass": 0,
        "Source": "ProtobufRpcEngine.java:275",
        "ThreadID": 1,
        "ThreadName": "",
        "EventID": "EE6C9622A84CE7DD",
        "ProcessID": 21035
      },
      {
        "Cycles": 0,
        "Agent": "edu.brown.cs.systems.xtrace.logging.BaggageWrappers",
        "ProcessName": "Read",
        "TaskID": "9928D6191EB74B41",
        "ParentEventID": [
          "16CDC227AD1678E3",
          "7B2650A5130B41C8"
        ],
        "Label": "Merged current baggage with other baggage",
        "Title": "X-Trace Task",
        "Host": "pinky19.mpi-sws.org",
        "HRT": 25491926980246456,
        "Operation": "join",
        "Timestamp": "1556275566920.611084",
        "TenantClass": 0,
        "Source": "Client.java:1545",
        "ThreadID": 1,
        "ThreadName": "",
        "EventID": "50A2C4BF2B9D51F3",
        "ProcessID": 21035
      },
      {
        "Cycles": 0,
        "Agent": "edu.brown.cs.systems.xtrace.logging.BaggageWrappers",
        "ProcessName": "Read",
        "TaskID": "9928D6191EB74B41",
        "ParentEventID": [
          "EE6C9622A84CE7DD"
        ],
        "Label": "Forking current baggage with Baggage.fork()",
        "Title": "X-Trace Task",
        "Host": "pinky19.mpi-sws.org",
        "HRT": 25491926980333893,
        "Operation": "fork",
        "Timestamp": "1556275566920.698486",
        "TenantClass": 0,
        "Source": "DataTransferProtoUtil.java:94",
        "ThreadID": 1,
        "ThreadName": "",
        "EventID": "72D0FCC3883A0779",
        "ProcessID": 21035
      },
      {
        "Cycles": 0,
        "Agent": "Execution-CPU",
        "ProcessName": "Data",
        "TaskID": "9928D6191EB74B41",
        "ParentEventID": [
          "72D0FCC3883A0779"
        ],
        "Label": "set",
        "Title": "X-Trace Task",
        "Host": "pinky20.mpi-sws.org",
        "HRT": 5095131340240494,
        "Operation": "set",
        "Timestamp": "1556275566921.330811",
        "TenantClass": 0,
        "Source": "Receiver.java:117",
        "ThreadID": 5400,
        "ThreadName": "",
        "EventID": "C4A3868A8FA584C4",
        "BaggageBytes": "[[248 5] [240 0] [0 153 40 214 25 30 183 75 65] [240 1] [0 114 208 252 195 136 58 7 121] [240 3] [0 2]]",
        "ProcessID": 13111
      },
      {
        "Cycles": 0,
        "Agent": "edu.brown.cs.systems.xtrace.logging.BaggageWrappers",
        "ProcessName": "Data",
        "TaskID": "9928D6191EB74B41",
        "ParentEventID": [
          "E89C0D13857C0D64"
        ],
        "Label": "Forking current baggage with Baggage.fork()",
        "Title": "X-Trace Task",
        "Host": "pinky20.mpi-sws.org",
        "HRT": 5095131340585644,
        "Operation": "fork",
        "Timestamp": "1556275566921.675781",
        "TenantClass": 0,
        "Source": "DataXceiver.java:1257",
        "ThreadID": 5400,
        "ThreadName": "",
        "EventID": "FD2D4382007B2690",
        "BaggageBytes": "[[248 5] [240 0] [0 153 40 214 25 30 183 75 65] [240 1] [0 232 156 13 19 133 124 13 100] [240 3] [0 2]]",
        "ProcessID": 13111
      },
      {
        "Cycles": 0,
        "Agent": "edu.brown.cs.systems.xtrace.logging.XTraceInit",
        "ProcessName": "Data",
        "TaskID": "9928D6191EB74B41",
        "ParentEventID": [
          "C4A3868A8FA584C4"
        ],
        "Label": "Thread.setName: DataXceiver for client DFSClient_NONMAPREDUCE_1377588049_1 at /139.19.171.63:32854 [Sending block BP-1633380353-139.19.171.63-1554193446451:blk_1073759587_18763]",
        "Title": "X-Trace Task",
        "Host": "pinky20.mpi-sws.org",
        "HRT": 5095131340339437,
        "Timestamp": "1556275566921.429688",
        "TenantClass": 0,
        "Source": "DataXceiver.java:168",
        "ThreadID": 5400,
        "ThreadName": "",
        "EventID": "E89C0D13857C0D64",
        "BaggageBytes": "[[248 5] [240 0] [0 153 40 214 25 30 183 75 65] [240 1] [0 196 163 134 138 143 165 132 196] [240 3] [0 2]]",
        "ProcessID": 13111
      },
      {
        "Cycles": 0,
        "Agent": "Execution-Sleep",
        "ProcessName": "Read",
        "TaskID": "9928D6191EB74B41",
        "ParentEventID": [
          "72D0FCC3883A0779"
        ],
        "Label": "waited",
        "Title": "X-Trace Task",
        "Host": "pinky19.mpi-sws.org",
        "Duration": "793494",
        "HRT": 25491926981199058,
        "Operation": "waited",
        "Timestamp": "1556275566921.563721",
        "TenantClass": 0,
        "Source": "SocketIOWithTimeout.java:335",
        "ThreadID": 1,
        "ThreadName": "",
        "EventID": "180769FFD8731004",
        "ProcessID": 21035
      },
      {
        "Cycles": 0,
        "Agent": "edu.brown.cs.systems.xtrace.logging.BaggageWrappers",
        "ProcessName": "Data",
        "TaskID": "9928D6191EB74B41",
        "ParentEventID": [
          "FD2D4382007B2690"
        ],
        "Label": "Forking current baggage with Baggage.fork()",
        "Title": "X-Trace Task",
        "Host": "pinky20.mpi-sws.org",
        "HRT": 5095131340772298,
        "Operation": "fork",
        "Timestamp": "1556275566921.862549",
        "TenantClass": 0,
        "Source": "PacketHeader.java:95",
        "ThreadID": 5400,
        "ThreadName": "",
        "EventID": "7D24000DC7E7359D",
        "BaggageBytes": "[[248 5] [240 0] [0 153 40 214 25 30 183 75 65] [240 1] [0 253 45 67 130 0 123 38 144] [240 3] [0 2]]",
        "ProcessID": 13111
      },
      {
        "Cycles": 0,
        "Agent": "edu.brown.cs.systems.xtrace.logging.BaggageWrappers",
        "ProcessName": "Read",
        "TaskID": "9928D6191EB74B41",
        "ParentEventID": [
          "FD2D4382007B2690",
          "180769FFD8731004"
        ],
        "Label": "Merged current baggage with other baggage",
        "Title": "X-Trace Task",
        "Host": "pinky19.mpi-sws.org",
        "HRT": 25491926981272328,
        "Operation": "join",
        "Timestamp": "1556275566921.636963",
        "TenantClass": 0,
        "Source": "RemoteBlockReader2.java:429",
        "ThreadID": 1,
        "ThreadName": "",
        "EventID": "AE506869F0561127",
        "ProcessID": 21035
      },
      {
        "Cycles": 0,
        "Agent": "Execution-Sleep",
        "ProcessName": "Data",
        "TaskID": "9928D6191EB74B41",
        "ParentEventID": [
          "7D24000DC7E7359D"
        ],
        "Label": "waited",
        "Title": "X-Trace Task",
        "Host": "pinky20.mpi-sws.org",
        "Duration": "11470",
        "HRT": 5095131340929565,
        "Operation": "waited",
        "Timestamp": "1556275566922.019775",
        "TenantClass": 0,
        "Source": "SocketIOWithTimeout.java:335",
        "ThreadID": 5400,
        "ThreadName": "",
        "EventID": "6D1E506123E8548F",
        "BaggageBytes": "[[248 5] [240 0] [0 153 40 214 25 30 183 75 65] [240 1] [0 125 36 0 13 199 231 53 157] [240 3] [0 2]]",
        "ProcessID": 13111
      },
      {
        "Cycles": 0,
        "Agent": "Execution-Sleep",
        "ProcessName": "Read",
        "TaskID": "9928D6191EB74B41",
        "ParentEventID": [
          "D1B9843573FC3F43"
        ],
        "Label": "waited",
        "Title": "X-Trace Task",
        "Host": "pinky19.mpi-sws.org",
        "Duration": "157226",
        "HRT": 25491926981575466,
        "Operation": "waited",
        "Timestamp": "1556275566921.940186",
        "TenantClass": 0,
        "Source": "SocketIOWithTimeout.java:335",
        "ThreadID": 1,
        "ThreadName": "",
        "EventID": "5647B45FA7E39FEE",
        "ProcessID": 21035
      },
      {
        "Cycles": 0,
        "Agent": "Execution-Sleep",
        "ProcessName": "Read",
        "TaskID": "9928D6191EB74B41",
        "ParentEventID": [
          "AE506869F0561127"
        ],
        "Label": "waited",
        "Title": "X-Trace Task",
        "Host": "pinky19.mpi-sws.org",
        "Duration": "27281",
        "HRT": 25491926981353326,
        "Operation": "waited",
        "Timestamp": "1556275566921.718018",
        "TenantClass": 0,
        "Source": "SocketIOWithTimeout.java:335",
        "ThreadID": 1,
        "ThreadName": "",
        "EventID": "D1B9843573FC3F43",
        "ProcessID": 21035
      },
      {
        "Cycles": 0,
        "Agent": "edu.brown.cs.systems.xtrace.logging.BaggageWrappers",
        "ProcessName": "Read",
        "TaskID": "9928D6191EB74B41",
        "ParentEventID": [
          "5647B45FA7E39FEE",
          "7D24000DC7E7359D"
        ],
        "Label": "Merged current baggage with other baggage",
        "Title": "X-Trace Task",
        "Host": "pinky19.mpi-sws.org",
        "HRT": 25491926981613283,
        "Operation": "join",
        "Timestamp": "1556275566921.977783",
        "TenantClass": 0,
        "Source": "PacketHeader.java:168",
        "ThreadID": 1,
        "ThreadName": "",
        "EventID": "01941D033A2F82DF",
        "ProcessID": 21035
      },
      {
        "Cycles": 0,
        "Agent": "Execution-Sleep",
        "ProcessName": "Read",
        "TaskID": "9928D6191EB74B41",
        "ParentEventID": [
          "01941D033A2F82DF"
        ],
        "Label": "waited",
        "Title": "X-Trace Task",
        "Host": "pinky19.mpi-sws.org",
        "Duration": "64997",
        "HRT": 25491926981707346,
        "Operation": "waited",
        "Timestamp": "1556275566922.072021",
        "TenantClass": 0,
        "Source": "SocketIOWithTimeout.java:335",
        "ThreadID": 1,
        "ThreadName": "",
        "EventID": "C32AFD791A9F68D8",
        "ProcessID": 21035
      },
      {
        "Cycles": 0,
        "Agent": "edu.brown.cs.systems.xtrace.logging.BaggageWrappers",
        "ProcessName": "Data",
        "TaskID": "9928D6191EB74B41",
        "ParentEventID": [
          "6D1E506123E8548F"
        ],
        "Label": "Forking current baggage with Baggage.fork()",
        "Title": "X-Trace Task",
        "Host": "pinky20.mpi-sws.org",
        "HRT": 5095131341125155,
        "Operation": "fork",
        "Timestamp": "1556275566922.215332",
        "TenantClass": 0,
        "Source": "PacketHeader.java:95",
        "ThreadID": 5400,
        "ThreadName": "",
        "EventID": "646DDCA40A160980",
        "BaggageBytes": "[[248 5] [240 0] [0 153 40 214 25 30 183 75 65] [240 1] [0 109 30 80 97 35 232 84 143] [240 3] [0 2]]",
        "ProcessID": 13111
      },
      {
        "Cycles": 0,
        "Agent": "edu.brown.cs.systems.xtrace.logging.BaggageWrappers",
        "ProcessName": "Read",
        "TaskID": "9928D6191EB74B41",
        "ParentEventID": [
          "C32AFD791A9F68D8",
          "646DDCA40A160980"
        ],
        "Label": "Merged current baggage with other baggage",
        "Title": "X-Trace Task",
        "Host": "pinky19.mpi-sws.org",
        "HRT": 25491926981776992,
        "Operation": "join",
        "Timestamp": "1556275566922.141602",
        "TenantClass": 0,
        "Source": "PacketHeader.java:168",
        "ThreadID": 1,
        "ThreadName": "",
        "EventID": "E2A4C1369E84E957",
        "ProcessID": 21035
      },
      {
        "Cycles": 0,
        "Agent": "edu.brown.cs.systems.xtrace.logging.BaggageWrappers",
        "ProcessName": "Read",
        "TaskID": "9928D6191EB74B41",
        "ParentEventID": [
          "E2A4C1369E84E957"
        ],
        "Label": "Forking current baggage with Baggage.fork()",
        "Title": "X-Trace Task",
        "Host": "pinky19.mpi-sws.org",
        "HRT": 25491926981789320,
        "Operation": "fork",
        "Timestamp": "1556275566922.154053",
        "TenantClass": 0,
        "Source": "RemoteBlockReader2.java:361",
        "ThreadID": 1,
        "ThreadName": "",
        "EventID": "55D2888DD423C914",
        "ProcessID": 21035
      },
      {
        "Cycles": 0,
        "Agent": "Execution-Sleep",
        "ProcessName": "Data",
        "TaskID": "9928D6191EB74B41",
        "ParentEventID": [
          "646DDCA40A160980"
        ],
        "Label": "waited",
        "Title": "X-Trace Task",
        "Host": "pinky20.mpi-sws.org",
        "Duration": "109767",
        "HRT": 5095131341458349,
        "Operation": "waited",
        "Timestamp": "1556275566922.548584",
        "TenantClass": 0,
        "Source": "SocketIOWithTimeout.java:335",
        "ThreadID": 5400,
        "ThreadName": "",
        "EventID": "2C2D2528211B872B",
        "BaggageBytes": "[[248 5] [240 0] [0 153 40 214 25 30 183 75 65] [240 1] [0 100 109 220 164 10 22 9 128] [240 3] [0 2]]",
        "ProcessID": 13111
      },
      {
        "Cycles": 0,
        "Agent": "Execution-CPU",
        "ProcessName": "Data",
        "TaskID": "9928D6191EB74B41",
        "ParentEventID": [
          "831A62CF64A79FA7"
        ],
        "Label": "unset",
        "Title": "X-Trace Task",
        "Host": "pinky20.mpi-sws.org",
        "Duration": "1332535",
        "HRT": 5095131341644266,
        "Operation": "unset",
        "Timestamp": "1556275566922.734619",
        "TenantClass": 0,
        "Source": "DataXceiver.java:261",
        "ThreadID": 5400,
        "ThreadName": "",
        "EventID": "6B3DB29FF23E8D93",
        "BaggageBytes": "[[248 5] [240 0] [0 153 40 214 25 30 183 75 65] [240 1] [0 131 26 98 207 100 167 159 167] [240 3] [0 2]]",
        "ProcessID": 13111
      },
      {
        "Cycles": 0,
        "Agent": "edu.brown.cs.systems.xtrace.logging.BaggageWrappers",
        "ProcessName": "Data",
        "TaskID": "9928D6191EB74B41",
        "ParentEventID": [
          "55D2888DD423C914",
          "2C2D2528211B872B"
        ],
        "Label": "Merged current baggage with other baggage",
        "Title": "X-Trace Task",
        "Host": "pinky20.mpi-sws.org",
        "HRT": 5095131341584759,
        "Operation": "join",
        "Timestamp": "1556275566922.675049",
        "TenantClass": 0,
        "Source": "DataXceiver.java:574",
        "ThreadID": 5400,
        "ThreadName": "",
        "EventID": "831A62CF64A79FA7",
        "BaggageBytes": "[[248 5] [240 0] [0 153 40 214 25 30 183 75 65] [240 1] [0 44 45 37 40 33 27 135 43] [0 85 210 136 141 212 35 201 20] [240 3] [0 2]]",
        "ProcessID": 13111
      },
      {
        "Cycles": 0,
        "Agent": "edu.brown.cs.systems.retro.benchmarks.hdfs_client.Reader",
        "ProcessName": "Read",
        "TaskID": "9928D6191EB74B41",
        "ParentEventID": [
          "0"
        ],
        "Label": "Reading file",
        "Title": "X-Trace Task",
        "Host": "pinky19.mpi-sws.org",
        "HRT": 25491926979603851,
        "Timestamp": "1556275566919.968506",
        "TenantClass": 0,
        "ThreadID": 1,
        "ThreadName": "",
        "EventID": "3D170C85C7C9BFD8",
        "ProcessID": 21035,
        "Tag": [
          "reader_1kb",
          "Read Size: 1024"
        ]
      }
    ]
  }
]