[
  {
    "id": "300DC1A897B860AB",
    "reports": [
      {
        "Cycles": 0,
        "Agent": "Execution-CPU",
        "ProcessName": "Read",
        "TaskID": "300DC1A897B860AB",
        "ParentEventID": [
          "C174A422874596F3"
        ],
        "Label": "unset",
        "Title": "X-Trace Task",
        "Host": "pinky19.mpi-sws.org",
        "Duration": "22311576",
        "HRT": 26966805093501942,
        "Operation": "unset",
        "Timestamp": "1557750445033.758545",
        "TenantClass": 0,
        "Source": "Client.java:1027",
        "ThreadID": 1,
        "ThreadName": "",
        "EventID": "9D1912C5EDE90D26",
        "ProcessID": 2801
      },
      {
        "Cycles": 0,
        "Agent": "org.apache.hadoop.ipc.ProtobufRpcEngine",
        "ProcessName": "Read",
        "TaskID": "300DC1A897B860AB",
        "ParentEventID": [
          "0982BB1E313D3C8C"
        ],
        "Label": "Invoking org.apache.hadoop.hdfs.protocol.ClientProtocol.getBlockLocations",
        "Title": "X-Trace Task",
        "Host": "pinky19.mpi-sws.org",
        "HRT": 26966805093485166,
        "Timestamp": "1557750445033.741699",
        "TenantClass": 0,
        "Source": "ProtobufRpcEngine.java:228",
        "ThreadID": 1,
        "ThreadName": "",
        "EventID": "C174A422874596F3",
        "ProcessID": 2801
      },
      {
        "Cycles": 0,
        "Agent": "edu.brown.cs.systems.retro.benchmarks.hdfs_client.Reader",
        "ProcessName": "Read",
        "TaskID": "300DC1A897B860AB",
        "ParentEventID": [
          "3E1CD48DA0248001"
        ],
        "Label": "Reading file",
        "Title": "X-Trace Task",
        "Host": "pinky19.mpi-sws.org",
        "HRT": 26966805093460384,
        "Timestamp": "1557750445033.717041",
        "TenantClass": 0,
        "ThreadID": 1,
        "ThreadName": "",
        "EventID": "0982BB1E313D3C8C",
        "ProcessID": 2801
      },
      {
        "Cycles": 0,
        "Agent": "edu.brown.cs.systems.xtrace.logging.BaggageWrappers",
        "ProcessName": "Read",
        "TaskID": "300DC1A897B860AB",
        "ParentEventID": [
          "403B6707B962C89D"
        ],
        "Label": "Forking current baggage with Baggage.fork()",
        "Title": "X-Trace Task",
        "Host": "pinky19.mpi-sws.org",
        "HRT": 26966805093545601,
        "Operation": "fork",
        "Timestamp": "1557750445033.802246",
        "TenantClass": 0,
        "Source": "Client.java:1043",
        "ThreadID": 41,
        "ThreadName": "",
        "EventID": "A13F78A8D6AA2CB7",
        "ProcessID": 2801
      },
      {
        "Cycles": 0,
        "Agent": "Execution-CPU",
        "ProcessName": "Read",
        "TaskID": "300DC1A897B860AB",
        "ParentEventID": [
          "A13F78A8D6AA2CB7"
        ],
        "Label": "unset",
        "Title": "X-Trace Task",
        "Host": "pinky19.mpi-sws.org",
        "Duration": "65284",
        "HRT": 26966805093610238,
        "Operation": "unset",
        "Timestamp": "1557750445033.866943",
        "TenantClass": 0,
        "Source": "Client.java:1062",
        "ThreadID": 41,
        "ThreadName": "",
        "EventID": "D1752C65F174F303",
        "ProcessID": 2801
      },
      {
        "Cycles": 0,
        "Agent": "Execution-CPU",
        "ProcessName": "Read",
        "TaskID": "300DC1A897B860AB",
        "ParentEventID": [
          "9D1912C5EDE90D26"
        ],
        "Label": "set",
        "Title": "X-Trace Task",
        "Host": "pinky19.mpi-sws.org",
        "HRT": 26966805093527058,
        "Operation": "set",
        "Timestamp": "1557750445033.783691",
        "TenantClass": 0,
        "Source": "Client.java:1032",
        "ThreadID": 41,
        "ThreadName": "",
        "EventID": "403B6707B962C89D",
        "ProcessID": 2801
      },
      {
        "Cycles": 0,
        "Agent": "Execution-CPU",
        "ProcessName": "Read",
        "TaskID": "300DC1A897B860AB",
        "ParentEventID": [
          "D1752C65F174F303"
        ],
        "Label": "set",
        "Title": "X-Trace Task",
        "Host": "pinky19.mpi-sws.org",
        "HRT": 26966805093631292,
        "Operation": "set",
        "Timestamp": "1557750445033.887939",
        "TenantClass": 0,
        "Source": "Client.java:1104",
        "ThreadID": 1,
        "ThreadName": "",
        "EventID": "D3F131BEA03B6C6C",
        "ProcessID": 2801
      },
      {
        "Cycles": 0,
        "Agent": "Execution-CPU",
        "ProcessName": "Name",
        "TaskID": "300DC1A897B860AB",
        "ParentEventID": [
          "A13F78A8D6AA2CB7"
        ],
        "Label": "set",
        "Title": "X-Trace Task",
        "Host": "pinky19.mpi-sws.org",
        "HRT": 26966805093690245,
        "Operation": "set",
        "Timestamp": "1557750445033.945557",
        "TenantClass": 0,
        "Source": "Server.java:1840",
        "ThreadID": 48,
        "ThreadName": "",
        "EventID": "E2A13B6DB31708FE",
        "BaggageBytes": "[[248 5] [240 0] [0 48 13 193 168 151 184 96 171] [240 1] [0 161 63 120 168 214 170 44 183] [240 3] [0 2]]",
        "ProcessID": 2171
      },
      {
        "Cycles": 0,
        "Agent": "edu.brown.cs.systems.xtrace.logging.BaggageWrappers",
        "ProcessName": "Name",
        "TaskID": "300DC1A897B860AB",
        "ParentEventID": [
          "E2A13B6DB31708FE"
        ],
        "Label": "Forking current baggage with Baggage.fork()",
        "Title": "X-Trace Task",
        "Host": "pinky19.mpi-sws.org",
        "HRT": 26966805093720696,
        "Operation": "fork",
        "Timestamp": "1557750445033.976074",
        "TenantClass": 0,
        "Source": "Server.java:550",
        "ThreadID": 48,
        "ThreadName": "",
        "EventID": "B52A6E1EFC1418B0",
        "BaggageBytes": "[[248 5] [240 0] [0 48 13 193 168 151 184 96 171] [240 1] [0 226 161 59 109 179 23 8 254] [240 3] [0 2]]",
        "ProcessID": 2171
      },
      {
        "Cycles": 0,
        "Agent": "Execution-CPU",
        "ProcessName": "Name",
        "TaskID": "300DC1A897B860AB",
        "ParentEventID": [
          "B52A6E1EFC1418B0"
        ],
        "Label": "set",
        "Title": "X-Trace Task",
        "Host": "pinky19.mpi-sws.org",
        "HRT": 26966805093752447,
        "Operation": "set",
        "Timestamp": "1557750445034.007812",
        "TenantClass": 0,
        "Source": "Server.java:2071",
        "ThreadID": 57,
        "ThreadName": "",
        "EventID": "E2C2D6BD4C562AB0",
        "BaggageBytes": "[[248 5] [240 0] [0 48 13 193 168 151 184 96 171] [240 1] [0 181 42 110 30 252 20 24 176] [240 3] [0 2]]",
        "ProcessID": 2171
      },
      {
        "Cycles": 0,
        "Agent": "Execution-CPU",
        "ProcessName": "Name",
        "TaskID": "300DC1A897B860AB",
        "ParentEventID": [
          "B52A6E1EFC1418B0"
        ],
        "Label": "unset",
        "Title": "X-Trace Task",
        "Host": "pinky19.mpi-sws.org",
        "Duration": "25739",
        "HRT": 26966805093742353,
        "Operation": "unset",
        "Timestamp": "1557750445033.997559",
        "TenantClass": 0,
        "Source": "Server.java:1828",
        "ThreadID": 48,
        "ThreadName": "",
        "EventID": "4DD3B6BDDEC1DEF0",
        "BaggageBytes": "[[248 5] [240 0] [0 48 13 193 168 151 184 96 171] [240 1] [0 181 42 110 30 252 20 24 176] [240 3] [0 2]]",
        "ProcessID": 2171
      },
      {
        "Cycles": 0,
        "Agent": "org.apache.hadoop.ipc.Server",
        "ProcessName": "Name",
        "TaskID": "300DC1A897B860AB",
        "ParentEventID": [
          "E2C2D6BD4C562AB0"
        ],
        "Label": "getBlockLocations in org.apache.hadoop.hdfs.protocol.ClientProtocol",
        "Title": "X-Trace Task",
        "Host": "pinky19.mpi-sws.org",
        "HRT": 26966805093787530,
        "Timestamp": "1557750445034.042725",
        "TenantClass": 0,
        "Source": "ProtobufRpcEngine.java:601",
        "ThreadID": 57,
        "ThreadName": "",
        "EventID": "CCDCF5F42099F26A",
        "BaggageBytes": "[[248 5] [240 0] [0 48 13 193 168 151 184 96 171] [240 1] [0 226 194 214 189 76 86 42 176] [240 3] [0 2]]",
        "ProcessID": 2171
      },
      {
        "Cycles": 0,
        "Agent": "edu.brown.cs.systems.xtrace.logging.BaggageWrappers",
        "ProcessName": "Name",
        "TaskID": "300DC1A897B860AB",
        "ParentEventID": [
          "A8A5E3300FCC4132"
        ],
        "Label": "Forking current baggage with Baggage.fork()",
        "Title": "X-Trace Task",
        "Host": "pinky19.mpi-sws.org",
        "HRT": 26966805093873402,
        "Operation": "fork",
        "Timestamp": "1557750445034.128662",
        "TenantClass": 0,
        "Source": "Server.java:2398",
        "ThreadID": 57,
        "ThreadName": "",
        "EventID": "6552CDA1BB44286A",
        "BaggageBytes": "[[248 5] [240 0] [0 48 13 193 168 151 184 96 171] [240 1] [0 168 165 227 48 15 204 65 50] [240 3] [0 2]]",
        "ProcessID": 2171
      },
      {
        "Cycles": 0,
        "Agent": "Execution-CPU",
        "ProcessName": "Name",
        "TaskID": "300DC1A897B860AB",
        "ParentEventID": [
          "6552CDA1BB44286A"
        ],
        "Label": "unset",
        "Title": "X-Trace Task",
        "Host": "pinky19.mpi-sws.org",
        "Duration": "200430",
        "HRT": 26966805093976011,
        "Operation": "unset",
        "Timestamp": "1557750445034.231201",
        "TenantClass": 0,
        "Source": "Server.java:1058",
        "ThreadID": 57,
        "ThreadName": "",
        "EventID": "D81303393F79B7CF",
        "BaggageBytes": "[[248 5] [240 0] [0 48 13 193 168 151 184 96 171] [240 1] [0 101 82 205 161 187 68 40 106] [240 3] [0 2]]",
        "ProcessID": 2171
      },
      {
        "Cycles": 0,
        "Agent": "org.apache.hadoop.hdfs.server.namenode.FSNamesystem.audit",
        "ProcessName": "Name",
        "TaskID": "300DC1A897B860AB",
        "ParentEventID": [
          "CCDCF5F42099F26A"
        ],
        "Label": "allowed=true\tugi=plascas (auth:SIMPLE)\tip=/139.19.171.63\tcmd=open\tsrc=/ds/E260jR3Ue6Z47CKR\tdst=null\tperm=null\tproto=rpc",
        "Title": "X-Trace Task",
        "Host": "pinky19.mpi-sws.org",
        "HRT": 26966805093830970,
        "Timestamp": "1557750445034.086182",
        "TenantClass": 0,
        "Source": "FSNamesystem.java:8313",
        "ThreadID": 57,
        "ThreadName": "",
        "EventID": "A8A5E3300FCC4132",
        "BaggageBytes": "[[248 5] [240 0] [0 48 13 193 168 151 184 96 171] [240 1] [0 204 220 245 244 32 153 242 106] [240 3] [0 2]]",
        "ProcessID": 2171
      },
      {
        "Cycles": 0,
        "Agent": "Execution-CPU",
        "ProcessName": "Read",
        "TaskID": "300DC1A897B860AB",
        "ParentEventID": [
          "6552CDA1BB44286A"
        ],
        "Label": "set",
        "Title": "X-Trace Task",
        "Host": "pinky19.mpi-sws.org",
        "HRT": 26966805094015507,
        "Operation": "set",
        "Timestamp": "1557750445034.272217",
        "TenantClass": 0,
        "Source": "Client.java:302",
        "ThreadID": 40,
        "ThreadName": "",
        "EventID": "80F8679C996F29A0",
        "ProcessID": 2801
      },
      {
        "Cycles": 0,
        "Agent": "Execution-Sleep",
        "ProcessName": "Read",
        "TaskID": "300DC1A897B860AB",
        "ParentEventID": [
          "D3F131BEA03B6C6C"
        ],
        "Label": "waited",
        "Title": "X-Trace Task",
        "Host": "pinky19.mpi-sws.org",
        "Duration": "415191",
        "HRT": 26966805094055152,
        "Operation": "waited",
        "Timestamp": "1557750445034.311768",
        "TenantClass": 0,
        "Source": "Client.java:1537",
        "ThreadID": 1,
        "ThreadName": "",
        "EventID": "CF3013881646D155",
        "ProcessID": 2801
      },
      {
        "Cycles": 0,
        "Agent": "Execution-CPU",
        "ProcessName": "Read",
        "TaskID": "300DC1A897B860AB",
        "ParentEventID": [
          "80F8679C996F29A0"
        ],
        "Label": "unset",
        "Title": "X-Trace Task",
        "Host": "pinky19.mpi-sws.org",
        "Duration": "5651",
        "HRT": 26966805094034136,
        "Operation": "unset",
        "Timestamp": "1557750445034.290771",
        "TenantClass": 0,
        "Source": "Client.java:1168",
        "ThreadID": 40,
        "ThreadName": "",
        "EventID": "B776D0909E460A37",
        "ProcessID": 2801
      },
      {
        "Cycles": 0,
        "Agent": "org.apache.hadoop.ipc.ProtobufRpcEngine",
        "ProcessName": "Read",
        "TaskID": "300DC1A897B860AB",
        "ParentEventID": [
          "97E754204F4CAFE5"
        ],
        "Label": "org.apache.hadoop.hdfs.protocol.ClientProtocol.getBlockLocations completed",
        "Title": "X-Trace Task",
        "Host": "pinky19.mpi-sws.org",
        "HRT": 26966805094118772,
        "Timestamp": "1557750445034.375488",
        "TenantClass": 0,
        "Source": "ProtobufRpcEngine.java:275",
        "ThreadID": 1,
        "ThreadName": "",
        "EventID": "E3C6460610CD079E",
        "ProcessID": 2801
      },
      {
        "Cycles": 0,
        "Agent": "Execution-Sleep",
        "ProcessName": "Read",
        "TaskID": "300DC1A897B860AB",
        "ParentEventID": [
          "E3C6460610CD079E"
        ],
        "Label": "waited",
        "Title": "X-Trace Task",
        "Host": "pinky19.mpi-sws.org",
        "Duration": "4462",
        "HRT": 26966805094226588,
        "Operation": "waited",
        "Timestamp": "1557750445034.483154",
        "TenantClass": 0,
        "Source": "SocketIOWithTimeout.java:335",
        "ThreadID": 1,
        "ThreadName": "",
        "EventID": "1E61D105FF5ECF6F",
        "ProcessID": 2801
      },
      {
        "Cycles": 0,
        "Agent": "edu.brown.cs.systems.xtrace.logging.BaggageWrappers",
        "ProcessName": "Read",
        "TaskID": "300DC1A897B860AB",
        "ParentEventID": [
          "B776D0909E460A37",
          "CF3013881646D155"
        ],
        "Label": "Merged current baggage with other baggage",
        "Title": "X-Trace Task",
        "Host": "pinky19.mpi-sws.org",
        "HRT": 26966805094065557,
        "Operation": "join",
        "Timestamp": "1557750445034.322266",
        "TenantClass": 0,
        "Source": "Client.java:1545",
        "ThreadID": 1,
        "ThreadName": "",
        "EventID": "97E754204F4CAFE5",
        "ProcessID": 2801
      },
      {
        "Cycles": 0,
        "Agent": "edu.brown.cs.systems.xtrace.logging.BaggageWrappers",
        "ProcessName": "Read",
        "TaskID": "300DC1A897B860AB",
        "ParentEventID": [
          "1E61D105FF5ECF6F"
        ],
        "Label": "Forking current baggage with Baggage.fork()",
        "Title": "X-Trace Task",
        "Host": "pinky19.mpi-sws.org",
        "HRT": 26966805094263478,
        "Operation": "fork",
        "Timestamp": "1557750445034.520020",
        "TenantClass": 0,
        "Source": "DataTransferProtoUtil.java:94",
        "ThreadID": 1,
        "ThreadName": "",
        "EventID": "EE65F7B5E25AC906",
        "ProcessID": 2801
      },
      {
        "Cycles": 0,
        "Agent": "edu.brown.cs.systems.xtrace.logging.XTraceInit",
        "ProcessName": "Data",
        "TaskID": "300DC1A897B860AB",
        "ParentEventID": [
          "EC91ED64485C69D8"
        ],
        "Label": "Thread.setName: DataXceiver for client DFSClient_NONMAPREDUCE_310321604_1 at /139.19.171.63:34884 [Sending block BP-1633380353-139.19.171.63-1554193446451:blk_1073761907_21083]",
        "Title": "X-Trace Task",
        "Host": "pinky19.mpi-sws.org",
        "HRT": 26966805094521374,
        "Timestamp": "1557750445034.788086",
        "TenantClass": 0,
        "Source": "DataXceiver.java:168",
        "ThreadID": 39056,
        "ThreadName": "",
        "EventID": "E017D7C2AD037BF0",
        "BaggageBytes": "[[248 5] [240 0] [0 48 13 193 168 151 184 96 171] [240 1] [0 236 145 237 100 72 92 105 216] [240 3] [0 2]]",
        "ProcessID": 2319
      },
      {
        "Cycles": 0,
        "Agent": "Execution-CPU",
        "ProcessName": "Data",
        "TaskID": "300DC1A897B860AB",
        "ParentEventID": [
          "EE65F7B5E25AC906"
        ],
        "Label": "set",
        "Title": "X-Trace Task",
        "Host": "pinky19.mpi-sws.org",
        "HRT": 26966805094481834,
        "Operation": "set",
        "Timestamp": "1557750445034.748535",
        "TenantClass": 0,
        "Source": "Receiver.java:117",
        "ThreadID": 39056,
        "ThreadName": "",
        "EventID": "EC91ED64485C69D8",
        "BaggageBytes": "[[248 5] [240 0] [0 48 13 193 168 151 184 96 171] [240 1] [0 238 101 247 181 226 90 201 6] [240 3] [0 2]]",
        "ProcessID": 2319
      },
      {
        "Cycles": 0,
        "Agent": "edu.brown.cs.systems.xtrace.logging.BaggageWrappers",
        "ProcessName": "Data",
        "TaskID": "300DC1A897B860AB",
        "ParentEventID": [
          "E017D7C2AD037BF0"
        ],
        "Label": "Forking current baggage with Baggage.fork()",
        "Title": "X-Trace Task",
        "Host": "pinky19.mpi-sws.org",
        "HRT": 26966805094601285,
        "Operation": "fork",
        "Timestamp": "1557750445034.868164",
        "TenantClass": 0,
        "Source": "DataXceiver.java:1257",
        "ThreadID": 39056,
        "ThreadName": "",
        "EventID": "1A0C65406A965222",
        "BaggageBytes": "[[248 5] [240 0] [0 48 13 193 168 151 184 96 171] [240 1] [0 224 23 215 194 173 3 123 240] [240 3] [0 2]]",
        "ProcessID": 2319
      },
      {
        "Cycles": 0,
        "Agent": "Execution-Sleep",
        "ProcessName": "Read",
        "TaskID": "300DC1A897B860AB",
        "ParentEventID": [
          "EE65F7B5E25AC906"
        ],
        "Label": "waited",
        "Title": "X-Trace Task",
        "Host": "pinky19.mpi-sws.org",
        "Duration": "304822",
        "HRT": 26966805094666163,
        "Operation": "waited",
        "Timestamp": "1557750445034.922852",
        "TenantClass": 0,
        "Source": "SocketIOWithTimeout.java:335",
        "ThreadID": 1,
        "ThreadName": "",
        "EventID": "4BD608DB0FB4F08F",
        "ProcessID": 2801
      },
      {
        "Cycles": 0,
        "Agent": "edu.brown.cs.systems.xtrace.logging.BaggageWrappers",
        "ProcessName": "Read",
        "TaskID": "300DC1A897B860AB",
        "ParentEventID": [
          "1A0C65406A965222",
          "4BD608DB0FB4F08F"
        ],
        "Label": "Merged current baggage with other baggage",
        "Title": "X-Trace Task",
        "Host": "pinky19.mpi-sws.org",
        "HRT": 26966805094731723,
        "Operation": "join",
        "Timestamp": "1557750445034.988281",
        "TenantClass": 0,
        "Source": "RemoteBlockReader2.java:429",
        "ThreadID": 1,
        "ThreadName": "",
        "EventID": "EE6B040136748ADC",
        "ProcessID": 2801
      },
      {
        "Cycles": 0,
        "Agent": "edu.brown.cs.systems.xtrace.logging.BaggageWrappers",
        "ProcessName": "Data",
        "TaskID": "300DC1A897B860AB",
        "ParentEventID": [
          "1A0C65406A965222"
        ],
        "Label": "Forking current baggage with Baggage.fork()",
        "Title": "X-Trace Task",
        "Host": "pinky19.mpi-sws.org",
        "HRT": 26966805094672434,
        "Operation": "fork",
        "Timestamp": "1557750445034.939209",
        "TenantClass": 0,
        "Source": "PacketHeader.java:95",
        "ThreadID": 39056,
        "ThreadName": "",
        "EventID": "296910A41CDAF8AD",
        "BaggageBytes": "[[248 5] [240 0] [0 48 13 193 168 151 184 96 171] [240 1] [0 26 12 101 64 106 150 82 34] [240 3] [0 2]]",
        "ProcessID": 2319
      },
      {
        "Cycles": 0,
        "Agent": "Execution-Sleep",
        "ProcessName": "Data",
        "TaskID": "300DC1A897B860AB",
        "ParentEventID": [
          "296910A41CDAF8AD"
        ],
        "Label": "waited",
        "Title": "X-Trace Task",
        "Host": "pinky19.mpi-sws.org",
        "Duration": "5219",
        "HRT": 26966805094739575,
        "Operation": "waited",
        "Timestamp": "1557750445035.006348",
        "TenantClass": 0,
        "Source": "SocketIOWithTimeout.java:335",
        "ThreadID": 39056,
        "ThreadName": "",
        "EventID": "1E7207A08CE125D9",
        "BaggageBytes": "[[248 5] [240 0] [0 48 13 193 168 151 184 96 171] [240 1] [0 41 105 16 164 28 218 248 173] [240 3] [0 2]]",
        "ProcessID": 2319
      },
      {
        "Cycles": 0,
        "Agent": "edu.brown.cs.systems.xtrace.logging.BaggageWrappers",
        "ProcessName": "Data",
        "TaskID": "300DC1A897B860AB",
        "ParentEventID": [
          "1E7207A08CE125D9"
        ],
        "Label": "Forking current baggage with Baggage.fork()",
        "Title": "X-Trace Task",
        "Host": "pinky19.mpi-sws.org",
        "HRT": 26966805094823503,
        "Operation": "fork",
        "Timestamp": "1557750445035.090332",
        "TenantClass": 0,
        "Source": "PacketHeader.java:95",
        "ThreadID": 39056,
        "ThreadName": "",
        "EventID": "C46D78D9E2170012",
        "BaggageBytes": "[[248 5] [240 0] [0 48 13 193 168 151 184 96 171] [240 1] [0 30 114 7 160 140 225 37 217] [240 3] [0 2]]",
        "ProcessID": 2319
      },
      {
        "Cycles": 0,
        "Agent": "edu.brown.cs.systems.xtrace.logging.BaggageWrappers",
        "ProcessName": "Read",
        "TaskID": "300DC1A897B860AB",
        "ParentEventID": [
          "11B493D8DA4BC396",
          "296910A41CDAF8AD"
        ],
        "Label": "Merged current baggage with other baggage",
        "Title": "X-Trace Task",
        "Host": "pinky19.mpi-sws.org",
        "HRT": 26966805094857328,
        "Operation": "join",
        "Timestamp": "1557750445035.114014",
        "TenantClass": 0,
        "Source": "PacketHeader.java:168",
        "ThreadID": 1,
        "ThreadName": "",
        "EventID": "2243A55B93A13C27",
        "ProcessID": 2801
      },
      {
        "Cycles": 0,
        "Agent": "Execution-Sleep",
        "ProcessName": "Read",
        "TaskID": "300DC1A897B860AB",
        "ParentEventID": [
          "EE6B040136748ADC"
        ],
        "Label": "waited",
        "Title": "X-Trace Task",
        "Host": "pinky19.mpi-sws.org",
        "Duration": "4005",
        "HRT": 26966805094807822,
        "Operation": "waited",
        "Timestamp": "1557750445035.064453",
        "TenantClass": 0,
        "Source": "SocketIOWithTimeout.java:335",
        "ThreadID": 1,
        "ThreadName": "",
        "EventID": "11B493D8DA4BC396",
        "ProcessID": 2801
      },
      {
        "Cycles": 0,
        "Agent": "edu.brown.cs.systems.xtrace.logging.BaggageWrappers",
        "ProcessName": "Read",
        "TaskID": "300DC1A897B860AB",
        "ParentEventID": [
          "C46D78D9E2170012",
          "2243A55B93A13C27"
        ],
        "Label": "Merged current baggage with other baggage",
        "Title": "X-Trace Task",
        "Host": "pinky19.mpi-sws.org",
        "HRT": 26966805094961809,
        "Operation": "join",
        "Timestamp": "1557750445035.218506",
        "TenantClass": 0,
        "Source": "PacketHeader.java:168",
        "ThreadID": 1,
        "ThreadName": "",
        "EventID": "394580C3239D0D7C",
        "ProcessID": 2801
      },
      {
        "Cycles": 0,
        "Agent": "Execution-Sleep",
        "ProcessName": "Data",
        "TaskID": "300DC1A897B860AB",
        "ParentEventID": [
          "C46D78D9E2170012"
        ],
        "Label": "waited",
        "Title": "X-Trace Task",
        "Host": "pinky19.mpi-sws.org",
        "Duration": "104159",
        "HRT": 26966805095012894,
        "Operation": "waited",
        "Timestamp": "1557750445035.279785",
        "TenantClass": 0,
        "Source": "SocketIOWithTimeout.java:335",
        "ThreadID": 39056,
        "ThreadName": "",
        "EventID": "AD7ACC6FFBF7D66F",
        "BaggageBytes": "[[248 5] [240 0] [0 48 13 193 168 151 184 96 171] [240 1] [0 196 109 120 217 226 23 0 18] [240 3] [0 2]]",
        "ProcessID": 2319
      },
      {
        "Cycles": 0,
        "Agent": "edu.brown.cs.systems.xtrace.logging.BaggageWrappers",
        "ProcessName": "Read",
        "TaskID": "300DC1A897B860AB",
        "ParentEventID": [
          "91B6F1CDD0FBE1D6"
        ],
        "Label": "Forking current baggage with Baggage.fork()",
        "Title": "X-Trace Task",
        "Host": "pinky19.mpi-sws.org",
        "HRT": 26966805095025612,
        "Operation": "fork",
        "Timestamp": "1557750445035.282227",
        "TenantClass": 0,
        "Source": "DataTransferProtoUtil.java:94",
        "ThreadID": 1,
        "ThreadName": "",
        "EventID": "5CEE8F0126F2C138",
        "ProcessID": 2801
      },
      {
        "Cycles": 0,
        "Agent": "edu.brown.cs.systems.xtrace.logging.BaggageWrappers",
        "ProcessName": "Read",
        "TaskID": "300DC1A897B860AB",
        "ParentEventID": [
          "394580C3239D0D7C"
        ],
        "Label": "Forking current baggage with Baggage.fork()",
        "Title": "X-Trace Task",
        "Host": "pinky19.mpi-sws.org",
        "HRT": 26966805094970415,
        "Operation": "fork",
        "Timestamp": "1557750445035.227051",
        "TenantClass": 0,
        "Source": "RemoteBlockReader2.java:361",
        "ThreadID": 1,
        "ThreadName": "",
        "EventID": "91B6F1CDD0FBE1D6",
        "ProcessID": 2801
      },
      {
        "Cycles": 0,
        "Agent": "edu.brown.cs.systems.xtrace.logging.BaggageWrappers",
        "ProcessName": "Data",
        "TaskID": "300DC1A897B860AB",
        "ParentEventID": [
          "91B6F1CDD0FBE1D6",
          "AD7ACC6FFBF7D66F"
        ],
        "Label": "Merged current baggage with other baggage",
        "Title": "X-Trace Task",
        "Host": "pinky19.mpi-sws.org",
        "HRT": 26966805095066031,
        "Operation": "join",
        "Timestamp": "1557750445035.332764",
        "TenantClass": 0,
        "Source": "DataXceiver.java:574",
        "ThreadID": 39056,
        "ThreadName": "",
        "EventID": "F40A68BF1A368FFE",
        "BaggageBytes": "[[248 5] [240 0] [0 48 13 193 168 151 184 96 171] [240 1] [0 145 182 241 205 208 251 225 214] [0 173 122 204 111 251 247 214 111] [240 3] [0 2]]",
        "ProcessID": 2319
      },
      {
        "Cycles": 0,
        "Agent": "Execution-CPU",
        "ProcessName": "Data",
        "TaskID": "300DC1A897B860AB",
        "ParentEventID": [
          "5CEE8F0126F2C138"
        ],
        "Label": "set",
        "Title": "X-Trace Task",
        "Host": "pinky19.mpi-sws.org",
        "HRT": 26966805095139227,
        "Operation": "set",
        "Timestamp": "1557750445035.406006",
        "TenantClass": 0,
        "Source": "Receiver.java:117",
        "ThreadID": 39056,
        "ThreadName": "",
        "EventID": "7925A389694CD470",
        "BaggageBytes": "[[248 5] [240 0] [0 48 13 193 168 151 184 96 171] [240 1] [0 92 238 143 1 38 242 193 56] [240 3] [0 2]]",
        "ProcessID": 2319
      },
      {
        "Cycles": 0,
        "Agent": "edu.brown.cs.systems.xtrace.logging.XTraceInit",
        "ProcessName": "Data",
        "TaskID": "300DC1A897B860AB",
        "ParentEventID": [
          "7925A389694CD470"
        ],
        "Label": "Thread.setName: DataXceiver for client DFSClient_NONMAPREDUCE_310321604_1 at /139.19.171.63:34884 [Sending block BP-1633380353-139.19.171.63-1554193446451:blk_1073761907_21083]",
        "Title": "X-Trace Task",
        "Host": "pinky19.mpi-sws.org",
        "HRT": 26966805095166503,
        "Timestamp": "1557750445035.433350",
        "TenantClass": 0,
        "Source": "DataXceiver.java:168",
        "ThreadID": 39056,
        "ThreadName": "",
        "EventID": "75AEF73B91D66DE2",
        "BaggageBytes": "[[248 5] [240 0] [0 48 13 193 168 151 184 96 171] [240 1] [0 121 37 163 137 105 76 212 112] [240 3] [0 2]]",
        "ProcessID": 2319
      },
      {
        "Cycles": 0,
        "Agent": "Execution-CPU",
        "ProcessName": "Data",
        "TaskID": "300DC1A897B860AB",
        "ParentEventID": [
          "F40A68BF1A368FFE"
        ],
        "Label": "unset",
        "Title": "X-Trace Task",
        "Host": "pinky19.mpi-sws.org",
        "Duration": "578639",
        "HRT": 26966805095088189,
        "Operation": "unset",
        "Timestamp": "1557750445035.354980",
        "TenantClass": 0,
        "Source": "DataXceiver.java:261",
        "ThreadID": 39056,
        "ThreadName": "",
        "EventID": "C708E13B81AABDC6",
        "BaggageBytes": "[[248 5] [240 0] [0 48 13 193 168 151 184 96 171] [240 1] [0 244 10 104 191 26 54 143 254] [240 3] [0 2]]",
        "ProcessID": 2319
      },
      {
        "Cycles": 0,
        "Agent": "edu.brown.cs.systems.xtrace.logging.BaggageWrappers",
        "ProcessName": "Data",
        "TaskID": "300DC1A897B860AB",
        "ParentEventID": [
          "75AEF73B91D66DE2"
        ],
        "Label": "Forking current baggage with Baggage.fork()",
        "Title": "X-Trace Task",
        "Host": "pinky19.mpi-sws.org",
        "HRT": 26966805095229210,
        "Operation": "fork",
        "Timestamp": "1557750445035.496094",
        "TenantClass": 0,
        "Source": "DataXceiver.java:1257",
        "ThreadID": 39056,
        "ThreadName": "",
        "EventID": "08477EF082D9605F",
        "BaggageBytes": "[[248 5] [240 0] [0 48 13 193 168 151 184 96 171] [240 1] [0 117 174 247 59 145 214 109 226] [240 3] [0 2]]",
        "ProcessID": 2319
      },
      {
        "Cycles": 0,
        "Agent": "edu.brown.cs.systems.xtrace.logging.BaggageWrappers",
        "ProcessName": "Data",
        "TaskID": "300DC1A897B860AB",
        "ParentEventID": [
          "08477EF082D9605F"
        ],
        "Label": "Forking current baggage with Baggage.fork()",
        "Title": "X-Trace Task",
        "Host": "pinky19.mpi-sws.org",
        "HRT": 26966805095285666,
        "Operation": "fork",
        "Timestamp": "1557750445035.552490",
        "TenantClass": 0,
        "Source": "PacketHeader.java:95",
        "ThreadID": 39056,
        "ThreadName": "",
        "EventID": "913EED943CCB47E0",
        "BaggageBytes": "[[248 5] [240 0] [0 48 13 193 168 151 184 96 171] [240 1] [0 8 71 126 240 130 217 96 95] [240 3] [0 2]]",
        "ProcessID": 2319
      },
      {
        "Cycles": 0,
        "Agent": "Execution-Sleep",
        "ProcessName": "Read",
        "TaskID": "300DC1A897B860AB",
        "ParentEventID": [
          "5CEE8F0126F2C138"
        ],
        "Label": "waited",
        "Title": "X-Trace Task",
        "Host": "pinky19.mpi-sws.org",
        "Duration": "190347",
        "HRT": 26966805095285055,
        "Operation": "waited",
        "Timestamp": "1557750445035.541748",
        "TenantClass": 0,
        "Source": "SocketIOWithTimeout.java:335",
        "ThreadID": 1,
        "ThreadName": "",
        "EventID": "27781BAFF2C6423B",
        "ProcessID": 2801
      },
      {
        "Cycles": 0,
        "Agent": "edu.brown.cs.systems.xtrace.logging.BaggageWrappers",
        "ProcessName": "Read",
        "TaskID": "300DC1A897B860AB",
        "ParentEventID": [
          "27781BAFF2C6423B",
          "08477EF082D9605F"
        ],
        "Label": "Merged current baggage with other baggage",
        "Title": "X-Trace Task",
        "Host": "pinky19.mpi-sws.org",
        "HRT": 26966805095345384,
        "Operation": "join",
        "Timestamp": "1557750445035.602051",
        "TenantClass": 0,
        "Source": "RemoteBlockReader2.java:429",
        "ThreadID": 1,
        "ThreadName": "",
        "EventID": "3FA0670EA4C1DA52",
        "ProcessID": 2801
      },
      {
        "Cycles": 0,
        "Agent": "edu.brown.cs.systems.xtrace.logging.BaggageWrappers",
        "ProcessName": "Data",
        "TaskID": "300DC1A897B860AB",
        "ParentEventID": [
          "52456114CDAA9FCA"
        ],
        "Label": "Forking current baggage with Baggage.fork()",
        "Title": "X-Trace Task",
        "Host": "pinky19.mpi-sws.org",
        "HRT": 26966805095407667,
        "Operation": "fork",
        "Timestamp": "1557750445035.674561",
        "TenantClass": 0,
        "Source": "PacketHeader.java:95",
        "ThreadID": 39056,
        "ThreadName": "",
        "EventID": "7B225BD717230E27",
        "BaggageBytes": "[[248 5] [240 0] [0 48 13 193 168 151 184 96 171] [240 1] [0 82 69 97 20 205 170 159 202] [240 3] [0 2]]",
        "ProcessID": 2319
      },
      {
        "Cycles": 0,
        "Agent": "edu.brown.cs.systems.xtrace.logging.BaggageWrappers",
        "ProcessName": "Read",
        "TaskID": "300DC1A897B860AB",
        "ParentEventID": [
          "3FA0670EA4C1DA52",
          "913EED943CCB47E0"
        ],
        "Label": "Merged current baggage with other baggage",
        "Title": "X-Trace Task",
        "Host": "pinky19.mpi-sws.org",
        "HRT": 26966805095443474,
        "Operation": "join",
        "Timestamp": "1557750445035.700195",
        "TenantClass": 0,
        "Source": "PacketHeader.java:168",
        "ThreadID": 1,
        "ThreadName": "",
        "EventID": "46A67AB2A1B653BA",
        "ProcessID": 2801
      },
      {
        "Cycles": 0,
        "Agent": "Execution-Sleep",
        "ProcessName": "Data",
        "TaskID": "300DC1A897B860AB",
        "ParentEventID": [
          "913EED943CCB47E0"
        ],
        "Label": "waited",
        "Title": "X-Trace Task",
        "Host": "pinky19.mpi-sws.org",
        "Duration": "4333",
        "HRT": 26966805095343159,
        "Operation": "waited",
        "Timestamp": "1557750445035.609863",
        "TenantClass": 0,
        "Source": "SocketIOWithTimeout.java:335",
        "ThreadID": 39056,
        "ThreadName": "",
        "EventID": "52456114CDAA9FCA",
        "BaggageBytes": "[[248 5] [240 0] [0 48 13 193 168 151 184 96 171] [240 1] [0 145 62 237 148 60 203 71 224] [240 3] [0 2]]",
        "ProcessID": 2319
      },
      {
        "Cycles": 0,
        "Agent": "Execution-Sleep",
        "ProcessName": "Data",
        "TaskID": "300DC1A897B860AB",
        "ParentEventID": [
          "7B225BD717230E27"
        ],
        "Label": "waited",
        "Title": "X-Trace Task",
        "Host": "pinky19.mpi-sws.org",
        "Duration": "3512",
        "HRT": 26966805095461974,
        "Operation": "waited",
        "Timestamp": "1557750445035.728760",
        "TenantClass": 0,
        "Source": "SocketIOWithTimeout.java:335",
        "ThreadID": 39056,
        "ThreadName": "",
        "EventID": "7B7BB89E35ACD70C",
        "BaggageBytes": "[[248 5] [240 0] [0 48 13 193 168 151 184 96 171] [240 1] [0 123 34 91 215 23 35 14 39] [240 3] [0 2]]",
        "ProcessID": 2319
      },
      {
        "Cycles": 0,
        "Agent": "edu.brown.cs.systems.xtrace.logging.BaggageWrappers",
        "ProcessName": "Data",
        "TaskID": "300DC1A897B860AB",
        "ParentEventID": [
          "7B7BB89E35ACD70C"
        ],
        "Label": "Forking current baggage with Baggage.fork()",
        "Title": "X-Trace Task",
        "Host": "pinky19.mpi-sws.org",
        "HRT": 26966805095538395,
        "Operation": "fork",
        "Timestamp": "1557750445035.805176",
        "TenantClass": 0,
        "Source": "PacketHeader.java:95",
        "ThreadID": 39056,
        "ThreadName": "",
        "EventID": "A652C0CD2D20E5DC",
        "BaggageBytes": "[[248 5] [240 0] [0 48 13 193 168 151 184 96 171] [240 1] [0 123 123 184 158 53 172 215 12] [240 3] [0 2]]",
        "ProcessID": 2319
      },
      {
        "Cycles": 0,
        "Agent": "Execution-CPU",
        "ProcessName": "Data",
        "TaskID": "300DC1A897B860AB",
        "ParentEventID": [
          "A652C0CD2D20E5DC"
        ],
        "Label": "unset",
        "Title": "X-Trace Task",
        "Host": "pinky19.mpi-sws.org",
        "Duration": "493797",
        "HRT": 26966805095652628,
        "Operation": "unset",
        "Timestamp": "1557750445035.919434",
        "TenantClass": 0,
        "Source": "DataXceiver.java:261",
        "ThreadID": 39056,
        "ThreadName": "",
        "EventID": "EBECD324D9D94375",
        "BaggageBytes": "[[248 5] [240 0] [0 48 13 193 168 151 184 96 171] [240 1] [0 166 82 192 205 45 32 229 220] [240 3] [0 2]]",
        "ProcessID": 2319
      },
      {
        "Cycles": 0,
        "Agent": "edu.brown.cs.systems.retro.benchmarks.hdfs_client.Reader",
        "ProcessName": "Read",
        "TaskID": "300DC1A897B860AB",
        "ParentEventID": [
          "0"
        ],
        "Label": "Reading file",
        "Title": "X-Trace Task",
        "Host": "pinky19.mpi-sws.org",
        "HRT": 26966805093443638,
        "Timestamp": "1557750445033.700195",
        "TenantClass": 0,
        "ThreadID": 1,
        "ThreadName": "",
        "EventID": "3E1CD48DA0248001",
        "ProcessID": 2801,
        "Tag": [
          "reader_100kb",
          "Read Size: 102400"
        ]
      }
    ]
  }
]