[
  {
    "id": "67D45C0297EB3D29",
    "reports": [
      {
        "Cycles": 0,
        "Agent": "Execution-CPU",
        "ProcessName": "Read",
        "TaskID": "67D45C0297EB3D29",
        "ParentEventID": [
          "D79F7BA8E53BA8DE"
        ],
        "Label": "unset",
        "Title": "X-Trace Task",
        "Host": "pinky19.mpi-sws.org",
        "Duration": "22076700",
        "HRT": 26966756066947654,
        "Operation": "unset",
        "Timestamp": "1557750396006.814209",
        "TenantClass": 0,
        "Source": "Client.java:1027",
        "ThreadID": 1,
        "ThreadName": "",
        "EventID": "506E7BFAFD733A43",
        "ProcessID": 2801
      },
      {
        "Cycles": 0,
        "Agent": "org.apache.hadoop.ipc.ProtobufRpcEngine",
        "ProcessName": "Read",
        "TaskID": "67D45C0297EB3D29",
        "ParentEventID": [
          "A157EC78CE1D8F8C"
        ],
        "Label": "Invoking org.apache.hadoop.hdfs.protocol.ClientProtocol.getBlockLocations",
        "Title": "X-Trace Task",
        "Host": "pinky19.mpi-sws.org",
        "HRT": 26966756066918392,
        "Timestamp": "1557750396006.784912",
        "TenantClass": 0,
        "Source": "ProtobufRpcEngine.java:228",
        "ThreadID": 1,
        "ThreadName": "",
        "EventID": "D79F7BA8E53BA8DE",
        "ProcessID": 2801
      },
      {
        "Cycles": 0,
        "Agent": "Execution-CPU",
        "ProcessName": "Read",
        "TaskID": "67D45C0297EB3D29",
        "ParentEventID": [
          "506E7BFAFD733A43"
        ],
        "Label": "set",
        "Title": "X-Trace Task",
        "Host": "pinky19.mpi-sws.org",
        "HRT": 26966756067008466,
        "Operation": "set",
        "Timestamp": "1557750396006.875000",
        "TenantClass": 0,
        "Source": "Client.java:1032",
        "ThreadID": 41,
        "ThreadName": "",
        "EventID": "6D0C3A1317525970",
        "ProcessID": 2801
      },
      {
        "Cycles": 0,
        "Agent": "edu.brown.cs.systems.xtrace.logging.BaggageWrappers",
        "ProcessName": "Read",
        "TaskID": "67D45C0297EB3D29",
        "ParentEventID": [
          "6D0C3A1317525970"
        ],
        "Label": "Forking current baggage with Baggage.fork()",
        "Title": "X-Trace Task",
        "Host": "pinky19.mpi-sws.org",
        "HRT": 26966756067041634,
        "Operation": "fork",
        "Timestamp": "1557750396006.908203",
        "TenantClass": 0,
        "Source": "Client.java:1043",
        "ThreadID": 41,
        "ThreadName": "",
        "EventID": "E7E4073CB55EA4C0",
        "ProcessID": 2801
      },
      {
        "Cycles": 0,
        "Agent": "Execution-CPU",
        "ProcessName": "Read",
        "TaskID": "67D45C0297EB3D29",
        "ParentEventID": [
          "E7E4073CB55EA4C0"
        ],
        "Label": "unset",
        "Title": "X-Trace Task",
        "Host": "pinky19.mpi-sws.org",
        "Duration": "63957",
        "HRT": 26966756067105213,
        "Operation": "unset",
        "Timestamp": "1557750396006.971680",
        "TenantClass": 0,
        "Source": "Client.java:1062",
        "ThreadID": 41,
        "ThreadName": "",
        "EventID": "CE930FE56E2ADAE2",
        "ProcessID": 2801
      },
      {
        "Cycles": 0,
        "Agent": "edu.brown.cs.systems.retro.benchmarks.hdfs_client.Reader",
        "ProcessName": "Read",
        "TaskID": "67D45C0297EB3D29",
        "ParentEventID": [
          "40FDA7F571D87B6C"
        ],
        "Label": "Reading file",
        "Title": "X-Trace Task",
        "Host": "pinky19.mpi-sws.org",
        "HRT": 26966756066872791,
        "Timestamp": "1557750396006.739258",
        "TenantClass": 0,
        "ThreadID": 1,
        "ThreadName": "",
        "EventID": "A157EC78CE1D8F8C",
        "ProcessID": 2801
      },
      {
        "Cycles": 0,
        "Agent": "Execution-CPU",
        "ProcessName": "Name",
        "TaskID": "67D45C0297EB3D29",
        "ParentEventID": [
          "E7E4073CB55EA4C0"
        ],
        "Label": "set",
        "Title": "X-Trace Task",
        "Host": "pinky19.mpi-sws.org",
        "HRT": 26966756067184607,
        "Operation": "set",
        "Timestamp": "1557750396007.074463",
        "TenantClass": 0,
        "Source": "Server.java:1840",
        "ThreadID": 48,
        "ThreadName": "",
        "EventID": "0CEF85013E6769E8",
        "BaggageBytes": "[[248 5] [240 0] [0 103 212 92 2 151 235 61 41] [240 1] [0 231 228 7 60 181 94 164 192] [240 3] [0 2]]",
        "ProcessID": 2171
      },
      {
        "Cycles": 0,
        "Agent": "edu.brown.cs.systems.xtrace.logging.BaggageWrappers",
        "ProcessName": "Name",
        "TaskID": "67D45C0297EB3D29",
        "ParentEventID": [
          "0CEF85013E6769E8"
        ],
        "Label": "Forking current baggage with Baggage.fork()",
        "Title": "X-Trace Task",
        "Host": "pinky19.mpi-sws.org",
        "HRT": 26966756067216065,
        "Operation": "fork",
        "Timestamp": "1557750396007.105957",
        "TenantClass": 0,
        "Source": "Server.java:550",
        "ThreadID": 48,
        "ThreadName": "",
        "EventID": "A1A1590AAA40A39D",
        "BaggageBytes": "[[248 5] [240 0] [0 103 212 92 2 151 235 61 41] [240 1] [0 12 239 133 1 62 103 105 232] [240 3] [0 2]]",
        "ProcessID": 2171
      },
      {
        "Cycles": 0,
        "Agent": "Execution-CPU",
        "ProcessName": "Read",
        "TaskID": "67D45C0297EB3D29",
        "ParentEventID": [
          "CE930FE56E2ADAE2"
        ],
        "Label": "set",
        "Title": "X-Trace Task",
        "Host": "pinky19.mpi-sws.org",
        "HRT": 26966756067127471,
        "Operation": "set",
        "Timestamp": "1557750396006.993896",
        "TenantClass": 0,
        "Source": "Client.java:1104",
        "ThreadID": 1,
        "ThreadName": "",
        "EventID": "13F247CC2D6AB4DE",
        "ProcessID": 2801
      },
      {
        "Cycles": 0,
        "Agent": "Execution-CPU",
        "ProcessName": "Name",
        "TaskID": "67D45C0297EB3D29",
        "ParentEventID": [
          "A1A1590AAA40A39D"
        ],
        "Label": "set",
        "Title": "X-Trace Task",
        "Host": "pinky19.mpi-sws.org",
        "HRT": 26966756067248617,
        "Operation": "set",
        "Timestamp": "1557750396007.138672",
        "TenantClass": 0,
        "Source": "Server.java:2071",
        "ThreadID": 64,
        "ThreadName": "",
        "EventID": "3B929872BE71D39A",
        "BaggageBytes": "[[248 5] [240 0] [0 103 212 92 2 151 235 61 41] [240 1] [0 161 161 89 10 170 64 163 157] [240 3] [0 2]]",
        "ProcessID": 2171
      },
      {
        "Cycles": 0,
        "Agent": "org.apache.hadoop.ipc.Server",
        "ProcessName": "Name",
        "TaskID": "67D45C0297EB3D29",
        "ParentEventID": [
          "3B929872BE71D39A"
        ],
        "Label": "getBlockLocations in org.apache.hadoop.hdfs.protocol.ClientProtocol",
        "Title": "X-Trace Task",
        "Host": "pinky19.mpi-sws.org",
        "HRT": 26966756067288771,
        "Timestamp": "1557750396007.178711",
        "TenantClass": 0,
        "Source": "ProtobufRpcEngine.java:601",
        "ThreadID": 64,
        "ThreadName": "",
        "EventID": "622BAB5768ADC205",
        "BaggageBytes": "[[248 5] [240 0] [0 103 212 92 2 151 235 61 41] [240 1] [0 59 146 152 114 190 113 211 154] [240 3] [0 2]]",
        "ProcessID": 2171
      },
      {
        "Cycles": 0,
        "Agent": "Execution-CPU",
        "ProcessName": "Name",
        "TaskID": "67D45C0297EB3D29",
        "ParentEventID": [
          "A1A1590AAA40A39D"
        ],
        "Label": "unset",
        "Title": "X-Trace Task",
        "Host": "pinky19.mpi-sws.org",
        "Duration": "26208",
        "HRT": 26966756067238212,
        "Operation": "unset",
        "Timestamp": "1557750396007.128174",
        "TenantClass": 0,
        "Source": "Server.java:1828",
        "ThreadID": 48,
        "ThreadName": "",
        "EventID": "9B01062673313EE6",
        "BaggageBytes": "[[248 5] [240 0] [0 103 212 92 2 151 235 61 41] [240 1] [0 161 161 89 10 170 64 163 157] [240 3] [0 2]]",
        "ProcessID": 2171
      },
      {
        "Cycles": 0,
        "Agent": "org.apache.hadoop.hdfs.server.namenode.FSNamesystem.audit",
        "ProcessName": "Name",
        "TaskID": "67D45C0297EB3D29",
        "ParentEventID": [
          "622BAB5768ADC205"
        ],
        "Label": "allowed=true\tugi=plascas (auth:SIMPLE)\tip=/139.19.171.63\tcmd=open\tsrc=/ds/ZytVI7hHXjHVhKeV\tdst=null\tperm=null\tproto=rpc",
        "Title": "X-Trace Task",
        "Host": "pinky19.mpi-sws.org",
        "HRT": 26966756067338098,
        "Timestamp": "1557750396007.228027",
        "TenantClass": 0,
        "Source": "FSNamesystem.java:8313",
        "ThreadID": 64,
        "ThreadName": "",
        "EventID": "01F3ED9E5210AAD5",
        "BaggageBytes": "[[248 5] [240 0] [0 103 212 92 2 151 235 61 41] [240 1] [0 98 43 171 87 104 173 194 5] [240 3] [0 2]]",
        "ProcessID": 2171
      },
      {
        "Cycles": 0,
        "Agent": "Execution-CPU",
        "ProcessName": "Name",
        "TaskID": "67D45C0297EB3D29",
        "ParentEventID": [
          "0B006F73E70801DC"
        ],
        "Label": "unset",
        "Title": "X-Trace Task",
        "Host": "pinky19.mpi-sws.org",
        "Duration": "286404",
        "HRT": 26966756067563259,
        "Operation": "unset",
        "Timestamp": "1557750396007.453125",
        "TenantClass": 0,
        "Source": "Server.java:1058",
        "ThreadID": 64,
        "ThreadName": "",
        "EventID": "76AE87AFC8CFA0DF",
        "BaggageBytes": "[[248 5] [240 0] [0 103 212 92 2 151 235 61 41] [240 1] [0 11 0 111 115 231 8 1 220] [240 3] [0 2]]",
        "ProcessID": 2171
      },
      {
        "Cycles": 0,
        "Agent": "edu.brown.cs.systems.xtrace.logging.BaggageWrappers",
        "ProcessName": "Name",
        "TaskID": "67D45C0297EB3D29",
        "ParentEventID": [
          "01F3ED9E5210AAD5"
        ],
        "Label": "Forking current baggage with Baggage.fork()",
        "Title": "X-Trace Task",
        "Host": "pinky19.mpi-sws.org",
        "HRT": 26966756067429802,
        "Operation": "fork",
        "Timestamp": "1557750396007.319824",
        "TenantClass": 0,
        "Source": "Server.java:2398",
        "ThreadID": 64,
        "ThreadName": "",
        "EventID": "0B006F73E70801DC",
        "BaggageBytes": "[[248 5] [240 0] [0 103 212 92 2 151 235 61 41] [240 1] [0 1 243 237 158 82 16 170 213] [240 3] [0 2]]",
        "ProcessID": 2171
      },
      {
        "Cycles": 0,
        "Agent": "Execution-CPU",
        "ProcessName": "Read",
        "TaskID": "67D45C0297EB3D29",
        "ParentEventID": [
          "0B006F73E70801DC"
        ],
        "Label": "set",
        "Title": "X-Trace Task",
        "Host": "pinky19.mpi-sws.org",
        "HRT": 26966756067619876,
        "Operation": "set",
        "Timestamp": "1557750396007.486328",
        "TenantClass": 0,
        "Source": "Client.java:302",
        "ThreadID": 40,
        "ThreadName": "",
        "EventID": "E7BE25D170C79A44",
        "ProcessID": 2801
      },
      {
        "Cycles": 0,
        "Agent": "Execution-CPU",
        "ProcessName": "Read",
        "TaskID": "67D45C0297EB3D29",
        "ParentEventID": [
          "E7BE25D170C79A44"
        ],
        "Label": "unset",
        "Title": "X-Trace Task",
        "Host": "pinky19.mpi-sws.org",
        "Duration": "5404",
        "HRT": 26966756067642086,
        "Operation": "unset",
        "Timestamp": "1557750396007.508545",
        "TenantClass": 0,
        "Source": "Client.java:1168",
        "ThreadID": 40,
        "ThreadName": "",
        "EventID": "B3747F762134407E",
        "ProcessID": 2801
      },
      {
        "Cycles": 0,
        "Agent": "Execution-Sleep",
        "ProcessName": "Read",
        "TaskID": "67D45C0297EB3D29",
        "ParentEventID": [
          "13F247CC2D6AB4DE"
        ],
        "Label": "waited",
        "Title": "X-Trace Task",
        "Host": "pinky19.mpi-sws.org",
        "Duration": "520295",
        "HRT": 26966756067663196,
        "Operation": "waited",
        "Timestamp": "1557750396007.529785",
        "TenantClass": 0,
        "Source": "Client.java:1537",
        "ThreadID": 1,
        "ThreadName": "",
        "EventID": "9402F497665E81A8",
        "ProcessID": 2801
      },
      {
        "Cycles": 0,
        "Agent": "org.apache.hadoop.ipc.ProtobufRpcEngine",
        "ProcessName": "Read",
        "TaskID": "67D45C0297EB3D29",
        "ParentEventID": [
          "0E0215E94E908452"
        ],
        "Label": "org.apache.hadoop.hdfs.protocol.ClientProtocol.getBlockLocations completed",
        "Title": "X-Trace Task",
        "Host": "pinky19.mpi-sws.org",
        "HRT": 26966756067719237,
        "Timestamp": "1557750396007.585693",
        "TenantClass": 0,
        "Source": "ProtobufRpcEngine.java:275",
        "ThreadID": 1,
        "ThreadName": "",
        "EventID": "4755553E3443FD18",
        "ProcessID": 2801
      },
      {
        "Cycles": 0,
        "Agent": "edu.brown.cs.systems.xtrace.logging.BaggageWrappers",
        "ProcessName": "Read",
        "TaskID": "67D45C0297EB3D29",
        "ParentEventID": [
          "B3747F762134407E",
          "9402F497665E81A8"
        ],
        "Label": "Merged current baggage with other baggage",
        "Title": "X-Trace Task",
        "Host": "pinky19.mpi-sws.org",
        "HRT": 26966756067682576,
        "Operation": "join",
        "Timestamp": "1557750396007.549072",
        "TenantClass": 0,
        "Source": "Client.java:1545",
        "ThreadID": 1,
        "ThreadName": "",
        "EventID": "0E0215E94E908452",
        "ProcessID": 2801
      },
      {
        "Cycles": 0,
        "Agent": "Execution-Sleep",
        "ProcessName": "Read",
        "TaskID": "67D45C0297EB3D29",
        "ParentEventID": [
          "4755553E3443FD18"
        ],
        "Label": "waited",
        "Title": "X-Trace Task",
        "Host": "pinky19.mpi-sws.org",
        "Duration": "106321",
        "HRT": 26966756067903234,
        "Operation": "waited",
        "Timestamp": "1557750396007.769775",
        "TenantClass": 0,
        "Source": "SocketIOWithTimeout.java:335",
        "ThreadID": 1,
        "ThreadName": "",
        "EventID": "A062EC9A14A3B3F8",
        "ProcessID": 2801
      },
      {
        "Cycles": 0,
        "Agent": "edu.brown.cs.systems.xtrace.logging.BaggageWrappers",
        "ProcessName": "Read",
        "TaskID": "67D45C0297EB3D29",
        "ParentEventID": [
          "A062EC9A14A3B3F8"
        ],
        "Label": "Forking current baggage with Baggage.fork()",
        "Title": "X-Trace Task",
        "Host": "pinky19.mpi-sws.org",
        "HRT": 26966756067946924,
        "Operation": "fork",
        "Timestamp": "1557750396007.813477",
        "TenantClass": 0,
        "Source": "DataTransferProtoUtil.java:94",
        "ThreadID": 1,
        "ThreadName": "",
        "EventID": "3AA4D1A0974CDACA",
        "ProcessID": 2801
      },
      {
        "Cycles": 0,
        "Agent": "edu.brown.cs.systems.xtrace.logging.XTraceInit",
        "ProcessName": "Data",
        "TaskID": "67D45C0297EB3D29",
        "ParentEventID": [
          "DE91BEBBEC19666F"
        ],
        "Label": "Thread.setName: DataXceiver for client DFSClient_NONMAPREDUCE_310321604_1 at /139.19.171.63:52964 [Sending block BP-1633380353-139.19.171.63-1554193446451:blk_1073770246_29422]",
        "Title": "X-Trace Task",
        "Host": "pinky23.mpi-sws.org",
        "HRT": 12368252042046263,
        "Timestamp": "1557750396008.294678",
        "TenantClass": 0,
        "Source": "DataXceiver.java:168",
        "ThreadID": 16178,
        "ThreadName": "",
        "EventID": "11EE492DE6651CB6",
        "BaggageBytes": "[[248 5] [240 0] [0 103 212 92 2 151 235 61 41] [240 1] [0 222 145 190 187 236 25 102 111] [240 3] [0 2]]",
        "ProcessID": 24612
      },
      {
        "Cycles": 0,
        "Agent": "Execution-CPU",
        "ProcessName": "Data",
        "TaskID": "67D45C0297EB3D29",
        "ParentEventID": [
          "3AA4D1A0974CDACA"
        ],
        "Label": "set",
        "Title": "X-Trace Task",
        "Host": "pinky23.mpi-sws.org",
        "HRT": 12368252041934533,
        "Operation": "set",
        "Timestamp": "1557750396008.182861",
        "TenantClass": 0,
        "Source": "Receiver.java:117",
        "ThreadID": 16178,
        "ThreadName": "",
        "EventID": "DE91BEBBEC19666F",
        "BaggageBytes": "[[248 5] [240 0] [0 103 212 92 2 151 235 61 41] [240 1] [0 58 164 209 160 151 76 218 202] [240 3] [0 2]]",
        "ProcessID": 24612
      },
      {
        "Cycles": 0,
        "Agent": "edu.brown.cs.systems.xtrace.logging.BaggageWrappers",
        "ProcessName": "Data",
        "TaskID": "67D45C0297EB3D29",
        "ParentEventID": [
          "11EE492DE6651CB6"
        ],
        "Label": "Forking current baggage with Baggage.fork()",
        "Title": "X-Trace Task",
        "Host": "pinky23.mpi-sws.org",
        "HRT": 12368252042280640,
        "Operation": "fork",
        "Timestamp": "1557750396008.529053",
        "TenantClass": 0,
        "Source": "DataXceiver.java:1257",
        "ThreadID": 16178,
        "ThreadName": "",
        "EventID": "BAFCA0889C1C19D9",
        "BaggageBytes": "[[248 5] [240 0] [0 103 212 92 2 151 235 61 41] [240 1] [0 17 238 73 45 230 101 28 182] [240 3] [0 2]]",
        "ProcessID": 24612
      },
      {
        "Cycles": 0,
        "Agent": "edu.brown.cs.systems.xtrace.logging.BaggageWrappers",
        "ProcessName": "Read",
        "TaskID": "67D45C0297EB3D29",
        "ParentEventID": [
          "BAFCA0889C1C19D9",
          "429A8CE87347F74A"
        ],
        "Label": "Merged current baggage with other baggage",
        "Title": "X-Trace Task",
        "Host": "pinky19.mpi-sws.org",
        "HRT": 26966756068952011,
        "Operation": "join",
        "Timestamp": "1557750396008.818604",
        "TenantClass": 0,
        "Source": "RemoteBlockReader2.java:429",
        "ThreadID": 1,
        "ThreadName": "",
        "EventID": "13BFF92BFA717A91",
        "ProcessID": 2801
      },
      {
        "Cycles": 0,
        "Agent": "Execution-Sleep",
        "ProcessName": "Read",
        "TaskID": "67D45C0297EB3D29",
        "ParentEventID": [
          "3AA4D1A0974CDACA"
        ],
        "Label": "waited",
        "Title": "X-Trace Task",
        "Host": "pinky19.mpi-sws.org",
        "Duration": "877997",
        "HRT": 26966756068895075,
        "Operation": "waited",
        "Timestamp": "1557750396008.761719",
        "TenantClass": 0,
        "Source": "SocketIOWithTimeout.java:335",
        "ThreadID": 1,
        "ThreadName": "",
        "EventID": "429A8CE87347F74A",
        "ProcessID": 2801
      },
      {
        "Cycles": 0,
        "Agent": "edu.brown.cs.systems.xtrace.logging.BaggageWrappers",
        "ProcessName": "Data",
        "TaskID": "67D45C0297EB3D29",
        "ParentEventID": [
          "BAFCA0889C1C19D9"
        ],
        "Label": "Forking current baggage with Baggage.fork()",
        "Title": "X-Trace Task",
        "Host": "pinky23.mpi-sws.org",
        "HRT": 12368252042444534,
        "Operation": "fork",
        "Timestamp": "1557750396008.692871",
        "TenantClass": 0,
        "Source": "PacketHeader.java:95",
        "ThreadID": 16178,
        "ThreadName": "",
        "EventID": "06ED1350E27B86B6",
        "BaggageBytes": "[[248 5] [240 0] [0 103 212 92 2 151 235 61 41] [240 1] [0 186 252 160 136 156 28 25 217] [240 3] [0 2]]",
        "ProcessID": 24612
      },
      {
        "Cycles": 0,
        "Agent": "Execution-Sleep",
        "ProcessName": "Read",
        "TaskID": "67D45C0297EB3D29",
        "ParentEventID": [
          "13BFF92BFA717A91"
        ],
        "Label": "waited",
        "Title": "X-Trace Task",
        "Host": "pinky19.mpi-sws.org",
        "Duration": "58886",
        "HRT": 26966756069052620,
        "Operation": "waited",
        "Timestamp": "1557750396008.919189",
        "TenantClass": 0,
        "Source": "SocketIOWithTimeout.java:335",
        "ThreadID": 1,
        "ThreadName": "",
        "EventID": "7EF5947FCF5668F4",
        "ProcessID": 2801
      },
      {
        "Cycles": 0,
        "Agent": "Execution-Sleep",
        "ProcessName": "Data",
        "TaskID": "67D45C0297EB3D29",
        "ParentEventID": [
          "06ED1350E27B86B6"
        ],
        "Label": "waited",
        "Title": "X-Trace Task",
        "Host": "pinky23.mpi-sws.org",
        "Duration": "13650",
        "HRT": 12368252042597071,
        "Operation": "waited",
        "Timestamp": "1557750396008.845459",
        "TenantClass": 0,
        "Source": "SocketIOWithTimeout.java:335",
        "ThreadID": 16178,
        "ThreadName": "",
        "EventID": "9C58F00C1522EC93",
        "BaggageBytes": "[[248 5] [240 0] [0 103 212 92 2 151 235 61 41] [240 1] [0 6 237 19 80 226 123 134 182] [240 3] [0 2]]",
        "ProcessID": 24612
      },
      {
        "Cycles": 0,
        "Agent": "Execution-Sleep",
        "ProcessName": "Read",
        "TaskID": "67D45C0297EB3D29",
        "ParentEventID": [
          "7EF5947FCF5668F4"
        ],
        "Label": "waited",
        "Title": "X-Trace Task",
        "Host": "pinky19.mpi-sws.org",
        "Duration": "342654",
        "HRT": 26966756069450315,
        "Operation": "waited",
        "Timestamp": "1557750396009.316895",
        "TenantClass": 0,
        "Source": "SocketIOWithTimeout.java:335",
        "ThreadID": 1,
        "ThreadName": "",
        "EventID": "1591BDE75A300097",
        "ProcessID": 2801
      },
      {
        "Cycles": 0,
        "Agent": "edu.brown.cs.systems.xtrace.logging.BaggageWrappers",
        "ProcessName": "Data",
        "TaskID": "67D45C0297EB3D29",
        "ParentEventID": [
          "9C58F00C1522EC93"
        ],
        "Label": "Forking current baggage with Baggage.fork()",
        "Title": "X-Trace Task",
        "Host": "pinky23.mpi-sws.org",
        "HRT": 12368252042784058,
        "Operation": "fork",
        "Timestamp": "1557750396009.032471",
        "TenantClass": 0,
        "Source": "PacketHeader.java:95",
        "ThreadID": 16178,
        "ThreadName": "",
        "EventID": "12040D35BBAB1351",
        "BaggageBytes": "[[248 5] [240 0] [0 103 212 92 2 151 235 61 41] [240 1] [0 156 88 240 12 21 34 236 147] [240 3] [0 2]]",
        "ProcessID": 24612
      },
      {
        "Cycles": 0,
        "Agent": "Execution-Sleep",
        "ProcessName": "Read",
        "TaskID": "67D45C0297EB3D29",
        "ParentEventID": [
          "1591BDE75A300097"
        ],
        "Label": "waited",
        "Title": "X-Trace Task",
        "Host": "pinky19.mpi-sws.org",
        "Duration": "248165",
        "HRT": 26966756069746484,
        "Operation": "waited",
        "Timestamp": "1557750396009.613037",
        "TenantClass": 0,
        "Source": "SocketIOWithTimeout.java:335",
        "ThreadID": 1,
        "ThreadName": "",
        "EventID": "725704019F68EA46",
        "ProcessID": 2801
      },
      {
        "Cycles": 0,
        "Agent": "edu.brown.cs.systems.xtrace.logging.BaggageWrappers",
        "ProcessName": "Read",
        "TaskID": "67D45C0297EB3D29",
        "ParentEventID": [
          "06ED1350E27B86B6",
          "F2691DB431D27F49"
        ],
        "Label": "Merged current baggage with other baggage",
        "Title": "X-Trace Task",
        "Host": "pinky19.mpi-sws.org",
        "HRT": 26966756070025584,
        "Operation": "join",
        "Timestamp": "1557750396009.892090",
        "TenantClass": 0,
        "Source": "PacketHeader.java:168",
        "ThreadID": 1,
        "ThreadName": "",
        "EventID": "21B953E3C6C4E04A",
        "ProcessID": 2801
      },
      {
        "Cycles": 0,
        "Agent": "Execution-Sleep",
        "ProcessName": "Read",
        "TaskID": "67D45C0297EB3D29",
        "ParentEventID": [
          "725704019F68EA46"
        ],
        "Label": "waited",
        "Title": "X-Trace Task",
        "Host": "pinky19.mpi-sws.org",
        "Duration": "147005",
        "HRT": 26966756069953799,
        "Operation": "waited",
        "Timestamp": "1557750396009.820312",
        "TenantClass": 0,
        "Source": "SocketIOWithTimeout.java:335",
        "ThreadID": 1,
        "ThreadName": "",
        "EventID": "F2691DB431D27F49",
        "ProcessID": 2801
      },
      {
        "Cycles": 0,
        "Agent": "edu.brown.cs.systems.xtrace.logging.BaggageWrappers",
        "ProcessName": "Read",
        "TaskID": "67D45C0297EB3D29",
        "ParentEventID": [
          "21B953E3C6C4E04A",
          "12040D35BBAB1351"
        ],
        "Label": "Merged current baggage with other baggage",
        "Title": "X-Trace Task",
        "Host": "pinky19.mpi-sws.org",
        "HRT": 26966756070121787,
        "Operation": "join",
        "Timestamp": "1557750396009.988281",
        "TenantClass": 0,
        "Source": "PacketHeader.java:168",
        "ThreadID": 1,
        "ThreadName": "",
        "EventID": "0E3B9BD3E8994C91",
        "ProcessID": 2801
      },
      {
        "Cycles": 0,
        "Agent": "edu.brown.cs.systems.xtrace.logging.BaggageWrappers",
        "ProcessName": "Read",
        "TaskID": "67D45C0297EB3D29",
        "ParentEventID": [
          "0E3B9BD3E8994C91"
        ],
        "Label": "Forking current baggage with Baggage.fork()",
        "Title": "X-Trace Task",
        "Host": "pinky19.mpi-sws.org",
        "HRT": 26966756070130503,
        "Operation": "fork",
        "Timestamp": "1557750396009.997070",
        "TenantClass": 0,
        "Source": "RemoteBlockReader2.java:361",
        "ThreadID": 1,
        "ThreadName": "",
        "EventID": "A1B17396868C2E19",
        "ProcessID": 2801
      },
      {
        "Cycles": 0,
        "Agent": "edu.brown.cs.systems.xtrace.logging.BaggageWrappers",
        "ProcessName": "Read",
        "TaskID": "67D45C0297EB3D29",
        "ParentEventID": [
          "A1B17396868C2E19"
        ],
        "Label": "Forking current baggage with Baggage.fork()",
        "Title": "X-Trace Task",
        "Host": "pinky19.mpi-sws.org",
        "HRT": 26966756070184422,
        "Operation": "fork",
        "Timestamp": "1557750396010.051025",
        "TenantClass": 0,
        "Source": "DataTransferProtoUtil.java:94",
        "ThreadID": 1,
        "ThreadName": "",
        "EventID": "CED74EAE9818F64A",
        "ProcessID": 2801
      },
      {
        "Cycles": 0,
        "Agent": "edu.brown.cs.systems.xtrace.logging.BaggageWrappers",
        "ProcessName": "Data",
        "TaskID": "67D45C0297EB3D29",
        "ParentEventID": [
          "4CE93A15CD60FA03",
          "A1B17396868C2E19"
        ],
        "Label": "Merged current baggage with other baggage",
        "Title": "X-Trace Task",
        "Host": "pinky23.mpi-sws.org",
        "HRT": 12368252044031864,
        "Operation": "join",
        "Timestamp": "1557750396010.280273",
        "TenantClass": 0,
        "Source": "DataXceiver.java:574",
        "ThreadID": 16178,
        "ThreadName": "",
        "EventID": "8E78AA8D24B794E8",
        "BaggageBytes": "[[248 5] [240 0] [0 103 212 92 2 151 235 61 41] [240 1] [0 161 177 115 150 134 140 46 25] [0 76 233 58 21 205 96 250 3] [240 3] [0 2]]",
        "ProcessID": 24612
      },
      {
        "Cycles": 0,
        "Agent": "Execution-Sleep",
        "ProcessName": "Data",
        "TaskID": "67D45C0297EB3D29",
        "ParentEventID": [
          "12040D35BBAB1351"
        ],
        "Label": "waited",
        "Title": "X-Trace Task",
        "Host": "pinky23.mpi-sws.org",
        "Duration": "818525",
        "HRT": 12368252043782383,
        "Operation": "waited",
        "Timestamp": "1557750396010.030762",
        "TenantClass": 0,
        "Source": "SocketIOWithTimeout.java:335",
        "ThreadID": 16178,
        "ThreadName": "",
        "EventID": "4CE93A15CD60FA03",
        "BaggageBytes": "[[248 5] [240 0] [0 103 212 92 2 151 235 61 41] [240 1] [0 18 4 13 53 187 171 19 81] [240 3] [0 2]]",
        "ProcessID": 24612
      },
      {
        "Cycles": 0,
        "Agent": "Execution-CPU",
        "ProcessName": "Data",
        "TaskID": "67D45C0297EB3D29",
        "ParentEventID": [
          "8E78AA8D24B794E8"
        ],
        "Label": "unset",
        "Title": "X-Trace Task",
        "Host": "pinky23.mpi-sws.org",
        "Duration": "2102645",
        "HRT": 12368252044109500,
        "Operation": "unset",
        "Timestamp": "1557750396010.357910",
        "TenantClass": 0,
        "Source": "DataXceiver.java:261",
        "ThreadID": 16178,
        "ThreadName": "",
        "EventID": "8F8460515546C726",
        "BaggageBytes": "[[248 5] [240 0] [0 103 212 92 2 151 235 61 41] [240 1] [0 142 120 170 141 36 183 148 232] [240 3] [0 2]]",
        "ProcessID": 24612
      },
      {
        "Cycles": 0,
        "Agent": "edu.brown.cs.systems.xtrace.logging.XTraceInit",
        "ProcessName": "Data",
        "TaskID": "67D45C0297EB3D29",
        "ParentEventID": [
          "75CF9E3A19ECEBBE"
        ],
        "Label": "Thread.setName: DataXceiver for client DFSClient_NONMAPREDUCE_310321604_1 at /139.19.171.63:52964 [Sending block BP-1633380353-139.19.171.63-1554193446451:blk_1073770246_29422]",
        "Title": "X-Trace Task",
        "Host": "pinky23.mpi-sws.org",
        "HRT": 12368252044277971,
        "Timestamp": "1557750396010.526367",
        "TenantClass": 0,
        "Source": "DataXceiver.java:168",
        "ThreadID": 16178,
        "ThreadName": "",
        "EventID": "8F4226851D95807F",
        "BaggageBytes": "[[248 5] [240 0] [0 103 212 92 2 151 235 61 41] [240 1] [0 117 207 158 58 25 236 235 190] [240 3] [0 2]]",
        "ProcessID": 24612
      },
      {
        "Cycles": 0,
        "Agent": "Execution-CPU",
        "ProcessName": "Data",
        "TaskID": "67D45C0297EB3D29",
        "ParentEventID": [
          "CED74EAE9818F64A"
        ],
        "Label": "set",
        "Title": "X-Trace Task",
        "Host": "pinky23.mpi-sws.org",
        "HRT": 12368252044181242,
        "Operation": "set",
        "Timestamp": "1557750396010.429688",
        "TenantClass": 0,
        "Source": "Receiver.java:117",
        "ThreadID": 16178,
        "ThreadName": "",
        "EventID": "75CF9E3A19ECEBBE",
        "BaggageBytes": "[[248 5] [240 0] [0 103 212 92 2 151 235 61 41] [240 1] [0 206 215 78 174 152 24 246 74] [240 3] [0 2]]",
        "ProcessID": 24612
      },
      {
        "Cycles": 0,
        "Agent": "edu.brown.cs.systems.xtrace.logging.BaggageWrappers",
        "ProcessName": "Data",
        "TaskID": "67D45C0297EB3D29",
        "ParentEventID": [
          "8F4226851D95807F"
        ],
        "Label": "Forking current baggage with Baggage.fork()",
        "Title": "X-Trace Task",
        "Host": "pinky23.mpi-sws.org",
        "HRT": 12368252044504276,
        "Operation": "fork",
        "Timestamp": "1557750396010.752686",
        "TenantClass": 0,
        "Source": "DataXceiver.java:1257",
        "ThreadID": 16178,
        "ThreadName": "",
        "EventID": "B4977337AAEEF711",
        "BaggageBytes": "[[248 5] [240 0] [0 103 212 92 2 151 235 61 41] [240 1] [0 143 66 38 133 29 149 128 127] [240 3] [0 2]]",
        "ProcessID": 24612
      },
      {
        "Cycles": 0,
        "Agent": "Execution-Sleep",
        "ProcessName": "Read",
        "TaskID": "67D45C0297EB3D29",
        "ParentEventID": [
          "CED74EAE9818F64A"
        ],
        "Label": "waited",
        "Title": "X-Trace Task",
        "Host": "pinky19.mpi-sws.org",
        "Duration": "872567",
        "HRT": 26966756071117874,
        "Operation": "waited",
        "Timestamp": "1557750396010.984375",
        "TenantClass": 0,
        "Source": "SocketIOWithTimeout.java:335",
        "ThreadID": 1,
        "ThreadName": "",
        "EventID": "E90016E6C153006A",
        "ProcessID": 2801
      },
      {
        "Cycles": 0,
        "Agent": "edu.brown.cs.systems.xtrace.logging.BaggageWrappers",
        "ProcessName": "Read",
        "TaskID": "67D45C0297EB3D29",
        "ParentEventID": [
          "B4977337AAEEF711",
          "E90016E6C153006A"
        ],
        "Label": "Merged current baggage with other baggage",
        "Title": "X-Trace Task",
        "Host": "pinky19.mpi-sws.org",
        "HRT": 26966756071169320,
        "Operation": "join",
        "Timestamp": "1557750396011.035889",
        "TenantClass": 0,
        "Source": "RemoteBlockReader2.java:429",
        "ThreadID": 1,
        "ThreadName": "",
        "EventID": "FC0185D4061E89F0",
        "ProcessID": 2801
      },
      {
        "Cycles": 0,
        "Agent": "edu.brown.cs.systems.xtrace.logging.BaggageWrappers",
        "ProcessName": "Data",
        "TaskID": "67D45C0297EB3D29",
        "ParentEventID": [
          "B4977337AAEEF711"
        ],
        "Label": "Forking current baggage with Baggage.fork()",
        "Title": "X-Trace Task",
        "Host": "pinky23.mpi-sws.org",
        "HRT": 12368252044674991,
        "Operation": "fork",
        "Timestamp": "1557750396010.923340",
        "TenantClass": 0,
        "Source": "PacketHeader.java:95",
        "ThreadID": 16178,
        "ThreadName": "",
        "EventID": "360CD015D493A34C",
        "BaggageBytes": "[[248 5] [240 0] [0 103 212 92 2 151 235 61 41] [240 1] [0 180 151 115 55 170 238 247 17] [240 3] [0 2]]",
        "ProcessID": 24612
      },
      {
        "Cycles": 0,
        "Agent": "Execution-Sleep",
        "ProcessName": "Read",
        "TaskID": "67D45C0297EB3D29",
        "ParentEventID": [
          "FC0185D4061E89F0"
        ],
        "Label": "waited",
        "Title": "X-Trace Task",
        "Host": "pinky19.mpi-sws.org",
        "Duration": "59932",
        "HRT": 26966756071267072,
        "Operation": "waited",
        "Timestamp": "1557750396011.133545",
        "TenantClass": 0,
        "Source": "SocketIOWithTimeout.java:335",
        "ThreadID": 1,
        "ThreadName": "",
        "EventID": "811FF5A6D80E3E6B",
        "ProcessID": 2801
      },
      {
        "Cycles": 0,
        "Agent": "Execution-Sleep",
        "ProcessName": "Read",
        "TaskID": "67D45C0297EB3D29",
        "ParentEventID": [
          "811FF5A6D80E3E6B"
        ],
        "Label": "waited",
        "Title": "X-Trace Task",
        "Host": "pinky19.mpi-sws.org",
        "Duration": "372699",
        "HRT": 26966756071702049,
        "Operation": "waited",
        "Timestamp": "1557750396011.568604",
        "TenantClass": 0,
        "Source": "SocketIOWithTimeout.java:335",
        "ThreadID": 1,
        "ThreadName": "",
        "EventID": "E5CB4C3CF2642397",
        "ProcessID": 2801
      },
      {
        "Cycles": 0,
        "Agent": "Execution-Sleep",
        "ProcessName": "Data",
        "TaskID": "67D45C0297EB3D29",
        "ParentEventID": [
          "360CD015D493A34C"
        ],
        "Label": "waited",
        "Title": "X-Trace Task",
        "Host": "pinky23.mpi-sws.org",
        "Duration": "10927",
        "HRT": 12368252044832603,
        "Operation": "waited",
        "Timestamp": "1557750396011.081055",
        "TenantClass": 0,
        "Source": "SocketIOWithTimeout.java:335",
        "ThreadID": 16178,
        "ThreadName": "",
        "EventID": "3DC94FBA476F036E",
        "BaggageBytes": "[[248 5] [240 0] [0 103 212 92 2 151 235 61 41] [240 1] [0 54 12 208 21 212 147 163 76] [240 3] [0 2]]",
        "ProcessID": 24612
      },
      {
        "Cycles": 0,
        "Agent": "edu.brown.cs.systems.xtrace.logging.BaggageWrappers",
        "ProcessName": "Data",
        "TaskID": "67D45C0297EB3D29",
        "ParentEventID": [
          "3DC94FBA476F036E"
        ],
        "Label": "Forking current baggage with Baggage.fork()",
        "Title": "X-Trace Task",
        "Host": "pinky23.mpi-sws.org",
        "HRT": 12368252045033575,
        "Operation": "fork",
        "Timestamp": "1557750396011.281982",
        "TenantClass": 0,
        "Source": "PacketHeader.java:95",
        "ThreadID": 16178,
        "ThreadName": "",
        "EventID": "647091D0624685FB",
        "BaggageBytes": "[[248 5] [240 0] [0 103 212 92 2 151 235 61 41] [240 1] [0 61 201 79 186 71 111 3 110] [240 3] [0 2]]",
        "ProcessID": 24612
      },
      {
        "Cycles": 0,
        "Agent": "Execution-Sleep",
        "ProcessName": "Read",
        "TaskID": "67D45C0297EB3D29",
        "ParentEventID": [
          "3585E18BC237B3D3"
        ],
        "Label": "waited",
        "Title": "X-Trace Task",
        "Host": "pinky19.mpi-sws.org",
        "Duration": "160880",
        "HRT": 26966756072110305,
        "Operation": "waited",
        "Timestamp": "1557750396011.976807",
        "TenantClass": 0,
        "Source": "SocketIOWithTimeout.java:335",
        "ThreadID": 1,
        "ThreadName": "",
        "EventID": "4C354AD83E8AF81E",
        "ProcessID": 2801
      },
      {
        "Cycles": 0,
        "Agent": "Execution-Sleep",
        "ProcessName": "Read",
        "TaskID": "67D45C0297EB3D29",
        "ParentEventID": [
          "E5CB4C3CF2642397"
        ],
        "Label": "waited",
        "Title": "X-Trace Task",
        "Host": "pinky19.mpi-sws.org",
        "Duration": "149760",
        "HRT": 26966756071908176,
        "Operation": "waited",
        "Timestamp": "1557750396011.774658",
        "TenantClass": 0,
        "Source": "SocketIOWithTimeout.java:335",
        "ThreadID": 1,
        "ThreadName": "",
        "EventID": "3585E18BC237B3D3",
        "ProcessID": 2801
      },
      {
        "Cycles": 0,
        "Agent": "Execution-Sleep",
        "ProcessName": "Data",
        "TaskID": "67D45C0297EB3D29",
        "ParentEventID": [
          "647091D0624685FB"
        ],
        "Label": "waited",
        "Title": "X-Trace Task",
        "Host": "pinky23.mpi-sws.org",
        "Duration": "172114",
        "HRT": 12368252045322013,
        "Operation": "waited",
        "Timestamp": "1557750396011.570312",
        "TenantClass": 0,
        "Source": "SocketIOWithTimeout.java:335",
        "ThreadID": 16178,
        "ThreadName": "",
        "EventID": "82D046922D994A41",
        "BaggageBytes": "[[248 5] [240 0] [0 103 212 92 2 151 235 61 41] [240 1] [0 100 112 145 208 98 70 133 251] [240 3] [0 2]]",
        "ProcessID": 24612
      },
      {
        "Cycles": 0,
        "Agent": "edu.brown.cs.systems.xtrace.logging.BaggageWrappers",
        "ProcessName": "Read",
        "TaskID": "67D45C0297EB3D29",
        "ParentEventID": [
          "360CD015D493A34C",
          "4C354AD83E8AF81E"
        ],
        "Label": "Merged current baggage with other baggage",
        "Title": "X-Trace Task",
        "Host": "pinky19.mpi-sws.org",
        "HRT": 26966756072176584,
        "Operation": "join",
        "Timestamp": "1557750396012.043213",
        "TenantClass": 0,
        "Source": "PacketHeader.java:168",
        "ThreadID": 1,
        "ThreadName": "",
        "EventID": "3E31D6589B424838",
        "ProcessID": 2801
      },
      {
        "Cycles": 0,
        "Agent": "edu.brown.cs.systems.xtrace.logging.BaggageWrappers",
        "ProcessName": "Data",
        "TaskID": "67D45C0297EB3D29",
        "ParentEventID": [
          "82D046922D994A41"
        ],
        "Label": "Forking current baggage with Baggage.fork()",
        "Title": "X-Trace Task",
        "Host": "pinky23.mpi-sws.org",
        "HRT": 12368252045569484,
        "Operation": "fork",
        "Timestamp": "1557750396011.817871",
        "TenantClass": 0,
        "Source": "PacketHeader.java:95",
        "ThreadID": 16178,
        "ThreadName": "",
        "EventID": "4B49DBE761D773DB",
        "BaggageBytes": "[[248 5] [240 0] [0 103 212 92 2 151 235 61 41] [240 1] [0 130 208 70 146 45 153 74 65] [240 3] [0 2]]",
        "ProcessID": 24612
      },
      {
        "Cycles": 0,
        "Agent": "Execution-CPU",
        "ProcessName": "Data",
        "TaskID": "67D45C0297EB3D29",
        "ParentEventID": [
          "9C69DAD61B2256AB"
        ],
        "Label": "unset",
        "Title": "X-Trace Task",
        "Host": "pinky23.mpi-sws.org",
        "Duration": "1903459",
        "HRT": 12368252046158257,
        "Operation": "unset",
        "Timestamp": "1557750396012.406738",
        "TenantClass": 0,
        "Source": "DataXceiver.java:261",
        "ThreadID": 16178,
        "ThreadName": "",
        "EventID": "A27FC03825825016",
        "BaggageBytes": "[[248 5] [240 0] [0 103 212 92 2 151 235 61 41] [240 1] [0 156 105 218 214 27 34 86 171] [240 3] [0 2]]",
        "ProcessID": 24612
      },
      {
        "Cycles": 0,
        "Agent": "Execution-Sleep",
        "ProcessName": "Data",
        "TaskID": "67D45C0297EB3D29",
        "ParentEventID": [
          "4B49DBE761D773DB"
        ],
        "Label": "waited",
        "Title": "X-Trace Task",
        "Host": "pinky23.mpi-sws.org",
        "Duration": "13566",
        "HRT": 12368252045739008,
        "Operation": "waited",
        "Timestamp": "1557750396011.987305",
        "TenantClass": 0,
        "Source": "SocketIOWithTimeout.java:335",
        "ThreadID": 16178,
        "ThreadName": "",
        "EventID": "9C69DAD61B2256AB",
        "BaggageBytes": "[[248 5] [240 0] [0 103 212 92 2 151 235 61 41] [240 1] [0 75 73 219 231 97 215 115 219] [240 3] [0 2]]",
        "ProcessID": 24612
      },
      {
        "Cycles": 0,
        "Agent": "edu.brown.cs.systems.retro.benchmarks.hdfs_client.Reader",
        "ProcessName": "Read",
        "TaskID": "67D45C0297EB3D29",
        "ParentEventID": [
          "0"
        ],
        "Label": "Reading file",
        "Title": "X-Trace Task",
        "Host": "pinky19.mpi-sws.org",
        "HRT": 26966756066826844,
        "Timestamp": "1557750396006.693359",
        "TenantClass": 0,
        "ThreadID": 1,
        "ThreadName": "",
        "EventID": "40FDA7F571D87B6C",
        "ProcessID": 2801,
        "Tag": [
          "reader_100kb",
          "Read Size: 102400"
        ]
      }
    ]
  }
]