[
  {
    "id": "81B72044693C2F5E",
    "reports": [
      {
        "Cycles": 0,
        "Agent": "org.apache.hadoop.ipc.ProtobufRpcEngine",
        "ProcessName": "Read",
        "TaskID": "81B72044693C2F5E",
        "ParentEventID": [
          "001D3779B7E6704B"
        ],
        "Label": "Invoking org.apache.hadoop.hdfs.protocol.ClientProtocol.getBlockLocations",
        "Title": "X-Trace Task",
        "Host": "pinky19.mpi-sws.org",
        "HRT": 25488946575142326,
        "Timestamp": "1556272586515.309082",
        "TenantClass": 0,
        "Source": "ProtobufRpcEngine.java:228",
        "ThreadID": 1,
        "ThreadName": "",
        "EventID": "122EBFD2467B6972",
        "ProcessID": 6356
      },
      {
        "Cycles": 0,
        "Agent": "Execution-CPU",
        "ProcessName": "Read",
        "TaskID": "81B72044693C2F5E",
        "ParentEventID": [
          "122EBFD2467B6972"
        ],
        "Label": "unset",
        "Title": "X-Trace Task",
        "Host": "pinky19.mpi-sws.org",
        "Duration": "33658609",
        "HRT": 25488946575168337,
        "Operation": "unset",
        "Timestamp": "1556272586515.335205",
        "TenantClass": 0,
        "Source": "Client.java:1027",
        "ThreadID": 1,
        "ThreadName": "",
        "EventID": "64F9419FDC4CD9A9",
        "ProcessID": 6356
      },
      {
        "Cycles": 0,
        "Agent": "edu.brown.cs.systems.retro.benchmarks.hdfs_client.Reader",
        "ProcessName": "Read",
        "TaskID": "81B72044693C2F5E",
        "ParentEventID": [
          "A578ABC21C04813C"
        ],
        "Label": "Reading file",
        "Title": "X-Trace Task",
        "Host": "pinky19.mpi-sws.org",
        "HRT": 25488946575103721,
        "Timestamp": "1556272586515.270508",
        "TenantClass": 0,
        "ThreadID": 1,
        "ThreadName": "",
        "EventID": "001D3779B7E6704B",
        "ProcessID": 6356
      },
      {
        "Cycles": 0,
        "Agent": "Execution-CPU",
        "ProcessName": "Read",
        "TaskID": "81B72044693C2F5E",
        "ParentEventID": [
          "64F9419FDC4CD9A9"
        ],
        "Label": "set",
        "Title": "X-Trace Task",
        "Host": "pinky19.mpi-sws.org",
        "HRT": 25488946575193322,
        "Operation": "set",
        "Timestamp": "1556272586515.360107",
        "TenantClass": 0,
        "Source": "Client.java:1032",
        "ThreadID": 41,
        "ThreadName": "",
        "EventID": "4F44BC1E8A0C4ADE",
        "ProcessID": 6356
      },
      {
        "Cycles": 0,
        "Agent": "Execution-CPU",
        "ProcessName": "Read",
        "TaskID": "81B72044693C2F5E",
        "ParentEventID": [
          "A5EF8C7F8B44506C"
        ],
        "Label": "unset",
        "Title": "X-Trace Task",
        "Host": "pinky19.mpi-sws.org",
        "Duration": "76376",
        "HRT": 25488946575285582,
        "Operation": "unset",
        "Timestamp": "1556272586515.452393",
        "TenantClass": 0,
        "Source": "Client.java:1062",
        "ThreadID": 41,
        "ThreadName": "",
        "EventID": "BF6DD68F5C921664",
        "ProcessID": 6356
      },
      {
        "Cycles": 0,
        "Agent": "edu.brown.cs.systems.xtrace.logging.BaggageWrappers",
        "ProcessName": "Read",
        "TaskID": "81B72044693C2F5E",
        "ParentEventID": [
          "4F44BC1E8A0C4ADE"
        ],
        "Label": "Forking current baggage with Baggage.fork()",
        "Title": "X-Trace Task",
        "Host": "pinky19.mpi-sws.org",
        "HRT": 25488946575210419,
        "Operation": "fork",
        "Timestamp": "1556272586515.377197",
        "TenantClass": 0,
        "Source": "Client.java:1043",
        "ThreadID": 41,
        "ThreadName": "",
        "EventID": "A5EF8C7F8B44506C",
        "ProcessID": 6356
      },
      {
        "Cycles": 0,
        "Agent": "Execution-CPU",
        "ProcessName": "Read",
        "TaskID": "81B72044693C2F5E",
        "ParentEventID": [
          "BF6DD68F5C921664"
        ],
        "Label": "set",
        "Title": "X-Trace Task",
        "Host": "pinky19.mpi-sws.org",
        "HRT": 25488946575306803,
        "Operation": "set",
        "Timestamp": "1556272586515.473633",
        "TenantClass": 0,
        "Source": "Client.java:1104",
        "ThreadID": 1,
        "ThreadName": "",
        "EventID": "A11D9FFAF3260C35",
        "ProcessID": 6356
      },
      {
        "Cycles": 0,
        "Agent": "Execution-CPU",
        "ProcessName": "Name",
        "TaskID": "81B72044693C2F5E",
        "ParentEventID": [
          "A5EF8C7F8B44506C"
        ],
        "Label": "set",
        "Title": "X-Trace Task",
        "Host": "pinky19.mpi-sws.org",
        "HRT": 25488946575363545,
        "Operation": "set",
        "Timestamp": "1556272586515.535645",
        "TenantClass": 0,
        "Source": "Server.java:1840",
        "ThreadID": 48,
        "ThreadName": "",
        "EventID": "1310D814F6310964",
        "BaggageBytes": "[[248 5] [240 0] [0 129 183 32 68 105 60 47 94] [240 1] [0 165 239 140 127 139 68 80 108] [240 3] [0 2]]",
        "ProcessID": 2171
      },
      {
        "Cycles": 0,
        "Agent": "edu.brown.cs.systems.xtrace.logging.BaggageWrappers",
        "ProcessName": "Name",
        "TaskID": "81B72044693C2F5E",
        "ParentEventID": [
          "1310D814F6310964"
        ],
        "Label": "Forking current baggage with Baggage.fork()",
        "Title": "X-Trace Task",
        "Host": "pinky19.mpi-sws.org",
        "HRT": 25488946575394296,
        "Operation": "fork",
        "Timestamp": "1556272586515.566406",
        "TenantClass": 0,
        "Source": "Server.java:550",
        "ThreadID": 48,
        "ThreadName": "",
        "EventID": "E5154663B87D2E33",
        "BaggageBytes": "[[248 5] [240 0] [0 129 183 32 68 105 60 47 94] [240 1] [0 19 16 216 20 246 49 9 100] [240 3] [0 2]]",
        "ProcessID": 2171
      },
      {
        "Cycles": 0,
        "Agent": "Execution-CPU",
        "ProcessName": "Name",
        "TaskID": "81B72044693C2F5E",
        "ParentEventID": [
          "E5154663B87D2E33"
        ],
        "Label": "unset",
        "Title": "X-Trace Task",
        "Host": "pinky19.mpi-sws.org",
        "Duration": "25372",
        "HRT": 25488946575416033,
        "Operation": "unset",
        "Timestamp": "1556272586515.588135",
        "TenantClass": 0,
        "Source": "Server.java:1828",
        "ThreadID": 48,
        "ThreadName": "",
        "EventID": "7C37DD0C9CFDBEBD",
        "BaggageBytes": "[[248 5] [240 0] [0 129 183 32 68 105 60 47 94] [240 1] [0 229 21 70 99 184 125 46 51] [240 3] [0 2]]",
        "ProcessID": 2171
      },
      {
        "Cycles": 0,
        "Agent": "Execution-CPU",
        "ProcessName": "Name",
        "TaskID": "81B72044693C2F5E",
        "ParentEventID": [
          "E5154663B87D2E33"
        ],
        "Label": "set",
        "Title": "X-Trace Task",
        "Host": "pinky19.mpi-sws.org",
        "HRT": 25488946575426457,
        "Operation": "set",
        "Timestamp": "1556272586515.598389",
        "TenantClass": 0,
        "Source": "Server.java:2071",
        "ThreadID": 64,
        "ThreadName": "",
        "EventID": "71DD8A61B1574EF9",
        "BaggageBytes": "[[248 5] [240 0] [0 129 183 32 68 105 60 47 94] [240 1] [0 229 21 70 99 184 125 46 51] [240 3] [0 2]]",
        "ProcessID": 2171
      },
      {
        "Cycles": 0,
        "Agent": "org.apache.hadoop.ipc.Server",
        "ProcessName": "Name",
        "TaskID": "81B72044693C2F5E",
        "ParentEventID": [
          "71DD8A61B1574EF9"
        ],
        "Label": "getBlockLocations in org.apache.hadoop.hdfs.protocol.ClientProtocol",
        "Title": "X-Trace Task",
        "Host": "pinky19.mpi-sws.org",
        "HRT": 25488946575464948,
        "Timestamp": "1556272586515.636963",
        "TenantClass": 0,
        "Source": "ProtobufRpcEngine.java:601",
        "ThreadID": 64,
        "ThreadName": "",
        "EventID": "1EE1B43C0DCFF1C1",
        "BaggageBytes": "[[248 5] [240 0] [0 129 183 32 68 105 60 47 94] [240 1] [0 113 221 138 97 177 87 78 249] [240 3] [0 2]]",
        "ProcessID": 2171
      },
      {
        "Cycles": 0,
        "Agent": "org.apache.hadoop.hdfs.server.namenode.FSNamesystem.audit",
        "ProcessName": "Name",
        "TaskID": "81B72044693C2F5E",
        "ParentEventID": [
          "1EE1B43C0DCFF1C1"
        ],
        "Label": "allowed=true\tugi=plascas (auth:SIMPLE)\tip=/139.19.171.63\tcmd=open\tsrc=/ds/smPZAhZOaOEZiFBC\tdst=null\tperm=null\tproto=rpc",
        "Title": "X-Trace Task",
        "Host": "pinky19.mpi-sws.org",
        "HRT": 25488946575512741,
        "Timestamp": "1556272586515.684814",
        "TenantClass": 0,
        "Source": "FSNamesystem.java:8313",
        "ThreadID": 64,
        "ThreadName": "",
        "EventID": "5C5F8E4BADCF1C0D",
        "BaggageBytes": "[[248 5] [240 0] [0 129 183 32 68 105 60 47 94] [240 1] [0 30 225 180 60 13 207 241 193] [240 3] [0 2]]",
        "ProcessID": 2171
      },
      {
        "Cycles": 0,
        "Agent": "edu.brown.cs.systems.xtrace.logging.BaggageWrappers",
        "ProcessName": "Name",
        "TaskID": "81B72044693C2F5E",
        "ParentEventID": [
          "5C5F8E4BADCF1C0D"
        ],
        "Label": "Forking current baggage with Baggage.fork()",
        "Title": "X-Trace Task",
        "Host": "pinky19.mpi-sws.org",
        "HRT": 25488946575554141,
        "Operation": "fork",
        "Timestamp": "1556272586515.726074",
        "TenantClass": 0,
        "Source": "Server.java:2398",
        "ThreadID": 64,
        "ThreadName": "",
        "EventID": "19A192944F7E1D07",
        "BaggageBytes": "[[248 5] [240 0] [0 129 183 32 68 105 60 47 94] [240 1] [0 92 95 142 75 173 207 28 13] [240 3] [0 2]]",
        "ProcessID": 2171
      },
      {
        "Cycles": 0,
        "Agent": "Execution-CPU",
        "ProcessName": "Name",
        "TaskID": "81B72044693C2F5E",
        "ParentEventID": [
          "19A192944F7E1D07"
        ],
        "Label": "unset",
        "Title": "X-Trace Task",
        "Host": "pinky19.mpi-sws.org",
        "Duration": "205424",
        "HRT": 25488946575657512,
        "Operation": "unset",
        "Timestamp": "1556272586515.829590",
        "TenantClass": 0,
        "Source": "Server.java:1058",
        "ThreadID": 64,
        "ThreadName": "",
        "EventID": "226AEA07BC7646CA",
        "BaggageBytes": "[[248 5] [240 0] [0 129 183 32 68 105 60 47 94] [240 1] [0 25 161 146 148 79 126 29 7] [240 3] [0 2]]",
        "ProcessID": 2171
      },
      {
        "Cycles": 0,
        "Agent": "Execution-CPU",
        "ProcessName": "Read",
        "TaskID": "81B72044693C2F5E",
        "ParentEventID": [
          "19A192944F7E1D07"
        ],
        "Label": "set",
        "Title": "X-Trace Task",
        "Host": "pinky19.mpi-sws.org",
        "HRT": 25488946575717734,
        "Operation": "set",
        "Timestamp": "1556272586515.884521",
        "TenantClass": 0,
        "Source": "Client.java:302",
        "ThreadID": 40,
        "ThreadName": "",
        "EventID": "1A33204908606A78",
        "ProcessID": 6356
      },
      {
        "Cycles": 0,
        "Agent": "Execution-CPU",
        "ProcessName": "Read",
        "TaskID": "81B72044693C2F5E",
        "ParentEventID": [
          "1A33204908606A78"
        ],
        "Label": "unset",
        "Title": "X-Trace Task",
        "Host": "pinky19.mpi-sws.org",
        "Duration": "10152",
        "HRT": 25488946575743374,
        "Operation": "unset",
        "Timestamp": "1556272586515.910156",
        "TenantClass": 0,
        "Source": "Client.java:1168",
        "ThreadID": 40,
        "ThreadName": "",
        "EventID": "91809D71ED4A0CE8",
        "ProcessID": 6356
      },
      {
        "Cycles": 0,
        "Agent": "Execution-Sleep",
        "ProcessName": "Read",
        "TaskID": "81B72044693C2F5E",
        "ParentEventID": [
          "A11D9FFAF3260C35"
        ],
        "Label": "waited",
        "Title": "X-Trace Task",
        "Host": "pinky19.mpi-sws.org",
        "Duration": "450333",
        "HRT": 25488946575765362,
        "Operation": "waited",
        "Timestamp": "1556272586515.932129",
        "TenantClass": 0,
        "Source": "Client.java:1537",
        "ThreadID": 1,
        "ThreadName": "",
        "EventID": "3F2A8DBEE79594D1",
        "ProcessID": 6356
      },
      {
        "Cycles": 0,
        "Agent": "edu.brown.cs.systems.xtrace.logging.BaggageWrappers",
        "ProcessName": "Read",
        "TaskID": "81B72044693C2F5E",
        "ParentEventID": [
          "3F2A8DBEE79594D1",
          "91809D71ED4A0CE8"
        ],
        "Label": "Merged current baggage with other baggage",
        "Title": "X-Trace Task",
        "Host": "pinky19.mpi-sws.org",
        "HRT": 25488946575777638,
        "Operation": "join",
        "Timestamp": "1556272586515.944336",
        "TenantClass": 0,
        "Source": "Client.java:1545",
        "ThreadID": 1,
        "ThreadName": "",
        "EventID": "A857B166BA3AD57B",
        "ProcessID": 6356
      },
      {
        "Cycles": 0,
        "Agent": "org.apache.hadoop.ipc.ProtobufRpcEngine",
        "ProcessName": "Read",
        "TaskID": "81B72044693C2F5E",
        "ParentEventID": [
          "A857B166BA3AD57B"
        ],
        "Label": "org.apache.hadoop.hdfs.protocol.ClientProtocol.getBlockLocations completed",
        "Title": "X-Trace Task",
        "Host": "pinky19.mpi-sws.org",
        "HRT": 25488946575821714,
        "Timestamp": "1556272586515.988525",
        "TenantClass": 0,
        "Source": "ProtobufRpcEngine.java:275",
        "ThreadID": 1,
        "ThreadName": "",
        "EventID": "E547FAEDBA1E7B5C",
        "ProcessID": 6356
      },
      {
        "Cycles": 0,
        "Agent": "Execution-Sleep",
        "ProcessName": "Read",
        "TaskID": "81B72044693C2F5E",
        "ParentEventID": [
          "E547FAEDBA1E7B5C"
        ],
        "Label": "waited",
        "Title": "X-Trace Task",
        "Host": "pinky19.mpi-sws.org",
        "Duration": "3964",
        "HRT": 25488946575935448,
        "Operation": "waited",
        "Timestamp": "1556272586516.102295",
        "TenantClass": 0,
        "Source": "SocketIOWithTimeout.java:335",
        "ThreadID": 1,
        "ThreadName": "",
        "EventID": "89097B635BE98011",
        "ProcessID": 6356
      },
      {
        "Cycles": 0,
        "Agent": "edu.brown.cs.systems.xtrace.logging.BaggageWrappers",
        "ProcessName": "Read",
        "TaskID": "81B72044693C2F5E",
        "ParentEventID": [
          "89097B635BE98011"
        ],
        "Label": "Forking current baggage with Baggage.fork()",
        "Title": "X-Trace Task",
        "Host": "pinky19.mpi-sws.org",
        "HRT": 25488946575972285,
        "Operation": "fork",
        "Timestamp": "1556272586516.139160",
        "TenantClass": 0,
        "Source": "DataTransferProtoUtil.java:94",
        "ThreadID": 1,
        "ThreadName": "",
        "EventID": "A783AFE4455BA073",
        "ProcessID": 6356
      },
      {
        "Cycles": 0,
        "Agent": "Execution-CPU",
        "ProcessName": "Data",
        "TaskID": "81B72044693C2F5E",
        "ParentEventID": [
          "A783AFE4455BA073"
        ],
        "Label": "set",
        "Title": "X-Trace Task",
        "Host": "pinky19.mpi-sws.org",
        "HRT": 25488946576136114,
        "Operation": "set",
        "Timestamp": "1556272586516.318115",
        "TenantClass": 0,
        "Source": "Receiver.java:117",
        "ThreadID": 7844,
        "ThreadName": "",
        "EventID": "04786564610FE1F9",
        "BaggageBytes": "[[248 5] [240 0] [0 129 183 32 68 105 60 47 94] [240 1] [0 167 131 175 228 69 91 160 115] [240 3] [0 2]]",
        "ProcessID": 2319
      },
      {
        "Cycles": 0,
        "Agent": "edu.brown.cs.systems.xtrace.logging.XTraceInit",
        "ProcessName": "Data",
        "TaskID": "81B72044693C2F5E",
        "ParentEventID": [
          "04786564610FE1F9"
        ],
        "Label": "Thread.setName: DataXceiver for client DFSClient_NONMAPREDUCE_614514224_1 at /139.19.171.63:47528 [Sending block BP-1633380353-139.19.171.63-1554193446451:blk_1073758619_17795]",
        "Title": "X-Trace Task",
        "Host": "pinky19.mpi-sws.org",
        "HRT": 25488946576174164,
        "Timestamp": "1556272586516.356201",
        "TenantClass": 0,
        "Source": "DataXceiver.java:168",
        "ThreadID": 7844,
        "ThreadName": "",
        "EventID": "C1A099056297C9CC",
        "BaggageBytes": "[[248 5] [240 0] [0 129 183 32 68 105 60 47 94] [240 1] [0 4 120 101 100 97 15 225 249] [240 3] [0 2]]",
        "ProcessID": 2319
      },
      {
        "Cycles": 0,
        "Agent": "edu.brown.cs.systems.xtrace.logging.BaggageWrappers",
        "ProcessName": "Data",
        "TaskID": "81B72044693C2F5E",
        "ParentEventID": [
          "C1A099056297C9CC"
        ],
        "Label": "Forking current baggage with Baggage.fork()",
        "Title": "X-Trace Task",
        "Host": "pinky19.mpi-sws.org",
        "HRT": 25488946576254450,
        "Operation": "fork",
        "Timestamp": "1556272586516.436523",
        "TenantClass": 0,
        "Source": "DataXceiver.java:1257",
        "ThreadID": 7844,
        "ThreadName": "",
        "EventID": "B62FF24590EC9A8B",
        "BaggageBytes": "[[248 5] [240 0] [0 129 183 32 68 105 60 47 94] [240 1] [0 193 160 153 5 98 151 201 204] [240 3] [0 2]]",
        "ProcessID": 2319
      },
      {
        "Cycles": 0,
        "Agent": "edu.brown.cs.systems.xtrace.logging.BaggageWrappers",
        "ProcessName": "Data",
        "TaskID": "81B72044693C2F5E",
        "ParentEventID": [
          "B62FF24590EC9A8B"
        ],
        "Label": "Forking current baggage with Baggage.fork()",
        "Title": "X-Trace Task",
        "Host": "pinky19.mpi-sws.org",
        "HRT": 25488946576326494,
        "Operation": "fork",
        "Timestamp": "1556272586516.508545",
        "TenantClass": 0,
        "Source": "PacketHeader.java:95",
        "ThreadID": 7844,
        "ThreadName": "",
        "EventID": "AC0FFBAE248EB591",
        "BaggageBytes": "[[248 5] [240 0] [0 129 183 32 68 105 60 47 94] [240 1] [0 182 47 242 69 144 236 154 139] [240 3] [0 2]]",
        "ProcessID": 2319
      },
      {
        "Cycles": 0,
        "Agent": "Execution-Sleep",
        "ProcessName": "Read",
        "TaskID": "81B72044693C2F5E",
        "ParentEventID": [
          "A783AFE4455BA073"
        ],
        "Label": "waited",
        "Title": "X-Trace Task",
        "Host": "pinky19.mpi-sws.org",
        "Duration": "252969",
        "HRT": 25488946576326093,
        "Operation": "waited",
        "Timestamp": "1556272586516.492920",
        "TenantClass": 0,
        "Source": "SocketIOWithTimeout.java:335",
        "ThreadID": 1,
        "ThreadName": "",
        "EventID": "7C1D9018A6067F47",
        "ProcessID": 6356
      },
      {
        "Cycles": 0,
        "Agent": "Execution-Sleep",
        "ProcessName": "Data",
        "TaskID": "81B72044693C2F5E",
        "ParentEventID": [
          "AC0FFBAE248EB591"
        ],
        "Label": "waited",
        "Title": "X-Trace Task",
        "Host": "pinky19.mpi-sws.org",
        "Duration": "4588",
        "HRT": 25488946576392412,
        "Operation": "waited",
        "Timestamp": "1556272586516.574463",
        "TenantClass": 0,
        "Source": "SocketIOWithTimeout.java:335",
        "ThreadID": 7844,
        "ThreadName": "",
        "EventID": "6FC246A1D3F946B8",
        "BaggageBytes": "[[248 5] [240 0] [0 129 183 32 68 105 60 47 94] [240 1] [0 172 15 251 174 36 142 181 145] [240 3] [0 2]]",
        "ProcessID": 2319
      },
      {
        "Cycles": 0,
        "Agent": "edu.brown.cs.systems.xtrace.logging.BaggageWrappers",
        "ProcessName": "Read",
        "TaskID": "81B72044693C2F5E",
        "ParentEventID": [
          "7C1D9018A6067F47",
          "B62FF24590EC9A8B"
        ],
        "Label": "Merged current baggage with other baggage",
        "Title": "X-Trace Task",
        "Host": "pinky19.mpi-sws.org",
        "HRT": 25488946576427783,
        "Operation": "join",
        "Timestamp": "1556272586516.594482",
        "TenantClass": 0,
        "Source": "RemoteBlockReader2.java:429",
        "ThreadID": 1,
        "ThreadName": "",
        "EventID": "C9C629820F95B64E",
        "ProcessID": 6356
      },
      {
        "Cycles": 0,
        "Agent": "edu.brown.cs.systems.xtrace.logging.BaggageWrappers",
        "ProcessName": "Data",
        "TaskID": "81B72044693C2F5E",
        "ParentEventID": [
          "6FC246A1D3F946B8"
        ],
        "Label": "Forking current baggage with Baggage.fork()",
        "Title": "X-Trace Task",
        "Host": "pinky19.mpi-sws.org",
        "HRT": 25488946576469402,
        "Operation": "fork",
        "Timestamp": "1556272586516.651367",
        "TenantClass": 0,
        "Source": "PacketHeader.java:95",
        "ThreadID": 7844,
        "ThreadName": "",
        "EventID": "5EA558A4789D0BC7",
        "BaggageBytes": "[[248 5] [240 0] [0 129 183 32 68 105 60 47 94] [240 1] [0 111 194 70 161 211 249 70 184] [240 3] [0 2]]",
        "ProcessID": 2319
      },
      {
        "Cycles": 0,
        "Agent": "edu.brown.cs.systems.xtrace.logging.BaggageWrappers",
        "ProcessName": "Read",
        "TaskID": "81B72044693C2F5E",
        "ParentEventID": [
          "AC0FFBAE248EB591",
          "C9C629820F95B64E"
        ],
        "Label": "Merged current baggage with other baggage",
        "Title": "X-Trace Task",
        "Host": "pinky19.mpi-sws.org",
        "HRT": 25488946576536631,
        "Operation": "join",
        "Timestamp": "1556272586516.703369",
        "TenantClass": 0,
        "Source": "PacketHeader.java:168",
        "ThreadID": 1,
        "ThreadName": "",
        "EventID": "834979CA8A14A0CC",
        "ProcessID": 6356
      },
      {
        "Cycles": 0,
        "Agent": "edu.brown.cs.systems.xtrace.logging.BaggageWrappers",
        "ProcessName": "Read",
        "TaskID": "81B72044693C2F5E",
        "ParentEventID": [
          "5EA558A4789D0BC7",
          "834979CA8A14A0CC"
        ],
        "Label": "Merged current baggage with other baggage",
        "Title": "X-Trace Task",
        "Host": "pinky19.mpi-sws.org",
        "HRT": 25488946576648359,
        "Operation": "join",
        "Timestamp": "1556272586516.815186",
        "TenantClass": 0,
        "Source": "PacketHeader.java:168",
        "ThreadID": 1,
        "ThreadName": "",
        "EventID": "69C12A83596375B9",
        "ProcessID": 6356
      },
      {
        "Cycles": 0,
        "Agent": "edu.brown.cs.systems.xtrace.logging.BaggageWrappers",
        "ProcessName": "Read",
        "TaskID": "81B72044693C2F5E",
        "ParentEventID": [
          "69C12A83596375B9"
        ],
        "Label": "Forking current baggage with Baggage.fork()",
        "Title": "X-Trace Task",
        "Host": "pinky19.mpi-sws.org",
        "HRT": 25488946576658763,
        "Operation": "fork",
        "Timestamp": "1556272586516.825439",
        "TenantClass": 0,
        "Source": "RemoteBlockReader2.java:361",
        "ThreadID": 1,
        "ThreadName": "",
        "EventID": "0EA2DAEC70112536",
        "ProcessID": 6356
      },
      {
        "Cycles": 0,
        "Agent": "edu.brown.cs.systems.xtrace.logging.BaggageWrappers",
        "ProcessName": "Read",
        "TaskID": "81B72044693C2F5E",
        "ParentEventID": [
          "0EA2DAEC70112536"
        ],
        "Label": "Forking current baggage with Baggage.fork()",
        "Title": "X-Trace Task",
        "Host": "pinky19.mpi-sws.org",
        "HRT": 25488946576737391,
        "Operation": "fork",
        "Timestamp": "1556272586516.904053",
        "TenantClass": 0,
        "Source": "DataTransferProtoUtil.java:94",
        "ThreadID": 1,
        "ThreadName": "",
        "EventID": "135A58BC0B09AC07",
        "ProcessID": 6356
      },
      {
        "Cycles": 0,
        "Agent": "Execution-Sleep",
        "ProcessName": "Data",
        "TaskID": "81B72044693C2F5E",
        "ParentEventID": [
          "5EA558A4789D0BC7"
        ],
        "Label": "waited",
        "Title": "X-Trace Task",
        "Host": "pinky19.mpi-sws.org",
        "Duration": "159267",
        "HRT": 25488946576708406,
        "Operation": "waited",
        "Timestamp": "1556272586516.890381",
        "TenantClass": 0,
        "Source": "SocketIOWithTimeout.java:335",
        "ThreadID": 7844,
        "ThreadName": "",
        "EventID": "727A6C3FEBD24434",
        "BaggageBytes": "[[248 5] [240 0] [0 129 183 32 68 105 60 47 94] [240 1] [0 94 165 88 164 120 157 11 199] [240 3] [0 2]]",
        "ProcessID": 2319
      },
      {
        "Cycles": 0,
        "Agent": "edu.brown.cs.systems.xtrace.logging.BaggageWrappers",
        "ProcessName": "Data",
        "TaskID": "81B72044693C2F5E",
        "ParentEventID": [
          "0EA2DAEC70112536",
          "727A6C3FEBD24434"
        ],
        "Label": "Merged current baggage with other baggage",
        "Title": "X-Trace Task",
        "Host": "pinky19.mpi-sws.org",
        "HRT": 25488946576760718,
        "Operation": "join",
        "Timestamp": "1556272586516.942627",
        "TenantClass": 0,
        "Source": "DataXceiver.java:574",
        "ThreadID": 7844,
        "ThreadName": "",
        "EventID": "0B26EF96069DD116",
        "BaggageBytes": "[[248 5] [240 0] [0 129 183 32 68 105 60 47 94] [240 1] [0 14 162 218 236 112 17 37 54] [0 114 122 108 63 235 210 68 52] [240 3] [0 2]]",
        "ProcessID": 2319
      },
      {
        "Cycles": 0,
        "Agent": "Execution-CPU",
        "ProcessName": "Data",
        "TaskID": "81B72044693C2F5E",
        "ParentEventID": [
          "0B26EF96069DD116"
        ],
        "Label": "unset",
        "Title": "X-Trace Task",
        "Host": "pinky19.mpi-sws.org",
        "Duration": "619639",
        "HRT": 25488946576781944,
        "Operation": "unset",
        "Timestamp": "1556272586516.963867",
        "TenantClass": 0,
        "Source": "DataXceiver.java:261",
        "ThreadID": 7844,
        "ThreadName": "",
        "EventID": "C1BEC0A43BD68637",
        "BaggageBytes": "[[248 5] [240 0] [0 129 183 32 68 105 60 47 94] [240 1] [0 11 38 239 150 6 157 209 22] [240 3] [0 2]]",
        "ProcessID": 2319
      },
      {
        "Cycles": 0,
        "Agent": "Execution-CPU",
        "ProcessName": "Data",
        "TaskID": "81B72044693C2F5E",
        "ParentEventID": [
          "135A58BC0B09AC07"
        ],
        "Label": "set",
        "Title": "X-Trace Task",
        "Host": "pinky19.mpi-sws.org",
        "HRT": 25488946576831598,
        "Operation": "set",
        "Timestamp": "1556272586517.013672",
        "TenantClass": 0,
        "Source": "Receiver.java:117",
        "ThreadID": 7844,
        "ThreadName": "",
        "EventID": "BE2DC7B85A8A68A9",
        "BaggageBytes": "[[248 5] [240 0] [0 129 183 32 68 105 60 47 94] [240 1] [0 19 90 88 188 11 9 172 7] [240 3] [0 2]]",
        "ProcessID": 2319
      },
      {
        "Cycles": 0,
        "Agent": "edu.brown.cs.systems.xtrace.logging.XTraceInit",
        "ProcessName": "Data",
        "TaskID": "81B72044693C2F5E",
        "ParentEventID": [
          "BE2DC7B85A8A68A9"
        ],
        "Label": "Thread.setName: DataXceiver for client DFSClient_NONMAPREDUCE_614514224_1 at /139.19.171.63:47528 [Sending block BP-1633380353-139.19.171.63-1554193446451:blk_1073758619_17795]",
        "Title": "X-Trace Task",
        "Host": "pinky19.mpi-sws.org",
        "HRT": 25488946576858195,
        "Timestamp": "1556272586517.040283",
        "TenantClass": 0,
        "Source": "DataXceiver.java:168",
        "ThreadID": 7844,
        "ThreadName": "",
        "EventID": "FD4CCAB3A1C2E44C",
        "BaggageBytes": "[[248 5] [240 0] [0 129 183 32 68 105 60 47 94] [240 1] [0 190 45 199 184 90 138 104 169] [240 3] [0 2]]",
        "ProcessID": 2319
      },
      {
        "Cycles": 0,
        "Agent": "edu.brown.cs.systems.xtrace.logging.BaggageWrappers",
        "ProcessName": "Data",
        "TaskID": "81B72044693C2F5E",
        "ParentEventID": [
          "FD4CCAB3A1C2E44C"
        ],
        "Label": "Forking current baggage with Baggage.fork()",
        "Title": "X-Trace Task",
        "Host": "pinky19.mpi-sws.org",
        "HRT": 25488946576915515,
        "Operation": "fork",
        "Timestamp": "1556272586517.097412",
        "TenantClass": 0,
        "Source": "DataXceiver.java:1257",
        "ThreadID": 7844,
        "ThreadName": "",
        "EventID": "A588B80B6CC23122",
        "BaggageBytes": "[[248 5] [240 0] [0 129 183 32 68 105 60 47 94] [240 1] [0 253 76 202 179 161 194 228 76] [240 3] [0 2]]",
        "ProcessID": 2319
      },
      {
        "Cycles": 0,
        "Agent": "edu.brown.cs.systems.xtrace.logging.BaggageWrappers",
        "ProcessName": "Data",
        "TaskID": "81B72044693C2F5E",
        "ParentEventID": [
          "A588B80B6CC23122"
        ],
        "Label": "Forking current baggage with Baggage.fork()",
        "Title": "X-Trace Task",
        "Host": "pinky19.mpi-sws.org",
        "HRT": 25488946576972044,
        "Operation": "fork",
        "Timestamp": "1556272586517.154053",
        "TenantClass": 0,
        "Source": "PacketHeader.java:95",
        "ThreadID": 7844,
        "ThreadName": "",
        "EventID": "07AA469D92B30269",
        "BaggageBytes": "[[248 5] [240 0] [0 129 183 32 68 105 60 47 94] [240 1] [0 165 136 184 11 108 194 49 34] [240 3] [0 2]]",
        "ProcessID": 2319
      },
      {
        "Cycles": 0,
        "Agent": "Execution-Sleep",
        "ProcessName": "Read",
        "TaskID": "81B72044693C2F5E",
        "ParentEventID": [
          "135A58BC0B09AC07"
        ],
        "Label": "waited",
        "Title": "X-Trace Task",
        "Host": "pinky19.mpi-sws.org",
        "Duration": "150472",
        "HRT": 25488946576971825,
        "Operation": "waited",
        "Timestamp": "1556272586517.138672",
        "TenantClass": 0,
        "Source": "SocketIOWithTimeout.java:335",
        "ThreadID": 1,
        "ThreadName": "",
        "EventID": "CFFE97061EE50114",
        "ProcessID": 6356
      },
      {
        "Cycles": 0,
        "Agent": "Execution-Sleep",
        "ProcessName": "Data",
        "TaskID": "81B72044693C2F5E",
        "ParentEventID": [
          "07AA469D92B30269"
        ],
        "Label": "waited",
        "Title": "X-Trace Task",
        "Host": "pinky19.mpi-sws.org",
        "Duration": "3754",
        "HRT": 25488946577026781,
        "Operation": "waited",
        "Timestamp": "1556272586517.208740",
        "TenantClass": 0,
        "Source": "SocketIOWithTimeout.java:335",
        "ThreadID": 7844,
        "ThreadName": "",
        "EventID": "84912FE0A7FA7CCE",
        "BaggageBytes": "[[248 5] [240 0] [0 129 183 32 68 105 60 47 94] [240 1] [0 7 170 70 157 146 179 2 105] [240 3] [0 2]]",
        "ProcessID": 2319
      },
      {
        "Cycles": 0,
        "Agent": "edu.brown.cs.systems.xtrace.logging.BaggageWrappers",
        "ProcessName": "Read",
        "TaskID": "81B72044693C2F5E",
        "ParentEventID": [
          "A588B80B6CC23122",
          "CFFE97061EE50114"
        ],
        "Label": "Merged current baggage with other baggage",
        "Title": "X-Trace Task",
        "Host": "pinky19.mpi-sws.org",
        "HRT": 25488946577040190,
        "Operation": "join",
        "Timestamp": "1556272586517.207031",
        "TenantClass": 0,
        "Source": "RemoteBlockReader2.java:429",
        "ThreadID": 1,
        "ThreadName": "",
        "EventID": "CFCBEAA4EEF9B446",
        "ProcessID": 6356
      },
      {
        "Cycles": 0,
        "Agent": "edu.brown.cs.systems.xtrace.logging.BaggageWrappers",
        "ProcessName": "Data",
        "TaskID": "81B72044693C2F5E",
        "ParentEventID": [
          "84912FE0A7FA7CCE"
        ],
        "Label": "Forking current baggage with Baggage.fork()",
        "Title": "X-Trace Task",
        "Host": "pinky19.mpi-sws.org",
        "HRT": 25488946577091080,
        "Operation": "fork",
        "Timestamp": "1556272586517.273193",
        "TenantClass": 0,
        "Source": "PacketHeader.java:95",
        "ThreadID": 7844,
        "ThreadName": "",
        "EventID": "0E408BF78DC0263E",
        "BaggageBytes": "[[248 5] [240 0] [0 129 183 32 68 105 60 47 94] [240 1] [0 132 145 47 224 167 250 124 206] [240 3] [0 2]]",
        "ProcessID": 2319
      },
      {
        "Cycles": 0,
        "Agent": "edu.brown.cs.systems.xtrace.logging.BaggageWrappers",
        "ProcessName": "Read",
        "TaskID": "81B72044693C2F5E",
        "ParentEventID": [
          "CFCBEAA4EEF9B446",
          "07AA469D92B30269"
        ],
        "Label": "Merged current baggage with other baggage",
        "Title": "X-Trace Task",
        "Host": "pinky19.mpi-sws.org",
        "HRT": 25488946577119182,
        "Operation": "join",
        "Timestamp": "1556272586517.285889",
        "TenantClass": 0,
        "Source": "PacketHeader.java:168",
        "ThreadID": 1,
        "ThreadName": "",
        "EventID": "179F25DCAE809B3F",
        "ProcessID": 6356
      },
      {
        "Cycles": 0,
        "Agent": "Execution-Sleep",
        "ProcessName": "Data",
        "TaskID": "81B72044693C2F5E",
        "ParentEventID": [
          "0E408BF78DC0263E"
        ],
        "Label": "waited",
        "Title": "X-Trace Task",
        "Host": "pinky19.mpi-sws.org",
        "Duration": "3346",
        "HRT": 25488946577144478,
        "Operation": "waited",
        "Timestamp": "1556272586517.326416",
        "TenantClass": 0,
        "Source": "SocketIOWithTimeout.java:335",
        "ThreadID": 7844,
        "ThreadName": "",
        "EventID": "B6E583A030395919",
        "BaggageBytes": "[[248 5] [240 0] [0 129 183 32 68 105 60 47 94] [240 1] [0 14 64 139 247 141 192 38 62] [240 3] [0 2]]",
        "ProcessID": 2319
      },
      {
        "Cycles": 0,
        "Agent": "edu.brown.cs.systems.xtrace.logging.BaggageWrappers",
        "ProcessName": "Data",
        "TaskID": "81B72044693C2F5E",
        "ParentEventID": [
          "B6E583A030395919"
        ],
        "Label": "Forking current baggage with Baggage.fork()",
        "Title": "X-Trace Task",
        "Host": "pinky19.mpi-sws.org",
        "HRT": 25488946577207001,
        "Operation": "fork",
        "Timestamp": "1556272586517.388916",
        "TenantClass": 0,
        "Source": "PacketHeader.java:95",
        "ThreadID": 7844,
        "ThreadName": "",
        "EventID": "8845B22860278DD1",
        "BaggageBytes": "[[248 5] [240 0] [0 129 183 32 68 105 60 47 94] [240 1] [0 182 229 131 160 48 57 89 25] [240 3] [0 2]]",
        "ProcessID": 2319
      },
      {
        "Cycles": 0,
        "Agent": "Execution-Sleep",
        "ProcessName": "Data",
        "TaskID": "81B72044693C2F5E",
        "ParentEventID": [
          "8845B22860278DD1"
        ],
        "Label": "waited",
        "Title": "X-Trace Task",
        "Host": "pinky19.mpi-sws.org",
        "Duration": "3181",
        "HRT": 25488946577258363,
        "Operation": "waited",
        "Timestamp": "1556272586517.440430",
        "TenantClass": 0,
        "Source": "SocketIOWithTimeout.java:335",
        "ThreadID": 7844,
        "ThreadName": "",
        "EventID": "CEF4C1C4DD70D944",
        "BaggageBytes": "[[248 5] [240 0] [0 129 183 32 68 105 60 47 94] [240 1] [0 136 69 178 40 96 39 141 209] [240 3] [0 2]]",
        "ProcessID": 2319
      },
      {
        "Cycles": 0,
        "Agent": "edu.brown.cs.systems.xtrace.logging.BaggageWrappers",
        "ProcessName": "Read",
        "TaskID": "81B72044693C2F5E",
        "ParentEventID": [
          "179F25DCAE809B3F",
          "0E408BF78DC0263E"
        ],
        "Label": "Merged current baggage with other baggage",
        "Title": "X-Trace Task",
        "Host": "pinky19.mpi-sws.org",
        "HRT": 25488946577251247,
        "Operation": "join",
        "Timestamp": "1556272586517.417969",
        "TenantClass": 0,
        "Source": "PacketHeader.java:168",
        "ThreadID": 1,
        "ThreadName": "",
        "EventID": "75E429168421CFB3",
        "ProcessID": 6356
      },
      {
        "Cycles": 0,
        "Agent": "edu.brown.cs.systems.xtrace.logging.BaggageWrappers",
        "ProcessName": "Data",
        "TaskID": "81B72044693C2F5E",
        "ParentEventID": [
          "CEF4C1C4DD70D944"
        ],
        "Label": "Forking current baggage with Baggage.fork()",
        "Title": "X-Trace Task",
        "Host": "pinky19.mpi-sws.org",
        "HRT": 25488946577320253,
        "Operation": "fork",
        "Timestamp": "1556272586517.502197",
        "TenantClass": 0,
        "Source": "PacketHeader.java:95",
        "ThreadID": 7844,
        "ThreadName": "",
        "EventID": "65E9170493671B4A",
        "BaggageBytes": "[[248 5] [240 0] [0 129 183 32 68 105 60 47 94] [240 1] [0 206 244 193 196 221 112 217 68] [240 3] [0 2]]",
        "ProcessID": 2319
      },
      {
        "Cycles": 0,
        "Agent": "Execution-Sleep",
        "ProcessName": "Data",
        "TaskID": "81B72044693C2F5E",
        "ParentEventID": [
          "65E9170493671B4A"
        ],
        "Label": "waited",
        "Title": "X-Trace Task",
        "Host": "pinky19.mpi-sws.org",
        "Duration": "3067",
        "HRT": 25488946577371658,
        "Operation": "waited",
        "Timestamp": "1556272586517.553711",
        "TenantClass": 0,
        "Source": "SocketIOWithTimeout.java:335",
        "ThreadID": 7844,
        "ThreadName": "",
        "EventID": "7A04542C0377D854",
        "BaggageBytes": "[[248 5] [240 0] [0 129 183 32 68 105 60 47 94] [240 1] [0 101 233 23 4 147 103 27 74] [240 3] [0 2]]",
        "ProcessID": 2319
      },
      {
        "Cycles": 0,
        "Agent": "edu.brown.cs.systems.xtrace.logging.BaggageWrappers",
        "ProcessName": "Read",
        "TaskID": "81B72044693C2F5E",
        "ParentEventID": [
          "8845B22860278DD1",
          "75E429168421CFB3"
        ],
        "Label": "Merged current baggage with other baggage",
        "Title": "X-Trace Task",
        "Host": "pinky19.mpi-sws.org",
        "HRT": 25488946577383074,
        "Operation": "join",
        "Timestamp": "1556272586517.549805",
        "TenantClass": 0,
        "Source": "PacketHeader.java:168",
        "ThreadID": 1,
        "ThreadName": "",
        "EventID": "B2D274D4A9C49C75",
        "ProcessID": 6356
      },
      {
        "Cycles": 0,
        "Agent": "edu.brown.cs.systems.xtrace.logging.BaggageWrappers",
        "ProcessName": "Data",
        "TaskID": "81B72044693C2F5E",
        "ParentEventID": [
          "7A04542C0377D854"
        ],
        "Label": "Forking current baggage with Baggage.fork()",
        "Title": "X-Trace Task",
        "Host": "pinky19.mpi-sws.org",
        "HRT": 25488946577431955,
        "Operation": "fork",
        "Timestamp": "1556272586517.614014",
        "TenantClass": 0,
        "Source": "PacketHeader.java:95",
        "ThreadID": 7844,
        "ThreadName": "",
        "EventID": "186F2BBE75586A0B",
        "BaggageBytes": "[[248 5] [240 0] [0 129 183 32 68 105 60 47 94] [240 1] [0 122 4 84 44 3 119 216 84] [240 3] [0 2]]",
        "ProcessID": 2319
      },
      {
        "Cycles": 0,
        "Agent": "Execution-Sleep",
        "ProcessName": "Data",
        "TaskID": "81B72044693C2F5E",
        "ParentEventID": [
          "186F2BBE75586A0B"
        ],
        "Label": "waited",
        "Title": "X-Trace Task",
        "Host": "pinky19.mpi-sws.org",
        "Duration": "2953",
        "HRT": 25488946577484968,
        "Operation": "waited",
        "Timestamp": "1556272586517.666992",
        "TenantClass": 0,
        "Source": "SocketIOWithTimeout.java:335",
        "ThreadID": 7844,
        "ThreadName": "",
        "EventID": "0F17F18DCB78664D",
        "BaggageBytes": "[[248 5] [240 0] [0 129 183 32 68 105 60 47 94] [240 1] [0 24 111 43 190 117 88 106 11] [240 3] [0 2]]",
        "ProcessID": 2319
      },
      {
        "Cycles": 0,
        "Agent": "edu.brown.cs.systems.xtrace.logging.BaggageWrappers",
        "ProcessName": "Read",
        "TaskID": "81B72044693C2F5E",
        "ParentEventID": [
          "65E9170493671B4A",
          "B2D274D4A9C49C75"
        ],
        "Label": "Merged current baggage with other baggage",
        "Title": "X-Trace Task",
        "Host": "pinky19.mpi-sws.org",
        "HRT": 25488946577517419,
        "Operation": "join",
        "Timestamp": "1556272586517.684082",
        "TenantClass": 0,
        "Source": "PacketHeader.java:168",
        "ThreadID": 1,
        "ThreadName": "",
        "EventID": "F914C956E6061170",
        "ProcessID": 6356
      },
      {
        "Cycles": 0,
        "Agent": "edu.brown.cs.systems.xtrace.logging.BaggageWrappers",
        "ProcessName": "Data",
        "TaskID": "81B72044693C2F5E",
        "ParentEventID": [
          "0F17F18DCB78664D"
        ],
        "Label": "Forking current baggage with Baggage.fork()",
        "Title": "X-Trace Task",
        "Host": "pinky19.mpi-sws.org",
        "HRT": 25488946577543889,
        "Operation": "fork",
        "Timestamp": "1556272586517.725830",
        "TenantClass": 0,
        "Source": "PacketHeader.java:95",
        "ThreadID": 7844,
        "ThreadName": "",
        "EventID": "A042ABF99A3FA104",
        "BaggageBytes": "[[248 5] [240 0] [0 129 183 32 68 105 60 47 94] [240 1] [0 15 23 241 141 203 120 102 77] [240 3] [0 2]]",
        "ProcessID": 2319
      },
      {
        "Cycles": 0,
        "Agent": "Execution-Sleep",
        "ProcessName": "Data",
        "TaskID": "81B72044693C2F5E",
        "ParentEventID": [
          "A042ABF99A3FA104"
        ],
        "Label": "waited",
        "Title": "X-Trace Task",
        "Host": "pinky19.mpi-sws.org",
        "Duration": "3072",
        "HRT": 25488946577593779,
        "Operation": "waited",
        "Timestamp": "1556272586517.775879",
        "TenantClass": 0,
        "Source": "SocketIOWithTimeout.java:335",
        "ThreadID": 7844,
        "ThreadName": "",
        "EventID": "FDA8A3490FBB54A0",
        "BaggageBytes": "[[248 5] [240 0] [0 129 183 32 68 105 60 47 94] [240 1] [0 160 66 171 249 154 63 161 4] [240 3] [0 2]]",
        "ProcessID": 2319
      },
      {
        "Cycles": 0,
        "Agent": "edu.brown.cs.systems.xtrace.logging.BaggageWrappers",
        "ProcessName": "Read",
        "TaskID": "81B72044693C2F5E",
        "ParentEventID": [
          "186F2BBE75586A0B",
          "F914C956E6061170"
        ],
        "Label": "Merged current baggage with other baggage",
        "Title": "X-Trace Task",
        "Host": "pinky19.mpi-sws.org",
        "HRT": 25488946577647497,
        "Operation": "join",
        "Timestamp": "1556272586517.814209",
        "TenantClass": 0,
        "Source": "PacketHeader.java:168",
        "ThreadID": 1,
        "ThreadName": "",
        "EventID": "8441FA902D6FA427",
        "ProcessID": 6356
      },
      {
        "Cycles": 0,
        "Agent": "edu.brown.cs.systems.xtrace.logging.BaggageWrappers",
        "ProcessName": "Data",
        "TaskID": "81B72044693C2F5E",
        "ParentEventID": [
          "FDA8A3490FBB54A0"
        ],
        "Label": "Forking current baggage with Baggage.fork()",
        "Title": "X-Trace Task",
        "Host": "pinky19.mpi-sws.org",
        "HRT": 25488946577655314,
        "Operation": "fork",
        "Timestamp": "1556272586517.837402",
        "TenantClass": 0,
        "Source": "PacketHeader.java:95",
        "ThreadID": 7844,
        "ThreadName": "",
        "EventID": "15BFA34032449644",
        "BaggageBytes": "[[248 5] [240 0] [0 129 183 32 68 105 60 47 94] [240 1] [0 253 168 163 73 15 187 84 160] [240 3] [0 2]]",
        "ProcessID": 2319
      },
      {
        "Cycles": 0,
        "Agent": "Execution-Sleep",
        "ProcessName": "Data",
        "TaskID": "81B72044693C2F5E",
        "ParentEventID": [
          "15BFA34032449644"
        ],
        "Label": "waited",
        "Title": "X-Trace Task",
        "Host": "pinky19.mpi-sws.org",
        "Duration": "3020",
        "HRT": 25488946577706028,
        "Operation": "waited",
        "Timestamp": "1556272586517.887939",
        "TenantClass": 0,
        "Source": "SocketIOWithTimeout.java:335",
        "ThreadID": 7844,
        "ThreadName": "",
        "EventID": "2C9FE3668D3B95E1",
        "BaggageBytes": "[[248 5] [240 0] [0 129 183 32 68 105 60 47 94] [240 1] [0 21 191 163 64 50 68 150 68] [240 3] [0 2]]",
        "ProcessID": 2319
      },
      {
        "Cycles": 0,
        "Agent": "edu.brown.cs.systems.xtrace.logging.BaggageWrappers",
        "ProcessName": "Data",
        "TaskID": "81B72044693C2F5E",
        "ParentEventID": [
          "2C9FE3668D3B95E1"
        ],
        "Label": "Forking current baggage with Baggage.fork()",
        "Title": "X-Trace Task",
        "Host": "pinky19.mpi-sws.org",
        "HRT": 25488946577765343,
        "Operation": "fork",
        "Timestamp": "1556272586517.947266",
        "TenantClass": 0,
        "Source": "PacketHeader.java:95",
        "ThreadID": 7844,
        "ThreadName": "",
        "EventID": "7EDEE498942217D2",
        "BaggageBytes": "[[248 5] [240 0] [0 129 183 32 68 105 60 47 94] [240 1] [0 44 159 227 102 141 59 149 225] [240 3] [0 2]]",
        "ProcessID": 2319
      },
      {
        "Cycles": 0,
        "Agent": "edu.brown.cs.systems.xtrace.logging.BaggageWrappers",
        "ProcessName": "Read",
        "TaskID": "81B72044693C2F5E",
        "ParentEventID": [
          "A042ABF99A3FA104",
          "8441FA902D6FA427"
        ],
        "Label": "Merged current baggage with other baggage",
        "Title": "X-Trace Task",
        "Host": "pinky19.mpi-sws.org",
        "HRT": 25488946577803342,
        "Operation": "join",
        "Timestamp": "1556272586517.970215",
        "TenantClass": 0,
        "Source": "PacketHeader.java:168",
        "ThreadID": 1,
        "ThreadName": "",
        "EventID": "B08F6351A4CFD174",
        "ProcessID": 6356
      },
      {
        "Cycles": 0,
        "Agent": "Execution-Sleep",
        "ProcessName": "Data",
        "TaskID": "81B72044693C2F5E",
        "ParentEventID": [
          "7EDEE498942217D2"
        ],
        "Label": "waited",
        "Title": "X-Trace Task",
        "Host": "pinky19.mpi-sws.org",
        "Duration": "3117",
        "HRT": 25488946577835538,
        "Operation": "waited",
        "Timestamp": "1556272586518.017578",
        "TenantClass": 0,
        "Source": "SocketIOWithTimeout.java:335",
        "ThreadID": 7844,
        "ThreadName": "",
        "EventID": "7DD816D7FDE364BC",
        "BaggageBytes": "[[248 5] [240 0] [0 129 183 32 68 105 60 47 94] [240 1] [0 126 222 228 152 148 34 23 210] [240 3] [0 2]]",
        "ProcessID": 2319
      },
      {
        "Cycles": 0,
        "Agent": "edu.brown.cs.systems.xtrace.logging.BaggageWrappers",
        "ProcessName": "Data",
        "TaskID": "81B72044693C2F5E",
        "ParentEventID": [
          "7DD816D7FDE364BC"
        ],
        "Label": "Forking current baggage with Baggage.fork()",
        "Title": "X-Trace Task",
        "Host": "pinky19.mpi-sws.org",
        "HRT": 25488946577896274,
        "Operation": "fork",
        "Timestamp": "1556272586518.078369",
        "TenantClass": 0,
        "Source": "PacketHeader.java:95",
        "ThreadID": 7844,
        "ThreadName": "",
        "EventID": "6D2ED8738F406DBD",
        "BaggageBytes": "[[248 5] [240 0] [0 129 183 32 68 105 60 47 94] [240 1] [0 125 216 22 215 253 227 100 188] [240 3] [0 2]]",
        "ProcessID": 2319
      },
      {
        "Cycles": 0,
        "Agent": "Execution-Sleep",
        "ProcessName": "Data",
        "TaskID": "81B72044693C2F5E",
        "ParentEventID": [
          "6D2ED8738F406DBD"
        ],
        "Label": "waited",
        "Title": "X-Trace Task",
        "Host": "pinky19.mpi-sws.org",
        "Duration": "3086",
        "HRT": 25488946577947643,
        "Operation": "waited",
        "Timestamp": "1556272586518.129639",
        "TenantClass": 0,
        "Source": "SocketIOWithTimeout.java:335",
        "ThreadID": 7844,
        "ThreadName": "",
        "EventID": "D6B3E801A6006629",
        "BaggageBytes": "[[248 5] [240 0] [0 129 183 32 68 105 60 47 94] [240 1] [0 109 46 216 115 143 64 109 189] [240 3] [0 2]]",
        "ProcessID": 2319
      },
      {
        "Cycles": 0,
        "Agent": "edu.brown.cs.systems.xtrace.logging.BaggageWrappers",
        "ProcessName": "Read",
        "TaskID": "81B72044693C2F5E",
        "ParentEventID": [
          "B08F6351A4CFD174",
          "15BFA34032449644"
        ],
        "Label": "Merged current baggage with other baggage",
        "Title": "X-Trace Task",
        "Host": "pinky19.mpi-sws.org",
        "HRT": 25488946577935457,
        "Operation": "join",
        "Timestamp": "1556272586518.102295",
        "TenantClass": 0,
        "Source": "PacketHeader.java:168",
        "ThreadID": 1,
        "ThreadName": "",
        "EventID": "F4BDE0DACC71F691",
        "ProcessID": 6356
      },
      {
        "Cycles": 0,
        "Agent": "edu.brown.cs.systems.xtrace.logging.BaggageWrappers",
        "ProcessName": "Data",
        "TaskID": "81B72044693C2F5E",
        "ParentEventID": [
          "D6B3E801A6006629"
        ],
        "Label": "Forking current baggage with Baggage.fork()",
        "Title": "X-Trace Task",
        "Host": "pinky19.mpi-sws.org",
        "HRT": 25488946578006546,
        "Operation": "fork",
        "Timestamp": "1556272586518.188477",
        "TenantClass": 0,
        "Source": "PacketHeader.java:95",
        "ThreadID": 7844,
        "ThreadName": "",
        "EventID": "2EF0C4C95D2D6971",
        "BaggageBytes": "[[248 5] [240 0] [0 129 183 32 68 105 60 47 94] [240 1] [0 214 179 232 1 166 0 102 41] [240 3] [0 2]]",
        "ProcessID": 2319
      },
      {
        "Cycles": 0,
        "Agent": "edu.brown.cs.systems.xtrace.logging.BaggageWrappers",
        "ProcessName": "Read",
        "TaskID": "81B72044693C2F5E",
        "ParentEventID": [
          "F4BDE0DACC71F691",
          "7EDEE498942217D2"
        ],
        "Label": "Merged current baggage with other baggage",
        "Title": "X-Trace Task",
        "Host": "pinky19.mpi-sws.org",
        "HRT": 25488946578067728,
        "Operation": "join",
        "Timestamp": "1556272586518.234375",
        "TenantClass": 0,
        "Source": "PacketHeader.java:168",
        "ThreadID": 1,
        "ThreadName": "",
        "EventID": "8FBC882A07ECDAC2",
        "ProcessID": 6356
      },
      {
        "Cycles": 0,
        "Agent": "Execution-Sleep",
        "ProcessName": "Data",
        "TaskID": "81B72044693C2F5E",
        "ParentEventID": [
          "2EF0C4C95D2D6971"
        ],
        "Label": "waited",
        "Title": "X-Trace Task",
        "Host": "pinky19.mpi-sws.org",
        "Duration": "3019",
        "HRT": 25488946578059477,
        "Operation": "waited",
        "Timestamp": "1556272586518.241455",
        "TenantClass": 0,
        "Source": "SocketIOWithTimeout.java:335",
        "ThreadID": 7844,
        "ThreadName": "",
        "EventID": "C772457ADE9B3ADE",
        "BaggageBytes": "[[248 5] [240 0] [0 129 183 32 68 105 60 47 94] [240 1] [0 46 240 196 201 93 45 105 113] [240 3] [0 2]]",
        "ProcessID": 2319
      },
      {
        "Cycles": 0,
        "Agent": "edu.brown.cs.systems.xtrace.logging.BaggageWrappers",
        "ProcessName": "Data",
        "TaskID": "81B72044693C2F5E",
        "ParentEventID": [
          "C772457ADE9B3ADE"
        ],
        "Label": "Forking current baggage with Baggage.fork()",
        "Title": "X-Trace Task",
        "Host": "pinky19.mpi-sws.org",
        "HRT": 25488946578116961,
        "Operation": "fork",
        "Timestamp": "1556272586518.299072",
        "TenantClass": 0,
        "Source": "PacketHeader.java:95",
        "ThreadID": 7844,
        "ThreadName": "",
        "EventID": "11FFF37EE6B5964B",
        "BaggageBytes": "[[248 5] [240 0] [0 129 183 32 68 105 60 47 94] [240 1] [0 199 114 69 122 222 155 58 222] [240 3] [0 2]]",
        "ProcessID": 2319
      },
      {
        "Cycles": 0,
        "Agent": "Execution-Sleep",
        "ProcessName": "Data",
        "TaskID": "81B72044693C2F5E",
        "ParentEventID": [
          "11FFF37EE6B5964B"
        ],
        "Label": "waited",
        "Title": "X-Trace Task",
        "Host": "pinky19.mpi-sws.org",
        "Duration": "3135",
        "HRT": 25488946578169901,
        "Operation": "waited",
        "Timestamp": "1556272586518.351807",
        "TenantClass": 0,
        "Source": "SocketIOWithTimeout.java:335",
        "ThreadID": 7844,
        "ThreadName": "",
        "EventID": "B8FD0914B0323405",
        "BaggageBytes": "[[248 5] [240 0] [0 129 183 32 68 105 60 47 94] [240 1] [0 17 255 243 126 230 181 150 75] [240 3] [0 2]]",
        "ProcessID": 2319
      },
      {
        "Cycles": 0,
        "Agent": "edu.brown.cs.systems.xtrace.logging.BaggageWrappers",
        "ProcessName": "Read",
        "TaskID": "81B72044693C2F5E",
        "ParentEventID": [
          "6D2ED8738F406DBD",
          "8FBC882A07ECDAC2"
        ],
        "Label": "Merged current baggage with other baggage",
        "Title": "X-Trace Task",
        "Host": "pinky19.mpi-sws.org",
        "HRT": 25488946578201907,
        "Operation": "join",
        "Timestamp": "1556272586518.368652",
        "TenantClass": 0,
        "Source": "PacketHeader.java:168",
        "ThreadID": 1,
        "ThreadName": "",
        "EventID": "047668C9FE85780B",
        "ProcessID": 6356
      },
      {
        "Cycles": 0,
        "Agent": "edu.brown.cs.systems.xtrace.logging.BaggageWrappers",
        "ProcessName": "Data",
        "TaskID": "81B72044693C2F5E",
        "ParentEventID": [
          "B8FD0914B0323405"
        ],
        "Label": "Forking current baggage with Baggage.fork()",
        "Title": "X-Trace Task",
        "Host": "pinky19.mpi-sws.org",
        "HRT": 25488946578228266,
        "Operation": "fork",
        "Timestamp": "1556272586518.410156",
        "TenantClass": 0,
        "Source": "PacketHeader.java:95",
        "ThreadID": 7844,
        "ThreadName": "",
        "EventID": "B19A5B11D9075F70",
        "BaggageBytes": "[[248 5] [240 0] [0 129 183 32 68 105 60 47 94] [240 1] [0 184 253 9 20 176 50 52 5] [240 3] [0 2]]",
        "ProcessID": 2319
      },
      {
        "Cycles": 0,
        "Agent": "Execution-Sleep",
        "ProcessName": "Data",
        "TaskID": "81B72044693C2F5E",
        "ParentEventID": [
          "B19A5B11D9075F70"
        ],
        "Label": "waited",
        "Title": "X-Trace Task",
        "Host": "pinky19.mpi-sws.org",
        "Duration": "3372",
        "HRT": 25488946578279763,
        "Operation": "waited",
        "Timestamp": "1556272586518.461670",
        "TenantClass": 0,
        "Source": "SocketIOWithTimeout.java:335",
        "ThreadID": 7844,
        "ThreadName": "",
        "EventID": "384C8B1A1D1E1F2F",
        "BaggageBytes": "[[248 5] [240 0] [0 129 183 32 68 105 60 47 94] [240 1] [0 177 154 91 17 217 7 95 112] [240 3] [0 2]]",
        "ProcessID": 2319
      },
      {
        "Cycles": 0,
        "Agent": "edu.brown.cs.systems.xtrace.logging.BaggageWrappers",
        "ProcessName": "Read",
        "TaskID": "81B72044693C2F5E",
        "ParentEventID": [
          "2EF0C4C95D2D6971",
          "047668C9FE85780B"
        ],
        "Label": "Merged current baggage with other baggage",
        "Title": "X-Trace Task",
        "Host": "pinky19.mpi-sws.org",
        "HRT": 25488946578333302,
        "Operation": "join",
        "Timestamp": "1556272586518.500000",
        "TenantClass": 0,
        "Source": "PacketHeader.java:168",
        "ThreadID": 1,
        "ThreadName": "",
        "EventID": "522F3CF0A9B6C8DD",
        "ProcessID": 6356
      },
      {
        "Cycles": 0,
        "Agent": "edu.brown.cs.systems.xtrace.logging.BaggageWrappers",
        "ProcessName": "Data",
        "TaskID": "81B72044693C2F5E",
        "ParentEventID": [
          "384C8B1A1D1E1F2F"
        ],
        "Label": "Forking current baggage with Baggage.fork()",
        "Title": "X-Trace Task",
        "Host": "pinky19.mpi-sws.org",
        "HRT": 25488946578340124,
        "Operation": "fork",
        "Timestamp": "1556272586518.522217",
        "TenantClass": 0,
        "Source": "PacketHeader.java:95",
        "ThreadID": 7844,
        "ThreadName": "",
        "EventID": "CF78AD7024823EDA",
        "BaggageBytes": "[[248 5] [240 0] [0 129 183 32 68 105 60 47 94] [240 1] [0 56 76 139 26 29 30 31 47] [240 3] [0 2]]",
        "ProcessID": 2319
      },
      {
        "Cycles": 0,
        "Agent": "Execution-Sleep",
        "ProcessName": "Data",
        "TaskID": "81B72044693C2F5E",
        "ParentEventID": [
          "CF78AD7024823EDA"
        ],
        "Label": "waited",
        "Title": "X-Trace Task",
        "Host": "pinky19.mpi-sws.org",
        "Duration": "3090",
        "HRT": 25488946578390608,
        "Operation": "waited",
        "Timestamp": "1556272586518.572510",
        "TenantClass": 0,
        "Source": "SocketIOWithTimeout.java:335",
        "ThreadID": 7844,
        "ThreadName": "",
        "EventID": "D75AA5D7F3E35D87",
        "BaggageBytes": "[[248 5] [240 0] [0 129 183 32 68 105 60 47 94] [240 1] [0 207 120 173 112 36 130 62 218] [240 3] [0 2]]",
        "ProcessID": 2319
      },
      {
        "Cycles": 0,
        "Agent": "edu.brown.cs.systems.xtrace.logging.BaggageWrappers",
        "ProcessName": "Data",
        "TaskID": "81B72044693C2F5E",
        "ParentEventID": [
          "D75AA5D7F3E35D87"
        ],
        "Label": "Forking current baggage with Baggage.fork()",
        "Title": "X-Trace Task",
        "Host": "pinky19.mpi-sws.org",
        "HRT": 25488946578452959,
        "Operation": "fork",
        "Timestamp": "1556272586518.635010",
        "TenantClass": 0,
        "Source": "PacketHeader.java:95",
        "ThreadID": 7844,
        "ThreadName": "",
        "EventID": "371DF123AE6149B3",
        "BaggageBytes": "[[248 5] [240 0] [0 129 183 32 68 105 60 47 94] [240 1] [0 215 90 165 215 243 227 93 135] [240 3] [0 2]]",
        "ProcessID": 2319
      },
      {
        "Cycles": 0,
        "Agent": "edu.brown.cs.systems.xtrace.logging.BaggageWrappers",
        "ProcessName": "Read",
        "TaskID": "81B72044693C2F5E",
        "ParentEventID": [
          "522F3CF0A9B6C8DD",
          "11FFF37EE6B5964B"
        ],
        "Label": "Merged current baggage with other baggage",
        "Title": "X-Trace Task",
        "Host": "pinky19.mpi-sws.org",
        "HRT": 25488946578467114,
        "Operation": "join",
        "Timestamp": "1556272586518.633789",
        "TenantClass": 0,
        "Source": "PacketHeader.java:168",
        "ThreadID": 1,
        "ThreadName": "",
        "EventID": "AE24ED201CF9899F",
        "ProcessID": 6356
      },
      {
        "Cycles": 0,
        "Agent": "Execution-Sleep",
        "ProcessName": "Data",
        "TaskID": "81B72044693C2F5E",
        "ParentEventID": [
          "371DF123AE6149B3"
        ],
        "Label": "waited",
        "Title": "X-Trace Task",
        "Host": "pinky19.mpi-sws.org",
        "Duration": "2987",
        "HRT": 25488946578503320,
        "Operation": "waited",
        "Timestamp": "1556272586518.685303",
        "TenantClass": 0,
        "Source": "SocketIOWithTimeout.java:335",
        "ThreadID": 7844,
        "ThreadName": "",
        "EventID": "4243ED5F0720BA4A",
        "BaggageBytes": "[[248 5] [240 0] [0 129 183 32 68 105 60 47 94] [240 1] [0 55 29 241 35 174 97 73 179] [240 3] [0 2]]",
        "ProcessID": 2319
      },
      {
        "Cycles": 0,
        "Agent": "edu.brown.cs.systems.xtrace.logging.BaggageWrappers",
        "ProcessName": "Data",
        "TaskID": "81B72044693C2F5E",
        "ParentEventID": [
          "4243ED5F0720BA4A"
        ],
        "Label": "Forking current baggage with Baggage.fork()",
        "Title": "X-Trace Task",
        "Host": "pinky19.mpi-sws.org",
        "HRT": 25488946578562901,
        "Operation": "fork",
        "Timestamp": "1556272586518.744873",
        "TenantClass": 0,
        "Source": "PacketHeader.java:95",
        "ThreadID": 7844,
        "ThreadName": "",
        "EventID": "6E2508B59191ADE6",
        "BaggageBytes": "[[248 5] [240 0] [0 129 183 32 68 105 60 47 94] [240 1] [0 66 67 237 95 7 32 186 74] [240 3] [0 2]]",
        "ProcessID": 2319
      },
      {
        "Cycles": 0,
        "Agent": "edu.brown.cs.systems.xtrace.logging.BaggageWrappers",
        "ProcessName": "Read",
        "TaskID": "81B72044693C2F5E",
        "ParentEventID": [
          "AE24ED201CF9899F",
          "B19A5B11D9075F70"
        ],
        "Label": "Merged current baggage with other baggage",
        "Title": "X-Trace Task",
        "Host": "pinky19.mpi-sws.org",
        "HRT": 25488946578597014,
        "Operation": "join",
        "Timestamp": "1556272586518.763672",
        "TenantClass": 0,
        "Source": "PacketHeader.java:168",
        "ThreadID": 1,
        "ThreadName": "",
        "EventID": "F70EDDB2E52E487A",
        "ProcessID": 6356
      },
      {
        "Cycles": 0,
        "Agent": "Execution-Sleep",
        "ProcessName": "Data",
        "TaskID": "81B72044693C2F5E",
        "ParentEventID": [
          "6E2508B59191ADE6"
        ],
        "Label": "waited",
        "Title": "X-Trace Task",
        "Host": "pinky19.mpi-sws.org",
        "Duration": "3003",
        "HRT": 25488946578614857,
        "Operation": "waited",
        "Timestamp": "1556272586518.796875",
        "TenantClass": 0,
        "Source": "SocketIOWithTimeout.java:335",
        "ThreadID": 7844,
        "ThreadName": "",
        "EventID": "ABDE1F884DF0B476",
        "BaggageBytes": "[[248 5] [240 0] [0 129 183 32 68 105 60 47 94] [240 1] [0 110 37 8 181 145 145 173 230] [240 3] [0 2]]",
        "ProcessID": 2319
      },
      {
        "Cycles": 0,
        "Agent": "edu.brown.cs.systems.xtrace.logging.BaggageWrappers",
        "ProcessName": "Data",
        "TaskID": "81B72044693C2F5E",
        "ParentEventID": [
          "ABDE1F884DF0B476"
        ],
        "Label": "Forking current baggage with Baggage.fork()",
        "Title": "X-Trace Task",
        "Host": "pinky19.mpi-sws.org",
        "HRT": 25488946578674265,
        "Operation": "fork",
        "Timestamp": "1556272586518.856201",
        "TenantClass": 0,
        "Source": "PacketHeader.java:95",
        "ThreadID": 7844,
        "ThreadName": "",
        "EventID": "EFD4CC5066FAF4F1",
        "BaggageBytes": "[[248 5] [240 0] [0 129 183 32 68 105 60 47 94] [240 1] [0 171 222 31 136 77 240 180 118] [240 3] [0 2]]",
        "ProcessID": 2319
      },
      {
        "Cycles": 0,
        "Agent": "edu.brown.cs.systems.xtrace.logging.BaggageWrappers",
        "ProcessName": "Read",
        "TaskID": "81B72044693C2F5E",
        "ParentEventID": [
          "CF78AD7024823EDA",
          "F70EDDB2E52E487A"
        ],
        "Label": "Merged current baggage with other baggage",
        "Title": "X-Trace Task",
        "Host": "pinky19.mpi-sws.org",
        "HRT": 25488946578721505,
        "Operation": "join",
        "Timestamp": "1556272586518.888184",
        "TenantClass": 0,
        "Source": "PacketHeader.java:168",
        "ThreadID": 1,
        "ThreadName": "",
        "EventID": "99D826F488879ADA",
        "ProcessID": 6356
      },
      {
        "Cycles": 0,
        "Agent": "Execution-Sleep",
        "ProcessName": "Data",
        "TaskID": "81B72044693C2F5E",
        "ParentEventID": [
          "EFD4CC5066FAF4F1"
        ],
        "Label": "waited",
        "Title": "X-Trace Task",
        "Host": "pinky19.mpi-sws.org",
        "Duration": "2999",
        "HRT": 25488946578732176,
        "Operation": "waited",
        "Timestamp": "1556272586518.914062",
        "TenantClass": 0,
        "Source": "SocketIOWithTimeout.java:335",
        "ThreadID": 7844,
        "ThreadName": "",
        "EventID": "F3F7103A7BA92FC1",
        "BaggageBytes": "[[248 5] [240 0] [0 129 183 32 68 105 60 47 94] [240 1] [0 239 212 204 80 102 250 244 241] [240 3] [0 2]]",
        "ProcessID": 2319
      },
      {
        "Cycles": 0,
        "Agent": "edu.brown.cs.systems.xtrace.logging.BaggageWrappers",
        "ProcessName": "Data",
        "TaskID": "81B72044693C2F5E",
        "ParentEventID": [
          "F3F7103A7BA92FC1"
        ],
        "Label": "Forking current baggage with Baggage.fork()",
        "Title": "X-Trace Task",
        "Host": "pinky19.mpi-sws.org",
        "HRT": 25488946578791700,
        "Operation": "fork",
        "Timestamp": "1556272586518.973633",
        "TenantClass": 0,
        "Source": "PacketHeader.java:95",
        "ThreadID": 7844,
        "ThreadName": "",
        "EventID": "BBA999A3EB882000",
        "BaggageBytes": "[[248 5] [240 0] [0 129 183 32 68 105 60 47 94] [240 1] [0 243 247 16 58 123 169 47 193] [240 3] [0 2]]",
        "ProcessID": 2319
      },
      {
        "Cycles": 0,
        "Agent": "Execution-Sleep",
        "ProcessName": "Data",
        "TaskID": "81B72044693C2F5E",
        "ParentEventID": [
          "BBA999A3EB882000"
        ],
        "Label": "waited",
        "Title": "X-Trace Task",
        "Host": "pinky19.mpi-sws.org",
        "Duration": "2900",
        "HRT": 25488946578840541,
        "Operation": "waited",
        "Timestamp": "1556272586519.022461",
        "TenantClass": 0,
        "Source": "SocketIOWithTimeout.java:335",
        "ThreadID": 7844,
        "ThreadName": "",
        "EventID": "C2DF95E80C30C0CC",
        "BaggageBytes": "[[248 5] [240 0] [0 129 183 32 68 105 60 47 94] [240 1] [0 187 169 153 163 235 136 32 0] [240 3] [0 2]]",
        "ProcessID": 2319
      },
      {
        "Cycles": 0,
        "Agent": "edu.brown.cs.systems.xtrace.logging.BaggageWrappers",
        "ProcessName": "Read",
        "TaskID": "81B72044693C2F5E",
        "ParentEventID": [
          "371DF123AE6149B3",
          "99D826F488879ADA"
        ],
        "Label": "Merged current baggage with other baggage",
        "Title": "X-Trace Task",
        "Host": "pinky19.mpi-sws.org",
        "HRT": 25488946578851390,
        "Operation": "join",
        "Timestamp": "1556272586519.018066",
        "TenantClass": 0,
        "Source": "PacketHeader.java:168",
        "ThreadID": 1,
        "ThreadName": "",
        "EventID": "1F0DACB9675D2F77",
        "ProcessID": 6356
      },
      {
        "Cycles": 0,
        "Agent": "edu.brown.cs.systems.xtrace.logging.BaggageWrappers",
        "ProcessName": "Data",
        "TaskID": "81B72044693C2F5E",
        "ParentEventID": [
          "C2DF95E80C30C0CC"
        ],
        "Label": "Forking current baggage with Baggage.fork()",
        "Title": "X-Trace Task",
        "Host": "pinky19.mpi-sws.org",
        "HRT": 25488946578900262,
        "Operation": "fork",
        "Timestamp": "1556272586519.082275",
        "TenantClass": 0,
        "Source": "PacketHeader.java:95",
        "ThreadID": 7844,
        "ThreadName": "",
        "EventID": "900D7E0C879DF137",
        "BaggageBytes": "[[248 5] [240 0] [0 129 183 32 68 105 60 47 94] [240 1] [0 194 223 149 232 12 48 192 204] [240 3] [0 2]]",
        "ProcessID": 2319
      },
      {
        "Cycles": 0,
        "Agent": "Execution-Sleep",
        "ProcessName": "Data",
        "TaskID": "81B72044693C2F5E",
        "ParentEventID": [
          "900D7E0C879DF137"
        ],
        "Label": "waited",
        "Title": "X-Trace Task",
        "Host": "pinky19.mpi-sws.org",
        "Duration": "2964",
        "HRT": 25488946578950627,
        "Operation": "waited",
        "Timestamp": "1556272586519.132568",
        "TenantClass": 0,
        "Source": "SocketIOWithTimeout.java:335",
        "ThreadID": 7844,
        "ThreadName": "",
        "EventID": "EE1A3A5D01E00898",
        "BaggageBytes": "[[248 5] [240 0] [0 129 183 32 68 105 60 47 94] [240 1] [0 144 13 126 12 135 157 241 55] [240 3] [0 2]]",
        "ProcessID": 2319
      },
      {
        "Cycles": 0,
        "Agent": "edu.brown.cs.systems.xtrace.logging.BaggageWrappers",
        "ProcessName": "Read",
        "TaskID": "81B72044693C2F5E",
        "ParentEventID": [
          "6E2508B59191ADE6",
          "1F0DACB9675D2F77"
        ],
        "Label": "Merged current baggage with other baggage",
        "Title": "X-Trace Task",
        "Host": "pinky19.mpi-sws.org",
        "HRT": 25488946578983924,
        "Operation": "join",
        "Timestamp": "1556272586519.150635",
        "TenantClass": 0,
        "Source": "PacketHeader.java:168",
        "ThreadID": 1,
        "ThreadName": "",
        "EventID": "D22D9891AAFE84E7",
        "ProcessID": 6356
      },
      {
        "Cycles": 0,
        "Agent": "edu.brown.cs.systems.xtrace.logging.BaggageWrappers",
        "ProcessName": "Data",
        "TaskID": "81B72044693C2F5E",
        "ParentEventID": [
          "EE1A3A5D01E00898"
        ],
        "Label": "Forking current baggage with Baggage.fork()",
        "Title": "X-Trace Task",
        "Host": "pinky19.mpi-sws.org",
        "HRT": 25488946579010788,
        "Operation": "fork",
        "Timestamp": "1556272586519.192871",
        "TenantClass": 0,
        "Source": "PacketHeader.java:95",
        "ThreadID": 7844,
        "ThreadName": "",
        "EventID": "22665EF3D99BF64F",
        "BaggageBytes": "[[248 5] [240 0] [0 129 183 32 68 105 60 47 94] [240 1] [0 238 26 58 93 1 224 8 152] [240 3] [0 2]]",
        "ProcessID": 2319
      },
      {
        "Cycles": 0,
        "Agent": "Execution-Sleep",
        "ProcessName": "Data",
        "TaskID": "81B72044693C2F5E",
        "ParentEventID": [
          "22665EF3D99BF64F"
        ],
        "Label": "waited",
        "Title": "X-Trace Task",
        "Host": "pinky19.mpi-sws.org",
        "Duration": "3243",
        "HRT": 25488946579060473,
        "Operation": "waited",
        "Timestamp": "1556272586519.242432",
        "TenantClass": 0,
        "Source": "SocketIOWithTimeout.java:335",
        "ThreadID": 7844,
        "ThreadName": "",
        "EventID": "793DB3BAC658D339",
        "BaggageBytes": "[[248 5] [240 0] [0 129 183 32 68 105 60 47 94] [240 1] [0 34 102 94 243 217 155 246 79] [240 3] [0 2]]",
        "ProcessID": 2319
      },
      {
        "Cycles": 0,
        "Agent": "Execution-CPU",
        "ProcessName": "Data",
        "TaskID": "81B72044693C2F5E",
        "ParentEventID": [
          "793DB3BAC658D339"
        ],
        "Label": "unset",
        "Title": "X-Trace Task",
        "Host": "pinky19.mpi-sws.org",
        "Duration": "2329686",
        "HRT": 25488946579180470,
        "Operation": "unset",
        "Timestamp": "1556272586519.362549",
        "TenantClass": 0,
        "Source": "DataXceiver.java:261",
        "ThreadID": 7844,
        "ThreadName": "",
        "EventID": "8633C47568CB2864",
        "BaggageBytes": "[[248 5] [240 0] [0 129 183 32 68 105 60 47 94] [240 1] [0 121 61 179 186 198 88 211 57] [240 3] [0 2]]",
        "ProcessID": 2319
      },
      {
        "Cycles": 0,
        "Agent": "edu.brown.cs.systems.retro.benchmarks.hdfs_client.Reader",
        "ProcessName": "Read",
        "TaskID": "81B72044693C2F5E",
        "ParentEventID": [
          "0"
        ],
        "Label": "Reading file",
        "Title": "X-Trace Task",
        "Host": "pinky19.mpi-sws.org",
        "HRT": 25488946575090007,
        "Timestamp": "1556272586515.256836",
        "TenantClass": 0,
        "ThreadID": 1,
        "ThreadName": "",
        "EventID": "A578ABC21C04813C",
        "ProcessID": 6356,
        "Tag": [
          "reader_1mb",
          "Read Size: 1048576"
        ]
      }
    ]
  }
]