[
  {
    "id": "580BBC8F689B7B1D",
    "reports": [
      {
        "Cycles": 0,
        "Agent": "Execution-CPU",
        "ProcessName": "Read",
        "TaskID": "580BBC8F689B7B1D",
        "ParentEventID": [
          "5A10D20585CDF82B"
        ],
        "Label": "unset",
        "Title": "X-Trace Task",
        "Host": "pinky19.mpi-sws.org",
        "Duration": "41407282",
        "HRT": 26962593781132057,
        "Operation": "unset",
        "Timestamp": "1557746233721.222900",
        "TenantClass": 0,
        "Source": "Client.java:1027",
        "ThreadID": 1,
        "ThreadName": "",
        "EventID": "3CD7914F9CC7CDD9",
        "ProcessID": 36430
      },
      {
        "Cycles": 0,
        "Agent": "org.apache.hadoop.ipc.ProtobufRpcEngine",
        "ProcessName": "Read",
        "TaskID": "580BBC8F689B7B1D",
        "ParentEventID": [
          "994CD19C7334D2F9"
        ],
        "Label": "Invoking org.apache.hadoop.hdfs.protocol.ClientProtocol.getBlockLocations",
        "Title": "X-Trace Task",
        "Host": "pinky19.mpi-sws.org",
        "HRT": 26962593781116763,
        "Timestamp": "1557746233721.207520",
        "TenantClass": 0,
        "Source": "ProtobufRpcEngine.java:228",
        "ThreadID": 1,
        "ThreadName": "",
        "EventID": "5A10D20585CDF82B",
        "ProcessID": 36430
      },
      {
        "Cycles": 0,
        "Agent": "Execution-CPU",
        "ProcessName": "Read",
        "TaskID": "580BBC8F689B7B1D",
        "ParentEventID": [
          "3CD7914F9CC7CDD9"
        ],
        "Label": "set",
        "Title": "X-Trace Task",
        "Host": "pinky19.mpi-sws.org",
        "HRT": 26962593781181813,
        "Operation": "set",
        "Timestamp": "1557746233721.272461",
        "TenantClass": 0,
        "Source": "Client.java:1032",
        "ThreadID": 41,
        "ThreadName": "",
        "EventID": "9CE3D12020A88E31",
        "ProcessID": 36430
      },
      {
        "Cycles": 0,
        "Agent": "edu.brown.cs.systems.xtrace.logging.BaggageWrappers",
        "ProcessName": "Read",
        "TaskID": "580BBC8F689B7B1D",
        "ParentEventID": [
          "9CE3D12020A88E31"
        ],
        "Label": "Forking current baggage with Baggage.fork()",
        "Title": "X-Trace Task",
        "Host": "pinky19.mpi-sws.org",
        "HRT": 26962593781203172,
        "Operation": "fork",
        "Timestamp": "1557746233721.293945",
        "TenantClass": 0,
        "Source": "Client.java:1043",
        "ThreadID": 41,
        "ThreadName": "",
        "EventID": "A0C6BC76A3AB4309",
        "ProcessID": 36430
      },
      {
        "Cycles": 0,
        "Agent": "edu.brown.cs.systems.retro.benchmarks.hdfs_client.Reader",
        "ProcessName": "Read",
        "TaskID": "580BBC8F689B7B1D",
        "ParentEventID": [
          "DE36083C50B1B6E8"
        ],
        "Label": "Reading file",
        "Title": "X-Trace Task",
        "Host": "pinky19.mpi-sws.org",
        "HRT": 26962593781090296,
        "Timestamp": "1557746233721.181152",
        "TenantClass": 0,
        "ThreadID": 1,
        "ThreadName": "",
        "EventID": "994CD19C7334D2F9",
        "ProcessID": 36430
      },
      {
        "Cycles": 0,
        "Agent": "Execution-CPU",
        "ProcessName": "Read",
        "TaskID": "580BBC8F689B7B1D",
        "ParentEventID": [
          "A0C6BC76A3AB4309"
        ],
        "Label": "unset",
        "Title": "X-Trace Task",
        "Host": "pinky19.mpi-sws.org",
        "Duration": "59159",
        "HRT": 26962593781262369,
        "Operation": "unset",
        "Timestamp": "1557746233721.353027",
        "TenantClass": 0,
        "Source": "Client.java:1062",
        "ThreadID": 41,
        "ThreadName": "",
        "EventID": "BAE3A2F06BB6503A",
        "ProcessID": 36430
      },
      {
        "Cycles": 0,
        "Agent": "Execution-CPU",
        "ProcessName": "Read",
        "TaskID": "580BBC8F689B7B1D",
        "ParentEventID": [
          "BAE3A2F06BB6503A"
        ],
        "Label": "set",
        "Title": "X-Trace Task",
        "Host": "pinky19.mpi-sws.org",
        "HRT": 26962593781285815,
        "Operation": "set",
        "Timestamp": "1557746233721.376465",
        "TenantClass": 0,
        "Source": "Client.java:1104",
        "ThreadID": 1,
        "ThreadName": "",
        "EventID": "F07466880A1D7E8E",
        "ProcessID": 36430
      },
      {
        "Cycles": 0,
        "Agent": "edu.brown.cs.systems.xtrace.logging.BaggageWrappers",
        "ProcessName": "Name",
        "TaskID": "580BBC8F689B7B1D",
        "ParentEventID": [
          "72C95B0597C21344"
        ],
        "Label": "Forking current baggage with Baggage.fork()",
        "Title": "X-Trace Task",
        "Host": "pinky19.mpi-sws.org",
        "HRT": 26962593781343035,
        "Operation": "fork",
        "Timestamp": "1557746233721.474609",
        "TenantClass": 0,
        "Source": "Server.java:550",
        "ThreadID": 48,
        "ThreadName": "",
        "EventID": "86515D2676C040E9",
        "BaggageBytes": "[[248 5] [240 0] [0 88 11 188 143 104 155 123 29] [240 1] [0 114 201 91 5 151 194 19 68] [240 3] [0 2]]",
        "ProcessID": 2171
      },
      {
        "Cycles": 0,
        "Agent": "Execution-CPU",
        "ProcessName": "Name",
        "TaskID": "580BBC8F689B7B1D",
        "ParentEventID": [
          "86515D2676C040E9"
        ],
        "Label": "unset",
        "Title": "X-Trace Task",
        "Host": "pinky19.mpi-sws.org",
        "Duration": "24848",
        "HRT": 26962593781363901,
        "Operation": "unset",
        "Timestamp": "1557746233721.495361",
        "TenantClass": 0,
        "Source": "Server.java:1828",
        "ThreadID": 48,
        "ThreadName": "",
        "EventID": "67E322B99D97D061",
        "BaggageBytes": "[[248 5] [240 0] [0 88 11 188 143 104 155 123 29] [240 1] [0 134 81 93 38 118 192 64 233] [240 3] [0 2]]",
        "ProcessID": 2171
      },
      {
        "Cycles": 0,
        "Agent": "Execution-CPU",
        "ProcessName": "Name",
        "TaskID": "580BBC8F689B7B1D",
        "ParentEventID": [
          "A0C6BC76A3AB4309"
        ],
        "Label": "set",
        "Title": "X-Trace Task",
        "Host": "pinky19.mpi-sws.org",
        "HRT": 26962593781313001,
        "Operation": "set",
        "Timestamp": "1557746233721.444580",
        "TenantClass": 0,
        "Source": "Server.java:1840",
        "ThreadID": 48,
        "ThreadName": "",
        "EventID": "72C95B0597C21344",
        "BaggageBytes": "[[248 5] [240 0] [0 88 11 188 143 104 155 123 29] [240 1] [0 160 198 188 118 163 171 67 9] [240 3] [0 2]]",
        "ProcessID": 2171
      },
      {
        "Cycles": 0,
        "Agent": "Execution-CPU",
        "ProcessName": "Name",
        "TaskID": "580BBC8F689B7B1D",
        "ParentEventID": [
          "86515D2676C040E9"
        ],
        "Label": "set",
        "Title": "X-Trace Task",
        "Host": "pinky19.mpi-sws.org",
        "HRT": 26962593781372297,
        "Operation": "set",
        "Timestamp": "1557746233721.503906",
        "TenantClass": 0,
        "Source": "Server.java:2071",
        "ThreadID": 62,
        "ThreadName": "",
        "EventID": "D263C63F75F4B19A",
        "BaggageBytes": "[[248 5] [240 0] [0 88 11 188 143 104 155 123 29] [240 1] [0 134 81 93 38 118 192 64 233] [240 3] [0 2]]",
        "ProcessID": 2171
      },
      {
        "Cycles": 0,
        "Agent": "org.apache.hadoop.ipc.Server",
        "ProcessName": "Name",
        "TaskID": "580BBC8F689B7B1D",
        "ParentEventID": [
          "D263C63F75F4B19A"
        ],
        "Label": "getBlockLocations in org.apache.hadoop.hdfs.protocol.ClientProtocol",
        "Title": "X-Trace Task",
        "Host": "pinky19.mpi-sws.org",
        "HRT": 26962593781410340,
        "Timestamp": "1557746233721.541992",
        "TenantClass": 0,
        "Source": "ProtobufRpcEngine.java:601",
        "ThreadID": 62,
        "ThreadName": "",
        "EventID": "B77E1022E2B6D735",
        "BaggageBytes": "[[248 5] [240 0] [0 88 11 188 143 104 155 123 29] [240 1] [0 210 99 198 63 117 244 177 154] [240 3] [0 2]]",
        "ProcessID": 2171
      },
      {
        "Cycles": 0,
        "Agent": "edu.brown.cs.systems.xtrace.logging.BaggageWrappers",
        "ProcessName": "Name",
        "TaskID": "580BBC8F689B7B1D",
        "ParentEventID": [
          "1125D9617319B7EE"
        ],
        "Label": "Forking current baggage with Baggage.fork()",
        "Title": "X-Trace Task",
        "Host": "pinky19.mpi-sws.org",
        "HRT": 26962593781498296,
        "Operation": "fork",
        "Timestamp": "1557746233721.629883",
        "TenantClass": 0,
        "Source": "Server.java:2398",
        "ThreadID": 62,
        "ThreadName": "",
        "EventID": "FC31E4DFC3A292CD",
        "BaggageBytes": "[[248 5] [240 0] [0 88 11 188 143 104 155 123 29] [240 1] [0 17 37 217 97 115 25 183 238] [240 3] [0 2]]",
        "ProcessID": 2171
      },
      {
        "Cycles": 0,
        "Agent": "org.apache.hadoop.hdfs.server.namenode.FSNamesystem.audit",
        "ProcessName": "Name",
        "TaskID": "580BBC8F689B7B1D",
        "ParentEventID": [
          "B77E1022E2B6D735"
        ],
        "Label": "allowed=true\tugi=plascas (auth:SIMPLE)\tip=/139.19.171.63\tcmd=open\tsrc=/ds/pt6Mkoegx7LIcYpM\tdst=null\tperm=null\tproto=rpc",
        "Title": "X-Trace Task",
        "Host": "pinky19.mpi-sws.org",
        "HRT": 26962593781454961,
        "Timestamp": "1557746233721.586426",
        "TenantClass": 0,
        "Source": "FSNamesystem.java:8313",
        "ThreadID": 62,
        "ThreadName": "",
        "EventID": "1125D9617319B7EE",
        "BaggageBytes": "[[248 5] [240 0] [0 88 11 188 143 104 155 123 29] [240 1] [0 183 126 16 34 226 182 215 53] [240 3] [0 2]]",
        "ProcessID": 2171
      },
      {
        "Cycles": 0,
        "Agent": "Execution-CPU",
        "ProcessName": "Name",
        "TaskID": "580BBC8F689B7B1D",
        "ParentEventID": [
          "FC31E4DFC3A292CD"
        ],
        "Label": "unset",
        "Title": "X-Trace Task",
        "Host": "pinky19.mpi-sws.org",
        "Duration": "209118",
        "HRT": 26962593781607763,
        "Operation": "unset",
        "Timestamp": "1557746233721.739258",
        "TenantClass": 0,
        "Source": "Server.java:1058",
        "ThreadID": 62,
        "ThreadName": "",
        "EventID": "472FA4B2F7104825",
        "BaggageBytes": "[[248 5] [240 0] [0 88 11 188 143 104 155 123 29] [240 1] [0 252 49 228 223 195 162 146 205] [240 3] [0 2]]",
        "ProcessID": 2171
      },
      {
        "Cycles": 0,
        "Agent": "Execution-CPU",
        "ProcessName": "Read",
        "TaskID": "580BBC8F689B7B1D",
        "ParentEventID": [
          "083053F4FF4212C7"
        ],
        "Label": "unset",
        "Title": "X-Trace Task",
        "Host": "pinky19.mpi-sws.org",
        "Duration": "5264",
        "HRT": 26962593781711485,
        "Operation": "unset",
        "Timestamp": "1557746233721.802246",
        "TenantClass": 0,
        "Source": "Client.java:1168",
        "ThreadID": 37,
        "ThreadName": "",
        "EventID": "2B9A30D0C01E2E46",
        "ProcessID": 36430
      },
      {
        "Cycles": 0,
        "Agent": "Execution-Sleep",
        "ProcessName": "Read",
        "TaskID": "580BBC8F689B7B1D",
        "ParentEventID": [
          "F07466880A1D7E8E"
        ],
        "Label": "waited",
        "Title": "X-Trace Task",
        "Host": "pinky19.mpi-sws.org",
        "Duration": "429844",
        "HRT": 26962593781727168,
        "Operation": "waited",
        "Timestamp": "1557746233721.817871",
        "TenantClass": 0,
        "Source": "Client.java:1537",
        "ThreadID": 1,
        "ThreadName": "",
        "EventID": "0ADDB01E2C92535C",
        "ProcessID": 36430
      },
      {
        "Cycles": 0,
        "Agent": "Execution-CPU",
        "ProcessName": "Read",
        "TaskID": "580BBC8F689B7B1D",
        "ParentEventID": [
          "FC31E4DFC3A292CD"
        ],
        "Label": "set",
        "Title": "X-Trace Task",
        "Host": "pinky19.mpi-sws.org",
        "HRT": 26962593781689717,
        "Operation": "set",
        "Timestamp": "1557746233721.780518",
        "TenantClass": 0,
        "Source": "Client.java:302",
        "ThreadID": 37,
        "ThreadName": "",
        "EventID": "083053F4FF4212C7",
        "ProcessID": 36430
      },
      {
        "Cycles": 0,
        "Agent": "edu.brown.cs.systems.xtrace.logging.BaggageWrappers",
        "ProcessName": "Read",
        "TaskID": "580BBC8F689B7B1D",
        "ParentEventID": [
          "2B9A30D0C01E2E46",
          "0ADDB01E2C92535C"
        ],
        "Label": "Merged current baggage with other baggage",
        "Title": "X-Trace Task",
        "Host": "pinky19.mpi-sws.org",
        "HRT": 26962593781739193,
        "Operation": "join",
        "Timestamp": "1557746233721.829834",
        "TenantClass": 0,
        "Source": "Client.java:1545",
        "ThreadID": 1,
        "ThreadName": "",
        "EventID": "EE5D84F3C8177D4E",
        "ProcessID": 36430
      },
      {
        "Cycles": 0,
        "Agent": "org.apache.hadoop.ipc.ProtobufRpcEngine",
        "ProcessName": "Read",
        "TaskID": "580BBC8F689B7B1D",
        "ParentEventID": [
          "EE5D84F3C8177D4E"
        ],
        "Label": "org.apache.hadoop.hdfs.protocol.ClientProtocol.getBlockLocations completed",
        "Title": "X-Trace Task",
        "Host": "pinky19.mpi-sws.org",
        "HRT": 26962593781774486,
        "Timestamp": "1557746233721.865234",
        "TenantClass": 0,
        "Source": "ProtobufRpcEngine.java:275",
        "ThreadID": 1,
        "ThreadName": "",
        "EventID": "7DBFC458B7D75C88",
        "ProcessID": 36430
      },
      {
        "Cycles": 0,
        "Agent": "edu.brown.cs.systems.xtrace.logging.BaggageWrappers",
        "ProcessName": "Read",
        "TaskID": "580BBC8F689B7B1D",
        "ParentEventID": [
          "7DBFC458B7D75C88"
        ],
        "Label": "Forking current baggage with Baggage.fork()",
        "Title": "X-Trace Task",
        "Host": "pinky19.mpi-sws.org",
        "HRT": 26962593781827217,
        "Operation": "fork",
        "Timestamp": "1557746233721.917969",
        "TenantClass": 0,
        "Source": "DataTransferProtoUtil.java:94",
        "ThreadID": 1,
        "ThreadName": "",
        "EventID": "3BC08291187301A3",
        "ProcessID": 36430
      },
      {
        "Cycles": 0,
        "Agent": "Execution-CPU",
        "ProcessName": "Data",
        "TaskID": "580BBC8F689B7B1D",
        "ParentEventID": [
          "3BC08291187301A3"
        ],
        "Label": "set",
        "Title": "X-Trace Task",
        "Host": "pinky26.mpi-sws.org",
        "HRT": 47512250512046269,
        "Operation": "set",
        "Timestamp": "1557746233722.333252",
        "TenantClass": 0,
        "Source": "Receiver.java:117",
        "ThreadID": 8227,
        "ThreadName": "",
        "EventID": "DB1D50F03C27386E",
        "BaggageBytes": "[[248 5] [240 0] [0 88 11 188 143 104 155 123 29] [240 1] [0 59 192 130 145 24 115 1 163] [240 3] [0 2]]",
        "ProcessID": 17069
      },
      {
        "Cycles": 0,
        "Agent": "edu.brown.cs.systems.xtrace.logging.BaggageWrappers",
        "ProcessName": "Data",
        "TaskID": "580BBC8F689B7B1D",
        "ParentEventID": [
          "8A1FD0F0D033A3F0"
        ],
        "Label": "Forking current baggage with Baggage.fork()",
        "Title": "X-Trace Task",
        "Host": "pinky26.mpi-sws.org",
        "HRT": 47512250512391468,
        "Operation": "fork",
        "Timestamp": "1557746233722.678467",
        "TenantClass": 0,
        "Source": "DataXceiver.java:1257",
        "ThreadID": 8227,
        "ThreadName": "",
        "EventID": "1BA7477488CB65F3",
        "BaggageBytes": "[[248 5] [240 0] [0 88 11 188 143 104 155 123 29] [240 1] [0 138 31 208 240 208 51 163 240] [240 3] [0 2]]",
        "ProcessID": 17069
      },
      {
        "Cycles": 0,
        "Agent": "edu.brown.cs.systems.xtrace.logging.XTraceInit",
        "ProcessName": "Data",
        "TaskID": "580BBC8F689B7B1D",
        "ParentEventID": [
          "DB1D50F03C27386E"
        ],
        "Label": "Thread.setName: DataXceiver for client DFSClient_NONMAPREDUCE_778905418_1 at /139.19.171.63:36880 [Sending block BP-1633380353-139.19.171.63-1554193446451:blk_1073762067_21243]",
        "Title": "X-Trace Task",
        "Host": "pinky26.mpi-sws.org",
        "HRT": 47512250512194429,
        "Timestamp": "1557746233722.481201",
        "TenantClass": 0,
        "Source": "DataXceiver.java:168",
        "ThreadID": 8227,
        "ThreadName": "",
        "EventID": "8A1FD0F0D033A3F0",
        "BaggageBytes": "[[248 5] [240 0] [0 88 11 188 143 104 155 123 29] [240 1] [0 219 29 80 240 60 39 56 110] [240 3] [0 2]]",
        "ProcessID": 17069
      },
      {
        "Cycles": 0,
        "Agent": "edu.brown.cs.systems.xtrace.logging.BaggageWrappers",
        "ProcessName": "Data",
        "TaskID": "580BBC8F689B7B1D",
        "ParentEventID": [
          "1BA7477488CB65F3"
        ],
        "Label": "Forking current baggage with Baggage.fork()",
        "Title": "X-Trace Task",
        "Host": "pinky26.mpi-sws.org",
        "HRT": 47512250512530875,
        "Operation": "fork",
        "Timestamp": "1557746233722.817871",
        "TenantClass": 0,
        "Source": "PacketHeader.java:95",
        "ThreadID": 8227,
        "ThreadName": "",
        "EventID": "6D17E578CCD69804",
        "BaggageBytes": "[[248 5] [240 0] [0 88 11 188 143 104 155 123 29] [240 1] [0 27 167 71 116 136 203 101 243] [240 3] [0 2]]",
        "ProcessID": 17069
      },
      {
        "Cycles": 0,
        "Agent": "Execution-Sleep",
        "ProcessName": "Read",
        "TaskID": "580BBC8F689B7B1D",
        "ParentEventID": [
          "3BC08291187301A3"
        ],
        "Label": "waited",
        "Title": "X-Trace Task",
        "Host": "pinky19.mpi-sws.org",
        "Duration": "779755",
        "HRT": 26962593782679635,
        "Operation": "waited",
        "Timestamp": "1557746233722.770264",
        "TenantClass": 0,
        "Source": "SocketIOWithTimeout.java:335",
        "ThreadID": 1,
        "ThreadName": "",
        "EventID": "758565689D092622",
        "ProcessID": 36430
      },
      {
        "Cycles": 0,
        "Agent": "Execution-Sleep",
        "ProcessName": "Data",
        "TaskID": "580BBC8F689B7B1D",
        "ParentEventID": [
          "6D17E578CCD69804"
        ],
        "Label": "waited",
        "Title": "X-Trace Task",
        "Host": "pinky26.mpi-sws.org",
        "Duration": "5190",
        "HRT": 47512250512611738,
        "Operation": "waited",
        "Timestamp": "1557746233722.898682",
        "TenantClass": 0,
        "Source": "SocketIOWithTimeout.java:335",
        "ThreadID": 8227,
        "ThreadName": "",
        "EventID": "40FD0CE419ABED55",
        "BaggageBytes": "[[248 5] [240 0] [0 88 11 188 143 104 155 123 29] [240 1] [0 109 23 229 120 204 214 152 4] [240 3] [0 2]]",
        "ProcessID": 17069
      },
      {
        "Cycles": 0,
        "Agent": "edu.brown.cs.systems.xtrace.logging.BaggageWrappers",
        "ProcessName": "Read",
        "TaskID": "580BBC8F689B7B1D",
        "ParentEventID": [
          "758565689D092622",
          "1BA7477488CB65F3"
        ],
        "Label": "Merged current baggage with other baggage",
        "Title": "X-Trace Task",
        "Host": "pinky19.mpi-sws.org",
        "HRT": 26962593782773065,
        "Operation": "join",
        "Timestamp": "1557746233722.863770",
        "TenantClass": 0,
        "Source": "RemoteBlockReader2.java:429",
        "ThreadID": 1,
        "ThreadName": "",
        "EventID": "5E479443EEDD600B",
        "ProcessID": 36430
      },
      {
        "Cycles": 0,
        "Agent": "edu.brown.cs.systems.xtrace.logging.BaggageWrappers",
        "ProcessName": "Data",
        "TaskID": "580BBC8F689B7B1D",
        "ParentEventID": [
          "40FD0CE419ABED55"
        ],
        "Label": "Forking current baggage with Baggage.fork()",
        "Title": "X-Trace Task",
        "Host": "pinky26.mpi-sws.org",
        "HRT": 47512250512705497,
        "Operation": "fork",
        "Timestamp": "1557746233722.992432",
        "TenantClass": 0,
        "Source": "PacketHeader.java:95",
        "ThreadID": 8227,
        "ThreadName": "",
        "EventID": "8513D7A847C70B63",
        "BaggageBytes": "[[248 5] [240 0] [0 88 11 188 143 104 155 123 29] [240 1] [0 64 253 12 228 25 171 237 85] [240 3] [0 2]]",
        "ProcessID": 17069
      },
      {
        "Cycles": 0,
        "Agent": "edu.brown.cs.systems.xtrace.logging.BaggageWrappers",
        "ProcessName": "Read",
        "TaskID": "580BBC8F689B7B1D",
        "ParentEventID": [
          "67F3CFFBA08C75D4",
          "6D17E578CCD69804"
        ],
        "Label": "Merged current baggage with other baggage",
        "Title": "X-Trace Task",
        "Host": "pinky19.mpi-sws.org",
        "HRT": 26962593783034431,
        "Operation": "join",
        "Timestamp": "1557746233723.125244",
        "TenantClass": 0,
        "Source": "PacketHeader.java:168",
        "ThreadID": 1,
        "ThreadName": "",
        "EventID": "4B2EDFD198C5CA35",
        "ProcessID": 36430
      },
      {
        "Cycles": 0,
        "Agent": "Execution-Sleep",
        "ProcessName": "Read",
        "TaskID": "580BBC8F689B7B1D",
        "ParentEventID": [
          "5E479443EEDD600B"
        ],
        "Label": "waited",
        "Title": "X-Trace Task",
        "Host": "pinky19.mpi-sws.org",
        "Duration": "82460",
        "HRT": 26962593782978298,
        "Operation": "waited",
        "Timestamp": "1557746233723.069092",
        "TenantClass": 0,
        "Source": "SocketIOWithTimeout.java:335",
        "ThreadID": 1,
        "ThreadName": "",
        "EventID": "67F3CFFBA08C75D4",
        "ProcessID": 36430
      },
      {
        "Cycles": 0,
        "Agent": "edu.brown.cs.systems.xtrace.logging.BaggageWrappers",
        "ProcessName": "Read",
        "TaskID": "580BBC8F689B7B1D",
        "ParentEventID": [
          "96B3B5FC23EB03DD"
        ],
        "Label": "Forking current baggage with Baggage.fork()",
        "Title": "X-Trace Task",
        "Host": "pinky19.mpi-sws.org",
        "HRT": 26962593783116412,
        "Operation": "fork",
        "Timestamp": "1557746233723.207031",
        "TenantClass": 0,
        "Source": "RemoteBlockReader2.java:361",
        "ThreadID": 1,
        "ThreadName": "",
        "EventID": "828A059E7DD4BB1F",
        "ProcessID": 36430
      },
      {
        "Cycles": 0,
        "Agent": "edu.brown.cs.systems.xtrace.logging.BaggageWrappers",
        "ProcessName": "Read",
        "TaskID": "580BBC8F689B7B1D",
        "ParentEventID": [
          "8513D7A847C70B63",
          "4B2EDFD198C5CA35"
        ],
        "Label": "Merged current baggage with other baggage",
        "Title": "X-Trace Task",
        "Host": "pinky19.mpi-sws.org",
        "HRT": 26962593783102972,
        "Operation": "join",
        "Timestamp": "1557746233723.193604",
        "TenantClass": 0,
        "Source": "PacketHeader.java:168",
        "ThreadID": 1,
        "ThreadName": "",
        "EventID": "96B3B5FC23EB03DD",
        "ProcessID": 36430
      },
      {
        "Cycles": 0,
        "Agent": "Execution-Sleep",
        "ProcessName": "Data",
        "TaskID": "580BBC8F689B7B1D",
        "ParentEventID": [
          "8513D7A847C70B63"
        ],
        "Label": "waited",
        "Title": "X-Trace Task",
        "Host": "pinky26.mpi-sws.org",
        "Duration": "219943",
        "HRT": 47512250513038247,
        "Operation": "waited",
        "Timestamp": "1557746233723.325195",
        "TenantClass": 0,
        "Source": "SocketIOWithTimeout.java:335",
        "ThreadID": 8227,
        "ThreadName": "",
        "EventID": "129FCA627D154E80",
        "BaggageBytes": "[[248 5] [240 0] [0 88 11 188 143 104 155 123 29] [240 1] [0 133 19 215 168 71 199 11 99] [240 3] [0 2]]",
        "ProcessID": 17069
      },
      {
        "Cycles": 0,
        "Agent": "edu.brown.cs.systems.xtrace.logging.BaggageWrappers",
        "ProcessName": "Data",
        "TaskID": "580BBC8F689B7B1D",
        "ParentEventID": [
          "828A059E7DD4BB1F",
          "129FCA627D154E80"
        ],
        "Label": "Merged current baggage with other baggage",
        "Title": "X-Trace Task",
        "Host": "pinky26.mpi-sws.org",
        "HRT": 47512250513105563,
        "Operation": "join",
        "Timestamp": "1557746233723.392334",
        "TenantClass": 0,
        "Source": "DataXceiver.java:574",
        "ThreadID": 8227,
        "ThreadName": "",
        "EventID": "813E68E84F0C14A2",
        "BaggageBytes": "[[248 5] [240 0] [0 88 11 188 143 104 155 123 29] [240 1] [0 130 138 5 158 125 212 187 31] [0 18 159 202 98 125 21 78 128] [240 3] [0 2]]",
        "ProcessID": 17069
      },
      {
        "Cycles": 0,
        "Agent": "Execution-CPU",
        "ProcessName": "Data",
        "TaskID": "580BBC8F689B7B1D",
        "ParentEventID": [
          "813E68E84F0C14A2"
        ],
        "Label": "unset",
        "Title": "X-Trace Task",
        "Host": "pinky26.mpi-sws.org",
        "Duration": "1008003",
        "HRT": 47512250513136934,
        "Operation": "unset",
        "Timestamp": "1557746233723.423828",
        "TenantClass": 0,
        "Source": "DataXceiver.java:261",
        "ThreadID": 8227,
        "ThreadName": "",
        "EventID": "0FF88D61F58525E0",
        "BaggageBytes": "[[248 5] [240 0] [0 88 11 188 143 104 155 123 29] [240 1] [0 129 62 104 232 79 12 20 162] [240 3] [0 2]]",
        "ProcessID": 17069
      },
      {
        "Cycles": 0,
        "Agent": "edu.brown.cs.systems.retro.benchmarks.hdfs_client.Reader",
        "ProcessName": "Read",
        "TaskID": "580BBC8F689B7B1D",
        "ParentEventID": [
          "0"
        ],
        "Label": "Reading file",
        "Title": "X-Trace Task",
        "Host": "pinky19.mpi-sws.org",
        "HRT": 26962593781075297,
        "Timestamp": "1557746233721.166016",
        "TenantClass": 0,
        "ThreadID": 1,
        "ThreadName": "",
        "EventID": "DE36083C50B1B6E8",
        "ProcessID": 36430,
        "Tag": [
          "reader_10kb",
          "Read Size: 10240"
        ]
      }
    ]
  }
]