[
  {
    "id": "4EBAEC60F606EA7B",
    "reports": [
      {
        "Cycles": 0,
        "Agent": "org.apache.hadoop.ipc.ProtobufRpcEngine",
        "ProcessName": "Read",
        "TaskID": "4EBAEC60F606EA7B",
        "ParentEventID": [
          "D5F24B3E3B4516E5"
        ],
        "Label": "Invoking org.apache.hadoop.hdfs.protocol.ClientProtocol.getBlockLocations",
        "Title": "X-Trace Task",
        "Host": "pinky19.mpi-sws.org",
        "HRT": 25491796388689568,
        "Timestamp": "1556275436328.644043",
        "TenantClass": 0,
        "Source": "ProtobufRpcEngine.java:228",
        "ThreadID": 1,
        "ThreadName": "",
        "EventID": "4FE0137ED2348EE0",
        "ProcessID": 21035
      },
      {
        "Cycles": 0,
        "Agent": "edu.brown.cs.systems.retro.benchmarks.hdfs_client.Reader",
        "ProcessName": "Read",
        "TaskID": "4EBAEC60F606EA7B",
        "ParentEventID": [
          "0720E32992A305FD"
        ],
        "Label": "Reading file",
        "Title": "X-Trace Task",
        "Host": "pinky19.mpi-sws.org",
        "HRT": 25491796388654911,
        "Timestamp": "1556275436328.609375",
        "TenantClass": 0,
        "ThreadID": 1,
        "ThreadName": "",
        "EventID": "D5F24B3E3B4516E5",
        "ProcessID": 21035
      },
      {
        "Cycles": 0,
        "Agent": "Execution-CPU",
        "ProcessName": "Read",
        "TaskID": "4EBAEC60F606EA7B",
        "ParentEventID": [
          "4FE0137ED2348EE0"
        ],
        "Label": "unset",
        "Title": "X-Trace Task",
        "Host": "pinky19.mpi-sws.org",
        "Duration": "21890432",
        "HRT": 25491796388714466,
        "Operation": "unset",
        "Timestamp": "1556275436328.668945",
        "TenantClass": 0,
        "Source": "Client.java:1027",
        "ThreadID": 1,
        "ThreadName": "",
        "EventID": "7698F7CBA6F0EF4F",
        "ProcessID": 21035
      },
      {
        "Cycles": 0,
        "Agent": "Execution-CPU",
        "ProcessName": "Read",
        "TaskID": "4EBAEC60F606EA7B",
        "ParentEventID": [
          "7698F7CBA6F0EF4F"
        ],
        "Label": "set",
        "Title": "X-Trace Task",
        "Host": "pinky19.mpi-sws.org",
        "HRT": 25491796388740318,
        "Operation": "set",
        "Timestamp": "1556275436328.694824",
        "TenantClass": 0,
        "Source": "Client.java:1032",
        "ThreadID": 41,
        "ThreadName": "",
        "EventID": "0280275767F0D65C",
        "ProcessID": 21035
      },
      {
        "Cycles": 0,
        "Agent": "edu.brown.cs.systems.xtrace.logging.BaggageWrappers",
        "ProcessName": "Read",
        "TaskID": "4EBAEC60F606EA7B",
        "ParentEventID": [
          "0280275767F0D65C"
        ],
        "Label": "Forking current baggage with Baggage.fork()",
        "Title": "X-Trace Task",
        "Host": "pinky19.mpi-sws.org",
        "HRT": 25491796388761146,
        "Operation": "fork",
        "Timestamp": "1556275436328.715576",
        "TenantClass": 0,
        "Source": "Client.java:1043",
        "ThreadID": 41,
        "ThreadName": "",
        "EventID": "BE72EAD948ACF16C",
        "ProcessID": 21035
      },
      {
        "Cycles": 0,
        "Agent": "Execution-CPU",
        "ProcessName": "Read",
        "TaskID": "4EBAEC60F606EA7B",
        "ParentEventID": [
          "BE72EAD948ACF16C"
        ],
        "Label": "unset",
        "Title": "X-Trace Task",
        "Host": "pinky19.mpi-sws.org",
        "Duration": "75292",
        "HRT": 25491796388834606,
        "Operation": "unset",
        "Timestamp": "1556275436328.789062",
        "TenantClass": 0,
        "Source": "Client.java:1062",
        "ThreadID": 41,
        "ThreadName": "",
        "EventID": "6713B4BF9BA1F7FF",
        "ProcessID": 21035
      },
      {
        "Cycles": 0,
        "Agent": "Execution-CPU",
        "ProcessName": "Name",
        "TaskID": "4EBAEC60F606EA7B",
        "ParentEventID": [
          "BE72EAD948ACF16C"
        ],
        "Label": "set",
        "Title": "X-Trace Task",
        "Host": "pinky19.mpi-sws.org",
        "HRT": 25491796388891246,
        "Operation": "set",
        "Timestamp": "1556275436328.876953",
        "TenantClass": 0,
        "Source": "Server.java:1840",
        "ThreadID": 48,
        "ThreadName": "",
        "EventID": "89E42415F83A4297",
        "BaggageBytes": "[[248 5] [240 0] [0 78 186 236 96 246 6 234 123] [240 1] [0 190 114 234 217 72 172 241 108] [240 3] [0 2]]",
        "ProcessID": 2171
      },
      {
        "Cycles": 0,
        "Agent": "edu.brown.cs.systems.xtrace.logging.BaggageWrappers",
        "ProcessName": "Name",
        "TaskID": "4EBAEC60F606EA7B",
        "ParentEventID": [
          "89E42415F83A4297"
        ],
        "Label": "Forking current baggage with Baggage.fork()",
        "Title": "X-Trace Task",
        "Host": "pinky19.mpi-sws.org",
        "HRT": 25491796388925613,
        "Operation": "fork",
        "Timestamp": "1556275436328.911377",
        "TenantClass": 0,
        "Source": "Server.java:550",
        "ThreadID": 48,
        "ThreadName": "",
        "EventID": "CF9A21B6BC8CA2DE",
        "BaggageBytes": "[[248 5] [240 0] [0 78 186 236 96 246 6 234 123] [240 1] [0 137 228 36 21 248 58 66 151] [240 3] [0 2]]",
        "ProcessID": 2171
      },
      {
        "Cycles": 0,
        "Agent": "Execution-CPU",
        "ProcessName": "Read",
        "TaskID": "4EBAEC60F606EA7B",
        "ParentEventID": [
          "6713B4BF9BA1F7FF"
        ],
        "Label": "set",
        "Title": "X-Trace Task",
        "Host": "pinky19.mpi-sws.org",
        "HRT": 25491796388861123,
        "Operation": "set",
        "Timestamp": "1556275436328.815674",
        "TenantClass": 0,
        "Source": "Client.java:1104",
        "ThreadID": 1,
        "ThreadName": "",
        "EventID": "2651B5CC6FD95D46",
        "ProcessID": 21035
      },
      {
        "Cycles": 0,
        "Agent": "Execution-CPU",
        "ProcessName": "Name",
        "TaskID": "4EBAEC60F606EA7B",
        "ParentEventID": [
          "CF9A21B6BC8CA2DE"
        ],
        "Label": "unset",
        "Title": "X-Trace Task",
        "Host": "pinky19.mpi-sws.org",
        "Duration": "33126",
        "HRT": 25491796388954071,
        "Operation": "unset",
        "Timestamp": "1556275436328.939697",
        "TenantClass": 0,
        "Source": "Server.java:1828",
        "ThreadID": 48,
        "ThreadName": "",
        "EventID": "A08F84FD3627CAFF",
        "BaggageBytes": "[[248 5] [240 0] [0 78 186 236 96 246 6 234 123] [240 1] [0 207 154 33 182 188 140 162 222] [240 3] [0 2]]",
        "ProcessID": 2171
      },
      {
        "Cycles": 0,
        "Agent": "org.apache.hadoop.ipc.Server",
        "ProcessName": "Name",
        "TaskID": "4EBAEC60F606EA7B",
        "ParentEventID": [
          "738B8E94259184E5"
        ],
        "Label": "getBlockLocations in org.apache.hadoop.hdfs.protocol.ClientProtocol",
        "Title": "X-Trace Task",
        "Host": "pinky19.mpi-sws.org",
        "HRT": 25491796389002967,
        "Timestamp": "1556275436328.988525",
        "TenantClass": 0,
        "Source": "ProtobufRpcEngine.java:601",
        "ThreadID": 64,
        "ThreadName": "",
        "EventID": "0D88F85CBF8E712A",
        "BaggageBytes": "[[248 5] [240 0] [0 78 186 236 96 246 6 234 123] [240 1] [0 115 139 142 148 37 145 132 229] [240 3] [0 2]]",
        "ProcessID": 2171
      },
      {
        "Cycles": 0,
        "Agent": "org.apache.hadoop.hdfs.server.namenode.FSNamesystem.audit",
        "ProcessName": "Name",
        "TaskID": "4EBAEC60F606EA7B",
        "ParentEventID": [
          "0D88F85CBF8E712A"
        ],
        "Label": "allowed=true\tugi=plascas (auth:SIMPLE)\tip=/139.19.171.63\tcmd=open\tsrc=/ds/xIB90YbN7ridsSiU\tdst=null\tperm=null\tproto=rpc",
        "Title": "X-Trace Task",
        "Host": "pinky19.mpi-sws.org",
        "HRT": 25491796389055833,
        "Timestamp": "1556275436329.041504",
        "TenantClass": 0,
        "Source": "FSNamesystem.java:8313",
        "ThreadID": 64,
        "ThreadName": "",
        "EventID": "7D78A72F0C9BAC6C",
        "BaggageBytes": "[[248 5] [240 0] [0 78 186 236 96 246 6 234 123] [240 1] [0 13 136 248 92 191 142 113 42] [240 3] [0 2]]",
        "ProcessID": 2171
      },
      {
        "Cycles": 0,
        "Agent": "edu.brown.cs.systems.xtrace.logging.BaggageWrappers",
        "ProcessName": "Name",
        "TaskID": "4EBAEC60F606EA7B",
        "ParentEventID": [
          "7D78A72F0C9BAC6C"
        ],
        "Label": "Forking current baggage with Baggage.fork()",
        "Title": "X-Trace Task",
        "Host": "pinky19.mpi-sws.org",
        "HRT": 25491796389104419,
        "Operation": "fork",
        "Timestamp": "1556275436329.090088",
        "TenantClass": 0,
        "Source": "Server.java:2398",
        "ThreadID": 64,
        "ThreadName": "",
        "EventID": "4D0A57918F94D33D",
        "BaggageBytes": "[[248 5] [240 0] [0 78 186 236 96 246 6 234 123] [240 1] [0 125 120 167 47 12 155 172 108] [240 3] [0 2]]",
        "ProcessID": 2171
      },
      {
        "Cycles": 0,
        "Agent": "Execution-CPU",
        "ProcessName": "Name",
        "TaskID": "4EBAEC60F606EA7B",
        "ParentEventID": [
          "CF9A21B6BC8CA2DE"
        ],
        "Label": "set",
        "Title": "X-Trace Task",
        "Host": "pinky19.mpi-sws.org",
        "HRT": 25491796388965213,
        "Operation": "set",
        "Timestamp": "1556275436328.950928",
        "TenantClass": 0,
        "Source": "Server.java:2071",
        "ThreadID": 64,
        "ThreadName": "",
        "EventID": "738B8E94259184E5",
        "BaggageBytes": "[[248 5] [240 0] [0 78 186 236 96 246 6 234 123] [240 1] [0 207 154 33 182 188 140 162 222] [240 3] [0 2]]",
        "ProcessID": 2171
      },
      {
        "Cycles": 0,
        "Agent": "Execution-CPU",
        "ProcessName": "Read",
        "TaskID": "4EBAEC60F606EA7B",
        "ParentEventID": [
          "4D0A57918F94D33D"
        ],
        "Label": "set",
        "Title": "X-Trace Task",
        "Host": "pinky19.mpi-sws.org",
        "HRT": 25491796389296666,
        "Operation": "set",
        "Timestamp": "1556275436329.251221",
        "TenantClass": 0,
        "Source": "Client.java:302",
        "ThreadID": 37,
        "ThreadName": "",
        "EventID": "FC4EDAB8ABB603F8",
        "ProcessID": 21035
      },
      {
        "Cycles": 0,
        "Agent": "Execution-CPU",
        "ProcessName": "Name",
        "TaskID": "4EBAEC60F606EA7B",
        "ParentEventID": [
          "4D0A57918F94D33D"
        ],
        "Label": "unset",
        "Title": "X-Trace Task",
        "Host": "pinky19.mpi-sws.org",
        "Duration": "233864",
        "HRT": 25491796389221354,
        "Operation": "unset",
        "Timestamp": "1556275436329.207031",
        "TenantClass": 0,
        "Source": "Server.java:1058",
        "ThreadID": 64,
        "ThreadName": "",
        "EventID": "3B16A14FB81EF674",
        "BaggageBytes": "[[248 5] [240 0] [0 78 186 236 96 246 6 234 123] [240 1] [0 77 10 87 145 143 148 211 61] [240 3] [0 2]]",
        "ProcessID": 2171
      },
      {
        "Cycles": 0,
        "Agent": "Execution-CPU",
        "ProcessName": "Read",
        "TaskID": "4EBAEC60F606EA7B",
        "ParentEventID": [
          "FC4EDAB8ABB603F8"
        ],
        "Label": "unset",
        "Title": "X-Trace Task",
        "Host": "pinky19.mpi-sws.org",
        "Duration": "10214",
        "HRT": 25491796389323357,
        "Operation": "unset",
        "Timestamp": "1556275436329.277832",
        "TenantClass": 0,
        "Source": "Client.java:1168",
        "ThreadID": 37,
        "ThreadName": "",
        "EventID": "8E798BE4EB9C3F2A",
        "ProcessID": 21035
      },
      {
        "Cycles": 0,
        "Agent": "Execution-Sleep",
        "ProcessName": "Read",
        "TaskID": "4EBAEC60F606EA7B",
        "ParentEventID": [
          "2651B5CC6FD95D46"
        ],
        "Label": "waited",
        "Title": "X-Trace Task",
        "Host": "pinky19.mpi-sws.org",
        "Duration": "469004",
        "HRT": 25491796389343695,
        "Operation": "waited",
        "Timestamp": "1556275436329.298096",
        "TenantClass": 0,
        "Source": "Client.java:1537",
        "ThreadID": 1,
        "ThreadName": "",
        "EventID": "B8D4B616AC6E9C31",
        "ProcessID": 21035
      },
      {
        "Cycles": 0,
        "Agent": "edu.brown.cs.systems.xtrace.logging.BaggageWrappers",
        "ProcessName": "Read",
        "TaskID": "4EBAEC60F606EA7B",
        "ParentEventID": [
          "8E798BE4EB9C3F2A",
          "B8D4B616AC6E9C31"
        ],
        "Label": "Merged current baggage with other baggage",
        "Title": "X-Trace Task",
        "Host": "pinky19.mpi-sws.org",
        "HRT": 25491796389369913,
        "Operation": "join",
        "Timestamp": "1556275436329.324463",
        "TenantClass": 0,
        "Source": "Client.java:1545",
        "ThreadID": 1,
        "ThreadName": "",
        "EventID": "33771BC9690BA4E2",
        "ProcessID": 21035
      },
      {
        "Cycles": 0,
        "Agent": "edu.brown.cs.systems.xtrace.logging.BaggageWrappers",
        "ProcessName": "Read",
        "TaskID": "4EBAEC60F606EA7B",
        "ParentEventID": [
          "32ECC0AC50C4CEA3"
        ],
        "Label": "Forking current baggage with Baggage.fork()",
        "Title": "X-Trace Task",
        "Host": "pinky19.mpi-sws.org",
        "HRT": 25491796389470998,
        "Operation": "fork",
        "Timestamp": "1556275436329.425537",
        "TenantClass": 0,
        "Source": "DataTransferProtoUtil.java:94",
        "ThreadID": 1,
        "ThreadName": "",
        "EventID": "0ABAFD3CAEA97229",
        "ProcessID": 21035
      },
      {
        "Cycles": 0,
        "Agent": "org.apache.hadoop.ipc.ProtobufRpcEngine",
        "ProcessName": "Read",
        "TaskID": "4EBAEC60F606EA7B",
        "ParentEventID": [
          "33771BC9690BA4E2"
        ],
        "Label": "org.apache.hadoop.hdfs.protocol.ClientProtocol.getBlockLocations completed",
        "Title": "X-Trace Task",
        "Host": "pinky19.mpi-sws.org",
        "HRT": 25491796389407592,
        "Timestamp": "1556275436329.362061",
        "TenantClass": 0,
        "Source": "ProtobufRpcEngine.java:275",
        "ThreadID": 1,
        "ThreadName": "",
        "EventID": "32ECC0AC50C4CEA3",
        "ProcessID": 21035
      },
      {
        "Cycles": 0,
        "Agent": "Execution-CPU",
        "ProcessName": "Data",
        "TaskID": "4EBAEC60F606EA7B",
        "ParentEventID": [
          "0ABAFD3CAEA97229"
        ],
        "Label": "set",
        "Title": "X-Trace Task",
        "Host": "pinky19.mpi-sws.org",
        "HRT": 25491796389604135,
        "Operation": "set",
        "Timestamp": "1556275436329.544189",
        "TenantClass": 0,
        "Source": "Receiver.java:117",
        "ThreadID": 9602,
        "ThreadName": "",
        "EventID": "22A7AEEC91C57435",
        "BaggageBytes": "[[248 5] [240 0] [0 78 186 236 96 246 6 234 123] [240 1] [0 10 186 253 60 174 169 114 41] [240 3] [0 2]]",
        "ProcessID": 2319
      },
      {
        "Cycles": 0,
        "Agent": "edu.brown.cs.systems.xtrace.logging.BaggageWrappers",
        "ProcessName": "Data",
        "TaskID": "4EBAEC60F606EA7B",
        "ParentEventID": [
          "39988BCD9801394C"
        ],
        "Label": "Forking current baggage with Baggage.fork()",
        "Title": "X-Trace Task",
        "Host": "pinky19.mpi-sws.org",
        "HRT": 25491796389717807,
        "Operation": "fork",
        "Timestamp": "1556275436329.657715",
        "TenantClass": 0,
        "Source": "DataXceiver.java:1257",
        "ThreadID": 9602,
        "ThreadName": "",
        "EventID": "EBAA95984F4A2C2F",
        "BaggageBytes": "[[248 5] [240 0] [0 78 186 236 96 246 6 234 123] [240 1] [0 57 152 139 205 152 1 57 76] [240 3] [0 2]]",
        "ProcessID": 2319
      },
      {
        "Cycles": 0,
        "Agent": "edu.brown.cs.systems.xtrace.logging.XTraceInit",
        "ProcessName": "Data",
        "TaskID": "4EBAEC60F606EA7B",
        "ParentEventID": [
          "22A7AEEC91C57435"
        ],
        "Label": "Thread.setName: DataXceiver for client DFSClient_NONMAPREDUCE_1377588049_1 at /139.19.171.63:36074 [Sending block BP-1633380353-139.19.171.63-1554193446451:blk_1073757195_16371]",
        "Title": "X-Trace Task",
        "Host": "pinky19.mpi-sws.org",
        "HRT": 25491796389642764,
        "Timestamp": "1556275436329.582764",
        "TenantClass": 0,
        "Source": "DataXceiver.java:168",
        "ThreadID": 9602,
        "ThreadName": "",
        "EventID": "39988BCD9801394C",
        "BaggageBytes": "[[248 5] [240 0] [0 78 186 236 96 246 6 234 123] [240 1] [0 34 167 174 236 145 197 116 53] [240 3] [0 2]]",
        "ProcessID": 2319
      },
      {
        "Cycles": 0,
        "Agent": "Execution-Sleep",
        "ProcessName": "Read",
        "TaskID": "4EBAEC60F606EA7B",
        "ParentEventID": [
          "0ABAFD3CAEA97229"
        ],
        "Label": "waited",
        "Title": "X-Trace Task",
        "Host": "pinky19.mpi-sws.org",
        "Duration": "214848",
        "HRT": 25491796389781324,
        "Operation": "waited",
        "Timestamp": "1556275436329.735840",
        "TenantClass": 0,
        "Source": "SocketIOWithTimeout.java:335",
        "ThreadID": 1,
        "ThreadName": "",
        "EventID": "A80C7EA461FFC0E4",
        "ProcessID": 21035
      },
      {
        "Cycles": 0,
        "Agent": "Execution-Sleep",
        "ProcessName": "Data",
        "TaskID": "4EBAEC60F606EA7B",
        "ParentEventID": [
          "B8312485E6636F13"
        ],
        "Label": "waited",
        "Title": "X-Trace Task",
        "Host": "pinky19.mpi-sws.org",
        "Duration": "4347",
        "HRT": 25491796389841502,
        "Operation": "waited",
        "Timestamp": "1556275436329.781494",
        "TenantClass": 0,
        "Source": "SocketIOWithTimeout.java:335",
        "ThreadID": 9602,
        "ThreadName": "",
        "EventID": "03CC3606A4A1D073",
        "BaggageBytes": "[[248 5] [240 0] [0 78 186 236 96 246 6 234 123] [240 1] [0 184 49 36 133 230 99 111 19] [240 3] [0 2]]",
        "ProcessID": 2319
      },
      {
        "Cycles": 0,
        "Agent": "edu.brown.cs.systems.xtrace.logging.BaggageWrappers",
        "ProcessName": "Data",
        "TaskID": "4EBAEC60F606EA7B",
        "ParentEventID": [
          "EBAA95984F4A2C2F"
        ],
        "Label": "Forking current baggage with Baggage.fork()",
        "Title": "X-Trace Task",
        "Host": "pinky19.mpi-sws.org",
        "HRT": 25491796389782028,
        "Operation": "fork",
        "Timestamp": "1556275436329.721924",
        "TenantClass": 0,
        "Source": "PacketHeader.java:95",
        "ThreadID": 9602,
        "ThreadName": "",
        "EventID": "B8312485E6636F13",
        "BaggageBytes": "[[248 5] [240 0] [0 78 186 236 96 246 6 234 123] [240 1] [0 235 170 149 152 79 74 44 47] [240 3] [0 2]]",
        "ProcessID": 2319
      },
      {
        "Cycles": 0,
        "Agent": "edu.brown.cs.systems.xtrace.logging.BaggageWrappers",
        "ProcessName": "Read",
        "TaskID": "4EBAEC60F606EA7B",
        "ParentEventID": [
          "A80C7EA461FFC0E4",
          "EBAA95984F4A2C2F"
        ],
        "Label": "Merged current baggage with other baggage",
        "Title": "X-Trace Task",
        "Host": "pinky19.mpi-sws.org",
        "HRT": 25491796389849318,
        "Operation": "join",
        "Timestamp": "1556275436329.803955",
        "TenantClass": 0,
        "Source": "RemoteBlockReader2.java:429",
        "ThreadID": 1,
        "ThreadName": "",
        "EventID": "9057B730F363885B",
        "ProcessID": 21035
      },
      {
        "Cycles": 0,
        "Agent": "edu.brown.cs.systems.xtrace.logging.BaggageWrappers",
        "ProcessName": "Data",
        "TaskID": "4EBAEC60F606EA7B",
        "ParentEventID": [
          "03CC3606A4A1D073"
        ],
        "Label": "Forking current baggage with Baggage.fork()",
        "Title": "X-Trace Task",
        "Host": "pinky19.mpi-sws.org",
        "HRT": 25491796389903266,
        "Operation": "fork",
        "Timestamp": "1556275436329.843262",
        "TenantClass": 0,
        "Source": "PacketHeader.java:95",
        "ThreadID": 9602,
        "ThreadName": "",
        "EventID": "3DBCF417BA83F217",
        "BaggageBytes": "[[248 5] [240 0] [0 78 186 236 96 246 6 234 123] [240 1] [0 3 204 54 6 164 161 208 115] [240 3] [0 2]]",
        "ProcessID": 2319
      },
      {
        "Cycles": 0,
        "Agent": "edu.brown.cs.systems.xtrace.logging.BaggageWrappers",
        "ProcessName": "Read",
        "TaskID": "4EBAEC60F606EA7B",
        "ParentEventID": [
          "B8312485E6636F13",
          "9057B730F363885B"
        ],
        "Label": "Merged current baggage with other baggage",
        "Title": "X-Trace Task",
        "Host": "pinky19.mpi-sws.org",
        "HRT": 25491796389921351,
        "Operation": "join",
        "Timestamp": "1556275436329.875977",
        "TenantClass": 0,
        "Source": "PacketHeader.java:168",
        "ThreadID": 1,
        "ThreadName": "",
        "EventID": "DD841E31E3D20104",
        "ProcessID": 21035
      },
      {
        "Cycles": 0,
        "Agent": "edu.brown.cs.systems.xtrace.logging.BaggageWrappers",
        "ProcessName": "Read",
        "TaskID": "4EBAEC60F606EA7B",
        "ParentEventID": [
          "D98BA2003342356C"
        ],
        "Label": "Forking current baggage with Baggage.fork()",
        "Title": "X-Trace Task",
        "Host": "pinky19.mpi-sws.org",
        "HRT": 25491796389983423,
        "Operation": "fork",
        "Timestamp": "1556275436329.937988",
        "TenantClass": 0,
        "Source": "RemoteBlockReader2.java:361",
        "ThreadID": 1,
        "ThreadName": "",
        "EventID": "C762ED6BCBBA8F9A",
        "ProcessID": 21035
      },
      {
        "Cycles": 0,
        "Agent": "edu.brown.cs.systems.xtrace.logging.BaggageWrappers",
        "ProcessName": "Read",
        "TaskID": "4EBAEC60F606EA7B",
        "ParentEventID": [
          "3DBCF417BA83F217",
          "DD841E31E3D20104"
        ],
        "Label": "Merged current baggage with other baggage",
        "Title": "X-Trace Task",
        "Host": "pinky19.mpi-sws.org",
        "HRT": 25491796389973925,
        "Operation": "join",
        "Timestamp": "1556275436329.928467",
        "TenantClass": 0,
        "Source": "PacketHeader.java:168",
        "ThreadID": 1,
        "ThreadName": "",
        "EventID": "D98BA2003342356C",
        "ProcessID": 21035
      },
      {
        "Cycles": 0,
        "Agent": "Execution-Sleep",
        "ProcessName": "Data",
        "TaskID": "4EBAEC60F606EA7B",
        "ParentEventID": [
          "3DBCF417BA83F217"
        ],
        "Label": "waited",
        "Title": "X-Trace Task",
        "Host": "pinky19.mpi-sws.org",
        "Duration": "46721",
        "HRT": 25491796390030216,
        "Operation": "waited",
        "Timestamp": "1556275436329.970215",
        "TenantClass": 0,
        "Source": "SocketIOWithTimeout.java:335",
        "ThreadID": 9602,
        "ThreadName": "",
        "EventID": "C8D6ED5583ECB17B",
        "BaggageBytes": "[[248 5] [240 0] [0 78 186 236 96 246 6 234 123] [240 1] [0 61 188 244 23 186 131 242 23] [240 3] [0 2]]",
        "ProcessID": 2319
      },
      {
        "Cycles": 0,
        "Agent": "Execution-CPU",
        "ProcessName": "Data",
        "TaskID": "4EBAEC60F606EA7B",
        "ParentEventID": [
          "F4FCAFA3A3580161"
        ],
        "Label": "unset",
        "Title": "X-Trace Task",
        "Host": "pinky19.mpi-sws.org",
        "Duration": "471177",
        "HRT": 25491796390103158,
        "Operation": "unset",
        "Timestamp": "1556275436330.043213",
        "TenantClass": 0,
        "Source": "DataXceiver.java:261",
        "ThreadID": 9602,
        "ThreadName": "",
        "EventID": "C101CD9B56139D82",
        "BaggageBytes": "[[248 5] [240 0] [0 78 186 236 96 246 6 234 123] [240 1] [0 244 252 175 163 163 88 1 97] [240 3] [0 2]]",
        "ProcessID": 2319
      },
      {
        "Cycles": 0,
        "Agent": "edu.brown.cs.systems.xtrace.logging.BaggageWrappers",
        "ProcessName": "Data",
        "TaskID": "4EBAEC60F606EA7B",
        "ParentEventID": [
          "C8D6ED5583ECB17B",
          "C762ED6BCBBA8F9A"
        ],
        "Label": "Merged current baggage with other baggage",
        "Title": "X-Trace Task",
        "Host": "pinky19.mpi-sws.org",
        "HRT": 25491796390083147,
        "Operation": "join",
        "Timestamp": "1556275436330.023193",
        "TenantClass": 0,
        "Source": "DataXceiver.java:574",
        "ThreadID": 9602,
        "ThreadName": "",
        "EventID": "F4FCAFA3A3580161",
        "BaggageBytes": "[[248 5] [240 0] [0 78 186 236 96 246 6 234 123] [240 1] [0 199 98 237 107 203 186 143 154] [0 200 214 237 85 131 236 177 123] [240 3] [0 2]]",
        "ProcessID": 2319
      },
      {
        "Cycles": 0,
        "Agent": "edu.brown.cs.systems.retro.benchmarks.hdfs_client.Reader",
        "ProcessName": "Read",
        "TaskID": "4EBAEC60F606EA7B",
        "ParentEventID": [
          "0"
        ],
        "Label": "Reading file",
        "Title": "X-Trace Task",
        "Host": "pinky19.mpi-sws.org",
        "HRT": 25491796388639047,
        "Timestamp": "1556275436328.593506",
        "TenantClass": 0,
        "ThreadID": 1,
        "ThreadName": "",
        "EventID": "0720E32992A305FD",
        "ProcessID": 21035,
        "Tag": [
          "reader_1kb",
          "Read Size: 1024"
        ]
      }
    ]
  }
]