[
  {
    "id": "6575D645DD2CC540",
    "reports": [
      {
        "Cycles": 0,
        "Agent": "org.apache.hadoop.ipc.ProtobufRpcEngine",
        "ProcessName": "Read",
        "TaskID": "6575D645DD2CC540",
        "ParentEventID": [
          "82E2264315A1F534"
        ],
        "Label": "Invoking org.apache.hadoop.hdfs.protocol.ClientProtocol.getBlockLocations",
        "Title": "X-Trace Task",
        "Host": "pinky19.mpi-sws.org",
        "HRT": 25491923385169021,
        "Timestamp": "1556275563325.625488",
        "TenantClass": 0,
        "Source": "ProtobufRpcEngine.java:228",
        "ThreadID": 1,
        "ThreadName": "",
        "EventID": "42F440605A9CD32F",
        "ProcessID": 21035
      },
      {
        "Cycles": 0,
        "Agent": "Execution-CPU",
        "ProcessName": "Read",
        "TaskID": "6575D645DD2CC540",
        "ParentEventID": [
          "14608DCCD9CF773A"
        ],
        "Label": "set",
        "Title": "X-Trace Task",
        "Host": "pinky19.mpi-sws.org",
        "HRT": 25491923385205625,
        "Operation": "set",
        "Timestamp": "1556275563325.662109",
        "TenantClass": 0,
        "Source": "Client.java:1032",
        "ThreadID": 41,
        "ThreadName": "",
        "EventID": "401189B51B30007F",
        "ProcessID": 21035
      },
      {
        "Cycles": 0,
        "Agent": "edu.brown.cs.systems.retro.benchmarks.hdfs_client.Reader",
        "ProcessName": "Read",
        "TaskID": "6575D645DD2CC540",
        "ParentEventID": [
          "0"
        ],
        "Label": "Reading file",
        "Title": "X-Trace Task",
        "Host": "pinky19.mpi-sws.org",
        "HRT": 25491923385126988,
        "Timestamp": "1556275563325.583496",
        "TenantClass": 0,
        "ThreadID": 1,
        "ThreadName": "",
        "EventID": "D101FD389C1AF644",
        "ProcessID": 21035,
        "Tag": [
          "reader_1kb",
          "Read Size: 1024"
        ]
      },
      {
        "Cycles": 0,
        "Agent": "edu.brown.cs.systems.xtrace.logging.BaggageWrappers",
        "ProcessName": "Read",
        "TaskID": "6575D645DD2CC540",
        "ParentEventID": [
          "401189B51B30007F"
        ],
        "Label": "Forking current baggage with Baggage.fork()",
        "Title": "X-Trace Task",
        "Host": "pinky19.mpi-sws.org",
        "HRT": 25491923385216882,
        "Operation": "fork",
        "Timestamp": "1556275563325.673584",
        "TenantClass": 0,
        "Source": "Client.java:1043",
        "ThreadID": 41,
        "ThreadName": "",
        "EventID": "D015DA3F5D6293DC",
        "ProcessID": 21035
      },
      {
        "Cycles": 0,
        "Agent": "Execution-CPU",
        "ProcessName": "Read",
        "TaskID": "6575D645DD2CC540",
        "ParentEventID": [
          "42F440605A9CD32F"
        ],
        "Label": "unset",
        "Title": "X-Trace Task",
        "Host": "pinky19.mpi-sws.org",
        "Duration": "21258513",
        "HRT": 25491923385186027,
        "Operation": "unset",
        "Timestamp": "1556275563325.642578",
        "TenantClass": 0,
        "Source": "Client.java:1027",
        "ThreadID": 1,
        "ThreadName": "",
        "EventID": "14608DCCD9CF773A",
        "ProcessID": 21035
      },
      {
        "Cycles": 0,
        "Agent": "Execution-CPU",
        "ProcessName": "Read",
        "TaskID": "6575D645DD2CC540",
        "ParentEventID": [
          "57DD206652F42E06"
        ],
        "Label": "set",
        "Title": "X-Trace Task",
        "Host": "pinky19.mpi-sws.org",
        "HRT": 25491923385306351,
        "Operation": "set",
        "Timestamp": "1556275563325.762939",
        "TenantClass": 0,
        "Source": "Client.java:1104",
        "ThreadID": 1,
        "ThreadName": "",
        "EventID": "4E43993ED6FC28C4",
        "ProcessID": 21035
      },
      {
        "Cycles": 0,
        "Agent": "Execution-CPU",
        "ProcessName": "Name",
        "TaskID": "6575D645DD2CC540",
        "ParentEventID": [
          "D015DA3F5D6293DC"
        ],
        "Label": "set",
        "Title": "X-Trace Task",
        "Host": "pinky19.mpi-sws.org",
        "HRT": 25491923385337511,
        "Operation": "set",
        "Timestamp": "1556275563325.823242",
        "TenantClass": 0,
        "Source": "Server.java:1840",
        "ThreadID": 48,
        "ThreadName": "",
        "EventID": "14B536540796C487",
        "BaggageBytes": "[[248 5] [240 0] [0 101 117 214 69 221 44 197 64] [240 1] [0 208 21 218 63 93 98 147 220] [240 3] [0 2]]",
        "ProcessID": 2171
      },
      {
        "Cycles": 0,
        "Agent": "Execution-CPU",
        "ProcessName": "Read",
        "TaskID": "6575D645DD2CC540",
        "ParentEventID": [
          "D015DA3F5D6293DC"
        ],
        "Label": "unset",
        "Title": "X-Trace Task",
        "Host": "pinky19.mpi-sws.org",
        "Duration": "66441",
        "HRT": 25491923385282554,
        "Operation": "unset",
        "Timestamp": "1556275563325.739258",
        "TenantClass": 0,
        "Source": "Client.java:1062",
        "ThreadID": 41,
        "ThreadName": "",
        "EventID": "57DD206652F42E06",
        "ProcessID": 21035
      },
      {
        "Cycles": 0,
        "Agent": "Execution-CPU",
        "ProcessName": "Name",
        "TaskID": "6575D645DD2CC540",
        "ParentEventID": [
          "310FE345FAFD06EF"
        ],
        "Label": "unset",
        "Title": "X-Trace Task",
        "Host": "pinky19.mpi-sws.org",
        "Duration": "27641",
        "HRT": 25491923385392266,
        "Operation": "unset",
        "Timestamp": "1556275563325.877930",
        "TenantClass": 0,
        "Source": "Server.java:1828",
        "ThreadID": 48,
        "ThreadName": "",
        "EventID": "B6A5BE7DBBB6CFA5",
        "BaggageBytes": "[[248 5] [240 0] [0 101 117 214 69 221 44 197 64] [240 1] [0 49 15 227 69 250 253 6 239] [240 3] [0 2]]",
        "ProcessID": 2171
      },
      {
        "Cycles": 0,
        "Agent": "Execution-CPU",
        "ProcessName": "Name",
        "TaskID": "6575D645DD2CC540",
        "ParentEventID": [
          "310FE345FAFD06EF"
        ],
        "Label": "set",
        "Title": "X-Trace Task",
        "Host": "pinky19.mpi-sws.org",
        "HRT": 25491923385404380,
        "Operation": "set",
        "Timestamp": "1556275563325.890137",
        "TenantClass": 0,
        "Source": "Server.java:2071",
        "ThreadID": 62,
        "ThreadName": "",
        "EventID": "6A6673B2FF83E709",
        "BaggageBytes": "[[248 5] [240 0] [0 101 117 214 69 221 44 197 64] [240 1] [0 49 15 227 69 250 253 6 239] [240 3] [0 2]]",
        "ProcessID": 2171
      },
      {
        "Cycles": 0,
        "Agent": "org.apache.hadoop.ipc.Server",
        "ProcessName": "Name",
        "TaskID": "6575D645DD2CC540",
        "ParentEventID": [
          "6A6673B2FF83E709"
        ],
        "Label": "getBlockLocations in org.apache.hadoop.hdfs.protocol.ClientProtocol",
        "Title": "X-Trace Task",
        "Host": "pinky19.mpi-sws.org",
        "HRT": 25491923385445909,
        "Timestamp": "1556275563325.931641",
        "TenantClass": 0,
        "Source": "ProtobufRpcEngine.java:601",
        "ThreadID": 62,
        "ThreadName": "",
        "EventID": "1DD00B72410FF768",
        "BaggageBytes": "[[248 5] [240 0] [0 101 117 214 69 221 44 197 64] [240 1] [0 106 102 115 178 255 131 231 9] [240 3] [0 2]]",
        "ProcessID": 2171
      },
      {
        "Cycles": 0,
        "Agent": "edu.brown.cs.systems.xtrace.logging.BaggageWrappers",
        "ProcessName": "Name",
        "TaskID": "6575D645DD2CC540",
        "ParentEventID": [
          "14B536540796C487"
        ],
        "Label": "Forking current baggage with Baggage.fork()",
        "Title": "X-Trace Task",
        "Host": "pinky19.mpi-sws.org",
        "HRT": 25491923385368499,
        "Operation": "fork",
        "Timestamp": "1556275563325.854248",
        "TenantClass": 0,
        "Source": "Server.java:550",
        "ThreadID": 48,
        "ThreadName": "",
        "EventID": "310FE345FAFD06EF",
        "BaggageBytes": "[[248 5] [240 0] [0 101 117 214 69 221 44 197 64] [240 1] [0 20 181 54 84 7 150 196 135] [240 3] [0 2]]",
        "ProcessID": 2171
      },
      {
        "Cycles": 0,
        "Agent": "org.apache.hadoop.hdfs.server.namenode.FSNamesystem.audit",
        "ProcessName": "Name",
        "TaskID": "6575D645DD2CC540",
        "ParentEventID": [
          "1DD00B72410FF768"
        ],
        "Label": "allowed=true\tugi=plascas (auth:SIMPLE)\tip=/139.19.171.63\tcmd=open\tsrc=/ds/SapHrtbJThnDvcgh\tdst=null\tperm=null\tproto=rpc",
        "Title": "X-Trace Task",
        "Host": "pinky19.mpi-sws.org",
        "HRT": 25491923385492440,
        "Timestamp": "1556275563325.978027",
        "TenantClass": 0,
        "Source": "FSNamesystem.java:8313",
        "ThreadID": 62,
        "ThreadName": "",
        "EventID": "0CEA7CEBC470F8D6",
        "BaggageBytes": "[[248 5] [240 0] [0 101 117 214 69 221 44 197 64] [240 1] [0 29 208 11 114 65 15 247 104] [240 3] [0 2]]",
        "ProcessID": 2171
      },
      {
        "Cycles": 0,
        "Agent": "Execution-CPU",
        "ProcessName": "Name",
        "TaskID": "6575D645DD2CC540",
        "ParentEventID": [
          "CB64792069C43160"
        ],
        "Label": "unset",
        "Title": "X-Trace Task",
        "Host": "pinky19.mpi-sws.org",
        "Duration": "208200",
        "HRT": 25491923385640960,
        "Operation": "unset",
        "Timestamp": "1556275563326.126709",
        "TenantClass": 0,
        "Source": "Server.java:1058",
        "ThreadID": 62,
        "ThreadName": "",
        "EventID": "EAEE88D4FD010ACD",
        "BaggageBytes": "[[248 5] [240 0] [0 101 117 214 69 221 44 197 64] [240 1] [0 203 100 121 32 105 196 49 96] [240 3] [0 2]]",
        "ProcessID": 2171
      },
      {
        "Cycles": 0,
        "Agent": "edu.brown.cs.systems.xtrace.logging.BaggageWrappers",
        "ProcessName": "Name",
        "TaskID": "6575D645DD2CC540",
        "ParentEventID": [
          "0CEA7CEBC470F8D6"
        ],
        "Label": "Forking current baggage with Baggage.fork()",
        "Title": "X-Trace Task",
        "Host": "pinky19.mpi-sws.org",
        "HRT": 25491923385534710,
        "Operation": "fork",
        "Timestamp": "1556275563326.020264",
        "TenantClass": 0,
        "Source": "Server.java:2398",
        "ThreadID": 62,
        "ThreadName": "",
        "EventID": "CB64792069C43160",
        "BaggageBytes": "[[248 5] [240 0] [0 101 117 214 69 221 44 197 64] [240 1] [0 12 234 124 235 196 112 248 214] [240 3] [0 2]]",
        "ProcessID": 2171
      },
      {
        "Cycles": 0,
        "Agent": "Execution-CPU",
        "ProcessName": "Read",
        "TaskID": "6575D645DD2CC540",
        "ParentEventID": [
          "CB64792069C43160"
        ],
        "Label": "set",
        "Title": "X-Trace Task",
        "Host": "pinky19.mpi-sws.org",
        "HRT": 25491923385713213,
        "Operation": "set",
        "Timestamp": "1556275563326.169678",
        "TenantClass": 0,
        "Source": "Client.java:302",
        "ThreadID": 37,
        "ThreadName": "",
        "EventID": "48001097ACBC5917",
        "ProcessID": 21035
      },
      {
        "Cycles": 0,
        "Agent": "Execution-CPU",
        "ProcessName": "Read",
        "TaskID": "6575D645DD2CC540",
        "ParentEventID": [
          "48001097ACBC5917"
        ],
        "Label": "unset",
        "Title": "X-Trace Task",
        "Host": "pinky19.mpi-sws.org",
        "Duration": "5956",
        "HRT": 25491923385735898,
        "Operation": "unset",
        "Timestamp": "1556275563326.192383",
        "TenantClass": 0,
        "Source": "Client.java:1168",
        "ThreadID": 37,
        "ThreadName": "",
        "EventID": "26F2AB1F0D86D549",
        "ProcessID": 21035
      },
      {
        "Cycles": 0,
        "Agent": "Execution-Sleep",
        "ProcessName": "Read",
        "TaskID": "6575D645DD2CC540",
        "ParentEventID": [
          "4E43993ED6FC28C4"
        ],
        "Label": "waited",
        "Title": "X-Trace Task",
        "Host": "pinky19.mpi-sws.org",
        "Duration": "435808",
        "HRT": 25491923385753052,
        "Operation": "waited",
        "Timestamp": "1556275563326.209717",
        "TenantClass": 0,
        "Source": "Client.java:1537",
        "ThreadID": 1,
        "ThreadName": "",
        "EventID": "06771E6726A4DD37",
        "ProcessID": 21035
      },
      {
        "Cycles": 0,
        "Agent": "org.apache.hadoop.ipc.ProtobufRpcEngine",
        "ProcessName": "Read",
        "TaskID": "6575D645DD2CC540",
        "ParentEventID": [
          "DBCA17862AEADC4C"
        ],
        "Label": "org.apache.hadoop.hdfs.protocol.ClientProtocol.getBlockLocations completed",
        "Title": "X-Trace Task",
        "Host": "pinky19.mpi-sws.org",
        "HRT": 25491923385813885,
        "Timestamp": "1556275563326.270508",
        "TenantClass": 0,
        "Source": "ProtobufRpcEngine.java:275",
        "ThreadID": 1,
        "ThreadName": "",
        "EventID": "1C7E652A442D5C13",
        "ProcessID": 21035
      },
      {
        "Cycles": 0,
        "Agent": "edu.brown.cs.systems.xtrace.logging.BaggageWrappers",
        "ProcessName": "Read",
        "TaskID": "6575D645DD2CC540",
        "ParentEventID": [
          "06771E6726A4DD37",
          "26F2AB1F0D86D549"
        ],
        "Label": "Merged current baggage with other baggage",
        "Title": "X-Trace Task",
        "Host": "pinky19.mpi-sws.org",
        "HRT": 25491923385770019,
        "Operation": "join",
        "Timestamp": "1556275563326.226562",
        "TenantClass": 0,
        "Source": "Client.java:1545",
        "ThreadID": 1,
        "ThreadName": "",
        "EventID": "DBCA17862AEADC4C",
        "ProcessID": 21035
      },
      {
        "Cycles": 0,
        "Agent": "edu.brown.cs.systems.xtrace.logging.BaggageWrappers",
        "ProcessName": "Read",
        "TaskID": "6575D645DD2CC540",
        "ParentEventID": [
          "1C7E652A442D5C13"
        ],
        "Label": "Forking current baggage with Baggage.fork()",
        "Title": "X-Trace Task",
        "Host": "pinky19.mpi-sws.org",
        "HRT": 25491923385869926,
        "Operation": "fork",
        "Timestamp": "1556275563326.326416",
        "TenantClass": 0,
        "Source": "DataTransferProtoUtil.java:94",
        "ThreadID": 1,
        "ThreadName": "",
        "EventID": "E06C084ED73DCF45",
        "ProcessID": 21035
      },
      {
        "Cycles": 0,
        "Agent": "edu.brown.cs.systems.xtrace.logging.XTraceInit",
        "ProcessName": "Data",
        "TaskID": "6575D645DD2CC540",
        "ParentEventID": [
          "7FB9DB5FF33A8530"
        ],
        "Label": "Thread.setName: DataXceiver for client DFSClient_NONMAPREDUCE_1377588049_1 at /139.19.171.63:36074 [Sending block BP-1633380353-139.19.171.63-1554193446451:blk_1073759411_18587]",
        "Title": "X-Trace Task",
        "Host": "pinky19.mpi-sws.org",
        "HRT": 25491923386056210,
        "Timestamp": "1556275563326.518066",
        "TenantClass": 0,
        "Source": "DataXceiver.java:168",
        "ThreadID": 9602,
        "ThreadName": "",
        "EventID": "D64F7F864EB19F13",
        "BaggageBytes": "[[248 5] [240 0] [0 101 117 214 69 221 44 197 64] [240 1] [0 127 185 219 95 243 58 133 48] [240 3] [0 2]]",
        "ProcessID": 2319
      },
      {
        "Cycles": 0,
        "Agent": "Execution-CPU",
        "ProcessName": "Data",
        "TaskID": "6575D645DD2CC540",
        "ParentEventID": [
          "E06C084ED73DCF45"
        ],
        "Label": "set",
        "Title": "X-Trace Task",
        "Host": "pinky19.mpi-sws.org",
        "HRT": 25491923386019128,
        "Operation": "set",
        "Timestamp": "1556275563326.480957",
        "TenantClass": 0,
        "Source": "Receiver.java:117",
        "ThreadID": 9602,
        "ThreadName": "",
        "EventID": "7FB9DB5FF33A8530",
        "BaggageBytes": "[[248 5] [240 0] [0 101 117 214 69 221 44 197 64] [240 1] [0 224 108 8 78 215 61 207 69] [240 3] [0 2]]",
        "ProcessID": 2319
      },
      {
        "Cycles": 0,
        "Agent": "edu.brown.cs.systems.xtrace.logging.BaggageWrappers",
        "ProcessName": "Data",
        "TaskID": "6575D645DD2CC540",
        "ParentEventID": [
          "D64F7F864EB19F13"
        ],
        "Label": "Forking current baggage with Baggage.fork()",
        "Title": "X-Trace Task",
        "Host": "pinky19.mpi-sws.org",
        "HRT": 25491923386132078,
        "Operation": "fork",
        "Timestamp": "1556275563326.593994",
        "TenantClass": 0,
        "Source": "DataXceiver.java:1257",
        "ThreadID": 9602,
        "ThreadName": "",
        "EventID": "E771858C7000F26B",
        "BaggageBytes": "[[248 5] [240 0] [0 101 117 214 69 221 44 197 64] [240 1] [0 214 79 127 134 78 177 159 19] [240 3] [0 2]]",
        "ProcessID": 2319
      },
      {
        "Cycles": 0,
        "Agent": "Execution-Sleep",
        "ProcessName": "Read",
        "TaskID": "6575D645DD2CC540",
        "ParentEventID": [
          "E06C084ED73DCF45"
        ],
        "Label": "waited",
        "Title": "X-Trace Task",
        "Host": "pinky19.mpi-sws.org",
        "Duration": "244450",
        "HRT": 25491923386214853,
        "Operation": "waited",
        "Timestamp": "1556275563326.671387",
        "TenantClass": 0,
        "Source": "SocketIOWithTimeout.java:335",
        "ThreadID": 1,
        "ThreadName": "",
        "EventID": "1C0126FB48F4B0B5",
        "ProcessID": 21035
      },
      {
        "Cycles": 0,
        "Agent": "edu.brown.cs.systems.xtrace.logging.BaggageWrappers",
        "ProcessName": "Data",
        "TaskID": "6575D645DD2CC540",
        "ParentEventID": [
          "E771858C7000F26B"
        ],
        "Label": "Forking current baggage with Baggage.fork()",
        "Title": "X-Trace Task",
        "Host": "pinky19.mpi-sws.org",
        "HRT": 25491923386195805,
        "Operation": "fork",
        "Timestamp": "1556275563326.657715",
        "TenantClass": 0,
        "Source": "PacketHeader.java:95",
        "ThreadID": 9602,
        "ThreadName": "",
        "EventID": "FDAB4B578C344E09",
        "BaggageBytes": "[[248 5] [240 0] [0 101 117 214 69 221 44 197 64] [240 1] [0 231 113 133 140 112 0 242 107] [240 3] [0 2]]",
        "ProcessID": 2319
      },
      {
        "Cycles": 0,
        "Agent": "Execution-Sleep",
        "ProcessName": "Data",
        "TaskID": "6575D645DD2CC540",
        "ParentEventID": [
          "FDAB4B578C344E09"
        ],
        "Label": "waited",
        "Title": "X-Trace Task",
        "Host": "pinky19.mpi-sws.org",
        "Duration": "4022",
        "HRT": 25491923386252755,
        "Operation": "waited",
        "Timestamp": "1556275563326.714600",
        "TenantClass": 0,
        "Source": "SocketIOWithTimeout.java:335",
        "ThreadID": 9602,
        "ThreadName": "",
        "EventID": "96AAD268EA6C75A3",
        "BaggageBytes": "[[248 5] [240 0] [0 101 117 214 69 221 44 197 64] [240 1] [0 253 171 75 87 140 52 78 9] [240 3] [0 2]]",
        "ProcessID": 2319
      },
      {
        "Cycles": 0,
        "Agent": "edu.brown.cs.systems.xtrace.logging.BaggageWrappers",
        "ProcessName": "Read",
        "TaskID": "6575D645DD2CC540",
        "ParentEventID": [
          "1C0126FB48F4B0B5",
          "E771858C7000F26B"
        ],
        "Label": "Merged current baggage with other baggage",
        "Title": "X-Trace Task",
        "Host": "pinky19.mpi-sws.org",
        "HRT": 25491923386299194,
        "Operation": "join",
        "Timestamp": "1556275563326.755859",
        "TenantClass": 0,
        "Source": "RemoteBlockReader2.java:429",
        "ThreadID": 1,
        "ThreadName": "",
        "EventID": "C4ED0EB06AD95698",
        "ProcessID": 21035
      },
      {
        "Cycles": 0,
        "Agent": "edu.brown.cs.systems.xtrace.logging.BaggageWrappers",
        "ProcessName": "Data",
        "TaskID": "6575D645DD2CC540",
        "ParentEventID": [
          "96AAD268EA6C75A3"
        ],
        "Label": "Forking current baggage with Baggage.fork()",
        "Title": "X-Trace Task",
        "Host": "pinky19.mpi-sws.org",
        "HRT": 25491923386311513,
        "Operation": "fork",
        "Timestamp": "1556275563326.773193",
        "TenantClass": 0,
        "Source": "PacketHeader.java:95",
        "ThreadID": 9602,
        "ThreadName": "",
        "EventID": "1A6C94D44A3AE2D0",
        "BaggageBytes": "[[248 5] [240 0] [0 101 117 214 69 221 44 197 64] [240 1] [0 150 170 210 104 234 108 117 163] [240 3] [0 2]]",
        "ProcessID": 2319
      },
      {
        "Cycles": 0,
        "Agent": "edu.brown.cs.systems.xtrace.logging.BaggageWrappers",
        "ProcessName": "Read",
        "TaskID": "6575D645DD2CC540",
        "ParentEventID": [
          "F0B89075D76461F2",
          "1A6C94D44A3AE2D0"
        ],
        "Label": "Merged current baggage with other baggage",
        "Title": "X-Trace Task",
        "Host": "pinky19.mpi-sws.org",
        "HRT": 25491923386421888,
        "Operation": "join",
        "Timestamp": "1556275563326.878418",
        "TenantClass": 0,
        "Source": "PacketHeader.java:168",
        "ThreadID": 1,
        "ThreadName": "",
        "EventID": "E898169E30A5AB2D",
        "ProcessID": 21035
      },
      {
        "Cycles": 0,
        "Agent": "edu.brown.cs.systems.xtrace.logging.BaggageWrappers",
        "ProcessName": "Read",
        "TaskID": "6575D645DD2CC540",
        "ParentEventID": [
          "FDAB4B578C344E09",
          "C4ED0EB06AD95698"
        ],
        "Label": "Merged current baggage with other baggage",
        "Title": "X-Trace Task",
        "Host": "pinky19.mpi-sws.org",
        "HRT": 25491923386369773,
        "Operation": "join",
        "Timestamp": "1556275563326.826416",
        "TenantClass": 0,
        "Source": "PacketHeader.java:168",
        "ThreadID": 1,
        "ThreadName": "",
        "EventID": "F0B89075D76461F2",
        "ProcessID": 21035
      },
      {
        "Cycles": 0,
        "Agent": "edu.brown.cs.systems.xtrace.logging.BaggageWrappers",
        "ProcessName": "Read",
        "TaskID": "6575D645DD2CC540",
        "ParentEventID": [
          "E898169E30A5AB2D"
        ],
        "Label": "Forking current baggage with Baggage.fork()",
        "Title": "X-Trace Task",
        "Host": "pinky19.mpi-sws.org",
        "HRT": 25491923386430965,
        "Operation": "fork",
        "Timestamp": "1556275563326.887451",
        "TenantClass": 0,
        "Source": "RemoteBlockReader2.java:361",
        "ThreadID": 1,
        "ThreadName": "",
        "EventID": "6F8C74BEB17C4827",
        "ProcessID": 21035
      },
      {
        "Cycles": 0,
        "Agent": "edu.brown.cs.systems.xtrace.logging.BaggageWrappers",
        "ProcessName": "Data",
        "TaskID": "6575D645DD2CC540",
        "ParentEventID": [
          "0343E8C6BCDA18FF",
          "6F8C74BEB17C4827"
        ],
        "Label": "Merged current baggage with other baggage",
        "Title": "X-Trace Task",
        "Host": "pinky19.mpi-sws.org",
        "HRT": 25491923386530778,
        "Operation": "join",
        "Timestamp": "1556275563326.992676",
        "TenantClass": 0,
        "Source": "DataXceiver.java:574",
        "ThreadID": 9602,
        "ThreadName": "",
        "EventID": "124AE0F2F57B7E99",
        "BaggageBytes": "[[248 5] [240 0] [0 101 117 214 69 221 44 197 64] [240 1] [0 3 67 232 198 188 218 24 255] [0 111 140 116 190 177 124 72 39] [240 3] [0 2]]",
        "ProcessID": 2319
      },
      {
        "Cycles": 0,
        "Agent": "Execution-Sleep",
        "ProcessName": "Data",
        "TaskID": "6575D645DD2CC540",
        "ParentEventID": [
          "1A6C94D44A3AE2D0"
        ],
        "Label": "waited",
        "Title": "X-Trace Task",
        "Host": "pinky19.mpi-sws.org",
        "Duration": "85038",
        "HRT": 25491923386477545,
        "Operation": "waited",
        "Timestamp": "1556275563326.939453",
        "TenantClass": 0,
        "Source": "SocketIOWithTimeout.java:335",
        "ThreadID": 9602,
        "ThreadName": "",
        "EventID": "0343E8C6BCDA18FF",
        "BaggageBytes": "[[248 5] [240 0] [0 101 117 214 69 221 44 197 64] [240 1] [0 26 108 148 212 74 58 226 208] [240 3] [0 2]]",
        "ProcessID": 2319
      },
      {
        "Cycles": 0,
        "Agent": "Execution-CPU",
        "ProcessName": "Data",
        "TaskID": "6575D645DD2CC540",
        "ParentEventID": [
          "124AE0F2F57B7E99"
        ],
        "Label": "unset",
        "Title": "X-Trace Task",
        "Host": "pinky19.mpi-sws.org",
        "Duration": "504433",
        "HRT": 25491923386549909,
        "Operation": "unset",
        "Timestamp": "1556275563327.011719",
        "TenantClass": 0,
        "Source": "DataXceiver.java:261",
        "ThreadID": 9602,
        "ThreadName": "",
        "EventID": "50858286807CEAE8",
        "BaggageBytes": "[[248 5] [240 0] [0 101 117 214 69 221 44 197 64] [240 1] [0 18 74 224 242 245 123 126 153] [240 3] [0 2]]",
        "ProcessID": 2319
      },
      {
        "Cycles": 0,
        "Agent": "edu.brown.cs.systems.retro.benchmarks.hdfs_client.Reader",
        "ProcessName": "Read",
        "TaskID": "6575D645DD2CC540",
        "ParentEventID": [
          "D101FD389C1AF644"
        ],
        "Label": "Reading file",
        "Title": "X-Trace Task",
        "Host": "pinky19.mpi-sws.org",
        "HRT": 25491923385138434,
        "Timestamp": "1556275563325.594971",
        "TenantClass": 0,
        "ThreadID": 1,
        "ThreadName": "",
        "EventID": "82E2264315A1F534",
        "ProcessID": 21035
      }
    ]
  }
]