[
  {
    "id": "C6628A92101359C2",
    "reports": [
      {
        "Cycles": 0,
        "Agent": "org.apache.hadoop.ipc.ProtobufRpcEngine",
        "ProcessName": "Read",
        "TaskID": "C6628A92101359C2",
        "ParentEventID": [
          "496B170731964ECB"
        ],
        "Label": "Invoking org.apache.hadoop.hdfs.protocol.ClientProtocol.getBlockLocations",
        "Title": "X-Trace Task",
        "Host": "pinky19.mpi-sws.org",
        "HRT": 26966748151875649,
        "Timestamp": "1557750388091.870361",
        "TenantClass": 0,
        "Source": "ProtobufRpcEngine.java:228",
        "ThreadID": 1,
        "ThreadName": "",
        "EventID": "9003B3E8856837E2",
        "ProcessID": 2801
      },
      {
        "Cycles": 0,
        "Agent": "edu.brown.cs.systems.retro.benchmarks.hdfs_client.Reader",
        "ProcessName": "Read",
        "TaskID": "C6628A92101359C2",
        "ParentEventID": [
          "45B4872812E271D4"
        ],
        "Label": "Reading file",
        "Title": "X-Trace Task",
        "Host": "pinky19.mpi-sws.org",
        "HRT": 26966748151852233,
        "Timestamp": "1557750388091.846924",
        "TenantClass": 0,
        "ThreadID": 1,
        "ThreadName": "",
        "EventID": "496B170731964ECB",
        "ProcessID": 2801
      },
      {
        "Cycles": 0,
        "Agent": "Execution-CPU",
        "ProcessName": "Read",
        "TaskID": "C6628A92101359C2",
        "ParentEventID": [
          "9003B3E8856837E2"
        ],
        "Label": "unset",
        "Title": "X-Trace Task",
        "Host": "pinky19.mpi-sws.org",
        "Duration": "24808679",
        "HRT": 26966748151890283,
        "Operation": "unset",
        "Timestamp": "1557750388091.885010",
        "TenantClass": 0,
        "Source": "Client.java:1027",
        "ThreadID": 1,
        "ThreadName": "",
        "EventID": "5CC2F78D348A5812",
        "ProcessID": 2801
      },
      {
        "Cycles": 0,
        "Agent": "Execution-CPU",
        "ProcessName": "Read",
        "TaskID": "C6628A92101359C2",
        "ParentEventID": [
          "5CC2F78D348A5812"
        ],
        "Label": "set",
        "Title": "X-Trace Task",
        "Host": "pinky19.mpi-sws.org",
        "HRT": 26966748151908342,
        "Operation": "set",
        "Timestamp": "1557750388091.903076",
        "TenantClass": 0,
        "Source": "Client.java:1032",
        "ThreadID": 41,
        "ThreadName": "",
        "EventID": "A947566884C937E1",
        "ProcessID": 2801
      },
      {
        "Cycles": 0,
        "Agent": "edu.brown.cs.systems.xtrace.logging.BaggageWrappers",
        "ProcessName": "Read",
        "TaskID": "C6628A92101359C2",
        "ParentEventID": [
          "A947566884C937E1"
        ],
        "Label": "Forking current baggage with Baggage.fork()",
        "Title": "X-Trace Task",
        "Host": "pinky19.mpi-sws.org",
        "HRT": 26966748151915923,
        "Operation": "fork",
        "Timestamp": "1557750388091.910645",
        "TenantClass": 0,
        "Source": "Client.java:1043",
        "ThreadID": 41,
        "ThreadName": "",
        "EventID": "D17EAD316A54C02C",
        "ProcessID": 2801
      },
      {
        "Cycles": 0,
        "Agent": "Execution-CPU",
        "ProcessName": "Read",
        "TaskID": "C6628A92101359C2",
        "ParentEventID": [
          "50C07010D0FA4EBA"
        ],
        "Label": "set",
        "Title": "X-Trace Task",
        "Host": "pinky19.mpi-sws.org",
        "HRT": 26966748151989299,
        "Operation": "set",
        "Timestamp": "1557750388091.984131",
        "TenantClass": 0,
        "Source": "Client.java:1104",
        "ThreadID": 1,
        "ThreadName": "",
        "EventID": "AE9F68C8F650C696",
        "ProcessID": 2801
      },
      {
        "Cycles": 0,
        "Agent": "Execution-CPU",
        "ProcessName": "Read",
        "TaskID": "C6628A92101359C2",
        "ParentEventID": [
          "D17EAD316A54C02C"
        ],
        "Label": "unset",
        "Title": "X-Trace Task",
        "Host": "pinky19.mpi-sws.org",
        "Duration": "51667",
        "HRT": 26966748151968042,
        "Operation": "unset",
        "Timestamp": "1557750388091.962891",
        "TenantClass": 0,
        "Source": "Client.java:1062",
        "ThreadID": 41,
        "ThreadName": "",
        "EventID": "50C07010D0FA4EBA",
        "ProcessID": 2801
      },
      {
        "Cycles": 0,
        "Agent": "Execution-CPU",
        "ProcessName": "Name",
        "TaskID": "C6628A92101359C2",
        "ParentEventID": [
          "D17EAD316A54C02C"
        ],
        "Label": "set",
        "Title": "X-Trace Task",
        "Host": "pinky19.mpi-sws.org",
        "HRT": 26966748152038860,
        "Operation": "set",
        "Timestamp": "1557750388092.061035",
        "TenantClass": 0,
        "Source": "Server.java:1840",
        "ThreadID": 48,
        "ThreadName": "",
        "EventID": "8F0383C3C9728345",
        "BaggageBytes": "[[248 5] [240 0] [0 198 98 138 146 16 19 89 194] [240 1] [0 209 126 173 49 106 84 192 44] [240 3] [0 2]]",
        "ProcessID": 2171
      },
      {
        "Cycles": 0,
        "Agent": "edu.brown.cs.systems.xtrace.logging.BaggageWrappers",
        "ProcessName": "Name",
        "TaskID": "C6628A92101359C2",
        "ParentEventID": [
          "8F0383C3C9728345"
        ],
        "Label": "Forking current baggage with Baggage.fork()",
        "Title": "X-Trace Task",
        "Host": "pinky19.mpi-sws.org",
        "HRT": 26966748152068705,
        "Operation": "fork",
        "Timestamp": "1557750388092.090820",
        "TenantClass": 0,
        "Source": "Server.java:550",
        "ThreadID": 48,
        "ThreadName": "",
        "EventID": "C2917C758E1A68E0",
        "BaggageBytes": "[[248 5] [240 0] [0 198 98 138 146 16 19 89 194] [240 1] [0 143 3 131 195 201 114 131 69] [240 3] [0 2]]",
        "ProcessID": 2171
      },
      {
        "Cycles": 0,
        "Agent": "Execution-CPU",
        "ProcessName": "Name",
        "TaskID": "C6628A92101359C2",
        "ParentEventID": [
          "C2917C758E1A68E0"
        ],
        "Label": "unset",
        "Title": "X-Trace Task",
        "Host": "pinky19.mpi-sws.org",
        "Duration": "24416",
        "HRT": 26966748152089027,
        "Operation": "unset",
        "Timestamp": "1557750388092.111084",
        "TenantClass": 0,
        "Source": "Server.java:1828",
        "ThreadID": 48,
        "ThreadName": "",
        "EventID": "D189637BE9DD7922",
        "BaggageBytes": "[[248 5] [240 0] [0 198 98 138 146 16 19 89 194] [240 1] [0 194 145 124 117 142 26 104 224] [240 3] [0 2]]",
        "ProcessID": 2171
      },
      {
        "Cycles": 0,
        "Agent": "org.apache.hadoop.ipc.Server",
        "ProcessName": "Name",
        "TaskID": "C6628A92101359C2",
        "ParentEventID": [
          "18725628BA7251CD"
        ],
        "Label": "getBlockLocations in org.apache.hadoop.hdfs.protocol.ClientProtocol",
        "Title": "X-Trace Task",
        "Host": "pinky19.mpi-sws.org",
        "HRT": 26966748152132503,
        "Timestamp": "1557750388092.154541",
        "TenantClass": 0,
        "Source": "ProtobufRpcEngine.java:601",
        "ThreadID": 59,
        "ThreadName": "",
        "EventID": "EA8C79B1E6725844",
        "BaggageBytes": "[[248 5] [240 0] [0 198 98 138 146 16 19 89 194] [240 1] [0 24 114 86 40 186 114 81 205] [240 3] [0 2]]",
        "ProcessID": 2171
      },
      {
        "Cycles": 0,
        "Agent": "org.apache.hadoop.hdfs.server.namenode.FSNamesystem.audit",
        "ProcessName": "Name",
        "TaskID": "C6628A92101359C2",
        "ParentEventID": [
          "EA8C79B1E6725844"
        ],
        "Label": "allowed=true\tugi=plascas (auth:SIMPLE)\tip=/139.19.171.63\tcmd=open\tsrc=/ds/Tagrc1OH7bKELh6j\tdst=null\tperm=null\tproto=rpc",
        "Title": "X-Trace Task",
        "Host": "pinky19.mpi-sws.org",
        "HRT": 26966748152178546,
        "Timestamp": "1557750388092.200684",
        "TenantClass": 0,
        "Source": "FSNamesystem.java:8313",
        "ThreadID": 59,
        "ThreadName": "",
        "EventID": "EE248AF388E2CB53",
        "BaggageBytes": "[[248 5] [240 0] [0 198 98 138 146 16 19 89 194] [240 1] [0 234 140 121 177 230 114 88 68] [240 3] [0 2]]",
        "ProcessID": 2171
      },
      {
        "Cycles": 0,
        "Agent": "Execution-CPU",
        "ProcessName": "Name",
        "TaskID": "C6628A92101359C2",
        "ParentEventID": [
          "C2917C758E1A68E0"
        ],
        "Label": "set",
        "Title": "X-Trace Task",
        "Host": "pinky19.mpi-sws.org",
        "HRT": 26966748152098046,
        "Operation": "set",
        "Timestamp": "1557750388092.120117",
        "TenantClass": 0,
        "Source": "Server.java:2071",
        "ThreadID": 59,
        "ThreadName": "",
        "EventID": "18725628BA7251CD",
        "BaggageBytes": "[[248 5] [240 0] [0 198 98 138 146 16 19 89 194] [240 1] [0 194 145 124 117 142 26 104 224] [240 3] [0 2]]",
        "ProcessID": 2171
      },
      {
        "Cycles": 0,
        "Agent": "edu.brown.cs.systems.xtrace.logging.BaggageWrappers",
        "ProcessName": "Name",
        "TaskID": "C6628A92101359C2",
        "ParentEventID": [
          "EE248AF388E2CB53"
        ],
        "Label": "Forking current baggage with Baggage.fork()",
        "Title": "X-Trace Task",
        "Host": "pinky19.mpi-sws.org",
        "HRT": 26966748152227846,
        "Operation": "fork",
        "Timestamp": "1557750388092.250000",
        "TenantClass": 0,
        "Source": "Server.java:2398",
        "ThreadID": 59,
        "ThreadName": "",
        "EventID": "85D3A399314A81CD",
        "BaggageBytes": "[[248 5] [240 0] [0 198 98 138 146 16 19 89 194] [240 1] [0 238 36 138 243 136 226 203 83] [240 3] [0 2]]",
        "ProcessID": 2171
      },
      {
        "Cycles": 0,
        "Agent": "Execution-CPU",
        "ProcessName": "Read",
        "TaskID": "C6628A92101359C2",
        "ParentEventID": [
          "85D3A399314A81CD"
        ],
        "Label": "set",
        "Title": "X-Trace Task",
        "Host": "pinky19.mpi-sws.org",
        "HRT": 26966748152405339,
        "Operation": "set",
        "Timestamp": "1557750388092.400146",
        "TenantClass": 0,
        "Source": "Client.java:302",
        "ThreadID": 40,
        "ThreadName": "",
        "EventID": "F1F9D919BBDAE983",
        "ProcessID": 2801
      },
      {
        "Cycles": 0,
        "Agent": "Execution-CPU",
        "ProcessName": "Name",
        "TaskID": "C6628A92101359C2",
        "ParentEventID": [
          "85D3A399314A81CD"
        ],
        "Label": "unset",
        "Title": "X-Trace Task",
        "Host": "pinky19.mpi-sws.org",
        "Duration": "210504",
        "HRT": 26966748152331099,
        "Operation": "unset",
        "Timestamp": "1557750388092.353271",
        "TenantClass": 0,
        "Source": "Server.java:1058",
        "ThreadID": 59,
        "ThreadName": "",
        "EventID": "56165AB6EA1B851D",
        "BaggageBytes": "[[248 5] [240 0] [0 198 98 138 146 16 19 89 194] [240 1] [0 133 211 163 153 49 74 129 205] [240 3] [0 2]]",
        "ProcessID": 2171
      },
      {
        "Cycles": 0,
        "Agent": "Execution-CPU",
        "ProcessName": "Read",
        "TaskID": "C6628A92101359C2",
        "ParentEventID": [
          "F1F9D919BBDAE983"
        ],
        "Label": "unset",
        "Title": "X-Trace Task",
        "Host": "pinky19.mpi-sws.org",
        "Duration": "5082",
        "HRT": 26966748152426360,
        "Operation": "unset",
        "Timestamp": "1557750388092.421143",
        "TenantClass": 0,
        "Source": "Client.java:1168",
        "ThreadID": 40,
        "ThreadName": "",
        "EventID": "82EB991577E87D0A",
        "ProcessID": 2801
      },
      {
        "Cycles": 0,
        "Agent": "Execution-Sleep",
        "ProcessName": "Read",
        "TaskID": "C6628A92101359C2",
        "ParentEventID": [
          "AE9F68C8F650C696"
        ],
        "Label": "waited",
        "Title": "X-Trace Task",
        "Host": "pinky19.mpi-sws.org",
        "Duration": "444809",
        "HRT": 26966748152443552,
        "Operation": "waited",
        "Timestamp": "1557750388092.438232",
        "TenantClass": 0,
        "Source": "Client.java:1537",
        "ThreadID": 1,
        "ThreadName": "",
        "EventID": "49A7F551F58D14EF",
        "ProcessID": 2801
      },
      {
        "Cycles": 0,
        "Agent": "edu.brown.cs.systems.xtrace.logging.BaggageWrappers",
        "ProcessName": "Read",
        "TaskID": "C6628A92101359C2",
        "ParentEventID": [
          "49A7F551F58D14EF",
          "82EB991577E87D0A"
        ],
        "Label": "Merged current baggage with other baggage",
        "Title": "X-Trace Task",
        "Host": "pinky19.mpi-sws.org",
        "HRT": 26966748152472690,
        "Operation": "join",
        "Timestamp": "1557750388092.467529",
        "TenantClass": 0,
        "Source": "Client.java:1545",
        "ThreadID": 1,
        "ThreadName": "",
        "EventID": "5B3FB71FA6CDA613",
        "ProcessID": 2801
      },
      {
        "Cycles": 0,
        "Agent": "Execution-Sleep",
        "ProcessName": "Read",
        "TaskID": "C6628A92101359C2",
        "ParentEventID": [
          "8A48711F5FFA9008"
        ],
        "Label": "waited",
        "Title": "X-Trace Task",
        "Host": "pinky19.mpi-sws.org",
        "Duration": "4464",
        "HRT": 26966748152603964,
        "Operation": "waited",
        "Timestamp": "1557750388092.598633",
        "TenantClass": 0,
        "Source": "SocketIOWithTimeout.java:335",
        "ThreadID": 1,
        "ThreadName": "",
        "EventID": "B6F4F4EBDAC968E3",
        "ProcessID": 2801
      },
      {
        "Cycles": 0,
        "Agent": "org.apache.hadoop.ipc.ProtobufRpcEngine",
        "ProcessName": "Read",
        "TaskID": "C6628A92101359C2",
        "ParentEventID": [
          "5B3FB71FA6CDA613"
        ],
        "Label": "org.apache.hadoop.hdfs.protocol.ClientProtocol.getBlockLocations completed",
        "Title": "X-Trace Task",
        "Host": "pinky19.mpi-sws.org",
        "HRT": 26966748152511357,
        "Timestamp": "1557750388092.506104",
        "TenantClass": 0,
        "Source": "ProtobufRpcEngine.java:275",
        "ThreadID": 1,
        "ThreadName": "",
        "EventID": "8A48711F5FFA9008",
        "ProcessID": 2801
      },
      {
        "Cycles": 0,
        "Agent": "edu.brown.cs.systems.xtrace.logging.BaggageWrappers",
        "ProcessName": "Read",
        "TaskID": "C6628A92101359C2",
        "ParentEventID": [
          "B6F4F4EBDAC968E3"
        ],
        "Label": "Forking current baggage with Baggage.fork()",
        "Title": "X-Trace Task",
        "Host": "pinky19.mpi-sws.org",
        "HRT": 26966748152639325,
        "Operation": "fork",
        "Timestamp": "1557750388092.634033",
        "TenantClass": 0,
        "Source": "DataTransferProtoUtil.java:94",
        "ThreadID": 1,
        "ThreadName": "",
        "EventID": "6A924AC45F8BD61B",
        "ProcessID": 2801
      },
      {
        "Cycles": 0,
        "Agent": "edu.brown.cs.systems.xtrace.logging.XTraceInit",
        "ProcessName": "Data",
        "TaskID": "C6628A92101359C2",
        "ParentEventID": [
          "6E902D76A04A4E4A"
        ],
        "Label": "Thread.setName: DataXceiver for client DFSClient_NONMAPREDUCE_310321604_1 at /139.19.171.63:58690 [Sending block BP-1633380353-139.19.171.63-1554193446451:blk_1073756099_15275]",
        "Title": "X-Trace Task",
        "Host": "pinky19.mpi-sws.org",
        "HRT": 26966748152821070,
        "Timestamp": "1557750388092.819336",
        "TenantClass": 0,
        "Source": "DataXceiver.java:168",
        "ThreadID": 38513,
        "ThreadName": "",
        "EventID": "0A9228AFE91495E0",
        "BaggageBytes": "[[248 5] [240 0] [0 198 98 138 146 16 19 89 194] [240 1] [0 110 144 45 118 160 74 78 74] [240 3] [0 2]]",
        "ProcessID": 2319
      },
      {
        "Cycles": 0,
        "Agent": "Execution-CPU",
        "ProcessName": "Data",
        "TaskID": "C6628A92101359C2",
        "ParentEventID": [
          "6A924AC45F8BD61B"
        ],
        "Label": "set",
        "Title": "X-Trace Task",
        "Host": "pinky19.mpi-sws.org",
        "HRT": 26966748152784799,
        "Operation": "set",
        "Timestamp": "1557750388092.782959",
        "TenantClass": 0,
        "Source": "Receiver.java:117",
        "ThreadID": 38513,
        "ThreadName": "",
        "EventID": "6E902D76A04A4E4A",
        "BaggageBytes": "[[248 5] [240 0] [0 198 98 138 146 16 19 89 194] [240 1] [0 106 146 74 196 95 139 214 27] [240 3] [0 2]]",
        "ProcessID": 2319
      },
      {
        "Cycles": 0,
        "Agent": "edu.brown.cs.systems.xtrace.logging.BaggageWrappers",
        "ProcessName": "Data",
        "TaskID": "C6628A92101359C2",
        "ParentEventID": [
          "0A9228AFE91495E0"
        ],
        "Label": "Forking current baggage with Baggage.fork()",
        "Title": "X-Trace Task",
        "Host": "pinky19.mpi-sws.org",
        "HRT": 26966748152902095,
        "Operation": "fork",
        "Timestamp": "1557750388092.900146",
        "TenantClass": 0,
        "Source": "DataXceiver.java:1257",
        "ThreadID": 38513,
        "ThreadName": "",
        "EventID": "FCBDB92408026EBA",
        "BaggageBytes": "[[248 5] [240 0] [0 198 98 138 146 16 19 89 194] [240 1] [0 10 146 40 175 233 20 149 224] [240 3] [0 2]]",
        "ProcessID": 2319
      },
      {
        "Cycles": 0,
        "Agent": "Execution-Sleep",
        "ProcessName": "Read",
        "TaskID": "C6628A92101359C2",
        "ParentEventID": [
          "6A924AC45F8BD61B"
        ],
        "Label": "waited",
        "Title": "X-Trace Task",
        "Host": "pinky19.mpi-sws.org",
        "Duration": "244564",
        "HRT": 26966748152964254,
        "Operation": "waited",
        "Timestamp": "1557750388092.958984",
        "TenantClass": 0,
        "Source": "SocketIOWithTimeout.java:335",
        "ThreadID": 1,
        "ThreadName": "",
        "EventID": "1DB1B24C98B2EE64",
        "ProcessID": 2801
      },
      {
        "Cycles": 0,
        "Agent": "edu.brown.cs.systems.xtrace.logging.BaggageWrappers",
        "ProcessName": "Data",
        "TaskID": "C6628A92101359C2",
        "ParentEventID": [
          "FCBDB92408026EBA"
        ],
        "Label": "Forking current baggage with Baggage.fork()",
        "Title": "X-Trace Task",
        "Host": "pinky19.mpi-sws.org",
        "HRT": 26966748152970218,
        "Operation": "fork",
        "Timestamp": "1557750388092.968506",
        "TenantClass": 0,
        "Source": "PacketHeader.java:95",
        "ThreadID": 38513,
        "ThreadName": "",
        "EventID": "1F6CDD90EA8DDF3B",
        "BaggageBytes": "[[248 5] [240 0] [0 198 98 138 146 16 19 89 194] [240 1] [0 252 189 185 36 8 2 110 186] [240 3] [0 2]]",
        "ProcessID": 2319
      },
      {
        "Cycles": 0,
        "Agent": "Execution-Sleep",
        "ProcessName": "Data",
        "TaskID": "C6628A92101359C2",
        "ParentEventID": [
          "1F6CDD90EA8DDF3B"
        ],
        "Label": "waited",
        "Title": "X-Trace Task",
        "Host": "pinky19.mpi-sws.org",
        "Duration": "4637",
        "HRT": 26966748153035562,
        "Operation": "waited",
        "Timestamp": "1557750388093.033691",
        "TenantClass": 0,
        "Source": "SocketIOWithTimeout.java:335",
        "ThreadID": 38513,
        "ThreadName": "",
        "EventID": "79C97CF720659168",
        "BaggageBytes": "[[248 5] [240 0] [0 198 98 138 146 16 19 89 194] [240 1] [0 31 108 221 144 234 141 223 59] [240 3] [0 2]]",
        "ProcessID": 2319
      },
      {
        "Cycles": 0,
        "Agent": "edu.brown.cs.systems.xtrace.logging.BaggageWrappers",
        "ProcessName": "Data",
        "TaskID": "C6628A92101359C2",
        "ParentEventID": [
          "79C97CF720659168"
        ],
        "Label": "Forking current baggage with Baggage.fork()",
        "Title": "X-Trace Task",
        "Host": "pinky19.mpi-sws.org",
        "HRT": 26966748153110291,
        "Operation": "fork",
        "Timestamp": "1557750388093.108398",
        "TenantClass": 0,
        "Source": "PacketHeader.java:95",
        "ThreadID": 38513,
        "ThreadName": "",
        "EventID": "D3F7BB8A6CF72D40",
        "BaggageBytes": "[[248 5] [240 0] [0 198 98 138 146 16 19 89 194] [240 1] [0 121 201 124 247 32 101 145 104] [240 3] [0 2]]",
        "ProcessID": 2319
      },
      {
        "Cycles": 0,
        "Agent": "edu.brown.cs.systems.xtrace.logging.BaggageWrappers",
        "ProcessName": "Read",
        "TaskID": "C6628A92101359C2",
        "ParentEventID": [
          "FCBDB92408026EBA",
          "1DB1B24C98B2EE64"
        ],
        "Label": "Merged current baggage with other baggage",
        "Title": "X-Trace Task",
        "Host": "pinky19.mpi-sws.org",
        "HRT": 26966748153028326,
        "Operation": "join",
        "Timestamp": "1557750388093.022949",
        "TenantClass": 0,
        "Source": "RemoteBlockReader2.java:429",
        "ThreadID": 1,
        "ThreadName": "",
        "EventID": "E206ABE345F153F2",
        "ProcessID": 2801
      },
      {
        "Cycles": 0,
        "Agent": "edu.brown.cs.systems.xtrace.logging.BaggageWrappers",
        "ProcessName": "Read",
        "TaskID": "C6628A92101359C2",
        "ParentEventID": [
          "1F6CDD90EA8DDF3B",
          "E206ABE345F153F2"
        ],
        "Label": "Merged current baggage with other baggage",
        "Title": "X-Trace Task",
        "Host": "pinky19.mpi-sws.org",
        "HRT": 26966748153148205,
        "Operation": "join",
        "Timestamp": "1557750388093.142822",
        "TenantClass": 0,
        "Source": "PacketHeader.java:168",
        "ThreadID": 1,
        "ThreadName": "",
        "EventID": "80D1DC14BE8A3B8C",
        "ProcessID": 2801
      },
      {
        "Cycles": 0,
        "Agent": "edu.brown.cs.systems.xtrace.logging.BaggageWrappers",
        "ProcessName": "Read",
        "TaskID": "C6628A92101359C2",
        "ParentEventID": [
          "2DF75742652E3C48"
        ],
        "Label": "Forking current baggage with Baggage.fork()",
        "Title": "X-Trace Task",
        "Host": "pinky19.mpi-sws.org",
        "HRT": 26966748153261574,
        "Operation": "fork",
        "Timestamp": "1557750388093.256348",
        "TenantClass": 0,
        "Source": "RemoteBlockReader2.java:361",
        "ThreadID": 1,
        "ThreadName": "",
        "EventID": "84D39970FAB5DCF5",
        "ProcessID": 2801
      },
      {
        "Cycles": 0,
        "Agent": "edu.brown.cs.systems.xtrace.logging.BaggageWrappers",
        "ProcessName": "Read",
        "TaskID": "C6628A92101359C2",
        "ParentEventID": [
          "D3F7BB8A6CF72D40",
          "80D1DC14BE8A3B8C"
        ],
        "Label": "Merged current baggage with other baggage",
        "Title": "X-Trace Task",
        "Host": "pinky19.mpi-sws.org",
        "HRT": 26966748153252796,
        "Operation": "join",
        "Timestamp": "1557750388093.247559",
        "TenantClass": 0,
        "Source": "PacketHeader.java:168",
        "ThreadID": 1,
        "ThreadName": "",
        "EventID": "2DF75742652E3C48",
        "ProcessID": 2801
      },
      {
        "Cycles": 0,
        "Agent": "Execution-Sleep",
        "ProcessName": "Data",
        "TaskID": "C6628A92101359C2",
        "ParentEventID": [
          "D3F7BB8A6CF72D40"
        ],
        "Label": "waited",
        "Title": "X-Trace Task",
        "Host": "pinky19.mpi-sws.org",
        "Duration": "102457",
        "HRT": 26966748153302108,
        "Operation": "waited",
        "Timestamp": "1557750388093.300293",
        "TenantClass": 0,
        "Source": "SocketIOWithTimeout.java:335",
        "ThreadID": 38513,
        "ThreadName": "",
        "EventID": "B4606BB19B21B8E3",
        "BaggageBytes": "[[248 5] [240 0] [0 198 98 138 146 16 19 89 194] [240 1] [0 211 247 187 138 108 247 45 64] [240 3] [0 2]]",
        "ProcessID": 2319
      },
      {
        "Cycles": 0,
        "Agent": "edu.brown.cs.systems.xtrace.logging.BaggageWrappers",
        "ProcessName": "Read",
        "TaskID": "C6628A92101359C2",
        "ParentEventID": [
          "84D39970FAB5DCF5"
        ],
        "Label": "Forking current baggage with Baggage.fork()",
        "Title": "X-Trace Task",
        "Host": "pinky19.mpi-sws.org",
        "HRT": 26966748153315339,
        "Operation": "fork",
        "Timestamp": "1557750388093.310059",
        "TenantClass": 0,
        "Source": "DataTransferProtoUtil.java:94",
        "ThreadID": 1,
        "ThreadName": "",
        "EventID": "835FAED0C817AF79",
        "ProcessID": 2801
      },
      {
        "Cycles": 0,
        "Agent": "edu.brown.cs.systems.xtrace.logging.BaggageWrappers",
        "ProcessName": "Data",
        "TaskID": "C6628A92101359C2",
        "ParentEventID": [
          "84D39970FAB5DCF5",
          "B4606BB19B21B8E3"
        ],
        "Label": "Merged current baggage with other baggage",
        "Title": "X-Trace Task",
        "Host": "pinky19.mpi-sws.org",
        "HRT": 26966748153370056,
        "Operation": "join",
        "Timestamp": "1557750388093.368164",
        "TenantClass": 0,
        "Source": "DataXceiver.java:574",
        "ThreadID": 38513,
        "ThreadName": "",
        "EventID": "939F58B9F76CAF1C",
        "BaggageBytes": "[[248 5] [240 0] [0 198 98 138 146 16 19 89 194] [240 1] [0 132 211 153 112 250 181 220 245] [0 180 96 107 177 155 33 184 227] [240 3] [0 2]]",
        "ProcessID": 2319
      },
      {
        "Cycles": 0,
        "Agent": "Execution-CPU",
        "ProcessName": "Data",
        "TaskID": "C6628A92101359C2",
        "ParentEventID": [
          "835FAED0C817AF79"
        ],
        "Label": "set",
        "Title": "X-Trace Task",
        "Host": "pinky19.mpi-sws.org",
        "HRT": 26966748153444368,
        "Operation": "set",
        "Timestamp": "1557750388093.442627",
        "TenantClass": 0,
        "Source": "Receiver.java:117",
        "ThreadID": 38513,
        "ThreadName": "",
        "EventID": "A8390C7E4225C8FE",
        "BaggageBytes": "[[248 5] [240 0] [0 198 98 138 146 16 19 89 194] [240 1] [0 131 95 174 208 200 23 175 121] [240 3] [0 2]]",
        "ProcessID": 2319
      },
      {
        "Cycles": 0,
        "Agent": "Execution-CPU",
        "ProcessName": "Data",
        "TaskID": "C6628A92101359C2",
        "ParentEventID": [
          "939F58B9F76CAF1C"
        ],
        "Label": "unset",
        "Title": "X-Trace Task",
        "Host": "pinky19.mpi-sws.org",
        "Duration": "581676",
        "HRT": 26966748153391859,
        "Operation": "unset",
        "Timestamp": "1557750388093.390137",
        "TenantClass": 0,
        "Source": "DataXceiver.java:261",
        "ThreadID": 38513,
        "ThreadName": "",
        "EventID": "F686C51A0CAD840B",
        "BaggageBytes": "[[248 5] [240 0] [0 198 98 138 146 16 19 89 194] [240 1] [0 147 159 88 185 247 108 175 28] [240 3] [0 2]]",
        "ProcessID": 2319
      },
      {
        "Cycles": 0,
        "Agent": "edu.brown.cs.systems.xtrace.logging.XTraceInit",
        "ProcessName": "Data",
        "TaskID": "C6628A92101359C2",
        "ParentEventID": [
          "A8390C7E4225C8FE"
        ],
        "Label": "Thread.setName: DataXceiver for client DFSClient_NONMAPREDUCE_310321604_1 at /139.19.171.63:58690 [Sending block BP-1633380353-139.19.171.63-1554193446451:blk_1073756099_15275]",
        "Title": "X-Trace Task",
        "Host": "pinky19.mpi-sws.org",
        "HRT": 26966748153471191,
        "Timestamp": "1557750388093.469482",
        "TenantClass": 0,
        "Source": "DataXceiver.java:168",
        "ThreadID": 38513,
        "ThreadName": "",
        "EventID": "171C79FBFF325BC1",
        "BaggageBytes": "[[248 5] [240 0] [0 198 98 138 146 16 19 89 194] [240 1] [0 168 57 12 126 66 37 200 254] [240 3] [0 2]]",
        "ProcessID": 2319
      },
      {
        "Cycles": 0,
        "Agent": "edu.brown.cs.systems.xtrace.logging.BaggageWrappers",
        "ProcessName": "Data",
        "TaskID": "C6628A92101359C2",
        "ParentEventID": [
          "171C79FBFF325BC1"
        ],
        "Label": "Forking current baggage with Baggage.fork()",
        "Title": "X-Trace Task",
        "Host": "pinky19.mpi-sws.org",
        "HRT": 26966748153533630,
        "Operation": "fork",
        "Timestamp": "1557750388093.531738",
        "TenantClass": 0,
        "Source": "DataXceiver.java:1257",
        "ThreadID": 38513,
        "ThreadName": "",
        "EventID": "E6B81D13D1CADAE9",
        "BaggageBytes": "[[248 5] [240 0] [0 198 98 138 146 16 19 89 194] [240 1] [0 23 28 121 251 255 50 91 193] [240 3] [0 2]]",
        "ProcessID": 2319
      },
      {
        "Cycles": 0,
        "Agent": "edu.brown.cs.systems.xtrace.logging.BaggageWrappers",
        "ProcessName": "Data",
        "TaskID": "C6628A92101359C2",
        "ParentEventID": [
          "E6B81D13D1CADAE9"
        ],
        "Label": "Forking current baggage with Baggage.fork()",
        "Title": "X-Trace Task",
        "Host": "pinky19.mpi-sws.org",
        "HRT": 26966748153590629,
        "Operation": "fork",
        "Timestamp": "1557750388093.588867",
        "TenantClass": 0,
        "Source": "PacketHeader.java:95",
        "ThreadID": 38513,
        "ThreadName": "",
        "EventID": "D1754C6FA1FF47E1",
        "BaggageBytes": "[[248 5] [240 0] [0 198 98 138 146 16 19 89 194] [240 1] [0 230 184 29 19 209 202 218 233] [240 3] [0 2]]",
        "ProcessID": 2319
      },
      {
        "Cycles": 0,
        "Agent": "Execution-Sleep",
        "ProcessName": "Read",
        "TaskID": "C6628A92101359C2",
        "ParentEventID": [
          "835FAED0C817AF79"
        ],
        "Label": "waited",
        "Title": "X-Trace Task",
        "Host": "pinky19.mpi-sws.org",
        "Duration": "195186",
        "HRT": 26966748153589339,
        "Operation": "waited",
        "Timestamp": "1557750388093.583984",
        "TenantClass": 0,
        "Source": "SocketIOWithTimeout.java:335",
        "ThreadID": 1,
        "ThreadName": "",
        "EventID": "FF16EB91E33737AC",
        "ProcessID": 2801
      },
      {
        "Cycles": 0,
        "Agent": "edu.brown.cs.systems.xtrace.logging.BaggageWrappers",
        "ProcessName": "Read",
        "TaskID": "C6628A92101359C2",
        "ParentEventID": [
          "FF16EB91E33737AC",
          "E6B81D13D1CADAE9"
        ],
        "Label": "Merged current baggage with other baggage",
        "Title": "X-Trace Task",
        "Host": "pinky19.mpi-sws.org",
        "HRT": 26966748153648669,
        "Operation": "join",
        "Timestamp": "1557750388093.643311",
        "TenantClass": 0,
        "Source": "RemoteBlockReader2.java:429",
        "ThreadID": 1,
        "ThreadName": "",
        "EventID": "4C3995EB21722A79",
        "ProcessID": 2801
      },
      {
        "Cycles": 0,
        "Agent": "Execution-Sleep",
        "ProcessName": "Data",
        "TaskID": "C6628A92101359C2",
        "ParentEventID": [
          "D1754C6FA1FF47E1"
        ],
        "Label": "waited",
        "Title": "X-Trace Task",
        "Host": "pinky19.mpi-sws.org",
        "Duration": "3981",
        "HRT": 26966748153648261,
        "Operation": "waited",
        "Timestamp": "1557750388093.646484",
        "TenantClass": 0,
        "Source": "SocketIOWithTimeout.java:335",
        "ThreadID": 38513,
        "ThreadName": "",
        "EventID": "7755A37FD56020CB",
        "BaggageBytes": "[[248 5] [240 0] [0 198 98 138 146 16 19 89 194] [240 1] [0 209 117 76 111 161 255 71 225] [240 3] [0 2]]",
        "ProcessID": 2319
      },
      {
        "Cycles": 0,
        "Agent": "edu.brown.cs.systems.xtrace.logging.BaggageWrappers",
        "ProcessName": "Data",
        "TaskID": "C6628A92101359C2",
        "ParentEventID": [
          "7755A37FD56020CB"
        ],
        "Label": "Forking current baggage with Baggage.fork()",
        "Title": "X-Trace Task",
        "Host": "pinky19.mpi-sws.org",
        "HRT": 26966748153709607,
        "Operation": "fork",
        "Timestamp": "1557750388093.707764",
        "TenantClass": 0,
        "Source": "PacketHeader.java:95",
        "ThreadID": 38513,
        "ThreadName": "",
        "EventID": "321C3061131F9F70",
        "BaggageBytes": "[[248 5] [240 0] [0 198 98 138 146 16 19 89 194] [240 1] [0 119 85 163 127 213 96 32 203] [240 3] [0 2]]",
        "ProcessID": 2319
      },
      {
        "Cycles": 0,
        "Agent": "Execution-Sleep",
        "ProcessName": "Data",
        "TaskID": "C6628A92101359C2",
        "ParentEventID": [
          "321C3061131F9F70"
        ],
        "Label": "waited",
        "Title": "X-Trace Task",
        "Host": "pinky19.mpi-sws.org",
        "Duration": "3978",
        "HRT": 26966748153764106,
        "Operation": "waited",
        "Timestamp": "1557750388093.762207",
        "TenantClass": 0,
        "Source": "SocketIOWithTimeout.java:335",
        "ThreadID": 38513,
        "ThreadName": "",
        "EventID": "14F849B1DB75FFCF",
        "BaggageBytes": "[[248 5] [240 0] [0 198 98 138 146 16 19 89 194] [240 1] [0 50 28 48 97 19 31 159 112] [240 3] [0 2]]",
        "ProcessID": 2319
      },
      {
        "Cycles": 0,
        "Agent": "edu.brown.cs.systems.xtrace.logging.BaggageWrappers",
        "ProcessName": "Read",
        "TaskID": "C6628A92101359C2",
        "ParentEventID": [
          "4C3995EB21722A79",
          "D1754C6FA1FF47E1"
        ],
        "Label": "Merged current baggage with other baggage",
        "Title": "X-Trace Task",
        "Host": "pinky19.mpi-sws.org",
        "HRT": 26966748153744864,
        "Operation": "join",
        "Timestamp": "1557750388093.739502",
        "TenantClass": 0,
        "Source": "PacketHeader.java:168",
        "ThreadID": 1,
        "ThreadName": "",
        "EventID": "1805238F5A929348",
        "ProcessID": 2801
      },
      {
        "Cycles": 0,
        "Agent": "edu.brown.cs.systems.xtrace.logging.BaggageWrappers",
        "ProcessName": "Data",
        "TaskID": "C6628A92101359C2",
        "ParentEventID": [
          "14F849B1DB75FFCF"
        ],
        "Label": "Forking current baggage with Baggage.fork()",
        "Title": "X-Trace Task",
        "Host": "pinky19.mpi-sws.org",
        "HRT": 26966748153836971,
        "Operation": "fork",
        "Timestamp": "1557750388093.835205",
        "TenantClass": 0,
        "Source": "PacketHeader.java:95",
        "ThreadID": 38513,
        "ThreadName": "",
        "EventID": "434DB04AA2B00812",
        "BaggageBytes": "[[248 5] [240 0] [0 198 98 138 146 16 19 89 194] [240 1] [0 20 248 73 177 219 117 255 207] [240 3] [0 2]]",
        "ProcessID": 2319
      },
      {
        "Cycles": 0,
        "Agent": "Execution-CPU",
        "ProcessName": "Data",
        "TaskID": "C6628A92101359C2",
        "ParentEventID": [
          "434DB04AA2B00812"
        ],
        "Label": "unset",
        "Title": "X-Trace Task",
        "Host": "pinky19.mpi-sws.org",
        "Duration": "487458",
        "HRT": 26966748153951096,
        "Operation": "unset",
        "Timestamp": "1557750388093.949219",
        "TenantClass": 0,
        "Source": "DataXceiver.java:261",
        "ThreadID": 38513,
        "ThreadName": "",
        "EventID": "2CD746E81D8054EF",
        "BaggageBytes": "[[248 5] [240 0] [0 198 98 138 146 16 19 89 194] [240 1] [0 67 77 176 74 162 176 8 18] [240 3] [0 2]]",
        "ProcessID": 2319
      },
      {
        "Cycles": 0,
        "Agent": "edu.brown.cs.systems.retro.benchmarks.hdfs_client.Reader",
        "ProcessName": "Read",
        "TaskID": "C6628A92101359C2",
        "ParentEventID": [
          "0"
        ],
        "Label": "Reading file",
        "Title": "X-Trace Task",
        "Host": "pinky19.mpi-sws.org",
        "HRT": 26966748151837002,
        "Timestamp": "1557750388091.831787",
        "TenantClass": 0,
        "ThreadID": 1,
        "ThreadName": "",
        "EventID": "45B4872812E271D4",
        "ProcessID": 2801,
        "Tag": [
          "reader_100kb",
          "Read Size: 102400"
        ]
      }
    ]
  }
]