[
  {
    "id": "6F13C363358E7928",
    "reports": [
      {
        "Cycles": 0,
        "Agent": "edu.brown.cs.systems.retro.benchmarks.hdfs_client.Reader",
        "ProcessName": "Read",
        "TaskID": "6F13C363358E7928",
        "ParentEventID": [
          "EDCBDC1C7D8B6C1F"
        ],
        "Label": "Reading file",
        "Title": "X-Trace Task",
        "Host": "pinky19.mpi-sws.org",
        "HRT": 26966735687649608,
        "Timestamp": "1557750375627.887451",
        "TenantClass": 0,
        "ThreadID": 1,
        "ThreadName": "",
        "EventID": "077F00160ED8FEE1",
        "ProcessID": 2801
      },
      {
        "Cycles": 0,
        "Agent": "Execution-CPU",
        "ProcessName": "Read",
        "TaskID": "6F13C363358E7928",
        "ParentEventID": [
          "687310B0015025FE"
        ],
        "Label": "set",
        "Title": "X-Trace Task",
        "Host": "pinky19.mpi-sws.org",
        "HRT": 26966735687724991,
        "Operation": "set",
        "Timestamp": "1557750375627.962646",
        "TenantClass": 0,
        "Source": "Client.java:1032",
        "ThreadID": 41,
        "ThreadName": "",
        "EventID": "492B567D4D944890",
        "ProcessID": 2801
      },
      {
        "Cycles": 0,
        "Agent": "org.apache.hadoop.ipc.ProtobufRpcEngine",
        "ProcessName": "Read",
        "TaskID": "6F13C363358E7928",
        "ParentEventID": [
          "077F00160ED8FEE1"
        ],
        "Label": "Invoking org.apache.hadoop.hdfs.protocol.ClientProtocol.getBlockLocations",
        "Title": "X-Trace Task",
        "Host": "pinky19.mpi-sws.org",
        "HRT": 26966735687678290,
        "Timestamp": "1557750375627.916016",
        "TenantClass": 0,
        "Source": "ProtobufRpcEngine.java:228",
        "ThreadID": 1,
        "ThreadName": "",
        "EventID": "1978D38D31FFF27D",
        "ProcessID": 2801
      },
      {
        "Cycles": 0,
        "Agent": "edu.brown.cs.systems.xtrace.logging.BaggageWrappers",
        "ProcessName": "Read",
        "TaskID": "6F13C363358E7928",
        "ParentEventID": [
          "492B567D4D944890"
        ],
        "Label": "Forking current baggage with Baggage.fork()",
        "Title": "X-Trace Task",
        "Host": "pinky19.mpi-sws.org",
        "HRT": 26966735687743929,
        "Operation": "fork",
        "Timestamp": "1557750375627.981689",
        "TenantClass": 0,
        "Source": "Client.java:1043",
        "ThreadID": 41,
        "ThreadName": "",
        "EventID": "0785A9E3B6270AAC",
        "ProcessID": 2801
      },
      {
        "Cycles": 0,
        "Agent": "Execution-CPU",
        "ProcessName": "Read",
        "TaskID": "6F13C363358E7928",
        "ParentEventID": [
          "1978D38D31FFF27D"
        ],
        "Label": "unset",
        "Title": "X-Trace Task",
        "Host": "pinky19.mpi-sws.org",
        "Duration": "25049614",
        "HRT": 26966735687698850,
        "Operation": "unset",
        "Timestamp": "1557750375627.936523",
        "TenantClass": 0,
        "Source": "Client.java:1027",
        "ThreadID": 1,
        "ThreadName": "",
        "EventID": "687310B0015025FE",
        "ProcessID": 2801
      },
      {
        "Cycles": 0,
        "Agent": "Execution-CPU",
        "ProcessName": "Read",
        "TaskID": "6F13C363358E7928",
        "ParentEventID": [
          "0785A9E3B6270AAC"
        ],
        "Label": "unset",
        "Title": "X-Trace Task",
        "Host": "pinky19.mpi-sws.org",
        "Duration": "79078",
        "HRT": 26966735687822338,
        "Operation": "unset",
        "Timestamp": "1557750375628.060059",
        "TenantClass": 0,
        "Source": "Client.java:1062",
        "ThreadID": 41,
        "ThreadName": "",
        "EventID": "A3BAF0E30EDC40EB",
        "ProcessID": 2801
      },
      {
        "Cycles": 0,
        "Agent": "Execution-CPU",
        "ProcessName": "Read",
        "TaskID": "6F13C363358E7928",
        "ParentEventID": [
          "A3BAF0E30EDC40EB"
        ],
        "Label": "set",
        "Title": "X-Trace Task",
        "Host": "pinky19.mpi-sws.org",
        "HRT": 26966735687846972,
        "Operation": "set",
        "Timestamp": "1557750375628.084717",
        "TenantClass": 0,
        "Source": "Client.java:1104",
        "ThreadID": 1,
        "ThreadName": "",
        "EventID": "00945B75F8284237",
        "ProcessID": 2801
      },
      {
        "Cycles": 0,
        "Agent": "Execution-CPU",
        "ProcessName": "Name",
        "TaskID": "6F13C363358E7928",
        "ParentEventID": [
          "0785A9E3B6270AAC"
        ],
        "Label": "set",
        "Title": "X-Trace Task",
        "Host": "pinky19.mpi-sws.org",
        "HRT": 26966735687897573,
        "Operation": "set",
        "Timestamp": "1557750375628.133301",
        "TenantClass": 0,
        "Source": "Server.java:1840",
        "ThreadID": 48,
        "ThreadName": "",
        "EventID": "2E664BF9A4FEF1B2",
        "BaggageBytes": "[[248 5] [240 0] [0 111 19 195 99 53 142 121 40] [240 1] [0 7 133 169 227 182 39 10 172] [240 3] [0 2]]",
        "ProcessID": 2171
      },
      {
        "Cycles": 0,
        "Agent": "Execution-CPU",
        "ProcessName": "Name",
        "TaskID": "6F13C363358E7928",
        "ParentEventID": [
          "8BF445D6254A0B36"
        ],
        "Label": "unset",
        "Title": "X-Trace Task",
        "Host": "pinky19.mpi-sws.org",
        "Duration": "25308",
        "HRT": 26966735687947999,
        "Operation": "unset",
        "Timestamp": "1557750375628.183594",
        "TenantClass": 0,
        "Source": "Server.java:1828",
        "ThreadID": 48,
        "ThreadName": "",
        "EventID": "D7AD9D07F07DDBB2",
        "BaggageBytes": "[[248 5] [240 0] [0 111 19 195 99 53 142 121 40] [240 1] [0 139 244 69 214 37 74 11 54] [240 3] [0 2]]",
        "ProcessID": 2171
      },
      {
        "Cycles": 0,
        "Agent": "edu.brown.cs.systems.xtrace.logging.BaggageWrappers",
        "ProcessName": "Name",
        "TaskID": "6F13C363358E7928",
        "ParentEventID": [
          "2E664BF9A4FEF1B2"
        ],
        "Label": "Forking current baggage with Baggage.fork()",
        "Title": "X-Trace Task",
        "Host": "pinky19.mpi-sws.org",
        "HRT": 26966735687926602,
        "Operation": "fork",
        "Timestamp": "1557750375628.162354",
        "TenantClass": 0,
        "Source": "Server.java:550",
        "ThreadID": 48,
        "ThreadName": "",
        "EventID": "8BF445D6254A0B36",
        "BaggageBytes": "[[248 5] [240 0] [0 111 19 195 99 53 142 121 40] [240 1] [0 46 102 75 249 164 254 241 178] [240 3] [0 2]]",
        "ProcessID": 2171
      },
      {
        "Cycles": 0,
        "Agent": "Execution-CPU",
        "ProcessName": "Name",
        "TaskID": "6F13C363358E7928",
        "ParentEventID": [
          "8BF445D6254A0B36"
        ],
        "Label": "set",
        "Title": "X-Trace Task",
        "Host": "pinky19.mpi-sws.org",
        "HRT": 26966735687958052,
        "Operation": "set",
        "Timestamp": "1557750375628.193604",
        "TenantClass": 0,
        "Source": "Server.java:2071",
        "ThreadID": 56,
        "ThreadName": "",
        "EventID": "49A36D428E328A39",
        "BaggageBytes": "[[248 5] [240 0] [0 111 19 195 99 53 142 121 40] [240 1] [0 139 244 69 214 37 74 11 54] [240 3] [0 2]]",
        "ProcessID": 2171
      },
      {
        "Cycles": 0,
        "Agent": "org.apache.hadoop.ipc.Server",
        "ProcessName": "Name",
        "TaskID": "6F13C363358E7928",
        "ParentEventID": [
          "49A36D428E328A39"
        ],
        "Label": "getBlockLocations in org.apache.hadoop.hdfs.protocol.ClientProtocol",
        "Title": "X-Trace Task",
        "Host": "pinky19.mpi-sws.org",
        "HRT": 26966735687999153,
        "Timestamp": "1557750375628.234863",
        "TenantClass": 0,
        "Source": "ProtobufRpcEngine.java:601",
        "ThreadID": 56,
        "ThreadName": "",
        "EventID": "C9EA03A5A4CF0473",
        "BaggageBytes": "[[248 5] [240 0] [0 111 19 195 99 53 142 121 40] [240 1] [0 73 163 109 66 142 50 138 57] [240 3] [0 2]]",
        "ProcessID": 2171
      },
      {
        "Cycles": 0,
        "Agent": "edu.brown.cs.systems.xtrace.logging.BaggageWrappers",
        "ProcessName": "Name",
        "TaskID": "6F13C363358E7928",
        "ParentEventID": [
          "8D24AAC6CBFF0476"
        ],
        "Label": "Forking current baggage with Baggage.fork()",
        "Title": "X-Trace Task",
        "Host": "pinky19.mpi-sws.org",
        "HRT": 26966735688090244,
        "Operation": "fork",
        "Timestamp": "1557750375628.325928",
        "TenantClass": 0,
        "Source": "Server.java:2398",
        "ThreadID": 56,
        "ThreadName": "",
        "EventID": "07F0BAE25741F217",
        "BaggageBytes": "[[248 5] [240 0] [0 111 19 195 99 53 142 121 40] [240 1] [0 141 36 170 198 203 255 4 118] [240 3] [0 2]]",
        "ProcessID": 2171
      },
      {
        "Cycles": 0,
        "Agent": "org.apache.hadoop.hdfs.server.namenode.FSNamesystem.audit",
        "ProcessName": "Name",
        "TaskID": "6F13C363358E7928",
        "ParentEventID": [
          "C9EA03A5A4CF0473"
        ],
        "Label": "allowed=true\tugi=plascas (auth:SIMPLE)\tip=/139.19.171.63\tcmd=open\tsrc=/ds/hVKGERTBDOcryMFt\tdst=null\tperm=null\tproto=rpc",
        "Title": "X-Trace Task",
        "Host": "pinky19.mpi-sws.org",
        "HRT": 26966735688045469,
        "Timestamp": "1557750375628.281250",
        "TenantClass": 0,
        "Source": "FSNamesystem.java:8313",
        "ThreadID": 56,
        "ThreadName": "",
        "EventID": "8D24AAC6CBFF0476",
        "BaggageBytes": "[[248 5] [240 0] [0 111 19 195 99 53 142 121 40] [240 1] [0 201 234 3 165 164 207 4 115] [240 3] [0 2]]",
        "ProcessID": 2171
      },
      {
        "Cycles": 0,
        "Agent": "Execution-CPU",
        "ProcessName": "Name",
        "TaskID": "6F13C363358E7928",
        "ParentEventID": [
          "07F0BAE25741F217"
        ],
        "Label": "unset",
        "Title": "X-Trace Task",
        "Host": "pinky19.mpi-sws.org",
        "Duration": "210026",
        "HRT": 26966735688196893,
        "Operation": "unset",
        "Timestamp": "1557750375628.432617",
        "TenantClass": 0,
        "Source": "Server.java:1058",
        "ThreadID": 56,
        "ThreadName": "",
        "EventID": "9FED38E06B1E5931",
        "BaggageBytes": "[[248 5] [240 0] [0 111 19 195 99 53 142 121 40] [240 1] [0 7 240 186 226 87 65 242 23] [240 3] [0 2]]",
        "ProcessID": 2171
      },
      {
        "Cycles": 0,
        "Agent": "Execution-CPU",
        "ProcessName": "Read",
        "TaskID": "6F13C363358E7928",
        "ParentEventID": [
          "B69ED485CAFF9470"
        ],
        "Label": "unset",
        "Title": "X-Trace Task",
        "Host": "pinky19.mpi-sws.org",
        "Duration": "6368",
        "HRT": 26966735688262662,
        "Operation": "unset",
        "Timestamp": "1557750375628.500488",
        "TenantClass": 0,
        "Source": "Client.java:1168",
        "ThreadID": 40,
        "ThreadName": "",
        "EventID": "F5C9C5451B3F05BF",
        "ProcessID": 2801
      },
      {
        "Cycles": 0,
        "Agent": "Execution-CPU",
        "ProcessName": "Read",
        "TaskID": "6F13C363358E7928",
        "ParentEventID": [
          "07F0BAE25741F217"
        ],
        "Label": "set",
        "Title": "X-Trace Task",
        "Host": "pinky19.mpi-sws.org",
        "HRT": 26966735688239740,
        "Operation": "set",
        "Timestamp": "1557750375628.477539",
        "TenantClass": 0,
        "Source": "Client.java:302",
        "ThreadID": 40,
        "ThreadName": "",
        "EventID": "B69ED485CAFF9470",
        "ProcessID": 2801
      },
      {
        "Cycles": 0,
        "Agent": "Execution-Sleep",
        "ProcessName": "Read",
        "TaskID": "6F13C363358E7928",
        "ParentEventID": [
          "00945B75F8284237"
        ],
        "Label": "waited",
        "Title": "X-Trace Task",
        "Host": "pinky19.mpi-sws.org",
        "Duration": "421905",
        "HRT": 26966735688283163,
        "Operation": "waited",
        "Timestamp": "1557750375628.520996",
        "TenantClass": 0,
        "Source": "Client.java:1537",
        "ThreadID": 1,
        "ThreadName": "",
        "EventID": "3DA2BF9B54276E2A",
        "ProcessID": 2801
      },
      {
        "Cycles": 0,
        "Agent": "org.apache.hadoop.ipc.ProtobufRpcEngine",
        "ProcessName": "Read",
        "TaskID": "6F13C363358E7928",
        "ParentEventID": [
          "D7529889C65BD42C"
        ],
        "Label": "org.apache.hadoop.hdfs.protocol.ClientProtocol.getBlockLocations completed",
        "Title": "X-Trace Task",
        "Host": "pinky19.mpi-sws.org",
        "HRT": 26966735688349715,
        "Timestamp": "1557750375628.587402",
        "TenantClass": 0,
        "Source": "ProtobufRpcEngine.java:275",
        "ThreadID": 1,
        "ThreadName": "",
        "EventID": "67B129B30218605A",
        "ProcessID": 2801
      },
      {
        "Cycles": 0,
        "Agent": "edu.brown.cs.systems.xtrace.logging.BaggageWrappers",
        "ProcessName": "Read",
        "TaskID": "6F13C363358E7928",
        "ParentEventID": [
          "3DA2BF9B54276E2A",
          "F5C9C5451B3F05BF"
        ],
        "Label": "Merged current baggage with other baggage",
        "Title": "X-Trace Task",
        "Host": "pinky19.mpi-sws.org",
        "HRT": 26966735688297574,
        "Operation": "join",
        "Timestamp": "1557750375628.535400",
        "TenantClass": 0,
        "Source": "Client.java:1545",
        "ThreadID": 1,
        "ThreadName": "",
        "EventID": "D7529889C65BD42C",
        "ProcessID": 2801
      },
      {
        "Cycles": 0,
        "Agent": "Execution-Sleep",
        "ProcessName": "Read",
        "TaskID": "6F13C363358E7928",
        "ParentEventID": [
          "67B129B30218605A"
        ],
        "Label": "waited",
        "Title": "X-Trace Task",
        "Host": "pinky19.mpi-sws.org",
        "Duration": "144905",
        "HRT": 26966735688584632,
        "Operation": "waited",
        "Timestamp": "1557750375628.822266",
        "TenantClass": 0,
        "Source": "SocketIOWithTimeout.java:335",
        "ThreadID": 1,
        "ThreadName": "",
        "EventID": "258AE96275ACBF5F",
        "ProcessID": 2801
      },
      {
        "Cycles": 0,
        "Agent": "Execution-CPU",
        "ProcessName": "Data",
        "TaskID": "6F13C363358E7928",
        "ParentEventID": [
          "2218DAD2D1CE16CF"
        ],
        "Label": "set",
        "Title": "X-Trace Task",
        "Host": "pinky25.mpi-sws.org",
        "HRT": 47515840930282444,
        "Operation": "set",
        "Timestamp": "1557750375629.157471",
        "TenantClass": 0,
        "Source": "Receiver.java:117",
        "ThreadID": 14817,
        "ThreadName": "",
        "EventID": "C9552063CDBC2357",
        "BaggageBytes": "[[248 5] [240 0] [0 111 19 195 99 53 142 121 40] [240 1] [0 34 24 218 210 209 206 22 207] [240 3] [0 2]]",
        "ProcessID": 28198
      },
      {
        "Cycles": 0,
        "Agent": "edu.brown.cs.systems.xtrace.logging.BaggageWrappers",
        "ProcessName": "Read",
        "TaskID": "6F13C363358E7928",
        "ParentEventID": [
          "258AE96275ACBF5F"
        ],
        "Label": "Forking current baggage with Baggage.fork()",
        "Title": "X-Trace Task",
        "Host": "pinky19.mpi-sws.org",
        "HRT": 26966735688635914,
        "Operation": "fork",
        "Timestamp": "1557750375628.873779",
        "TenantClass": 0,
        "Source": "DataTransferProtoUtil.java:94",
        "ThreadID": 1,
        "ThreadName": "",
        "EventID": "2218DAD2D1CE16CF",
        "ProcessID": 2801
      },
      {
        "Cycles": 0,
        "Agent": "edu.brown.cs.systems.xtrace.logging.XTraceInit",
        "ProcessName": "Data",
        "TaskID": "6F13C363358E7928",
        "ParentEventID": [
          "C9552063CDBC2357"
        ],
        "Label": "Thread.setName: DataXceiver for client DFSClient_NONMAPREDUCE_310321604_1 at /139.19.171.63:55774 [Sending block BP-1633380353-139.19.171.63-1554193446451:blk_1073764764_23940]",
        "Title": "X-Trace Task",
        "Host": "pinky25.mpi-sws.org",
        "HRT": 47515840930378570,
        "Timestamp": "1557750375629.253662",
        "TenantClass": 0,
        "Source": "DataXceiver.java:168",
        "ThreadID": 14817,
        "ThreadName": "",
        "EventID": "426D6DD80D24C25C",
        "BaggageBytes": "[[248 5] [240 0] [0 111 19 195 99 53 142 121 40] [240 1] [0 201 85 32 99 205 188 35 87] [240 3] [0 2]]",
        "ProcessID": 28198
      },
      {
        "Cycles": 0,
        "Agent": "Execution-Sleep",
        "ProcessName": "Read",
        "TaskID": "6F13C363358E7928",
        "ParentEventID": [
          "2218DAD2D1CE16CF"
        ],
        "Label": "waited",
        "Title": "X-Trace Task",
        "Host": "pinky19.mpi-sws.org",
        "Duration": "639791",
        "HRT": 26966735689380902,
        "Operation": "waited",
        "Timestamp": "1557750375629.618652",
        "TenantClass": 0,
        "Source": "SocketIOWithTimeout.java:335",
        "ThreadID": 1,
        "ThreadName": "",
        "EventID": "85F0948975F0D8A9",
        "ProcessID": 2801
      },
      {
        "Cycles": 0,
        "Agent": "edu.brown.cs.systems.xtrace.logging.BaggageWrappers",
        "ProcessName": "Data",
        "TaskID": "6F13C363358E7928",
        "ParentEventID": [
          "426D6DD80D24C25C"
        ],
        "Label": "Forking current baggage with Baggage.fork()",
        "Title": "X-Trace Task",
        "Host": "pinky25.mpi-sws.org",
        "HRT": 47515840930602076,
        "Operation": "fork",
        "Timestamp": "1557750375629.477051",
        "TenantClass": 0,
        "Source": "DataXceiver.java:1257",
        "ThreadID": 14817,
        "ThreadName": "",
        "EventID": "3ECB6DEB8482347E",
        "BaggageBytes": "[[248 5] [240 0] [0 111 19 195 99 53 142 121 40] [240 1] [0 66 109 109 216 13 36 194 92] [240 3] [0 2]]",
        "ProcessID": 28198
      },
      {
        "Cycles": 0,
        "Agent": "edu.brown.cs.systems.xtrace.logging.BaggageWrappers",
        "ProcessName": "Data",
        "TaskID": "6F13C363358E7928",
        "ParentEventID": [
          "3ECB6DEB8482347E"
        ],
        "Label": "Forking current baggage with Baggage.fork()",
        "Title": "X-Trace Task",
        "Host": "pinky25.mpi-sws.org",
        "HRT": 47515840930696694,
        "Operation": "fork",
        "Timestamp": "1557750375629.571777",
        "TenantClass": 0,
        "Source": "PacketHeader.java:95",
        "ThreadID": 14817,
        "ThreadName": "",
        "EventID": "47A07108E51471F2",
        "BaggageBytes": "[[248 5] [240 0] [0 111 19 195 99 53 142 121 40] [240 1] [0 62 203 109 235 132 130 52 126] [240 3] [0 2]]",
        "ProcessID": 28198
      },
      {
        "Cycles": 0,
        "Agent": "edu.brown.cs.systems.xtrace.logging.BaggageWrappers",
        "ProcessName": "Read",
        "TaskID": "6F13C363358E7928",
        "ParentEventID": [
          "3ECB6DEB8482347E",
          "85F0948975F0D8A9"
        ],
        "Label": "Merged current baggage with other baggage",
        "Title": "X-Trace Task",
        "Host": "pinky19.mpi-sws.org",
        "HRT": 26966735689441964,
        "Operation": "join",
        "Timestamp": "1557750375629.679688",
        "TenantClass": 0,
        "Source": "RemoteBlockReader2.java:429",
        "ThreadID": 1,
        "ThreadName": "",
        "EventID": "A17250E3F86F5A7A",
        "ProcessID": 2801
      },
      {
        "Cycles": 0,
        "Agent": "Execution-Sleep",
        "ProcessName": "Data",
        "TaskID": "6F13C363358E7928",
        "ParentEventID": [
          "47A07108E51471F2"
        ],
        "Label": "waited",
        "Title": "X-Trace Task",
        "Host": "pinky25.mpi-sws.org",
        "Duration": "8014",
        "HRT": 47515840930795354,
        "Operation": "waited",
        "Timestamp": "1557750375629.670410",
        "TenantClass": 0,
        "Source": "SocketIOWithTimeout.java:335",
        "ThreadID": 14817,
        "ThreadName": "",
        "EventID": "262D0F6450D4037C",
        "BaggageBytes": "[[248 5] [240 0] [0 111 19 195 99 53 142 121 40] [240 1] [0 71 160 113 8 229 20 113 242] [240 3] [0 2]]",
        "ProcessID": 28198
      },
      {
        "Cycles": 0,
        "Agent": "Execution-Sleep",
        "ProcessName": "Read",
        "TaskID": "6F13C363358E7928",
        "ParentEventID": [
          "A17250E3F86F5A7A"
        ],
        "Label": "waited",
        "Title": "X-Trace Task",
        "Host": "pinky19.mpi-sws.org",
        "Duration": "307109",
        "HRT": 26966735689811895,
        "Operation": "waited",
        "Timestamp": "1557750375630.049561",
        "TenantClass": 0,
        "Source": "SocketIOWithTimeout.java:335",
        "ThreadID": 1,
        "ThreadName": "",
        "EventID": "34AFBD671A317080",
        "ProcessID": 2801
      },
      {
        "Cycles": 0,
        "Agent": "edu.brown.cs.systems.xtrace.logging.BaggageWrappers",
        "ProcessName": "Data",
        "TaskID": "6F13C363358E7928",
        "ParentEventID": [
          "262D0F6450D4037C"
        ],
        "Label": "Forking current baggage with Baggage.fork()",
        "Title": "X-Trace Task",
        "Host": "pinky25.mpi-sws.org",
        "HRT": 47515840930904130,
        "Operation": "fork",
        "Timestamp": "1557750375629.779297",
        "TenantClass": 0,
        "Source": "PacketHeader.java:95",
        "ThreadID": 14817,
        "ThreadName": "",
        "EventID": "A721A3ADD7E1D5EF",
        "BaggageBytes": "[[248 5] [240 0] [0 111 19 195 99 53 142 121 40] [240 1] [0 38 45 15 100 80 212 3 124] [240 3] [0 2]]",
        "ProcessID": 28198
      },
      {
        "Cycles": 0,
        "Agent": "Execution-Sleep",
        "ProcessName": "Read",
        "TaskID": "6F13C363358E7928",
        "ParentEventID": [
          "34AFBD671A317080"
        ],
        "Label": "waited",
        "Title": "X-Trace Task",
        "Host": "pinky19.mpi-sws.org",
        "Duration": "214225",
        "HRT": 26966735690089546,
        "Operation": "waited",
        "Timestamp": "1557750375630.327393",
        "TenantClass": 0,
        "Source": "SocketIOWithTimeout.java:335",
        "ThreadID": 1,
        "ThreadName": "",
        "EventID": "82AB974C9C463A41",
        "ProcessID": 2801
      },
      {
        "Cycles": 0,
        "Agent": "edu.brown.cs.systems.xtrace.logging.BaggageWrappers",
        "ProcessName": "Read",
        "TaskID": "6F13C363358E7928",
        "ParentEventID": [
          "47A07108E51471F2",
          "366AA850AAA31D6F"
        ],
        "Label": "Merged current baggage with other baggage",
        "Title": "X-Trace Task",
        "Host": "pinky19.mpi-sws.org",
        "HRT": 26966735690379122,
        "Operation": "join",
        "Timestamp": "1557750375630.616943",
        "TenantClass": 0,
        "Source": "PacketHeader.java:168",
        "ThreadID": 1,
        "ThreadName": "",
        "EventID": "AE0774DDC4D16D13",
        "ProcessID": 2801
      },
      {
        "Cycles": 0,
        "Agent": "Execution-Sleep",
        "ProcessName": "Read",
        "TaskID": "6F13C363358E7928",
        "ParentEventID": [
          "82AB974C9C463A41"
        ],
        "Label": "waited",
        "Title": "X-Trace Task",
        "Host": "pinky19.mpi-sws.org",
        "Duration": "130044",
        "HRT": 26966735690295382,
        "Operation": "waited",
        "Timestamp": "1557750375630.533203",
        "TenantClass": 0,
        "Source": "SocketIOWithTimeout.java:335",
        "ThreadID": 1,
        "ThreadName": "",
        "EventID": "366AA850AAA31D6F",
        "ProcessID": 2801
      },
      {
        "Cycles": 0,
        "Agent": "edu.brown.cs.systems.xtrace.logging.BaggageWrappers",
        "ProcessName": "Read",
        "TaskID": "6F13C363358E7928",
        "ParentEventID": [
          "AE0774DDC4D16D13",
          "A721A3ADD7E1D5EF"
        ],
        "Label": "Merged current baggage with other baggage",
        "Title": "X-Trace Task",
        "Host": "pinky19.mpi-sws.org",
        "HRT": 26966735690492361,
        "Operation": "join",
        "Timestamp": "1557750375630.730225",
        "TenantClass": 0,
        "Source": "PacketHeader.java:168",
        "ThreadID": 1,
        "ThreadName": "",
        "EventID": "F02E7508611BBE4E",
        "ProcessID": 2801
      },
      {
        "Cycles": 0,
        "Agent": "edu.brown.cs.systems.xtrace.logging.BaggageWrappers",
        "ProcessName": "Read",
        "TaskID": "6F13C363358E7928",
        "ParentEventID": [
          "F02E7508611BBE4E"
        ],
        "Label": "Forking current baggage with Baggage.fork()",
        "Title": "X-Trace Task",
        "Host": "pinky19.mpi-sws.org",
        "HRT": 26966735690502195,
        "Operation": "fork",
        "Timestamp": "1557750375630.739990",
        "TenantClass": 0,
        "Source": "RemoteBlockReader2.java:361",
        "ThreadID": 1,
        "ThreadName": "",
        "EventID": "FB4713EEE6C1413C",
        "ProcessID": 2801
      },
      {
        "Cycles": 0,
        "Agent": "edu.brown.cs.systems.xtrace.logging.BaggageWrappers",
        "ProcessName": "Read",
        "TaskID": "6F13C363358E7928",
        "ParentEventID": [
          "FB4713EEE6C1413C"
        ],
        "Label": "Forking current baggage with Baggage.fork()",
        "Title": "X-Trace Task",
        "Host": "pinky19.mpi-sws.org",
        "HRT": 26966735690569136,
        "Operation": "fork",
        "Timestamp": "1557750375630.806885",
        "TenantClass": 0,
        "Source": "DataTransferProtoUtil.java:94",
        "ThreadID": 1,
        "ThreadName": "",
        "EventID": "7A9A7D8384A9EBB3",
        "ProcessID": 2801
      },
      {
        "Cycles": 0,
        "Agent": "edu.brown.cs.systems.xtrace.logging.BaggageWrappers",
        "ProcessName": "Data",
        "TaskID": "6F13C363358E7928",
        "ParentEventID": [
          "EEF7C23E18F40FD4",
          "FB4713EEE6C1413C"
        ],
        "Label": "Merged current baggage with other baggage",
        "Title": "X-Trace Task",
        "Host": "pinky25.mpi-sws.org",
        "HRT": 47515840932067386,
        "Operation": "join",
        "Timestamp": "1557750375630.942383",
        "TenantClass": 0,
        "Source": "DataXceiver.java:574",
        "ThreadID": 14817,
        "ThreadName": "",
        "EventID": "1CA7A4954C7DE6E2",
        "BaggageBytes": "[[248 5] [240 0] [0 111 19 195 99 53 142 121 40] [240 1] [0 238 247 194 62 24 244 15 212] [0 251 71 19 238 230 193 65 60] [240 3] [0 2]]",
        "ProcessID": 28198
      },
      {
        "Cycles": 0,
        "Agent": "Execution-Sleep",
        "ProcessName": "Data",
        "TaskID": "6F13C363358E7928",
        "ParentEventID": [
          "A721A3ADD7E1D5EF"
        ],
        "Label": "waited",
        "Title": "X-Trace Task",
        "Host": "pinky25.mpi-sws.org",
        "Duration": "887014",
        "HRT": 47515840931908078,
        "Operation": "waited",
        "Timestamp": "1557750375630.783203",
        "TenantClass": 0,
        "Source": "SocketIOWithTimeout.java:335",
        "ThreadID": 14817,
        "ThreadName": "",
        "EventID": "EEF7C23E18F40FD4",
        "BaggageBytes": "[[248 5] [240 0] [0 111 19 195 99 53 142 121 40] [240 1] [0 167 33 163 173 215 225 213 239] [240 3] [0 2]]",
        "ProcessID": 28198
      },
      {
        "Cycles": 0,
        "Agent": "Execution-CPU",
        "ProcessName": "Data",
        "TaskID": "6F13C363358E7928",
        "ParentEventID": [
          "1CA7A4954C7DE6E2"
        ],
        "Label": "unset",
        "Title": "X-Trace Task",
        "Host": "pinky25.mpi-sws.org",
        "Duration": "1769758",
        "HRT": 47515840932113648,
        "Operation": "unset",
        "Timestamp": "1557750375630.988770",
        "TenantClass": 0,
        "Source": "DataXceiver.java:261",
        "ThreadID": 14817,
        "ThreadName": "",
        "EventID": "DD00475A5E695C7C",
        "BaggageBytes": "[[248 5] [240 0] [0 111 19 195 99 53 142 121 40] [240 1] [0 28 167 164 149 76 125 230 226] [240 3] [0 2]]",
        "ProcessID": 28198
      },
      {
        "Cycles": 0,
        "Agent": "edu.brown.cs.systems.xtrace.logging.XTraceInit",
        "ProcessName": "Data",
        "TaskID": "6F13C363358E7928",
        "ParentEventID": [
          "B013C947F18DF34D"
        ],
        "Label": "Thread.setName: DataXceiver for client DFSClient_NONMAPREDUCE_310321604_1 at /139.19.171.63:55774 [Sending block BP-1633380353-139.19.171.63-1554193446451:blk_1073764764_23940]",
        "Title": "X-Trace Task",
        "Host": "pinky25.mpi-sws.org",
        "HRT": 47515840932265016,
        "Timestamp": "1557750375631.140137",
        "TenantClass": 0,
        "Source": "DataXceiver.java:168",
        "ThreadID": 14817,
        "ThreadName": "",
        "EventID": "2EDB83A95B45ADAF",
        "BaggageBytes": "[[248 5] [240 0] [0 111 19 195 99 53 142 121 40] [240 1] [0 176 19 201 71 241 141 243 77] [240 3] [0 2]]",
        "ProcessID": 28198
      },
      {
        "Cycles": 0,
        "Agent": "edu.brown.cs.systems.xtrace.logging.BaggageWrappers",
        "ProcessName": "Data",
        "TaskID": "6F13C363358E7928",
        "ParentEventID": [
          "2EDB83A95B45ADAF"
        ],
        "Label": "Forking current baggage with Baggage.fork()",
        "Title": "X-Trace Task",
        "Host": "pinky25.mpi-sws.org",
        "HRT": 47515840932425706,
        "Operation": "fork",
        "Timestamp": "1557750375631.300781",
        "TenantClass": 0,
        "Source": "DataXceiver.java:1257",
        "ThreadID": 14817,
        "ThreadName": "",
        "EventID": "1F56E94ABD254397",
        "BaggageBytes": "[[248 5] [240 0] [0 111 19 195 99 53 142 121 40] [240 1] [0 46 219 131 169 91 69 173 175] [240 3] [0 2]]",
        "ProcessID": 28198
      },
      {
        "Cycles": 0,
        "Agent": "Execution-CPU",
        "ProcessName": "Data",
        "TaskID": "6F13C363358E7928",
        "ParentEventID": [
          "7A9A7D8384A9EBB3"
        ],
        "Label": "set",
        "Title": "X-Trace Task",
        "Host": "pinky25.mpi-sws.org",
        "HRT": 47515840932198133,
        "Operation": "set",
        "Timestamp": "1557750375631.073242",
        "TenantClass": 0,
        "Source": "Receiver.java:117",
        "ThreadID": 14817,
        "ThreadName": "",
        "EventID": "B013C947F18DF34D",
        "BaggageBytes": "[[248 5] [240 0] [0 111 19 195 99 53 142 121 40] [240 1] [0 122 154 125 131 132 169 235 179] [240 3] [0 2]]",
        "ProcessID": 28198
      },
      {
        "Cycles": 0,
        "Agent": "Execution-Sleep",
        "ProcessName": "Read",
        "TaskID": "6F13C363358E7928",
        "ParentEventID": [
          "7A9A7D8384A9EBB3"
        ],
        "Label": "waited",
        "Title": "X-Trace Task",
        "Host": "pinky19.mpi-sws.org",
        "Duration": "565272",
        "HRT": 26966735691208300,
        "Operation": "waited",
        "Timestamp": "1557750375631.446045",
        "TenantClass": 0,
        "Source": "SocketIOWithTimeout.java:335",
        "ThreadID": 1,
        "ThreadName": "",
        "EventID": "300388C83B03ACF9",
        "ProcessID": 2801
      },
      {
        "Cycles": 0,
        "Agent": "edu.brown.cs.systems.xtrace.logging.BaggageWrappers",
        "ProcessName": "Data",
        "TaskID": "6F13C363358E7928",
        "ParentEventID": [
          "1F56E94ABD254397"
        ],
        "Label": "Forking current baggage with Baggage.fork()",
        "Title": "X-Trace Task",
        "Host": "pinky25.mpi-sws.org",
        "HRT": 47515840932541081,
        "Operation": "fork",
        "Timestamp": "1557750375631.416260",
        "TenantClass": 0,
        "Source": "PacketHeader.java:95",
        "ThreadID": 14817,
        "ThreadName": "",
        "EventID": "8626871331315002",
        "BaggageBytes": "[[248 5] [240 0] [0 111 19 195 99 53 142 121 40] [240 1] [0 31 86 233 74 189 37 67 151] [240 3] [0 2]]",
        "ProcessID": 28198
      },
      {
        "Cycles": 0,
        "Agent": "edu.brown.cs.systems.xtrace.logging.BaggageWrappers",
        "ProcessName": "Read",
        "TaskID": "6F13C363358E7928",
        "ParentEventID": [
          "300388C83B03ACF9",
          "1F56E94ABD254397"
        ],
        "Label": "Merged current baggage with other baggage",
        "Title": "X-Trace Task",
        "Host": "pinky19.mpi-sws.org",
        "HRT": 26966735691277215,
        "Operation": "join",
        "Timestamp": "1557750375631.514893",
        "TenantClass": 0,
        "Source": "RemoteBlockReader2.java:429",
        "ThreadID": 1,
        "ThreadName": "",
        "EventID": "29585CF6DDAD8CA8",
        "ProcessID": 2801
      },
      {
        "Cycles": 0,
        "Agent": "Execution-Sleep",
        "ProcessName": "Read",
        "TaskID": "6F13C363358E7928",
        "ParentEventID": [
          "29585CF6DDAD8CA8"
        ],
        "Label": "waited",
        "Title": "X-Trace Task",
        "Host": "pinky19.mpi-sws.org",
        "Duration": "320869",
        "HRT": 26966735691710458,
        "Operation": "waited",
        "Timestamp": "1557750375631.948242",
        "TenantClass": 0,
        "Source": "SocketIOWithTimeout.java:335",
        "ThreadID": 1,
        "ThreadName": "",
        "EventID": "B1AEDA42A628544F",
        "ProcessID": 2801
      },
      {
        "Cycles": 0,
        "Agent": "Execution-Sleep",
        "ProcessName": "Data",
        "TaskID": "6F13C363358E7928",
        "ParentEventID": [
          "8626871331315002"
        ],
        "Label": "waited",
        "Title": "X-Trace Task",
        "Host": "pinky25.mpi-sws.org",
        "Duration": "7090",
        "HRT": 47515840932645188,
        "Operation": "waited",
        "Timestamp": "1557750375631.520264",
        "TenantClass": 0,
        "Source": "SocketIOWithTimeout.java:335",
        "ThreadID": 14817,
        "ThreadName": "",
        "EventID": "59C119A165E08946",
        "BaggageBytes": "[[248 5] [240 0] [0 111 19 195 99 53 142 121 40] [240 1] [0 134 38 135 19 49 49 80 2] [240 3] [0 2]]",
        "ProcessID": 28198
      },
      {
        "Cycles": 0,
        "Agent": "edu.brown.cs.systems.xtrace.logging.BaggageWrappers",
        "ProcessName": "Data",
        "TaskID": "6F13C363358E7928",
        "ParentEventID": [
          "59C119A165E08946"
        ],
        "Label": "Forking current baggage with Baggage.fork()",
        "Title": "X-Trace Task",
        "Host": "pinky25.mpi-sws.org",
        "HRT": 47515840932803594,
        "Operation": "fork",
        "Timestamp": "1557750375631.678711",
        "TenantClass": 0,
        "Source": "PacketHeader.java:95",
        "ThreadID": 14817,
        "ThreadName": "",
        "EventID": "BA0D9D99EB83BCB5",
        "BaggageBytes": "[[248 5] [240 0] [0 111 19 195 99 53 142 121 40] [240 1] [0 89 193 25 161 101 224 137 70] [240 3] [0 2]]",
        "ProcessID": 28198
      },
      {
        "Cycles": 0,
        "Agent": "Execution-Sleep",
        "ProcessName": "Read",
        "TaskID": "6F13C363358E7928",
        "ParentEventID": [
          "B1AEDA42A628544F"
        ],
        "Label": "waited",
        "Title": "X-Trace Task",
        "Host": "pinky19.mpi-sws.org",
        "Duration": "164326",
        "HRT": 26966735691938224,
        "Operation": "waited",
        "Timestamp": "1557750375632.176025",
        "TenantClass": 0,
        "Source": "SocketIOWithTimeout.java:335",
        "ThreadID": 1,
        "ThreadName": "",
        "EventID": "255EE30BC598829D",
        "ProcessID": 2801
      },
      {
        "Cycles": 0,
        "Agent": "Execution-Sleep",
        "ProcessName": "Data",
        "TaskID": "6F13C363358E7928",
        "ParentEventID": [
          "BA0D9D99EB83BCB5"
        ],
        "Label": "waited",
        "Title": "X-Trace Task",
        "Host": "pinky25.mpi-sws.org",
        "Duration": "205252",
        "HRT": 47515840933082478,
        "Operation": "waited",
        "Timestamp": "1557750375631.957520",
        "TenantClass": 0,
        "Source": "SocketIOWithTimeout.java:335",
        "ThreadID": 14817,
        "ThreadName": "",
        "EventID": "DD931C94E4EC8D6D",
        "BaggageBytes": "[[248 5] [240 0] [0 111 19 195 99 53 142 121 40] [240 1] [0 186 13 157 153 235 131 188 181] [240 3] [0 2]]",
        "ProcessID": 28198
      },
      {
        "Cycles": 0,
        "Agent": "edu.brown.cs.systems.xtrace.logging.BaggageWrappers",
        "ProcessName": "Read",
        "TaskID": "6F13C363358E7928",
        "ParentEventID": [
          "720A70AFC09E9818",
          "8626871331315002"
        ],
        "Label": "Merged current baggage with other baggage",
        "Title": "X-Trace Task",
        "Host": "pinky19.mpi-sws.org",
        "HRT": 26966735692127390,
        "Operation": "join",
        "Timestamp": "1557750375632.365234",
        "TenantClass": 0,
        "Source": "PacketHeader.java:168",
        "ThreadID": 1,
        "ThreadName": "",
        "EventID": "EF5A776EAC79A0A0",
        "ProcessID": 2801
      },
      {
        "Cycles": 0,
        "Agent": "Execution-Sleep",
        "ProcessName": "Read",
        "TaskID": "6F13C363358E7928",
        "ParentEventID": [
          "255EE30BC598829D"
        ],
        "Label": "waited",
        "Title": "X-Trace Task",
        "Host": "pinky19.mpi-sws.org",
        "Duration": "72564",
        "HRT": 26966735692074534,
        "Operation": "waited",
        "Timestamp": "1557750375632.312256",
        "TenantClass": 0,
        "Source": "SocketIOWithTimeout.java:335",
        "ThreadID": 1,
        "ThreadName": "",
        "EventID": "720A70AFC09E9818",
        "ProcessID": 2801
      },
      {
        "Cycles": 0,
        "Agent": "edu.brown.cs.systems.xtrace.logging.BaggageWrappers",
        "ProcessName": "Data",
        "TaskID": "6F13C363358E7928",
        "ParentEventID": [
          "DD931C94E4EC8D6D"
        ],
        "Label": "Forking current baggage with Baggage.fork()",
        "Title": "X-Trace Task",
        "Host": "pinky25.mpi-sws.org",
        "HRT": 47515840933196663,
        "Operation": "fork",
        "Timestamp": "1557750375632.071777",
        "TenantClass": 0,
        "Source": "PacketHeader.java:95",
        "ThreadID": 14817,
        "ThreadName": "",
        "EventID": "9FD0CEBF1251AF4B",
        "BaggageBytes": "[[248 5] [240 0] [0 111 19 195 99 53 142 121 40] [240 1] [0 221 147 28 148 228 236 141 109] [240 3] [0 2]]",
        "ProcessID": 28198
      },
      {
        "Cycles": 0,
        "Agent": "Execution-Sleep",
        "ProcessName": "Data",
        "TaskID": "6F13C363358E7928",
        "ParentEventID": [
          "9FD0CEBF1251AF4B"
        ],
        "Label": "waited",
        "Title": "X-Trace Task",
        "Host": "pinky25.mpi-sws.org",
        "Duration": "5953",
        "HRT": 47515840933314671,
        "Operation": "waited",
        "Timestamp": "1557750375632.189697",
        "TenantClass": 0,
        "Source": "SocketIOWithTimeout.java:335",
        "ThreadID": 14817,
        "ThreadName": "",
        "EventID": "38D089B67B24D262",
        "BaggageBytes": "[[248 5] [240 0] [0 111 19 195 99 53 142 121 40] [240 1] [0 159 208 206 191 18 81 175 75] [240 3] [0 2]]",
        "ProcessID": 28198
      },
      {
        "Cycles": 0,
        "Agent": "edu.brown.cs.systems.xtrace.logging.BaggageWrappers",
        "ProcessName": "Data",
        "TaskID": "6F13C363358E7928",
        "ParentEventID": [
          "38D089B67B24D262"
        ],
        "Label": "Forking current baggage with Baggage.fork()",
        "Title": "X-Trace Task",
        "Host": "pinky25.mpi-sws.org",
        "HRT": 47515840933437916,
        "Operation": "fork",
        "Timestamp": "1557750375632.312988",
        "TenantClass": 0,
        "Source": "PacketHeader.java:95",
        "ThreadID": 14817,
        "ThreadName": "",
        "EventID": "E8066F2429CE805D",
        "BaggageBytes": "[[248 5] [240 0] [0 111 19 195 99 53 142 121 40] [240 1] [0 56 208 137 182 123 36 210 98] [240 3] [0 2]]",
        "ProcessID": 28198
      },
      {
        "Cycles": 0,
        "Agent": "Execution-CPU",
        "ProcessName": "Data",
        "TaskID": "6F13C363358E7928",
        "ParentEventID": [
          "50BDF221DD0E1CB4"
        ],
        "Label": "unset",
        "Title": "X-Trace Task",
        "Host": "pinky25.mpi-sws.org",
        "Duration": "1589665",
        "HRT": 47515840933822322,
        "Operation": "unset",
        "Timestamp": "1557750375632.697266",
        "TenantClass": 0,
        "Source": "DataXceiver.java:261",
        "ThreadID": 14817,
        "ThreadName": "",
        "EventID": "C842A87270E7D9AA",
        "BaggageBytes": "[[248 5] [240 0] [0 111 19 195 99 53 142 121 40] [240 1] [0 80 189 242 33 221 14 28 180] [240 3] [0 2]]",
        "ProcessID": 28198
      },
      {
        "Cycles": 0,
        "Agent": "Execution-Sleep",
        "ProcessName": "Data",
        "TaskID": "6F13C363358E7928",
        "ParentEventID": [
          "E8066F2429CE805D"
        ],
        "Label": "waited",
        "Title": "X-Trace Task",
        "Host": "pinky25.mpi-sws.org",
        "Duration": "5438",
        "HRT": 47515840933521981,
        "Operation": "waited",
        "Timestamp": "1557750375632.396973",
        "TenantClass": 0,
        "Source": "SocketIOWithTimeout.java:335",
        "ThreadID": 14817,
        "ThreadName": "",
        "EventID": "50BDF221DD0E1CB4",
        "BaggageBytes": "[[248 5] [240 0] [0 111 19 195 99 53 142 121 40] [240 1] [0 232 6 111 36 41 206 128 93] [240 3] [0 2]]",
        "ProcessID": 28198
      },
      {
        "Cycles": 0,
        "Agent": "edu.brown.cs.systems.retro.benchmarks.hdfs_client.Reader",
        "ProcessName": "Read",
        "TaskID": "6F13C363358E7928",
        "ParentEventID": [
          "0"
        ],
        "Label": "Reading file",
        "Title": "X-Trace Task",
        "Host": "pinky19.mpi-sws.org",
        "HRT": 26966735687632337,
        "Timestamp": "1557750375627.870117",
        "TenantClass": 0,
        "ThreadID": 1,
        "ThreadName": "",
        "EventID": "EDCBDC1C7D8B6C1F",
        "ProcessID": 2801,
        "Tag": [
          "reader_100kb",
          "Read Size: 102400"
        ]
      }
    ]
  }
]