[
  {
    "id": "FBF04AF54267FF64",
    "reports": [
      {
        "Cycles": 0,
        "Agent": "Execution-CPU",
        "ProcessName": "Read",
        "TaskID": "FBF04AF54267FF64",
        "ParentEventID": [
          "85E205D0A8280D51"
        ],
        "Label": "unset",
        "Title": "X-Trace Task",
        "Host": "pinky19.mpi-sws.org",
        "Duration": "21750153",
        "HRT": 25491950851205657,
        "Operation": "unset",
        "Timestamp": "1556275590791.554199",
        "TenantClass": 0,
        "Source": "Client.java:1027",
        "ThreadID": 1,
        "ThreadName": "",
        "EventID": "0CEF936471D77B82",
        "ProcessID": 21035
      },
      {
        "Cycles": 0,
        "Agent": "edu.brown.cs.systems.retro.benchmarks.hdfs_client.Reader",
        "ProcessName": "Read",
        "TaskID": "FBF04AF54267FF64",
        "ParentEventID": [
          "5F484FFD5C3B8443"
        ],
        "Label": "Reading file",
        "Title": "X-Trace Task",
        "Host": "pinky19.mpi-sws.org",
        "HRT": 25491950851134596,
        "Timestamp": "1556275590791.483154",
        "TenantClass": 0,
        "ThreadID": 1,
        "ThreadName": "",
        "EventID": "C5B4916958C6BDCE",
        "ProcessID": 21035
      },
      {
        "Cycles": 0,
        "Agent": "org.apache.hadoop.ipc.ProtobufRpcEngine",
        "ProcessName": "Read",
        "TaskID": "FBF04AF54267FF64",
        "ParentEventID": [
          "C5B4916958C6BDCE"
        ],
        "Label": "Invoking org.apache.hadoop.hdfs.protocol.ClientProtocol.getBlockLocations",
        "Title": "X-Trace Task",
        "Host": "pinky19.mpi-sws.org",
        "HRT": 25491950851175800,
        "Timestamp": "1556275590791.524414",
        "TenantClass": 0,
        "Source": "ProtobufRpcEngine.java:228",
        "ThreadID": 1,
        "ThreadName": "",
        "EventID": "85E205D0A8280D51",
        "ProcessID": 21035
      },
      {
        "Cycles": 0,
        "Agent": "Execution-CPU",
        "ProcessName": "Read",
        "TaskID": "FBF04AF54267FF64",
        "ParentEventID": [
          "0CEF936471D77B82"
        ],
        "Label": "set",
        "Title": "X-Trace Task",
        "Host": "pinky19.mpi-sws.org",
        "HRT": 25491950851258935,
        "Operation": "set",
        "Timestamp": "1556275590791.607422",
        "TenantClass": 0,
        "Source": "Client.java:1032",
        "ThreadID": 41,
        "ThreadName": "",
        "EventID": "504CFCDDB3186447",
        "ProcessID": 21035
      },
      {
        "Cycles": 0,
        "Agent": "edu.brown.cs.systems.xtrace.logging.BaggageWrappers",
        "ProcessName": "Read",
        "TaskID": "FBF04AF54267FF64",
        "ParentEventID": [
          "504CFCDDB3186447"
        ],
        "Label": "Forking current baggage with Baggage.fork()",
        "Title": "X-Trace Task",
        "Host": "pinky19.mpi-sws.org",
        "HRT": 25491950851277590,
        "Operation": "fork",
        "Timestamp": "1556275590791.626221",
        "TenantClass": 0,
        "Source": "Client.java:1043",
        "ThreadID": 41,
        "ThreadName": "",
        "EventID": "8DC76C10997AB2A6",
        "ProcessID": 21035
      },
      {
        "Cycles": 0,
        "Agent": "Execution-CPU",
        "ProcessName": "Read",
        "TaskID": "FBF04AF54267FF64",
        "ParentEventID": [
          "8DC76C10997AB2A6"
        ],
        "Label": "unset",
        "Title": "X-Trace Task",
        "Host": "pinky19.mpi-sws.org",
        "Duration": "66073",
        "HRT": 25491950851342722,
        "Operation": "unset",
        "Timestamp": "1556275590791.691162",
        "TenantClass": 0,
        "Source": "Client.java:1062",
        "ThreadID": 41,
        "ThreadName": "",
        "EventID": "91D39A292D3FADDB",
        "ProcessID": 21035
      },
      {
        "Cycles": 0,
        "Agent": "Execution-CPU",
        "ProcessName": "Name",
        "TaskID": "FBF04AF54267FF64",
        "ParentEventID": [
          "8DC76C10997AB2A6"
        ],
        "Label": "set",
        "Title": "X-Trace Task",
        "Host": "pinky19.mpi-sws.org",
        "HRT": 25491950851388453,
        "Operation": "set",
        "Timestamp": "1556275590791.747803",
        "TenantClass": 0,
        "Source": "Server.java:1840",
        "ThreadID": 48,
        "ThreadName": "",
        "EventID": "48C4B69BA7F71834",
        "BaggageBytes": "[[248 5] [240 0] [0 251 240 74 245 66 103 255 100] [240 1] [0 141 199 108 16 153 122 178 166] [240 3] [0 2]]",
        "ProcessID": 2171
      },
      {
        "Cycles": 0,
        "Agent": "Execution-CPU",
        "ProcessName": "Read",
        "TaskID": "FBF04AF54267FF64",
        "ParentEventID": [
          "91D39A292D3FADDB"
        ],
        "Label": "set",
        "Title": "X-Trace Task",
        "Host": "pinky19.mpi-sws.org",
        "HRT": 25491950851368742,
        "Operation": "set",
        "Timestamp": "1556275590791.717285",
        "TenantClass": 0,
        "Source": "Client.java:1104",
        "ThreadID": 1,
        "ThreadName": "",
        "EventID": "51A73625B8A113E7",
        "ProcessID": 21035
      },
      {
        "Cycles": 0,
        "Agent": "edu.brown.cs.systems.xtrace.logging.BaggageWrappers",
        "ProcessName": "Name",
        "TaskID": "FBF04AF54267FF64",
        "ParentEventID": [
          "48C4B69BA7F71834"
        ],
        "Label": "Forking current baggage with Baggage.fork()",
        "Title": "X-Trace Task",
        "Host": "pinky19.mpi-sws.org",
        "HRT": 25491950851411267,
        "Operation": "fork",
        "Timestamp": "1556275590791.770508",
        "TenantClass": 0,
        "Source": "Server.java:550",
        "ThreadID": 48,
        "ThreadName": "",
        "EventID": "122F183DDDE2EB83",
        "BaggageBytes": "[[248 5] [240 0] [0 251 240 74 245 66 103 255 100] [240 1] [0 72 196 182 155 167 247 24 52] [240 3] [0 2]]",
        "ProcessID": 2171
      },
      {
        "Cycles": 0,
        "Agent": "Execution-CPU",
        "ProcessName": "Name",
        "TaskID": "FBF04AF54267FF64",
        "ParentEventID": [
          "122F183DDDE2EB83"
        ],
        "Label": "unset",
        "Title": "X-Trace Task",
        "Host": "pinky19.mpi-sws.org",
        "Duration": "21123",
        "HRT": 25491950851429865,
        "Operation": "unset",
        "Timestamp": "1556275590791.789062",
        "TenantClass": 0,
        "Source": "Server.java:1828",
        "ThreadID": 48,
        "ThreadName": "",
        "EventID": "0E75CC1F6F83D1D8",
        "BaggageBytes": "[[248 5] [240 0] [0 251 240 74 245 66 103 255 100] [240 1] [0 18 47 24 61 221 226 235 131] [240 3] [0 2]]",
        "ProcessID": 2171
      },
      {
        "Cycles": 0,
        "Agent": "Execution-CPU",
        "ProcessName": "Name",
        "TaskID": "FBF04AF54267FF64",
        "ParentEventID": [
          "122F183DDDE2EB83"
        ],
        "Label": "set",
        "Title": "X-Trace Task",
        "Host": "pinky19.mpi-sws.org",
        "HRT": 25491950851435957,
        "Operation": "set",
        "Timestamp": "1556275590791.795166",
        "TenantClass": 0,
        "Source": "Server.java:2071",
        "ThreadID": 55,
        "ThreadName": "",
        "EventID": "E3D834D4823FCE87",
        "BaggageBytes": "[[248 5] [240 0] [0 251 240 74 245 66 103 255 100] [240 1] [0 18 47 24 61 221 226 235 131] [240 3] [0 2]]",
        "ProcessID": 2171
      },
      {
        "Cycles": 0,
        "Agent": "org.apache.hadoop.ipc.Server",
        "ProcessName": "Name",
        "TaskID": "FBF04AF54267FF64",
        "ParentEventID": [
          "E3D834D4823FCE87"
        ],
        "Label": "getBlockLocations in org.apache.hadoop.hdfs.protocol.ClientProtocol",
        "Title": "X-Trace Task",
        "Host": "pinky19.mpi-sws.org",
        "HRT": 25491950851465513,
        "Timestamp": "1556275590791.824707",
        "TenantClass": 0,
        "Source": "ProtobufRpcEngine.java:601",
        "ThreadID": 55,
        "ThreadName": "",
        "EventID": "667A14048B614244",
        "BaggageBytes": "[[248 5] [240 0] [0 251 240 74 245 66 103 255 100] [240 1] [0 227 216 52 212 130 63 206 135] [240 3] [0 2]]",
        "ProcessID": 2171
      },
      {
        "Cycles": 0,
        "Agent": "edu.brown.cs.systems.xtrace.logging.BaggageWrappers",
        "ProcessName": "Name",
        "TaskID": "FBF04AF54267FF64",
        "ParentEventID": [
          "3F7E3587D291FE50"
        ],
        "Label": "Forking current baggage with Baggage.fork()",
        "Title": "X-Trace Task",
        "Host": "pinky19.mpi-sws.org",
        "HRT": 25491950851543610,
        "Operation": "fork",
        "Timestamp": "1556275590791.902832",
        "TenantClass": 0,
        "Source": "Server.java:2398",
        "ThreadID": 55,
        "ThreadName": "",
        "EventID": "D8A224853662194C",
        "BaggageBytes": "[[248 5] [240 0] [0 251 240 74 245 66 103 255 100] [240 1] [0 63 126 53 135 210 145 254 80] [240 3] [0 2]]",
        "ProcessID": 2171
      },
      {
        "Cycles": 0,
        "Agent": "Execution-CPU",
        "ProcessName": "Name",
        "TaskID": "FBF04AF54267FF64",
        "ParentEventID": [
          "D8A224853662194C"
        ],
        "Label": "unset",
        "Title": "X-Trace Task",
        "Host": "pinky19.mpi-sws.org",
        "Duration": "179408",
        "HRT": 25491950851635134,
        "Operation": "unset",
        "Timestamp": "1556275590791.994385",
        "TenantClass": 0,
        "Source": "Server.java:1058",
        "ThreadID": 55,
        "ThreadName": "",
        "EventID": "998A5E5F7C114F6A",
        "BaggageBytes": "[[248 5] [240 0] [0 251 240 74 245 66 103 255 100] [240 1] [0 216 162 36 133 54 98 25 76] [240 3] [0 2]]",
        "ProcessID": 2171
      },
      {
        "Cycles": 0,
        "Agent": "org.apache.hadoop.hdfs.server.namenode.FSNamesystem.audit",
        "ProcessName": "Name",
        "TaskID": "FBF04AF54267FF64",
        "ParentEventID": [
          "667A14048B614244"
        ],
        "Label": "allowed=true\tugi=plascas (auth:SIMPLE)\tip=/139.19.171.63\tcmd=open\tsrc=/ds/wxFy4iWgV2icit6R\tdst=null\tperm=null\tproto=rpc",
        "Title": "X-Trace Task",
        "Host": "pinky19.mpi-sws.org",
        "HRT": 25491950851507082,
        "Timestamp": "1556275590791.866455",
        "TenantClass": 0,
        "Source": "FSNamesystem.java:8313",
        "ThreadID": 55,
        "ThreadName": "",
        "EventID": "3F7E3587D291FE50",
        "BaggageBytes": "[[248 5] [240 0] [0 251 240 74 245 66 103 255 100] [240 1] [0 102 122 20 4 139 97 66 68] [240 3] [0 2]]",
        "ProcessID": 2171
      },
      {
        "Cycles": 0,
        "Agent": "Execution-CPU",
        "ProcessName": "Read",
        "TaskID": "FBF04AF54267FF64",
        "ParentEventID": [
          "D8A224853662194C"
        ],
        "Label": "set",
        "Title": "X-Trace Task",
        "Host": "pinky19.mpi-sws.org",
        "HRT": 25491950851675766,
        "Operation": "set",
        "Timestamp": "1556275590792.024170",
        "TenantClass": 0,
        "Source": "Client.java:302",
        "ThreadID": 37,
        "ThreadName": "",
        "EventID": "21206418CED08B1A",
        "ProcessID": 21035
      },
      {
        "Cycles": 0,
        "Agent": "Execution-Sleep",
        "ProcessName": "Read",
        "TaskID": "FBF04AF54267FF64",
        "ParentEventID": [
          "51A73625B8A113E7"
        ],
        "Label": "waited",
        "Title": "X-Trace Task",
        "Host": "pinky19.mpi-sws.org",
        "Duration": "346191",
        "HRT": 25491950851730288,
        "Operation": "waited",
        "Timestamp": "1556275590792.078857",
        "TenantClass": 0,
        "Source": "Client.java:1537",
        "ThreadID": 1,
        "ThreadName": "",
        "EventID": "E3468E5A667F8178",
        "ProcessID": 21035
      },
      {
        "Cycles": 0,
        "Agent": "Execution-CPU",
        "ProcessName": "Read",
        "TaskID": "FBF04AF54267FF64",
        "ParentEventID": [
          "21206418CED08B1A"
        ],
        "Label": "unset",
        "Title": "X-Trace Task",
        "Host": "pinky19.mpi-sws.org",
        "Duration": "3919",
        "HRT": 25491950851690976,
        "Operation": "unset",
        "Timestamp": "1556275590792.039551",
        "TenantClass": 0,
        "Source": "Client.java:1168",
        "ThreadID": 37,
        "ThreadName": "",
        "EventID": "1F8D94248BD8A365",
        "ProcessID": 21035
      },
      {
        "Cycles": 0,
        "Agent": "edu.brown.cs.systems.xtrace.logging.BaggageWrappers",
        "ProcessName": "Read",
        "TaskID": "FBF04AF54267FF64",
        "ParentEventID": [
          "1F8D94248BD8A365",
          "E3468E5A667F8178"
        ],
        "Label": "Merged current baggage with other baggage",
        "Title": "X-Trace Task",
        "Host": "pinky19.mpi-sws.org",
        "HRT": 25491950851751714,
        "Operation": "join",
        "Timestamp": "1556275590792.100342",
        "TenantClass": 0,
        "Source": "Client.java:1545",
        "ThreadID": 1,
        "ThreadName": "",
        "EventID": "1D84F8DDC65A30EF",
        "ProcessID": 21035
      },
      {
        "Cycles": 0,
        "Agent": "org.apache.hadoop.ipc.ProtobufRpcEngine",
        "ProcessName": "Read",
        "TaskID": "FBF04AF54267FF64",
        "ParentEventID": [
          "1D84F8DDC65A30EF"
        ],
        "Label": "org.apache.hadoop.hdfs.protocol.ClientProtocol.getBlockLocations completed",
        "Title": "X-Trace Task",
        "Host": "pinky19.mpi-sws.org",
        "HRT": 25491950851781845,
        "Timestamp": "1556275590792.130371",
        "TenantClass": 0,
        "Source": "ProtobufRpcEngine.java:275",
        "ThreadID": 1,
        "ThreadName": "",
        "EventID": "BA6CE004643B5027",
        "ProcessID": 21035
      },
      {
        "Cycles": 0,
        "Agent": "edu.brown.cs.systems.xtrace.logging.BaggageWrappers",
        "ProcessName": "Read",
        "TaskID": "FBF04AF54267FF64",
        "ParentEventID": [
          "BA6CE004643B5027"
        ],
        "Label": "Forking current baggage with Baggage.fork()",
        "Title": "X-Trace Task",
        "Host": "pinky19.mpi-sws.org",
        "HRT": 25491950851831272,
        "Operation": "fork",
        "Timestamp": "1556275590792.179688",
        "TenantClass": 0,
        "Source": "DataTransferProtoUtil.java:94",
        "ThreadID": 1,
        "ThreadName": "",
        "EventID": "FF3974393A799F70",
        "ProcessID": 21035
      },
      {
        "Cycles": 0,
        "Agent": "edu.brown.cs.systems.xtrace.logging.XTraceInit",
        "ProcessName": "Data",
        "TaskID": "FBF04AF54267FF64",
        "ParentEventID": [
          "85BAC1AFBD06A292"
        ],
        "Label": "Thread.setName: DataXceiver for client DFSClient_NONMAPREDUCE_1377588049_1 at /139.19.171.63:38298 [Sending block BP-1633380353-139.19.171.63-1554193446451:blk_1073767526_26702]",
        "Title": "X-Trace Task",
        "Host": "pinky22.mpi-sws.org",
        "HRT": 46041923107139773,
        "Timestamp": "1556275590792.527832",
        "TenantClass": 0,
        "Source": "DataXceiver.java:168",
        "ThreadID": 5996,
        "ThreadName": "",
        "EventID": "6DDD395C52F39A9B",
        "BaggageBytes": "[[248 5] [240 0] [0 251 240 74 245 66 103 255 100] [240 1] [0 133 186 193 175 189 6 162 146] [240 3] [0 2]]",
        "ProcessID": 28841
      },
      {
        "Cycles": 0,
        "Agent": "Execution-CPU",
        "ProcessName": "Data",
        "TaskID": "FBF04AF54267FF64",
        "ParentEventID": [
          "FF3974393A799F70"
        ],
        "Label": "set",
        "Title": "X-Trace Task",
        "Host": "pinky22.mpi-sws.org",
        "HRT": 46041923107045003,
        "Operation": "set",
        "Timestamp": "1556275590792.432861",
        "TenantClass": 0,
        "Source": "Receiver.java:117",
        "ThreadID": 5996,
        "ThreadName": "",
        "EventID": "85BAC1AFBD06A292",
        "BaggageBytes": "[[248 5] [240 0] [0 251 240 74 245 66 103 255 100] [240 1] [0 255 57 116 57 58 121 159 112] [240 3] [0 2]]",
        "ProcessID": 28841
      },
      {
        "Cycles": 0,
        "Agent": "edu.brown.cs.systems.xtrace.logging.BaggageWrappers",
        "ProcessName": "Data",
        "TaskID": "FBF04AF54267FF64",
        "ParentEventID": [
          "6DDD395C52F39A9B"
        ],
        "Label": "Forking current baggage with Baggage.fork()",
        "Title": "X-Trace Task",
        "Host": "pinky22.mpi-sws.org",
        "HRT": 46041923107317237,
        "Operation": "fork",
        "Timestamp": "1556275590792.705078",
        "TenantClass": 0,
        "Source": "DataXceiver.java:1257",
        "ThreadID": 5996,
        "ThreadName": "",
        "EventID": "B6F6A16A9B1B8133",
        "BaggageBytes": "[[248 5] [240 0] [0 251 240 74 245 66 103 255 100] [240 1] [0 109 221 57 92 82 243 154 155] [240 3] [0 2]]",
        "ProcessID": 28841
      },
      {
        "Cycles": 0,
        "Agent": "edu.brown.cs.systems.xtrace.logging.BaggageWrappers",
        "ProcessName": "Data",
        "TaskID": "FBF04AF54267FF64",
        "ParentEventID": [
          "B6F6A16A9B1B8133"
        ],
        "Label": "Forking current baggage with Baggage.fork()",
        "Title": "X-Trace Task",
        "Host": "pinky22.mpi-sws.org",
        "HRT": 46041923107463029,
        "Operation": "fork",
        "Timestamp": "1556275590792.851074",
        "TenantClass": 0,
        "Source": "PacketHeader.java:95",
        "ThreadID": 5996,
        "ThreadName": "",
        "EventID": "60B9463EA9452589",
        "BaggageBytes": "[[248 5] [240 0] [0 251 240 74 245 66 103 255 100] [240 1] [0 182 246 161 106 155 27 129 51] [240 3] [0 2]]",
        "ProcessID": 28841
      },
      {
        "Cycles": 0,
        "Agent": "edu.brown.cs.systems.xtrace.logging.BaggageWrappers",
        "ProcessName": "Read",
        "TaskID": "FBF04AF54267FF64",
        "ParentEventID": [
          "B6F6A16A9B1B8133",
          "14BE57FB2D84C6AC"
        ],
        "Label": "Merged current baggage with other baggage",
        "Title": "X-Trace Task",
        "Host": "pinky19.mpi-sws.org",
        "HRT": 25491950852593870,
        "Operation": "join",
        "Timestamp": "1556275590792.942383",
        "TenantClass": 0,
        "Source": "RemoteBlockReader2.java:429",
        "ThreadID": 1,
        "ThreadName": "",
        "EventID": "02980832678EAFA8",
        "ProcessID": 21035
      },
      {
        "Cycles": 0,
        "Agent": "Execution-Sleep",
        "ProcessName": "Read",
        "TaskID": "FBF04AF54267FF64",
        "ParentEventID": [
          "FF3974393A799F70"
        ],
        "Label": "waited",
        "Title": "X-Trace Task",
        "Host": "pinky19.mpi-sws.org",
        "Duration": "593463",
        "HRT": 25491950852504319,
        "Operation": "waited",
        "Timestamp": "1556275590792.852783",
        "TenantClass": 0,
        "Source": "SocketIOWithTimeout.java:335",
        "ThreadID": 1,
        "ThreadName": "",
        "EventID": "14BE57FB2D84C6AC",
        "ProcessID": 21035
      },
      {
        "Cycles": 0,
        "Agent": "Execution-Sleep",
        "ProcessName": "Data",
        "TaskID": "FBF04AF54267FF64",
        "ParentEventID": [
          "60B9463EA9452589"
        ],
        "Label": "waited",
        "Title": "X-Trace Task",
        "Host": "pinky22.mpi-sws.org",
        "Duration": "8923",
        "HRT": 46041923107588404,
        "Operation": "waited",
        "Timestamp": "1556275590792.976318",
        "TenantClass": 0,
        "Source": "SocketIOWithTimeout.java:335",
        "ThreadID": 5996,
        "ThreadName": "",
        "EventID": "50AEC2E82EDF0813",
        "BaggageBytes": "[[248 5] [240 0] [0 251 240 74 245 66 103 255 100] [240 1] [0 96 185 70 62 169 69 37 137] [240 3] [0 2]]",
        "ProcessID": 28841
      },
      {
        "Cycles": 0,
        "Agent": "Execution-Sleep",
        "ProcessName": "Read",
        "TaskID": "FBF04AF54267FF64",
        "ParentEventID": [
          "02980832678EAFA8"
        ],
        "Label": "waited",
        "Title": "X-Trace Task",
        "Host": "pinky19.mpi-sws.org",
        "Duration": "102694",
        "HRT": 25491950852802747,
        "Operation": "waited",
        "Timestamp": "1556275590793.151367",
        "TenantClass": 0,
        "Source": "SocketIOWithTimeout.java:335",
        "ThreadID": 1,
        "ThreadName": "",
        "EventID": "74963397FD54F0AE",
        "ProcessID": 21035
      },
      {
        "Cycles": 0,
        "Agent": "edu.brown.cs.systems.xtrace.logging.BaggageWrappers",
        "ProcessName": "Read",
        "TaskID": "FBF04AF54267FF64",
        "ParentEventID": [
          "74963397FD54F0AE",
          "60B9463EA9452589"
        ],
        "Label": "Merged current baggage with other baggage",
        "Title": "X-Trace Task",
        "Host": "pinky19.mpi-sws.org",
        "HRT": 25491950852841838,
        "Operation": "join",
        "Timestamp": "1556275590793.190430",
        "TenantClass": 0,
        "Source": "PacketHeader.java:168",
        "ThreadID": 1,
        "ThreadName": "",
        "EventID": "4F9FCA22CC93421E",
        "ProcessID": 21035
      },
      {
        "Cycles": 0,
        "Agent": "Execution-Sleep",
        "ProcessName": "Read",
        "TaskID": "FBF04AF54267FF64",
        "ParentEventID": [
          "4F9FCA22CC93421E"
        ],
        "Label": "waited",
        "Title": "X-Trace Task",
        "Host": "pinky19.mpi-sws.org",
        "Duration": "22094",
        "HRT": 25491950852903060,
        "Operation": "waited",
        "Timestamp": "1556275590793.251465",
        "TenantClass": 0,
        "Source": "SocketIOWithTimeout.java:335",
        "ThreadID": 1,
        "ThreadName": "",
        "EventID": "32133B884119AB10",
        "ProcessID": 21035
      },
      {
        "Cycles": 0,
        "Agent": "edu.brown.cs.systems.xtrace.logging.BaggageWrappers",
        "ProcessName": "Read",
        "TaskID": "FBF04AF54267FF64",
        "ParentEventID": [
          "32133B884119AB10",
          "33304016DBABA39C"
        ],
        "Label": "Merged current baggage with other baggage",
        "Title": "X-Trace Task",
        "Host": "pinky19.mpi-sws.org",
        "HRT": 25491950852949062,
        "Operation": "join",
        "Timestamp": "1556275590793.297607",
        "TenantClass": 0,
        "Source": "PacketHeader.java:168",
        "ThreadID": 1,
        "ThreadName": "",
        "EventID": "444D5448E10F4454",
        "ProcessID": 21035
      },
      {
        "Cycles": 0,
        "Agent": "edu.brown.cs.systems.xtrace.logging.BaggageWrappers",
        "ProcessName": "Data",
        "TaskID": "FBF04AF54267FF64",
        "ParentEventID": [
          "50AEC2E82EDF0813"
        ],
        "Label": "Forking current baggage with Baggage.fork()",
        "Title": "X-Trace Task",
        "Host": "pinky22.mpi-sws.org",
        "HRT": 46041923107729873,
        "Operation": "fork",
        "Timestamp": "1556275590793.117920",
        "TenantClass": 0,
        "Source": "PacketHeader.java:95",
        "ThreadID": 5996,
        "ThreadName": "",
        "EventID": "33304016DBABA39C",
        "BaggageBytes": "[[248 5] [240 0] [0 251 240 74 245 66 103 255 100] [240 1] [0 80 174 194 232 46 223 8 19] [240 3] [0 2]]",
        "ProcessID": 28841
      },
      {
        "Cycles": 0,
        "Agent": "edu.brown.cs.systems.xtrace.logging.BaggageWrappers",
        "ProcessName": "Read",
        "TaskID": "FBF04AF54267FF64",
        "ParentEventID": [
          "444D5448E10F4454"
        ],
        "Label": "Forking current baggage with Baggage.fork()",
        "Title": "X-Trace Task",
        "Host": "pinky19.mpi-sws.org",
        "HRT": 25491950852958487,
        "Operation": "fork",
        "Timestamp": "1556275590793.307129",
        "TenantClass": 0,
        "Source": "RemoteBlockReader2.java:361",
        "ThreadID": 1,
        "ThreadName": "",
        "EventID": "32987AF46C3DF642",
        "ProcessID": 21035
      },
      {
        "Cycles": 0,
        "Agent": "edu.brown.cs.systems.xtrace.logging.BaggageWrappers",
        "ProcessName": "Data",
        "TaskID": "FBF04AF54267FF64",
        "ParentEventID": [
          "A729BFDF1311F14F",
          "32987AF46C3DF642"
        ],
        "Label": "Merged current baggage with other baggage",
        "Title": "X-Trace Task",
        "Host": "pinky22.mpi-sws.org",
        "HRT": 46041923108099089,
        "Operation": "join",
        "Timestamp": "1556275590793.487061",
        "TenantClass": 0,
        "Source": "DataXceiver.java:574",
        "ThreadID": 5996,
        "ThreadName": "",
        "EventID": "C805D534C5F80086",
        "BaggageBytes": "[[248 5] [240 0] [0 251 240 74 245 66 103 255 100] [240 1] [0 167 41 191 223 19 17 241 79] [0 50 152 122 244 108 61 246 66] [240 3] [0 2]]",
        "ProcessID": 28841
      },
      {
        "Cycles": 0,
        "Agent": "Execution-Sleep",
        "ProcessName": "Data",
        "TaskID": "FBF04AF54267FF64",
        "ParentEventID": [
          "33304016DBABA39C"
        ],
        "Label": "waited",
        "Title": "X-Trace Task",
        "Host": "pinky22.mpi-sws.org",
        "Duration": "86388",
        "HRT": 46041923107993436,
        "Operation": "waited",
        "Timestamp": "1556275590793.381348",
        "TenantClass": 0,
        "Source": "SocketIOWithTimeout.java:335",
        "ThreadID": 5996,
        "ThreadName": "",
        "EventID": "A729BFDF1311F14F",
        "BaggageBytes": "[[248 5] [240 0] [0 251 240 74 245 66 103 255 100] [240 1] [0 51 48 64 22 219 171 163 156] [240 3] [0 2]]",
        "ProcessID": 28841
      },
      {
        "Cycles": 0,
        "Agent": "Execution-CPU",
        "ProcessName": "Data",
        "TaskID": "FBF04AF54267FF64",
        "ParentEventID": [
          "C805D534C5F80086"
        ],
        "Label": "unset",
        "Title": "X-Trace Task",
        "Host": "pinky22.mpi-sws.org",
        "Duration": "1050449",
        "HRT": 46041923108165459,
        "Operation": "unset",
        "Timestamp": "1556275590793.553467",
        "TenantClass": 0,
        "Source": "DataXceiver.java:261",
        "ThreadID": 5996,
        "ThreadName": "",
        "EventID": "63C2C44C9BE55C6B",
        "BaggageBytes": "[[248 5] [240 0] [0 251 240 74 245 66 103 255 100] [240 1] [0 200 5 213 52 197 248 0 134] [240 3] [0 2]]",
        "ProcessID": 28841
      },
      {
        "Cycles": 0,
        "Agent": "edu.brown.cs.systems.retro.benchmarks.hdfs_client.Reader",
        "ProcessName": "Read",
        "TaskID": "FBF04AF54267FF64",
        "ParentEventID": [
          "0"
        ],
        "Label": "Reading file",
        "Title": "X-Trace Task",
        "Host": "pinky19.mpi-sws.org",
        "HRT": 25491950851115872,
        "Timestamp": "1556275590791.464355",
        "TenantClass": 0,
        "ThreadID": 1,
        "ThreadName": "",
        "EventID": "5F484FFD5C3B8443",
        "ProcessID": 21035,
        "Tag": [
          "reader_1kb",
          "Read Size: 1024"
        ]
      }
    ]
  }
]