[
  {
    "id": "924F5F5E7A62EF3B",
    "reports": [
      {
        "Cycles": 0,
        "Agent": "org.apache.hadoop.ipc.ProtobufRpcEngine",
        "ProcessName": "Read",
        "TaskID": "924F5F5E7A62EF3B",
        "ParentEventID": [
          "382637EFC05F531A"
        ],
        "Label": "Invoking org.apache.hadoop.hdfs.protocol.ClientProtocol.getBlockLocations",
        "Title": "X-Trace Task",
        "Host": "pinky19.mpi-sws.org",
        "HRT": 26966615003996771,
        "Timestamp": "1557750254944.328125",
        "TenantClass": 0,
        "Source": "ProtobufRpcEngine.java:228",
        "ThreadID": 1,
        "ThreadName": "",
        "EventID": "4E8B39A6B3CB99D9",
        "ProcessID": 2801
      },
      {
        "Cycles": 0,
        "Agent": "Execution-CPU",
        "ProcessName": "Read",
        "TaskID": "924F5F5E7A62EF3B",
        "ParentEventID": [
          "4E8B39A6B3CB99D9"
        ],
        "Label": "unset",
        "Title": "X-Trace Task",
        "Host": "pinky19.mpi-sws.org",
        "Duration": "25218052",
        "HRT": 26966615004024013,
        "Operation": "unset",
        "Timestamp": "1557750254944.355225",
        "TenantClass": 0,
        "Source": "Client.java:1027",
        "ThreadID": 1,
        "ThreadName": "",
        "EventID": "087D0A9BB84EEAD9",
        "ProcessID": 2801
      },
      {
        "Cycles": 0,
        "Agent": "edu.brown.cs.systems.xtrace.logging.BaggageWrappers",
        "ProcessName": "Read",
        "TaskID": "924F5F5E7A62EF3B",
        "ParentEventID": [
          "6BBF3E2E0556BBD1"
        ],
        "Label": "Forking current baggage with Baggage.fork()",
        "Title": "X-Trace Task",
        "Host": "pinky19.mpi-sws.org",
        "HRT": 26966615004083629,
        "Operation": "fork",
        "Timestamp": "1557750254944.414795",
        "TenantClass": 0,
        "Source": "Client.java:1043",
        "ThreadID": 41,
        "ThreadName": "",
        "EventID": "AF3AF150662AA20C",
        "ProcessID": 2801
      },
      {
        "Cycles": 0,
        "Agent": "Execution-CPU",
        "ProcessName": "Read",
        "TaskID": "924F5F5E7A62EF3B",
        "ParentEventID": [
          "087D0A9BB84EEAD9"
        ],
        "Label": "set",
        "Title": "X-Trace Task",
        "Host": "pinky19.mpi-sws.org",
        "HRT": 26966615004055133,
        "Operation": "set",
        "Timestamp": "1557750254944.386475",
        "TenantClass": 0,
        "Source": "Client.java:1032",
        "ThreadID": 41,
        "ThreadName": "",
        "EventID": "6BBF3E2E0556BBD1",
        "ProcessID": 2801
      },
      {
        "Cycles": 0,
        "Agent": "edu.brown.cs.systems.retro.benchmarks.hdfs_client.Reader",
        "ProcessName": "Read",
        "TaskID": "924F5F5E7A62EF3B",
        "ParentEventID": [
          "6F6D5DD396AF385A"
        ],
        "Label": "Reading file",
        "Title": "X-Trace Task",
        "Host": "pinky19.mpi-sws.org",
        "HRT": 26966615003945827,
        "Timestamp": "1557750254944.277100",
        "TenantClass": 0,
        "ThreadID": 1,
        "ThreadName": "",
        "EventID": "382637EFC05F531A",
        "ProcessID": 2801
      },
      {
        "Cycles": 0,
        "Agent": "Execution-CPU",
        "ProcessName": "Read",
        "TaskID": "924F5F5E7A62EF3B",
        "ParentEventID": [
          "F277E9CE3D607DAA"
        ],
        "Label": "set",
        "Title": "X-Trace Task",
        "Host": "pinky19.mpi-sws.org",
        "HRT": 26966615004191320,
        "Operation": "set",
        "Timestamp": "1557750254944.522705",
        "TenantClass": 0,
        "Source": "Client.java:1104",
        "ThreadID": 1,
        "ThreadName": "",
        "EventID": "50DF36F1135EADC5",
        "ProcessID": 2801
      },
      {
        "Cycles": 0,
        "Agent": "Execution-CPU",
        "ProcessName": "Read",
        "TaskID": "924F5F5E7A62EF3B",
        "ParentEventID": [
          "AF3AF150662AA20C"
        ],
        "Label": "unset",
        "Title": "X-Trace Task",
        "Host": "pinky19.mpi-sws.org",
        "Duration": "84979",
        "HRT": 26966615004164908,
        "Operation": "unset",
        "Timestamp": "1557750254944.496094",
        "TenantClass": 0,
        "Source": "Client.java:1062",
        "ThreadID": 41,
        "ThreadName": "",
        "EventID": "F277E9CE3D607DAA",
        "ProcessID": 2801
      },
      {
        "Cycles": 0,
        "Agent": "Execution-CPU",
        "ProcessName": "Name",
        "TaskID": "924F5F5E7A62EF3B",
        "ParentEventID": [
          "AF3AF150662AA20C"
        ],
        "Label": "set",
        "Title": "X-Trace Task",
        "Host": "pinky19.mpi-sws.org",
        "HRT": 26966615004240619,
        "Operation": "set",
        "Timestamp": "1557750254944.571045",
        "TenantClass": 0,
        "Source": "Server.java:1840",
        "ThreadID": 48,
        "ThreadName": "",
        "EventID": "E315F050708FBC1E",
        "BaggageBytes": "[[248 5] [240 0] [0 146 79 95 94 122 98 239 59] [240 1] [0 175 58 241 80 102 42 162 12] [240 3] [0 2]]",
        "ProcessID": 2171
      },
      {
        "Cycles": 0,
        "Agent": "edu.brown.cs.systems.xtrace.logging.BaggageWrappers",
        "ProcessName": "Name",
        "TaskID": "924F5F5E7A62EF3B",
        "ParentEventID": [
          "E315F050708FBC1E"
        ],
        "Label": "Forking current baggage with Baggage.fork()",
        "Title": "X-Trace Task",
        "Host": "pinky19.mpi-sws.org",
        "HRT": 26966615004270591,
        "Operation": "fork",
        "Timestamp": "1557750254944.601074",
        "TenantClass": 0,
        "Source": "Server.java:550",
        "ThreadID": 48,
        "ThreadName": "",
        "EventID": "570BC9B717811499",
        "BaggageBytes": "[[248 5] [240 0] [0 146 79 95 94 122 98 239 59] [240 1] [0 227 21 240 80 112 143 188 30] [240 3] [0 2]]",
        "ProcessID": 2171
      },
      {
        "Cycles": 0,
        "Agent": "Execution-CPU",
        "ProcessName": "Name",
        "TaskID": "924F5F5E7A62EF3B",
        "ParentEventID": [
          "570BC9B717811499"
        ],
        "Label": "set",
        "Title": "X-Trace Task",
        "Host": "pinky19.mpi-sws.org",
        "HRT": 26966615004301062,
        "Operation": "set",
        "Timestamp": "1557750254944.631348",
        "TenantClass": 0,
        "Source": "Server.java:2071",
        "ThreadID": 59,
        "ThreadName": "",
        "EventID": "64130BC740A06941",
        "BaggageBytes": "[[248 5] [240 0] [0 146 79 95 94 122 98 239 59] [240 1] [0 87 11 201 183 23 129 20 153] [240 3] [0 2]]",
        "ProcessID": 2171
      },
      {
        "Cycles": 0,
        "Agent": "org.apache.hadoop.ipc.Server",
        "ProcessName": "Name",
        "TaskID": "924F5F5E7A62EF3B",
        "ParentEventID": [
          "64130BC740A06941"
        ],
        "Label": "getBlockLocations in org.apache.hadoop.hdfs.protocol.ClientProtocol",
        "Title": "X-Trace Task",
        "Host": "pinky19.mpi-sws.org",
        "HRT": 26966615004336017,
        "Timestamp": "1557750254944.666504",
        "TenantClass": 0,
        "Source": "ProtobufRpcEngine.java:601",
        "ThreadID": 59,
        "ThreadName": "",
        "EventID": "5D32B398D02F4264",
        "BaggageBytes": "[[248 5] [240 0] [0 146 79 95 94 122 98 239 59] [240 1] [0 100 19 11 199 64 160 105 65] [240 3] [0 2]]",
        "ProcessID": 2171
      },
      {
        "Cycles": 0,
        "Agent": "Execution-CPU",
        "ProcessName": "Name",
        "TaskID": "924F5F5E7A62EF3B",
        "ParentEventID": [
          "570BC9B717811499"
        ],
        "Label": "unset",
        "Title": "X-Trace Task",
        "Host": "pinky19.mpi-sws.org",
        "Duration": "24604",
        "HRT": 26966615004291169,
        "Operation": "unset",
        "Timestamp": "1557750254944.621582",
        "TenantClass": 0,
        "Source": "Server.java:1828",
        "ThreadID": 48,
        "ThreadName": "",
        "EventID": "55B4233399180F13",
        "BaggageBytes": "[[248 5] [240 0] [0 146 79 95 94 122 98 239 59] [240 1] [0 87 11 201 183 23 129 20 153] [240 3] [0 2]]",
        "ProcessID": 2171
      },
      {
        "Cycles": 0,
        "Agent": "org.apache.hadoop.hdfs.server.namenode.FSNamesystem.audit",
        "ProcessName": "Name",
        "TaskID": "924F5F5E7A62EF3B",
        "ParentEventID": [
          "5D32B398D02F4264"
        ],
        "Label": "allowed=true\tugi=plascas (auth:SIMPLE)\tip=/139.19.171.63\tcmd=open\tsrc=/ds/LoRIgHDMUvwozBHI\tdst=null\tperm=null\tproto=rpc",
        "Title": "X-Trace Task",
        "Host": "pinky19.mpi-sws.org",
        "HRT": 26966615004384771,
        "Timestamp": "1557750254944.715088",
        "TenantClass": 0,
        "Source": "FSNamesystem.java:8313",
        "ThreadID": 59,
        "ThreadName": "",
        "EventID": "0F55CD56FF2D946E",
        "BaggageBytes": "[[248 5] [240 0] [0 146 79 95 94 122 98 239 59] [240 1] [0 93 50 179 152 208 47 66 100] [240 3] [0 2]]",
        "ProcessID": 2171
      },
      {
        "Cycles": 0,
        "Agent": "Execution-CPU",
        "ProcessName": "Name",
        "TaskID": "924F5F5E7A62EF3B",
        "ParentEventID": [
          "3F4B64548C8B95F7"
        ],
        "Label": "unset",
        "Title": "X-Trace Task",
        "Host": "pinky19.mpi-sws.org",
        "Duration": "210197",
        "HRT": 26966615004533225,
        "Operation": "unset",
        "Timestamp": "1557750254944.863525",
        "TenantClass": 0,
        "Source": "Server.java:1058",
        "ThreadID": 59,
        "ThreadName": "",
        "EventID": "B76ACC88483346F8",
        "BaggageBytes": "[[248 5] [240 0] [0 146 79 95 94 122 98 239 59] [240 1] [0 63 75 100 84 140 139 149 247] [240 3] [0 2]]",
        "ProcessID": 2171
      },
      {
        "Cycles": 0,
        "Agent": "edu.brown.cs.systems.xtrace.logging.BaggageWrappers",
        "ProcessName": "Name",
        "TaskID": "924F5F5E7A62EF3B",
        "ParentEventID": [
          "0F55CD56FF2D946E"
        ],
        "Label": "Forking current baggage with Baggage.fork()",
        "Title": "X-Trace Task",
        "Host": "pinky19.mpi-sws.org",
        "HRT": 26966615004427270,
        "Operation": "fork",
        "Timestamp": "1557750254944.757568",
        "TenantClass": 0,
        "Source": "Server.java:2398",
        "ThreadID": 59,
        "ThreadName": "",
        "EventID": "3F4B64548C8B95F7",
        "BaggageBytes": "[[248 5] [240 0] [0 146 79 95 94 122 98 239 59] [240 1] [0 15 85 205 86 255 45 148 110] [240 3] [0 2]]",
        "ProcessID": 2171
      },
      {
        "Cycles": 0,
        "Agent": "Execution-CPU",
        "ProcessName": "Read",
        "TaskID": "924F5F5E7A62EF3B",
        "ParentEventID": [
          "3F4B64548C8B95F7"
        ],
        "Label": "set",
        "Title": "X-Trace Task",
        "Host": "pinky19.mpi-sws.org",
        "HRT": 26966615004582615,
        "Operation": "set",
        "Timestamp": "1557750254944.913818",
        "TenantClass": 0,
        "Source": "Client.java:302",
        "ThreadID": 40,
        "ThreadName": "",
        "EventID": "8F11599B13D8DC7E",
        "ProcessID": 2801
      },
      {
        "Cycles": 0,
        "Agent": "Execution-CPU",
        "ProcessName": "Read",
        "TaskID": "924F5F5E7A62EF3B",
        "ParentEventID": [
          "8F11599B13D8DC7E"
        ],
        "Label": "unset",
        "Title": "X-Trace Task",
        "Host": "pinky19.mpi-sws.org",
        "Duration": "11138",
        "HRT": 26966615004610202,
        "Operation": "unset",
        "Timestamp": "1557750254944.941406",
        "TenantClass": 0,
        "Source": "Client.java:1168",
        "ThreadID": 40,
        "ThreadName": "",
        "EventID": "41EA0A59F6E45D49",
        "ProcessID": 2801
      },
      {
        "Cycles": 0,
        "Agent": "Execution-Sleep",
        "ProcessName": "Read",
        "TaskID": "924F5F5E7A62EF3B",
        "ParentEventID": [
          "50DF36F1135EADC5"
        ],
        "Label": "waited",
        "Title": "X-Trace Task",
        "Host": "pinky19.mpi-sws.org",
        "Duration": "430963",
        "HRT": 26966615004634889,
        "Operation": "waited",
        "Timestamp": "1557750254944.966064",
        "TenantClass": 0,
        "Source": "Client.java:1537",
        "ThreadID": 1,
        "ThreadName": "",
        "EventID": "B144DDFB0ECD94EB",
        "ProcessID": 2801
      },
      {
        "Cycles": 0,
        "Agent": "org.apache.hadoop.ipc.ProtobufRpcEngine",
        "ProcessName": "Read",
        "TaskID": "924F5F5E7A62EF3B",
        "ParentEventID": [
          "AFEEDDA47E5BC205"
        ],
        "Label": "org.apache.hadoop.hdfs.protocol.ClientProtocol.getBlockLocations completed",
        "Title": "X-Trace Task",
        "Host": "pinky19.mpi-sws.org",
        "HRT": 26966615004708649,
        "Timestamp": "1557750254945.040039",
        "TenantClass": 0,
        "Source": "ProtobufRpcEngine.java:275",
        "ThreadID": 1,
        "ThreadName": "",
        "EventID": "25EAB58909FF8E29",
        "ProcessID": 2801
      },
      {
        "Cycles": 0,
        "Agent": "edu.brown.cs.systems.xtrace.logging.BaggageWrappers",
        "ProcessName": "Read",
        "TaskID": "924F5F5E7A62EF3B",
        "ParentEventID": [
          "41EA0A59F6E45D49",
          "B144DDFB0ECD94EB"
        ],
        "Label": "Merged current baggage with other baggage",
        "Title": "X-Trace Task",
        "Host": "pinky19.mpi-sws.org",
        "HRT": 26966615004655916,
        "Operation": "join",
        "Timestamp": "1557750254944.987305",
        "TenantClass": 0,
        "Source": "Client.java:1545",
        "ThreadID": 1,
        "ThreadName": "",
        "EventID": "AFEEDDA47E5BC205",
        "ProcessID": 2801
      },
      {
        "Cycles": 0,
        "Agent": "Execution-Sleep",
        "ProcessName": "Read",
        "TaskID": "924F5F5E7A62EF3B",
        "ParentEventID": [
          "25EAB58909FF8E29"
        ],
        "Label": "waited",
        "Title": "X-Trace Task",
        "Host": "pinky19.mpi-sws.org",
        "Duration": "4942",
        "HRT": 26966615004834725,
        "Operation": "waited",
        "Timestamp": "1557750254945.166016",
        "TenantClass": 0,
        "Source": "SocketIOWithTimeout.java:335",
        "ThreadID": 1,
        "ThreadName": "",
        "EventID": "A8D6F5A6F80362C2",
        "ProcessID": 2801
      },
      {
        "Cycles": 0,
        "Agent": "Execution-CPU",
        "ProcessName": "Data",
        "TaskID": "924F5F5E7A62EF3B",
        "ParentEventID": [
          "4C62123B5DFB625E"
        ],
        "Label": "set",
        "Title": "X-Trace Task",
        "Host": "pinky19.mpi-sws.org",
        "HRT": 26966615005284087,
        "Operation": "set",
        "Timestamp": "1557750254945.610107",
        "TenantClass": 0,
        "Source": "Receiver.java:117",
        "ThreadID": 37338,
        "ThreadName": "",
        "EventID": "863254BF06C1B057",
        "BaggageBytes": "[[248 5] [240 0] [0 146 79 95 94 122 98 239 59] [240 1] [0 76 98 18 59 93 251 98 94] [240 3] [0 2]]",
        "ProcessID": 2319
      },
      {
        "Cycles": 0,
        "Agent": "edu.brown.cs.systems.xtrace.logging.BaggageWrappers",
        "ProcessName": "Read",
        "TaskID": "924F5F5E7A62EF3B",
        "ParentEventID": [
          "A8D6F5A6F80362C2"
        ],
        "Label": "Forking current baggage with Baggage.fork()",
        "Title": "X-Trace Task",
        "Host": "pinky19.mpi-sws.org",
        "HRT": 26966615004885324,
        "Operation": "fork",
        "Timestamp": "1557750254945.216553",
        "TenantClass": 0,
        "Source": "DataTransferProtoUtil.java:94",
        "ThreadID": 1,
        "ThreadName": "",
        "EventID": "4C62123B5DFB625E",
        "ProcessID": 2801
      },
      {
        "Cycles": 0,
        "Agent": "edu.brown.cs.systems.xtrace.logging.XTraceInit",
        "ProcessName": "Data",
        "TaskID": "924F5F5E7A62EF3B",
        "ParentEventID": [
          "863254BF06C1B057"
        ],
        "Label": "Thread.setName: DataXceiver for client DFSClient_NONMAPREDUCE_310321604_1 at /139.19.171.63:48800 [Sending block BP-1633380353-139.19.171.63-1554193446451:blk_1073764132_23308]",
        "Title": "X-Trace Task",
        "Host": "pinky19.mpi-sws.org",
        "HRT": 26966615005378269,
        "Timestamp": "1557750254945.704346",
        "TenantClass": 0,
        "Source": "DataXceiver.java:168",
        "ThreadID": 37338,
        "ThreadName": "",
        "EventID": "C0BAFDB47D12959C",
        "BaggageBytes": "[[248 5] [240 0] [0 146 79 95 94 122 98 239 59] [240 1] [0 134 50 84 191 6 193 176 87] [240 3] [0 2]]",
        "ProcessID": 2319
      },
      {
        "Cycles": 0,
        "Agent": "Execution-Sleep",
        "ProcessName": "Read",
        "TaskID": "924F5F5E7A62EF3B",
        "ParentEventID": [
          "4C62123B5DFB625E"
        ],
        "Label": "waited",
        "Title": "X-Trace Task",
        "Host": "pinky19.mpi-sws.org",
        "Duration": "748666",
        "HRT": 26966615005736554,
        "Operation": "waited",
        "Timestamp": "1557750254946.067871",
        "TenantClass": 0,
        "Source": "SocketIOWithTimeout.java:335",
        "ThreadID": 1,
        "ThreadName": "",
        "EventID": "503EEDC0C09B6E17",
        "ProcessID": 2801
      },
      {
        "Cycles": 0,
        "Agent": "edu.brown.cs.systems.xtrace.logging.BaggageWrappers",
        "ProcessName": "Data",
        "TaskID": "924F5F5E7A62EF3B",
        "ParentEventID": [
          "C0BAFDB47D12959C"
        ],
        "Label": "Forking current baggage with Baggage.fork()",
        "Title": "X-Trace Task",
        "Host": "pinky19.mpi-sws.org",
        "HRT": 26966615005560913,
        "Operation": "fork",
        "Timestamp": "1557750254945.886963",
        "TenantClass": 0,
        "Source": "DataXceiver.java:1257",
        "ThreadID": 37338,
        "ThreadName": "",
        "EventID": "223ACDCDC52D4893",
        "BaggageBytes": "[[248 5] [240 0] [0 146 79 95 94 122 98 239 59] [240 1] [0 192 186 253 180 125 18 149 156] [240 3] [0 2]]",
        "ProcessID": 2319
      },
      {
        "Cycles": 0,
        "Agent": "edu.brown.cs.systems.xtrace.logging.BaggageWrappers",
        "ProcessName": "Read",
        "TaskID": "924F5F5E7A62EF3B",
        "ParentEventID": [
          "503EEDC0C09B6E17",
          "223ACDCDC52D4893"
        ],
        "Label": "Merged current baggage with other baggage",
        "Title": "X-Trace Task",
        "Host": "pinky19.mpi-sws.org",
        "HRT": 26966615005810263,
        "Operation": "join",
        "Timestamp": "1557750254946.141602",
        "TenantClass": 0,
        "Source": "RemoteBlockReader2.java:429",
        "ThreadID": 1,
        "ThreadName": "",
        "EventID": "DA91CCC60DC19830",
        "ProcessID": 2801
      },
      {
        "Cycles": 0,
        "Agent": "edu.brown.cs.systems.xtrace.logging.BaggageWrappers",
        "ProcessName": "Data",
        "TaskID": "924F5F5E7A62EF3B",
        "ParentEventID": [
          "223ACDCDC52D4893"
        ],
        "Label": "Forking current baggage with Baggage.fork()",
        "Title": "X-Trace Task",
        "Host": "pinky19.mpi-sws.org",
        "HRT": 26966615005741996,
        "Operation": "fork",
        "Timestamp": "1557750254946.068115",
        "TenantClass": 0,
        "Source": "PacketHeader.java:95",
        "ThreadID": 37338,
        "ThreadName": "",
        "EventID": "207352482FB47B89",
        "BaggageBytes": "[[248 5] [240 0] [0 146 79 95 94 122 98 239 59] [240 1] [0 34 58 205 205 197 45 72 147] [240 3] [0 2]]",
        "ProcessID": 2319
      },
      {
        "Cycles": 0,
        "Agent": "Execution-Sleep",
        "ProcessName": "Read",
        "TaskID": "924F5F5E7A62EF3B",
        "ParentEventID": [
          "DA91CCC60DC19830"
        ],
        "Label": "waited",
        "Title": "X-Trace Task",
        "Host": "pinky19.mpi-sws.org",
        "Duration": "3992",
        "HRT": 26966615005864946,
        "Operation": "waited",
        "Timestamp": "1557750254946.196289",
        "TenantClass": 0,
        "Source": "SocketIOWithTimeout.java:335",
        "ThreadID": 1,
        "ThreadName": "",
        "EventID": "E04233D53725201F",
        "ProcessID": 2801
      },
      {
        "Cycles": 0,
        "Agent": "Execution-Sleep",
        "ProcessName": "Read",
        "TaskID": "924F5F5E7A62EF3B",
        "ParentEventID": [
          "E04233D53725201F"
        ],
        "Label": "waited",
        "Title": "X-Trace Task",
        "Host": "pinky19.mpi-sws.org",
        "Duration": "111045",
        "HRT": 26966615006043943,
        "Operation": "waited",
        "Timestamp": "1557750254946.375244",
        "TenantClass": 0,
        "Source": "SocketIOWithTimeout.java:335",
        "ThreadID": 1,
        "ThreadName": "",
        "EventID": "74B66A3FEDC0619C",
        "ProcessID": 2801
      },
      {
        "Cycles": 0,
        "Agent": "Execution-Sleep",
        "ProcessName": "Data",
        "TaskID": "924F5F5E7A62EF3B",
        "ParentEventID": [
          "207352482FB47B89"
        ],
        "Label": "waited",
        "Title": "X-Trace Task",
        "Host": "pinky19.mpi-sws.org",
        "Duration": "11108",
        "HRT": 26966615005894180,
        "Operation": "waited",
        "Timestamp": "1557750254946.220215",
        "TenantClass": 0,
        "Source": "SocketIOWithTimeout.java:335",
        "ThreadID": 37338,
        "ThreadName": "",
        "EventID": "8A271B96F8690D00",
        "BaggageBytes": "[[248 5] [240 0] [0 146 79 95 94 122 98 239 59] [240 1] [0 32 115 82 72 47 180 123 137] [240 3] [0 2]]",
        "ProcessID": 2319
      },
      {
        "Cycles": 0,
        "Agent": "edu.brown.cs.systems.xtrace.logging.BaggageWrappers",
        "ProcessName": "Read",
        "TaskID": "924F5F5E7A62EF3B",
        "ParentEventID": [
          "207352482FB47B89",
          "74B66A3FEDC0619C"
        ],
        "Label": "Merged current baggage with other baggage",
        "Title": "X-Trace Task",
        "Host": "pinky19.mpi-sws.org",
        "HRT": 26966615006097335,
        "Operation": "join",
        "Timestamp": "1557750254946.428711",
        "TenantClass": 0,
        "Source": "PacketHeader.java:168",
        "ThreadID": 1,
        "ThreadName": "",
        "EventID": "66B3C0961A464F6C",
        "ProcessID": 2801
      },
      {
        "Cycles": 0,
        "Agent": "Execution-Sleep",
        "ProcessName": "Read",
        "TaskID": "924F5F5E7A62EF3B",
        "ParentEventID": [
          "66B3C0961A464F6C"
        ],
        "Label": "waited",
        "Title": "X-Trace Task",
        "Host": "pinky19.mpi-sws.org",
        "Duration": "26600",
        "HRT": 26966615006211887,
        "Operation": "waited",
        "Timestamp": "1557750254946.543213",
        "TenantClass": 0,
        "Source": "SocketIOWithTimeout.java:335",
        "ThreadID": 1,
        "ThreadName": "",
        "EventID": "6A58580740A9F405",
        "ProcessID": 2801
      },
      {
        "Cycles": 0,
        "Agent": "edu.brown.cs.systems.xtrace.logging.BaggageWrappers",
        "ProcessName": "Data",
        "TaskID": "924F5F5E7A62EF3B",
        "ParentEventID": [
          "8A271B96F8690D00"
        ],
        "Label": "Forking current baggage with Baggage.fork()",
        "Title": "X-Trace Task",
        "Host": "pinky19.mpi-sws.org",
        "HRT": 26966615006082432,
        "Operation": "fork",
        "Timestamp": "1557750254946.408447",
        "TenantClass": 0,
        "Source": "PacketHeader.java:95",
        "ThreadID": 37338,
        "ThreadName": "",
        "EventID": "F528F97B40FD70C9",
        "BaggageBytes": "[[248 5] [240 0] [0 146 79 95 94 122 98 239 59] [240 1] [0 138 39 27 150 248 105 13 0] [240 3] [0 2]]",
        "ProcessID": 2319
      },
      {
        "Cycles": 0,
        "Agent": "edu.brown.cs.systems.xtrace.logging.BaggageWrappers",
        "ProcessName": "Read",
        "TaskID": "924F5F5E7A62EF3B",
        "ParentEventID": [
          "6A58580740A9F405",
          "F528F97B40FD70C9"
        ],
        "Label": "Merged current baggage with other baggage",
        "Title": "X-Trace Task",
        "Host": "pinky19.mpi-sws.org",
        "HRT": 26966615006271272,
        "Operation": "join",
        "Timestamp": "1557750254946.602539",
        "TenantClass": 0,
        "Source": "PacketHeader.java:168",
        "ThreadID": 1,
        "ThreadName": "",
        "EventID": "A9F390055324553B",
        "ProcessID": 2801
      },
      {
        "Cycles": 0,
        "Agent": "edu.brown.cs.systems.xtrace.logging.BaggageWrappers",
        "ProcessName": "Read",
        "TaskID": "924F5F5E7A62EF3B",
        "ParentEventID": [
          "A9F390055324553B"
        ],
        "Label": "Forking current baggage with Baggage.fork()",
        "Title": "X-Trace Task",
        "Host": "pinky19.mpi-sws.org",
        "HRT": 26966615006282194,
        "Operation": "fork",
        "Timestamp": "1557750254946.613525",
        "TenantClass": 0,
        "Source": "RemoteBlockReader2.java:361",
        "ThreadID": 1,
        "ThreadName": "",
        "EventID": "EA0F81E11BCFCD90",
        "ProcessID": 2801
      },
      {
        "Cycles": 0,
        "Agent": "edu.brown.cs.systems.xtrace.logging.BaggageWrappers",
        "ProcessName": "Read",
        "TaskID": "924F5F5E7A62EF3B",
        "ParentEventID": [
          "EA0F81E11BCFCD90"
        ],
        "Label": "Forking current baggage with Baggage.fork()",
        "Title": "X-Trace Task",
        "Host": "pinky19.mpi-sws.org",
        "HRT": 26966615006354506,
        "Operation": "fork",
        "Timestamp": "1557750254946.685791",
        "TenantClass": 0,
        "Source": "DataTransferProtoUtil.java:94",
        "ThreadID": 1,
        "ThreadName": "",
        "EventID": "A5849E37BF08C4E8",
        "ProcessID": 2801
      },
      {
        "Cycles": 0,
        "Agent": "edu.brown.cs.systems.xtrace.logging.BaggageWrappers",
        "ProcessName": "Data",
        "TaskID": "924F5F5E7A62EF3B",
        "ParentEventID": [
          "E0301A6F36730F76",
          "EA0F81E11BCFCD90"
        ],
        "Label": "Merged current baggage with other baggage",
        "Title": "X-Trace Task",
        "Host": "pinky19.mpi-sws.org",
        "HRT": 26966615006481823,
        "Operation": "join",
        "Timestamp": "1557750254946.807861",
        "TenantClass": 0,
        "Source": "DataXceiver.java:574",
        "ThreadID": 37338,
        "ThreadName": "",
        "EventID": "B9AF37D88D8CAD5B",
        "BaggageBytes": "[[248 5] [240 0] [0 146 79 95 94 122 98 239 59] [240 1] [0 224 48 26 111 54 115 15 118] [0 234 15 129 225 27 207 205 144] [240 3] [0 2]]",
        "ProcessID": 2319
      },
      {
        "Cycles": 0,
        "Agent": "Execution-Sleep",
        "ProcessName": "Data",
        "TaskID": "924F5F5E7A62EF3B",
        "ParentEventID": [
          "F528F97B40FD70C9"
        ],
        "Label": "waited",
        "Title": "X-Trace Task",
        "Host": "pinky19.mpi-sws.org",
        "Duration": "46341",
        "HRT": 26966615006338348,
        "Operation": "waited",
        "Timestamp": "1557750254946.664307",
        "TenantClass": 0,
        "Source": "SocketIOWithTimeout.java:335",
        "ThreadID": 37338,
        "ThreadName": "",
        "EventID": "E0301A6F36730F76",
        "BaggageBytes": "[[248 5] [240 0] [0 146 79 95 94 122 98 239 59] [240 1] [0 245 40 249 123 64 253 112 201] [240 3] [0 2]]",
        "ProcessID": 2319
      },
      {
        "Cycles": 0,
        "Agent": "Execution-CPU",
        "ProcessName": "Data",
        "TaskID": "924F5F5E7A62EF3B",
        "ParentEventID": [
          "B9AF37D88D8CAD5B"
        ],
        "Label": "unset",
        "Title": "X-Trace Task",
        "Host": "pinky19.mpi-sws.org",
        "Duration": "1182010",
        "HRT": 26966615006531329,
        "Operation": "unset",
        "Timestamp": "1557750254946.857422",
        "TenantClass": 0,
        "Source": "DataXceiver.java:261",
        "ThreadID": 37338,
        "ThreadName": "",
        "EventID": "12CBDAB8250CBFAB",
        "BaggageBytes": "[[248 5] [240 0] [0 146 79 95 94 122 98 239 59] [240 1] [0 185 175 55 216 141 140 173 91] [240 3] [0 2]]",
        "ProcessID": 2319
      },
      {
        "Cycles": 0,
        "Agent": "Execution-CPU",
        "ProcessName": "Data",
        "TaskID": "924F5F5E7A62EF3B",
        "ParentEventID": [
          "A5849E37BF08C4E8"
        ],
        "Label": "set",
        "Title": "X-Trace Task",
        "Host": "pinky19.mpi-sws.org",
        "HRT": 26966615006579217,
        "Operation": "set",
        "Timestamp": "1557750254946.905273",
        "TenantClass": 0,
        "Source": "Receiver.java:117",
        "ThreadID": 37338,
        "ThreadName": "",
        "EventID": "CAD410A0CEC58D7E",
        "BaggageBytes": "[[248 5] [240 0] [0 146 79 95 94 122 98 239 59] [240 1] [0 165 132 158 55 191 8 196 232] [240 3] [0 2]]",
        "ProcessID": 2319
      },
      {
        "Cycles": 0,
        "Agent": "edu.brown.cs.systems.xtrace.logging.BaggageWrappers",
        "ProcessName": "Data",
        "TaskID": "924F5F5E7A62EF3B",
        "ParentEventID": [
          "CC53AF41B08CE3C2"
        ],
        "Label": "Forking current baggage with Baggage.fork()",
        "Title": "X-Trace Task",
        "Host": "pinky19.mpi-sws.org",
        "HRT": 26966615006806126,
        "Operation": "fork",
        "Timestamp": "1557750254947.132080",
        "TenantClass": 0,
        "Source": "DataXceiver.java:1257",
        "ThreadID": 37338,
        "ThreadName": "",
        "EventID": "E48C14CB92244E63",
        "BaggageBytes": "[[248 5] [240 0] [0 146 79 95 94 122 98 239 59] [240 1] [0 204 83 175 65 176 140 227 194] [240 3] [0 2]]",
        "ProcessID": 2319
      },
      {
        "Cycles": 0,
        "Agent": "edu.brown.cs.systems.xtrace.logging.XTraceInit",
        "ProcessName": "Data",
        "TaskID": "924F5F5E7A62EF3B",
        "ParentEventID": [
          "CAD410A0CEC58D7E"
        ],
        "Label": "Thread.setName: DataXceiver for client DFSClient_NONMAPREDUCE_310321604_1 at /139.19.171.63:48800 [Sending block BP-1633380353-139.19.171.63-1554193446451:blk_1073764132_23308]",
        "Title": "X-Trace Task",
        "Host": "pinky19.mpi-sws.org",
        "HRT": 26966615006633124,
        "Timestamp": "1557750254946.959229",
        "TenantClass": 0,
        "Source": "DataXceiver.java:168",
        "ThreadID": 37338,
        "ThreadName": "",
        "EventID": "CC53AF41B08CE3C2",
        "BaggageBytes": "[[248 5] [240 0] [0 146 79 95 94 122 98 239 59] [240 1] [0 202 212 16 160 206 197 141 126] [240 3] [0 2]]",
        "ProcessID": 2319
      },
      {
        "Cycles": 0,
        "Agent": "edu.brown.cs.systems.xtrace.logging.BaggageWrappers",
        "ProcessName": "Data",
        "TaskID": "924F5F5E7A62EF3B",
        "ParentEventID": [
          "E48C14CB92244E63"
        ],
        "Label": "Forking current baggage with Baggage.fork()",
        "Title": "X-Trace Task",
        "Host": "pinky19.mpi-sws.org",
        "HRT": 26966615006931727,
        "Operation": "fork",
        "Timestamp": "1557750254947.257812",
        "TenantClass": 0,
        "Source": "PacketHeader.java:95",
        "ThreadID": 37338,
        "ThreadName": "",
        "EventID": "F1923DEE20800628",
        "BaggageBytes": "[[248 5] [240 0] [0 146 79 95 94 122 98 239 59] [240 1] [0 228 140 20 203 146 36 78 99] [240 3] [0 2]]",
        "ProcessID": 2319
      },
      {
        "Cycles": 0,
        "Agent": "edu.brown.cs.systems.xtrace.logging.BaggageWrappers",
        "ProcessName": "Read",
        "TaskID": "924F5F5E7A62EF3B",
        "ParentEventID": [
          "9067A663E65C7BAE",
          "E48C14CB92244E63"
        ],
        "Label": "Merged current baggage with other baggage",
        "Title": "X-Trace Task",
        "Host": "pinky19.mpi-sws.org",
        "HRT": 26966615007061568,
        "Operation": "join",
        "Timestamp": "1557750254947.392822",
        "TenantClass": 0,
        "Source": "RemoteBlockReader2.java:429",
        "ThreadID": 1,
        "ThreadName": "",
        "EventID": "067F6C5C2755A6A4",
        "ProcessID": 2801
      },
      {
        "Cycles": 0,
        "Agent": "Execution-Sleep",
        "ProcessName": "Data",
        "TaskID": "924F5F5E7A62EF3B",
        "ParentEventID": [
          "F1923DEE20800628"
        ],
        "Label": "waited",
        "Title": "X-Trace Task",
        "Host": "pinky19.mpi-sws.org",
        "Duration": "8738",
        "HRT": 26966615007054188,
        "Operation": "waited",
        "Timestamp": "1557750254947.380127",
        "TenantClass": 0,
        "Source": "SocketIOWithTimeout.java:335",
        "ThreadID": 37338,
        "ThreadName": "",
        "EventID": "245D9E4C32D56223",
        "BaggageBytes": "[[248 5] [240 0] [0 146 79 95 94 122 98 239 59] [240 1] [0 241 146 61 238 32 128 6 40] [240 3] [0 2]]",
        "ProcessID": 2319
      },
      {
        "Cycles": 0,
        "Agent": "Execution-Sleep",
        "ProcessName": "Read",
        "TaskID": "924F5F5E7A62EF3B",
        "ParentEventID": [
          "A5849E37BF08C4E8"
        ],
        "Label": "waited",
        "Title": "X-Trace Task",
        "Host": "pinky19.mpi-sws.org",
        "Duration": "508694",
        "HRT": 26966615006945733,
        "Operation": "waited",
        "Timestamp": "1557750254947.277100",
        "TenantClass": 0,
        "Source": "SocketIOWithTimeout.java:335",
        "ThreadID": 1,
        "ThreadName": "",
        "EventID": "9067A663E65C7BAE",
        "ProcessID": 2801
      },
      {
        "Cycles": 0,
        "Agent": "Execution-Sleep",
        "ProcessName": "Read",
        "TaskID": "924F5F5E7A62EF3B",
        "ParentEventID": [
          "067F6C5C2755A6A4"
        ],
        "Label": "waited",
        "Title": "X-Trace Task",
        "Host": "pinky19.mpi-sws.org",
        "Duration": "23860",
        "HRT": 26966615007184340,
        "Operation": "waited",
        "Timestamp": "1557750254947.515625",
        "TenantClass": 0,
        "Source": "SocketIOWithTimeout.java:335",
        "ThreadID": 1,
        "ThreadName": "",
        "EventID": "9D8B0D982A4AB6F9",
        "ProcessID": 2801
      },
      {
        "Cycles": 0,
        "Agent": "edu.brown.cs.systems.xtrace.logging.BaggageWrappers",
        "ProcessName": "Read",
        "TaskID": "924F5F5E7A62EF3B",
        "ParentEventID": [
          "9D8B0D982A4AB6F9",
          "F1923DEE20800628"
        ],
        "Label": "Merged current baggage with other baggage",
        "Title": "X-Trace Task",
        "Host": "pinky19.mpi-sws.org",
        "HRT": 26966615007240082,
        "Operation": "join",
        "Timestamp": "1557750254947.571289",
        "TenantClass": 0,
        "Source": "PacketHeader.java:168",
        "ThreadID": 1,
        "ThreadName": "",
        "EventID": "A73951FC1D762964",
        "ProcessID": 2801
      },
      {
        "Cycles": 0,
        "Agent": "edu.brown.cs.systems.xtrace.logging.BaggageWrappers",
        "ProcessName": "Data",
        "TaskID": "924F5F5E7A62EF3B",
        "ParentEventID": [
          "245D9E4C32D56223"
        ],
        "Label": "Forking current baggage with Baggage.fork()",
        "Title": "X-Trace Task",
        "Host": "pinky19.mpi-sws.org",
        "HRT": 26966615007199163,
        "Operation": "fork",
        "Timestamp": "1557750254947.525146",
        "TenantClass": 0,
        "Source": "PacketHeader.java:95",
        "ThreadID": 37338,
        "ThreadName": "",
        "EventID": "D98F76946B816CA0",
        "BaggageBytes": "[[248 5] [240 0] [0 146 79 95 94 122 98 239 59] [240 1] [0 36 93 158 76 50 213 98 35] [240 3] [0 2]]",
        "ProcessID": 2319
      },
      {
        "Cycles": 0,
        "Agent": "Execution-CPU",
        "ProcessName": "Data",
        "TaskID": "924F5F5E7A62EF3B",
        "ParentEventID": [
          "C92DFB986ED98EF2"
        ],
        "Label": "unset",
        "Title": "X-Trace Task",
        "Host": "pinky19.mpi-sws.org",
        "Duration": "949371",
        "HRT": 26966615007564958,
        "Operation": "unset",
        "Timestamp": "1557750254947.891113",
        "TenantClass": 0,
        "Source": "DataXceiver.java:261",
        "ThreadID": 37338,
        "ThreadName": "",
        "EventID": "1DEA94260FC3EC9B",
        "BaggageBytes": "[[248 5] [240 0] [0 146 79 95 94 122 98 239 59] [240 1] [0 201 45 251 152 110 217 142 242] [240 3] [0 2]]",
        "ProcessID": 2319
      },
      {
        "Cycles": 0,
        "Agent": "Execution-Sleep",
        "ProcessName": "Data",
        "TaskID": "924F5F5E7A62EF3B",
        "ParentEventID": [
          "D98F76946B816CA0"
        ],
        "Label": "waited",
        "Title": "X-Trace Task",
        "Host": "pinky19.mpi-sws.org",
        "Duration": "7930",
        "HRT": 26966615007315589,
        "Operation": "waited",
        "Timestamp": "1557750254947.641602",
        "TenantClass": 0,
        "Source": "SocketIOWithTimeout.java:335",
        "ThreadID": 37338,
        "ThreadName": "",
        "EventID": "C92DFB986ED98EF2",
        "BaggageBytes": "[[248 5] [240 0] [0 146 79 95 94 122 98 239 59] [240 1] [0 217 143 118 148 107 129 108 160] [240 3] [0 2]]",
        "ProcessID": 2319
      },
      {
        "Cycles": 0,
        "Agent": "edu.brown.cs.systems.retro.benchmarks.hdfs_client.Reader",
        "ProcessName": "Read",
        "TaskID": "924F5F5E7A62EF3B",
        "ParentEventID": [
          "0"
        ],
        "Label": "Reading file",
        "Title": "X-Trace Task",
        "Host": "pinky19.mpi-sws.org",
        "HRT": 26966615003930336,
        "Timestamp": "1557750254944.261719",
        "TenantClass": 0,
        "ThreadID": 1,
        "ThreadName": "",
        "EventID": "6F6D5DD396AF385A",
        "ProcessID": 2801,
        "Tag": [
          "reader_100kb",
          "Read Size: 102400"
        ]
      }
    ]
  }
]