[
  {
    "id": "A96431BCACDFDE41",
    "reports": [
      {
        "Cycles": 0,
        "Agent": "edu.brown.cs.systems.retro.benchmarks.hdfs_client.Reader",
        "ProcessName": "Read",
        "TaskID": "A96431BCACDFDE41",
        "ParentEventID": [
          "9640490752A99600"
        ],
        "Label": "Reading file",
        "Title": "X-Trace Task",
        "Host": "pinky19.mpi-sws.org",
        "HRT": 26962560505751014,
        "Timestamp": "1557746200445.871338",
        "TenantClass": 0,
        "ThreadID": 1,
        "ThreadName": "",
        "EventID": "64FD93A4A1555907",
        "ProcessID": 36430
      },
      {
        "Cycles": 0,
        "Agent": "Execution-CPU",
        "ProcessName": "Read",
        "TaskID": "A96431BCACDFDE41",
        "ParentEventID": [
          "1384EA9C1B4F6D57"
        ],
        "Label": "unset",
        "Title": "X-Trace Task",
        "Host": "pinky19.mpi-sws.org",
        "Duration": "22010605",
        "HRT": 26962560505824162,
        "Operation": "unset",
        "Timestamp": "1557746200445.944336",
        "TenantClass": 0,
        "Source": "Client.java:1027",
        "ThreadID": 1,
        "ThreadName": "",
        "EventID": "259ABF079E86104E",
        "ProcessID": 36430
      },
      {
        "Cycles": 0,
        "Agent": "org.apache.hadoop.ipc.ProtobufRpcEngine",
        "ProcessName": "Read",
        "TaskID": "A96431BCACDFDE41",
        "ParentEventID": [
          "64FD93A4A1555907"
        ],
        "Label": "Invoking org.apache.hadoop.hdfs.protocol.ClientProtocol.getBlockLocations",
        "Title": "X-Trace Task",
        "Host": "pinky19.mpi-sws.org",
        "HRT": 26962560505796392,
        "Timestamp": "1557746200445.916748",
        "TenantClass": 0,
        "Source": "ProtobufRpcEngine.java:228",
        "ThreadID": 1,
        "ThreadName": "",
        "EventID": "1384EA9C1B4F6D57",
        "ProcessID": 36430
      },
      {
        "Cycles": 0,
        "Agent": "Execution-CPU",
        "ProcessName": "Read",
        "TaskID": "A96431BCACDFDE41",
        "ParentEventID": [
          "259ABF079E86104E"
        ],
        "Label": "set",
        "Title": "X-Trace Task",
        "Host": "pinky19.mpi-sws.org",
        "HRT": 26962560505853210,
        "Operation": "set",
        "Timestamp": "1557746200445.973389",
        "TenantClass": 0,
        "Source": "Client.java:1032",
        "ThreadID": 41,
        "ThreadName": "",
        "EventID": "37A1395A7514FB42",
        "ProcessID": 36430
      },
      {
        "Cycles": 0,
        "Agent": "Execution-CPU",
        "ProcessName": "Read",
        "TaskID": "A96431BCACDFDE41",
        "ParentEventID": [
          "DF9B81788B890FA9"
        ],
        "Label": "unset",
        "Title": "X-Trace Task",
        "Host": "pinky19.mpi-sws.org",
        "Duration": "72407",
        "HRT": 26962560505944220,
        "Operation": "unset",
        "Timestamp": "1557746200446.064453",
        "TenantClass": 0,
        "Source": "Client.java:1062",
        "ThreadID": 41,
        "ThreadName": "",
        "EventID": "8C63BED98877411E",
        "ProcessID": 36430
      },
      {
        "Cycles": 0,
        "Agent": "Execution-CPU",
        "ProcessName": "Read",
        "TaskID": "A96431BCACDFDE41",
        "ParentEventID": [
          "8C63BED98877411E"
        ],
        "Label": "set",
        "Title": "X-Trace Task",
        "Host": "pinky19.mpi-sws.org",
        "HRT": 26962560505967310,
        "Operation": "set",
        "Timestamp": "1557746200446.087646",
        "TenantClass": 0,
        "Source": "Client.java:1104",
        "ThreadID": 1,
        "ThreadName": "",
        "EventID": "3FBDCABD9B02FDFF",
        "ProcessID": 36430
      },
      {
        "Cycles": 0,
        "Agent": "Execution-CPU",
        "ProcessName": "Name",
        "TaskID": "A96431BCACDFDE41",
        "ParentEventID": [
          "DF9B81788B890FA9"
        ],
        "Label": "set",
        "Title": "X-Trace Task",
        "Host": "pinky19.mpi-sws.org",
        "HRT": 26962560506000330,
        "Operation": "set",
        "Timestamp": "1557746200446.138184",
        "TenantClass": 0,
        "Source": "Server.java:1840",
        "ThreadID": 48,
        "ThreadName": "",
        "EventID": "A9E8E19A4F40C402",
        "BaggageBytes": "[[248 5] [240 0] [0 169 100 49 188 172 223 222 65] [240 1] [0 223 155 129 120 139 137 15 169] [240 3] [0 2]]",
        "ProcessID": 2171
      },
      {
        "Cycles": 0,
        "Agent": "edu.brown.cs.systems.xtrace.logging.BaggageWrappers",
        "ProcessName": "Read",
        "TaskID": "A96431BCACDFDE41",
        "ParentEventID": [
          "37A1395A7514FB42"
        ],
        "Label": "Forking current baggage with Baggage.fork()",
        "Title": "X-Trace Task",
        "Host": "pinky19.mpi-sws.org",
        "HRT": 26962560505872240,
        "Operation": "fork",
        "Timestamp": "1557746200445.992432",
        "TenantClass": 0,
        "Source": "Client.java:1043",
        "ThreadID": 41,
        "ThreadName": "",
        "EventID": "DF9B81788B890FA9",
        "ProcessID": 36430
      },
      {
        "Cycles": 0,
        "Agent": "Execution-CPU",
        "ProcessName": "Name",
        "TaskID": "A96431BCACDFDE41",
        "ParentEventID": [
          "2903328FFC63E24A"
        ],
        "Label": "unset",
        "Title": "X-Trace Task",
        "Host": "pinky19.mpi-sws.org",
        "Duration": "23969",
        "HRT": 26962560506049271,
        "Operation": "unset",
        "Timestamp": "1557746200446.187012",
        "TenantClass": 0,
        "Source": "Server.java:1828",
        "ThreadID": 48,
        "ThreadName": "",
        "EventID": "F7C929CDBB584272",
        "BaggageBytes": "[[248 5] [240 0] [0 169 100 49 188 172 223 222 65] [240 1] [0 41 3 50 143 252 99 226 74] [240 3] [0 2]]",
        "ProcessID": 2171
      },
      {
        "Cycles": 0,
        "Agent": "edu.brown.cs.systems.xtrace.logging.BaggageWrappers",
        "ProcessName": "Name",
        "TaskID": "A96431BCACDFDE41",
        "ParentEventID": [
          "A9E8E19A4F40C402"
        ],
        "Label": "Forking current baggage with Baggage.fork()",
        "Title": "X-Trace Task",
        "Host": "pinky19.mpi-sws.org",
        "HRT": 26962560506029229,
        "Operation": "fork",
        "Timestamp": "1557746200446.166992",
        "TenantClass": 0,
        "Source": "Server.java:550",
        "ThreadID": 48,
        "ThreadName": "",
        "EventID": "2903328FFC63E24A",
        "BaggageBytes": "[[248 5] [240 0] [0 169 100 49 188 172 223 222 65] [240 1] [0 169 232 225 154 79 64 196 2] [240 3] [0 2]]",
        "ProcessID": 2171
      },
      {
        "Cycles": 0,
        "Agent": "Execution-CPU",
        "ProcessName": "Name",
        "TaskID": "A96431BCACDFDE41",
        "ParentEventID": [
          "2903328FFC63E24A"
        ],
        "Label": "set",
        "Title": "X-Trace Task",
        "Host": "pinky19.mpi-sws.org",
        "HRT": 26962560506060765,
        "Operation": "set",
        "Timestamp": "1557746200446.198486",
        "TenantClass": 0,
        "Source": "Server.java:2071",
        "ThreadID": 62,
        "ThreadName": "",
        "EventID": "19246E7B71382DF1",
        "BaggageBytes": "[[248 5] [240 0] [0 169 100 49 188 172 223 222 65] [240 1] [0 41 3 50 143 252 99 226 74] [240 3] [0 2]]",
        "ProcessID": 2171
      },
      {
        "Cycles": 0,
        "Agent": "org.apache.hadoop.ipc.Server",
        "ProcessName": "Name",
        "TaskID": "A96431BCACDFDE41",
        "ParentEventID": [
          "19246E7B71382DF1"
        ],
        "Label": "getBlockLocations in org.apache.hadoop.hdfs.protocol.ClientProtocol",
        "Title": "X-Trace Task",
        "Host": "pinky19.mpi-sws.org",
        "HRT": 26962560506100058,
        "Timestamp": "1557746200446.237793",
        "TenantClass": 0,
        "Source": "ProtobufRpcEngine.java:601",
        "ThreadID": 62,
        "ThreadName": "",
        "EventID": "BF628C5DBAAA304C",
        "BaggageBytes": "[[248 5] [240 0] [0 169 100 49 188 172 223 222 65] [240 1] [0 25 36 110 123 113 56 45 241] [240 3] [0 2]]",
        "ProcessID": 2171
      },
      {
        "Cycles": 0,
        "Agent": "edu.brown.cs.systems.xtrace.logging.BaggageWrappers",
        "ProcessName": "Name",
        "TaskID": "A96431BCACDFDE41",
        "ParentEventID": [
          "D1C571E0242FCD54"
        ],
        "Label": "Forking current baggage with Baggage.fork()",
        "Title": "X-Trace Task",
        "Host": "pinky19.mpi-sws.org",
        "HRT": 26962560506210145,
        "Operation": "fork",
        "Timestamp": "1557746200446.347900",
        "TenantClass": 0,
        "Source": "Server.java:2398",
        "ThreadID": 62,
        "ThreadName": "",
        "EventID": "162F8CAFFE590130",
        "BaggageBytes": "[[248 5] [240 0] [0 169 100 49 188 172 223 222 65] [240 1] [0 209 197 113 224 36 47 205 84] [240 3] [0 2]]",
        "ProcessID": 2171
      },
      {
        "Cycles": 0,
        "Agent": "Execution-CPU",
        "ProcessName": "Name",
        "TaskID": "A96431BCACDFDE41",
        "ParentEventID": [
          "162F8CAFFE590130"
        ],
        "Label": "unset",
        "Title": "X-Trace Task",
        "Host": "pinky19.mpi-sws.org",
        "Duration": "242798",
        "HRT": 26962560506331070,
        "Operation": "unset",
        "Timestamp": "1557746200446.468994",
        "TenantClass": 0,
        "Source": "Server.java:1058",
        "ThreadID": 62,
        "ThreadName": "",
        "EventID": "28B599D49D8FE0E0",
        "BaggageBytes": "[[248 5] [240 0] [0 169 100 49 188 172 223 222 65] [240 1] [0 22 47 140 175 254 89 1 48] [240 3] [0 2]]",
        "ProcessID": 2171
      },
      {
        "Cycles": 0,
        "Agent": "Execution-CPU",
        "ProcessName": "Read",
        "TaskID": "A96431BCACDFDE41",
        "ParentEventID": [
          "162F8CAFFE590130"
        ],
        "Label": "set",
        "Title": "X-Trace Task",
        "Host": "pinky19.mpi-sws.org",
        "HRT": 26962560506373077,
        "Operation": "set",
        "Timestamp": "1557746200446.493408",
        "TenantClass": 0,
        "Source": "Client.java:302",
        "ThreadID": 37,
        "ThreadName": "",
        "EventID": "C3C50C3B16F12B83",
        "ProcessID": 36430
      },
      {
        "Cycles": 0,
        "Agent": "Execution-CPU",
        "ProcessName": "Read",
        "TaskID": "A96431BCACDFDE41",
        "ParentEventID": [
          "C3C50C3B16F12B83"
        ],
        "Label": "unset",
        "Title": "X-Trace Task",
        "Host": "pinky19.mpi-sws.org",
        "Duration": "8931",
        "HRT": 26962560506395740,
        "Operation": "unset",
        "Timestamp": "1557746200446.515869",
        "TenantClass": 0,
        "Source": "Client.java:1168",
        "ThreadID": 37,
        "ThreadName": "",
        "EventID": "933FD4C23E86586C",
        "ProcessID": 36430
      },
      {
        "Cycles": 0,
        "Agent": "Execution-Sleep",
        "ProcessName": "Read",
        "TaskID": "A96431BCACDFDE41",
        "ParentEventID": [
          "3FBDCABD9B02FDFF"
        ],
        "Label": "waited",
        "Title": "X-Trace Task",
        "Host": "pinky19.mpi-sws.org",
        "Duration": "443455",
        "HRT": 26962560506420542,
        "Operation": "waited",
        "Timestamp": "1557746200446.540771",
        "TenantClass": 0,
        "Source": "Client.java:1537",
        "ThreadID": 1,
        "ThreadName": "",
        "EventID": "CEF9A5367540A1C9",
        "ProcessID": 36430
      },
      {
        "Cycles": 0,
        "Agent": "edu.brown.cs.systems.xtrace.logging.BaggageWrappers",
        "ProcessName": "Read",
        "TaskID": "A96431BCACDFDE41",
        "ParentEventID": [
          "933FD4C23E86586C",
          "CEF9A5367540A1C9"
        ],
        "Label": "Merged current baggage with other baggage",
        "Title": "X-Trace Task",
        "Host": "pinky19.mpi-sws.org",
        "HRT": 26962560506435829,
        "Operation": "join",
        "Timestamp": "1557746200446.556152",
        "TenantClass": 0,
        "Source": "Client.java:1545",
        "ThreadID": 1,
        "ThreadName": "",
        "EventID": "28E856D02101F764",
        "ProcessID": 36430
      },
      {
        "Cycles": 0,
        "Agent": "org.apache.hadoop.ipc.ProtobufRpcEngine",
        "ProcessName": "Read",
        "TaskID": "A96431BCACDFDE41",
        "ParentEventID": [
          "28E856D02101F764"
        ],
        "Label": "org.apache.hadoop.hdfs.protocol.ClientProtocol.getBlockLocations completed",
        "Title": "X-Trace Task",
        "Host": "pinky19.mpi-sws.org",
        "HRT": 26962560506483778,
        "Timestamp": "1557746200446.604004",
        "TenantClass": 0,
        "Source": "ProtobufRpcEngine.java:275",
        "ThreadID": 1,
        "ThreadName": "",
        "EventID": "C04F086ED16E89CD",
        "ProcessID": 36430
      },
      {
        "Cycles": 0,
        "Agent": "edu.brown.cs.systems.xtrace.logging.BaggageWrappers",
        "ProcessName": "Read",
        "TaskID": "A96431BCACDFDE41",
        "ParentEventID": [
          "C04F086ED16E89CD"
        ],
        "Label": "Forking current baggage with Baggage.fork()",
        "Title": "X-Trace Task",
        "Host": "pinky19.mpi-sws.org",
        "HRT": 26962560506565854,
        "Operation": "fork",
        "Timestamp": "1557746200446.686035",
        "TenantClass": 0,
        "Source": "DataTransferProtoUtil.java:94",
        "ThreadID": 1,
        "ThreadName": "",
        "EventID": "C68237FE69B0421E",
        "ProcessID": 36430
      },
      {
        "Cycles": 0,
        "Agent": "org.apache.hadoop.hdfs.server.namenode.FSNamesystem.audit",
        "ProcessName": "Name",
        "TaskID": "A96431BCACDFDE41",
        "ParentEventID": [
          "BF628C5DBAAA304C"
        ],
        "Label": "allowed=true\tugi=plascas (auth:SIMPLE)\tip=/139.19.171.63\tcmd=open\tsrc=/ds/dZ0Dvih4eoSym8Wc\tdst=null\tperm=null\tproto=rpc",
        "Title": "X-Trace Task",
        "Host": "pinky19.mpi-sws.org",
        "HRT": 26962560506157427,
        "Timestamp": "1557746200446.295166",
        "TenantClass": 0,
        "Source": "FSNamesystem.java:8313",
        "ThreadID": 62,
        "ThreadName": "",
        "EventID": "D1C571E0242FCD54",
        "BaggageBytes": "[[248 5] [240 0] [0 169 100 49 188 172 223 222 65] [240 1] [0 191 98 140 93 186 170 48 76] [240 3] [0 2]]",
        "ProcessID": 2171
      },
      {
        "Cycles": 0,
        "Agent": "Execution-CPU",
        "ProcessName": "Data",
        "TaskID": "A96431BCACDFDE41",
        "ParentEventID": [
          "C68237FE69B0421E"
        ],
        "Label": "set",
        "Title": "X-Trace Task",
        "Host": "pinky19.mpi-sws.org",
        "HRT": 26962560506691787,
        "Operation": "set",
        "Timestamp": "1557746200446.805664",
        "TenantClass": 0,
        "Source": "Receiver.java:117",
        "ThreadID": 36633,
        "ThreadName": "",
        "EventID": "373BD02DBBA09979",
        "BaggageBytes": "[[248 5] [240 0] [0 169 100 49 188 172 223 222 65] [240 1] [0 198 130 55 254 105 176 66 30] [240 3] [0 2]]",
        "ProcessID": 2319
      },
      {
        "Cycles": 0,
        "Agent": "edu.brown.cs.systems.xtrace.logging.BaggageWrappers",
        "ProcessName": "Data",
        "TaskID": "A96431BCACDFDE41",
        "ParentEventID": [
          "102C1BD3EFA84A0C"
        ],
        "Label": "Forking current baggage with Baggage.fork()",
        "Title": "X-Trace Task",
        "Host": "pinky19.mpi-sws.org",
        "HRT": 26962560506798452,
        "Operation": "fork",
        "Timestamp": "1557746200446.912354",
        "TenantClass": 0,
        "Source": "DataXceiver.java:1257",
        "ThreadID": 36633,
        "ThreadName": "",
        "EventID": "220E9A04D8BBB0E0",
        "BaggageBytes": "[[248 5] [240 0] [0 169 100 49 188 172 223 222 65] [240 1] [0 16 44 27 211 239 168 74 12] [240 3] [0 2]]",
        "ProcessID": 2319
      },
      {
        "Cycles": 0,
        "Agent": "Execution-Sleep",
        "ProcessName": "Read",
        "TaskID": "A96431BCACDFDE41",
        "ParentEventID": [
          "C68237FE69B0421E"
        ],
        "Label": "waited",
        "Title": "X-Trace Task",
        "Host": "pinky19.mpi-sws.org",
        "Duration": "195335",
        "HRT": 26962560506857393,
        "Operation": "waited",
        "Timestamp": "1557746200446.977539",
        "TenantClass": 0,
        "Source": "SocketIOWithTimeout.java:335",
        "ThreadID": 1,
        "ThreadName": "",
        "EventID": "4B60690D946CC3F4",
        "ProcessID": 36430
      },
      {
        "Cycles": 0,
        "Agent": "edu.brown.cs.systems.xtrace.logging.XTraceInit",
        "ProcessName": "Data",
        "TaskID": "A96431BCACDFDE41",
        "ParentEventID": [
          "373BD02DBBA09979"
        ],
        "Label": "Thread.setName: DataXceiver for client DFSClient_NONMAPREDUCE_778905418_1 at /139.19.171.63:43130 [Sending block BP-1633380353-139.19.171.63-1554193446451:blk_1073770438_29614]",
        "Title": "X-Trace Task",
        "Host": "pinky19.mpi-sws.org",
        "HRT": 26962560506724464,
        "Timestamp": "1557746200446.838379",
        "TenantClass": 0,
        "Source": "DataXceiver.java:168",
        "ThreadID": 36633,
        "ThreadName": "",
        "EventID": "102C1BD3EFA84A0C",
        "BaggageBytes": "[[248 5] [240 0] [0 169 100 49 188 172 223 222 65] [240 1] [0 55 59 208 45 187 160 153 121] [240 3] [0 2]]",
        "ProcessID": 2319
      },
      {
        "Cycles": 0,
        "Agent": "Execution-Sleep",
        "ProcessName": "Data",
        "TaskID": "A96431BCACDFDE41",
        "ParentEventID": [
          "A9EB7DD549B86684"
        ],
        "Label": "waited",
        "Title": "X-Trace Task",
        "Host": "pinky19.mpi-sws.org",
        "Duration": "3974",
        "HRT": 26962560506917771,
        "Operation": "waited",
        "Timestamp": "1557746200447.031738",
        "TenantClass": 0,
        "Source": "SocketIOWithTimeout.java:335",
        "ThreadID": 36633,
        "ThreadName": "",
        "EventID": "CD606EFE702ABF6B",
        "BaggageBytes": "[[248 5] [240 0] [0 169 100 49 188 172 223 222 65] [240 1] [0 169 235 125 213 73 184 102 132] [240 3] [0 2]]",
        "ProcessID": 2319
      },
      {
        "Cycles": 0,
        "Agent": "edu.brown.cs.systems.xtrace.logging.BaggageWrappers",
        "ProcessName": "Read",
        "TaskID": "A96431BCACDFDE41",
        "ParentEventID": [
          "4B60690D946CC3F4",
          "220E9A04D8BBB0E0"
        ],
        "Label": "Merged current baggage with other baggage",
        "Title": "X-Trace Task",
        "Host": "pinky19.mpi-sws.org",
        "HRT": 26962560506928765,
        "Operation": "join",
        "Timestamp": "1557746200447.049072",
        "TenantClass": 0,
        "Source": "RemoteBlockReader2.java:429",
        "ThreadID": 1,
        "ThreadName": "",
        "EventID": "F53C74E6433BB42F",
        "ProcessID": 36430
      },
      {
        "Cycles": 0,
        "Agent": "edu.brown.cs.systems.xtrace.logging.BaggageWrappers",
        "ProcessName": "Data",
        "TaskID": "A96431BCACDFDE41",
        "ParentEventID": [
          "CD606EFE702ABF6B"
        ],
        "Label": "Forking current baggage with Baggage.fork()",
        "Title": "X-Trace Task",
        "Host": "pinky19.mpi-sws.org",
        "HRT": 26962560506981188,
        "Operation": "fork",
        "Timestamp": "1557746200447.095215",
        "TenantClass": 0,
        "Source": "PacketHeader.java:95",
        "ThreadID": 36633,
        "ThreadName": "",
        "EventID": "140FEC15074C7DA2",
        "BaggageBytes": "[[248 5] [240 0] [0 169 100 49 188 172 223 222 65] [240 1] [0 205 96 110 254 112 42 191 107] [240 3] [0 2]]",
        "ProcessID": 2319
      },
      {
        "Cycles": 0,
        "Agent": "edu.brown.cs.systems.xtrace.logging.BaggageWrappers",
        "ProcessName": "Data",
        "TaskID": "A96431BCACDFDE41",
        "ParentEventID": [
          "220E9A04D8BBB0E0"
        ],
        "Label": "Forking current baggage with Baggage.fork()",
        "Title": "X-Trace Task",
        "Host": "pinky19.mpi-sws.org",
        "HRT": 26962560506859926,
        "Operation": "fork",
        "Timestamp": "1557746200446.973877",
        "TenantClass": 0,
        "Source": "PacketHeader.java:95",
        "ThreadID": 36633,
        "ThreadName": "",
        "EventID": "A9EB7DD549B86684",
        "BaggageBytes": "[[248 5] [240 0] [0 169 100 49 188 172 223 222 65] [240 1] [0 34 14 154 4 216 187 176 224] [240 3] [0 2]]",
        "ProcessID": 2319
      },
      {
        "Cycles": 0,
        "Agent": "edu.brown.cs.systems.xtrace.logging.BaggageWrappers",
        "ProcessName": "Read",
        "TaskID": "A96431BCACDFDE41",
        "ParentEventID": [
          "F53C74E6433BB42F",
          "A9EB7DD549B86684"
        ],
        "Label": "Merged current baggage with other baggage",
        "Title": "X-Trace Task",
        "Host": "pinky19.mpi-sws.org",
        "HRT": 26962560507007697,
        "Operation": "join",
        "Timestamp": "1557746200447.127930",
        "TenantClass": 0,
        "Source": "PacketHeader.java:168",
        "ThreadID": 1,
        "ThreadName": "",
        "EventID": "8AE4ED8DAAC9636F",
        "ProcessID": 36430
      },
      {
        "Cycles": 0,
        "Agent": "edu.brown.cs.systems.xtrace.logging.BaggageWrappers",
        "ProcessName": "Read",
        "TaskID": "A96431BCACDFDE41",
        "ParentEventID": [
          "140FEC15074C7DA2",
          "8AE4ED8DAAC9636F"
        ],
        "Label": "Merged current baggage with other baggage",
        "Title": "X-Trace Task",
        "Host": "pinky19.mpi-sws.org",
        "HRT": 26962560507071484,
        "Operation": "join",
        "Timestamp": "1557746200447.191650",
        "TenantClass": 0,
        "Source": "PacketHeader.java:168",
        "ThreadID": 1,
        "ThreadName": "",
        "EventID": "D1362C9B96F39974",
        "ProcessID": 36430
      },
      {
        "Cycles": 0,
        "Agent": "Execution-Sleep",
        "ProcessName": "Data",
        "TaskID": "A96431BCACDFDE41",
        "ParentEventID": [
          "140FEC15074C7DA2"
        ],
        "Label": "waited",
        "Title": "X-Trace Task",
        "Host": "pinky19.mpi-sws.org",
        "Duration": "75407",
        "HRT": 26962560507139400,
        "Operation": "waited",
        "Timestamp": "1557746200447.253418",
        "TenantClass": 0,
        "Source": "SocketIOWithTimeout.java:335",
        "ThreadID": 36633,
        "ThreadName": "",
        "EventID": "B00295F36E1905D9",
        "BaggageBytes": "[[248 5] [240 0] [0 169 100 49 188 172 223 222 65] [240 1] [0 20 15 236 21 7 76 125 162] [240 3] [0 2]]",
        "ProcessID": 2319
      },
      {
        "Cycles": 0,
        "Agent": "edu.brown.cs.systems.xtrace.logging.BaggageWrappers",
        "ProcessName": "Read",
        "TaskID": "A96431BCACDFDE41",
        "ParentEventID": [
          "D1362C9B96F39974"
        ],
        "Label": "Forking current baggage with Baggage.fork()",
        "Title": "X-Trace Task",
        "Host": "pinky19.mpi-sws.org",
        "HRT": 26962560507090628,
        "Operation": "fork",
        "Timestamp": "1557746200447.210938",
        "TenantClass": 0,
        "Source": "RemoteBlockReader2.java:361",
        "ThreadID": 1,
        "ThreadName": "",
        "EventID": "052287D42226A6C0",
        "ProcessID": 36430
      },
      {
        "Cycles": 0,
        "Agent": "edu.brown.cs.systems.xtrace.logging.BaggageWrappers",
        "ProcessName": "Data",
        "TaskID": "A96431BCACDFDE41",
        "ParentEventID": [
          "052287D42226A6C0",
          "B00295F36E1905D9"
        ],
        "Label": "Merged current baggage with other baggage",
        "Title": "X-Trace Task",
        "Host": "pinky19.mpi-sws.org",
        "HRT": 26962560507193392,
        "Operation": "join",
        "Timestamp": "1557746200447.307373",
        "TenantClass": 0,
        "Source": "DataXceiver.java:574",
        "ThreadID": 36633,
        "ThreadName": "",
        "EventID": "A3BD5D8776351DA9",
        "BaggageBytes": "[[248 5] [240 0] [0 169 100 49 188 172 223 222 65] [240 1] [0 176 2 149 243 110 25 5 217] [0 5 34 135 212 34 38 166 192] [240 3] [0 2]]",
        "ProcessID": 2319
      },
      {
        "Cycles": 0,
        "Agent": "Execution-CPU",
        "ProcessName": "Data",
        "TaskID": "A96431BCACDFDE41",
        "ParentEventID": [
          "A3BD5D8776351DA9"
        ],
        "Label": "unset",
        "Title": "X-Trace Task",
        "Host": "pinky19.mpi-sws.org",
        "Duration": "498547",
        "HRT": 26962560507213287,
        "Operation": "unset",
        "Timestamp": "1557746200447.327148",
        "TenantClass": 0,
        "Source": "DataXceiver.java:261",
        "ThreadID": 36633,
        "ThreadName": "",
        "EventID": "00C05569E5D6FC77",
        "BaggageBytes": "[[248 5] [240 0] [0 169 100 49 188 172 223 222 65] [240 1] [0 163 189 93 135 118 53 29 169] [240 3] [0 2]]",
        "ProcessID": 2319
      },
      {
        "Cycles": 0,
        "Agent": "edu.brown.cs.systems.retro.benchmarks.hdfs_client.Reader",
        "ProcessName": "Read",
        "TaskID": "A96431BCACDFDE41",
        "ParentEventID": [
          "0"
        ],
        "Label": "Reading file",
        "Title": "X-Trace Task",
        "Host": "pinky19.mpi-sws.org",
        "HRT": 26962560505731894,
        "Timestamp": "1557746200445.852051",
        "TenantClass": 0,
        "ThreadID": 1,
        "ThreadName": "",
        "EventID": "9640490752A99600",
        "ProcessID": 36430,
        "Tag": [
          "reader_10kb",
          "Read Size: 10240"
        ]
      }
    ]
  }
]