[
  {
    "id": "C1F4463CB0F74B26",
    "reports": [
      {
        "Cycles": 0,
        "Agent": "Execution-CPU",
        "ProcessName": "Read",
        "TaskID": "C1F4463CB0F74B26",
        "ParentEventID": [
          "09B6D486CB99047F"
        ],
        "Label": "unset",
        "Title": "X-Trace Task",
        "Host": "pinky19.mpi-sws.org",
        "Duration": "21331573",
        "HRT": 26962502073643390,
        "Operation": "unset",
        "Timestamp": "1557746142013.622070",
        "TenantClass": 0,
        "Source": "Client.java:1027",
        "ThreadID": 1,
        "ThreadName": "",
        "EventID": "CE254C307968A975",
        "ProcessID": 36430
      },
      {
        "Cycles": 0,
        "Agent": "edu.brown.cs.systems.retro.benchmarks.hdfs_client.Reader",
        "ProcessName": "Read",
        "TaskID": "C1F4463CB0F74B26",
        "ParentEventID": [
          "6EE4362E06E2B9B6"
        ],
        "Label": "Reading file",
        "Title": "X-Trace Task",
        "Host": "pinky19.mpi-sws.org",
        "HRT": 26962502073579786,
        "Timestamp": "1557746142013.558594",
        "TenantClass": 0,
        "ThreadID": 1,
        "ThreadName": "",
        "EventID": "1AB9DD9637C65D35",
        "ProcessID": 36430
      },
      {
        "Cycles": 0,
        "Agent": "Execution-CPU",
        "ProcessName": "Read",
        "TaskID": "C1F4463CB0F74B26",
        "ParentEventID": [
          "CE254C307968A975"
        ],
        "Label": "set",
        "Title": "X-Trace Task",
        "Host": "pinky19.mpi-sws.org",
        "HRT": 26962502073669273,
        "Operation": "set",
        "Timestamp": "1557746142013.647949",
        "TenantClass": 0,
        "Source": "Client.java:1032",
        "ThreadID": 41,
        "ThreadName": "",
        "EventID": "2E14FB939E2F74D6",
        "ProcessID": 36430
      },
      {
        "Cycles": 0,
        "Agent": "org.apache.hadoop.ipc.ProtobufRpcEngine",
        "ProcessName": "Read",
        "TaskID": "C1F4463CB0F74B26",
        "ParentEventID": [
          "1AB9DD9637C65D35"
        ],
        "Label": "Invoking org.apache.hadoop.hdfs.protocol.ClientProtocol.getBlockLocations",
        "Title": "X-Trace Task",
        "Host": "pinky19.mpi-sws.org",
        "HRT": 26962502073614147,
        "Timestamp": "1557746142013.592773",
        "TenantClass": 0,
        "Source": "ProtobufRpcEngine.java:228",
        "ThreadID": 1,
        "ThreadName": "",
        "EventID": "09B6D486CB99047F",
        "ProcessID": 36430
      },
      {
        "Cycles": 0,
        "Agent": "edu.brown.cs.systems.xtrace.logging.BaggageWrappers",
        "ProcessName": "Read",
        "TaskID": "C1F4463CB0F74B26",
        "ParentEventID": [
          "2E14FB939E2F74D6"
        ],
        "Label": "Forking current baggage with Baggage.fork()",
        "Title": "X-Trace Task",
        "Host": "pinky19.mpi-sws.org",
        "HRT": 26962502073687337,
        "Operation": "fork",
        "Timestamp": "1557746142013.666016",
        "TenantClass": 0,
        "Source": "Client.java:1043",
        "ThreadID": 41,
        "ThreadName": "",
        "EventID": "DD834916485506D1",
        "ProcessID": 36430
      },
      {
        "Cycles": 0,
        "Agent": "Execution-CPU",
        "ProcessName": "Read",
        "TaskID": "C1F4463CB0F74B26",
        "ParentEventID": [
          "DD834916485506D1"
        ],
        "Label": "unset",
        "Title": "X-Trace Task",
        "Host": "pinky19.mpi-sws.org",
        "Duration": "85478",
        "HRT": 26962502073772347,
        "Operation": "unset",
        "Timestamp": "1557746142013.750977",
        "TenantClass": 0,
        "Source": "Client.java:1062",
        "ThreadID": 41,
        "ThreadName": "",
        "EventID": "1CBFB95E2EE6D62D",
        "ProcessID": 36430
      },
      {
        "Cycles": 0,
        "Agent": "Execution-CPU",
        "ProcessName": "Read",
        "TaskID": "C1F4463CB0F74B26",
        "ParentEventID": [
          "1CBFB95E2EE6D62D"
        ],
        "Label": "set",
        "Title": "X-Trace Task",
        "Host": "pinky19.mpi-sws.org",
        "HRT": 26962502073798246,
        "Operation": "set",
        "Timestamp": "1557746142013.776855",
        "TenantClass": 0,
        "Source": "Client.java:1104",
        "ThreadID": 1,
        "ThreadName": "",
        "EventID": "B51E73648B2ACE31",
        "ProcessID": 36430
      },
      {
        "Cycles": 0,
        "Agent": "Execution-CPU",
        "ProcessName": "Name",
        "TaskID": "C1F4463CB0F74B26",
        "ParentEventID": [
          "DD834916485506D1"
        ],
        "Label": "set",
        "Title": "X-Trace Task",
        "Host": "pinky19.mpi-sws.org",
        "HRT": 26962502073814487,
        "Operation": "set",
        "Timestamp": "1557746142013.801514",
        "TenantClass": 0,
        "Source": "Server.java:1840",
        "ThreadID": 48,
        "ThreadName": "",
        "EventID": "8BBB89818F8B8F87",
        "BaggageBytes": "[[248 5] [240 0] [0 193 244 70 60 176 247 75 38] [240 1] [0 221 131 73 22 72 85 6 209] [240 3] [0 2]]",
        "ProcessID": 2171
      },
      {
        "Cycles": 0,
        "Agent": "edu.brown.cs.systems.xtrace.logging.BaggageWrappers",
        "ProcessName": "Name",
        "TaskID": "C1F4463CB0F74B26",
        "ParentEventID": [
          "8BBB89818F8B8F87"
        ],
        "Label": "Forking current baggage with Baggage.fork()",
        "Title": "X-Trace Task",
        "Host": "pinky19.mpi-sws.org",
        "HRT": 26962502073849206,
        "Operation": "fork",
        "Timestamp": "1557746142013.836426",
        "TenantClass": 0,
        "Source": "Server.java:550",
        "ThreadID": 48,
        "ThreadName": "",
        "EventID": "15DC526202F9DAA3",
        "BaggageBytes": "[[248 5] [240 0] [0 193 244 70 60 176 247 75 38] [240 1] [0 139 187 137 129 143 139 143 135] [240 3] [0 2]]",
        "ProcessID": 2171
      },
      {
        "Cycles": 0,
        "Agent": "Execution-CPU",
        "ProcessName": "Name",
        "TaskID": "C1F4463CB0F74B26",
        "ParentEventID": [
          "15DC526202F9DAA3"
        ],
        "Label": "set",
        "Title": "X-Trace Task",
        "Host": "pinky19.mpi-sws.org",
        "HRT": 26962502073880978,
        "Operation": "set",
        "Timestamp": "1557746142013.868164",
        "TenantClass": 0,
        "Source": "Server.java:2071",
        "ThreadID": 60,
        "ThreadName": "",
        "EventID": "316BD71C25989692",
        "BaggageBytes": "[[248 5] [240 0] [0 193 244 70 60 176 247 75 38] [240 1] [0 21 220 82 98 2 249 218 163] [240 3] [0 2]]",
        "ProcessID": 2171
      },
      {
        "Cycles": 0,
        "Agent": "org.apache.hadoop.ipc.Server",
        "ProcessName": "Name",
        "TaskID": "C1F4463CB0F74B26",
        "ParentEventID": [
          "316BD71C25989692"
        ],
        "Label": "getBlockLocations in org.apache.hadoop.hdfs.protocol.ClientProtocol",
        "Title": "X-Trace Task",
        "Host": "pinky19.mpi-sws.org",
        "HRT": 26962502073920243,
        "Timestamp": "1557746142013.907471",
        "TenantClass": 0,
        "Source": "ProtobufRpcEngine.java:601",
        "ThreadID": 60,
        "ThreadName": "",
        "EventID": "58F42E19F8DE7C35",
        "BaggageBytes": "[[248 5] [240 0] [0 193 244 70 60 176 247 75 38] [240 1] [0 49 107 215 28 37 152 150 146] [240 3] [0 2]]",
        "ProcessID": 2171
      },
      {
        "Cycles": 0,
        "Agent": "Execution-CPU",
        "ProcessName": "Name",
        "TaskID": "C1F4463CB0F74B26",
        "ParentEventID": [
          "15DC526202F9DAA3"
        ],
        "Label": "unset",
        "Title": "X-Trace Task",
        "Host": "pinky19.mpi-sws.org",
        "Duration": "26005",
        "HRT": 26962502073871596,
        "Operation": "unset",
        "Timestamp": "1557746142013.858643",
        "TenantClass": 0,
        "Source": "Server.java:1828",
        "ThreadID": 48,
        "ThreadName": "",
        "EventID": "9781CB56D6D9E419",
        "BaggageBytes": "[[248 5] [240 0] [0 193 244 70 60 176 247 75 38] [240 1] [0 21 220 82 98 2 249 218 163] [240 3] [0 2]]",
        "ProcessID": 2171
      },
      {
        "Cycles": 0,
        "Agent": "org.apache.hadoop.hdfs.server.namenode.FSNamesystem.audit",
        "ProcessName": "Name",
        "TaskID": "C1F4463CB0F74B26",
        "ParentEventID": [
          "58F42E19F8DE7C35"
        ],
        "Label": "allowed=true\tugi=plascas (auth:SIMPLE)\tip=/139.19.171.63\tcmd=open\tsrc=/ds/mJvXkjT4PEIjXWaf\tdst=null\tperm=null\tproto=rpc",
        "Title": "X-Trace Task",
        "Host": "pinky19.mpi-sws.org",
        "HRT": 26962502073966243,
        "Timestamp": "1557746142013.953369",
        "TenantClass": 0,
        "Source": "FSNamesystem.java:8313",
        "ThreadID": 60,
        "ThreadName": "",
        "EventID": "4B837A8D3C12EED8",
        "BaggageBytes": "[[248 5] [240 0] [0 193 244 70 60 176 247 75 38] [240 1] [0 88 244 46 25 248 222 124 53] [240 3] [0 2]]",
        "ProcessID": 2171
      },
      {
        "Cycles": 0,
        "Agent": "Execution-CPU",
        "ProcessName": "Name",
        "TaskID": "C1F4463CB0F74B26",
        "ParentEventID": [
          "B3AF66A0A558D1CF"
        ],
        "Label": "unset",
        "Title": "X-Trace Task",
        "Host": "pinky19.mpi-sws.org",
        "Duration": "210773",
        "HRT": 26962502074119223,
        "Operation": "unset",
        "Timestamp": "1557746142014.106445",
        "TenantClass": 0,
        "Source": "Server.java:1058",
        "ThreadID": 60,
        "ThreadName": "",
        "EventID": "7477505B74A4DF22",
        "BaggageBytes": "[[248 5] [240 0] [0 193 244 70 60 176 247 75 38] [240 1] [0 179 175 102 160 165 88 209 207] [240 3] [0 2]]",
        "ProcessID": 2171
      },
      {
        "Cycles": 0,
        "Agent": "Execution-CPU",
        "ProcessName": "Read",
        "TaskID": "C1F4463CB0F74B26",
        "ParentEventID": [
          "B3AF66A0A558D1CF"
        ],
        "Label": "set",
        "Title": "X-Trace Task",
        "Host": "pinky19.mpi-sws.org",
        "HRT": 26962502074153006,
        "Operation": "set",
        "Timestamp": "1557746142014.131592",
        "TenantClass": 0,
        "Source": "Client.java:302",
        "ThreadID": 37,
        "ThreadName": "",
        "EventID": "A264E2AE8C0933BC",
        "ProcessID": 36430
      },
      {
        "Cycles": 0,
        "Agent": "Execution-CPU",
        "ProcessName": "Read",
        "TaskID": "C1F4463CB0F74B26",
        "ParentEventID": [
          "A264E2AE8C0933BC"
        ],
        "Label": "unset",
        "Title": "X-Trace Task",
        "Host": "pinky19.mpi-sws.org",
        "Duration": "7473",
        "HRT": 26962502074171017,
        "Operation": "unset",
        "Timestamp": "1557746142014.149658",
        "TenantClass": 0,
        "Source": "Client.java:1168",
        "ThreadID": 37,
        "ThreadName": "",
        "EventID": "CE9A7BFACEEA5420",
        "ProcessID": 36430
      },
      {
        "Cycles": 0,
        "Agent": "Execution-Sleep",
        "ProcessName": "Read",
        "TaskID": "C1F4463CB0F74B26",
        "ParentEventID": [
          "B51E73648B2ACE31"
        ],
        "Label": "waited",
        "Title": "X-Trace Task",
        "Host": "pinky19.mpi-sws.org",
        "Duration": "381450",
        "HRT": 26962502074189563,
        "Operation": "waited",
        "Timestamp": "1557746142014.168213",
        "TenantClass": 0,
        "Source": "Client.java:1537",
        "ThreadID": 1,
        "ThreadName": "",
        "EventID": "722435E83D5424C8",
        "ProcessID": 36430
      },
      {
        "Cycles": 0,
        "Agent": "edu.brown.cs.systems.xtrace.logging.BaggageWrappers",
        "ProcessName": "Name",
        "TaskID": "C1F4463CB0F74B26",
        "ParentEventID": [
          "4B837A8D3C12EED8"
        ],
        "Label": "Forking current baggage with Baggage.fork()",
        "Title": "X-Trace Task",
        "Host": "pinky19.mpi-sws.org",
        "HRT": 26962502074009090,
        "Operation": "fork",
        "Timestamp": "1557746142013.996338",
        "TenantClass": 0,
        "Source": "Server.java:2398",
        "ThreadID": 60,
        "ThreadName": "",
        "EventID": "B3AF66A0A558D1CF",
        "BaggageBytes": "[[248 5] [240 0] [0 193 244 70 60 176 247 75 38] [240 1] [0 75 131 122 141 60 18 238 216] [240 3] [0 2]]",
        "ProcessID": 2171
      },
      {
        "Cycles": 0,
        "Agent": "edu.brown.cs.systems.xtrace.logging.BaggageWrappers",
        "ProcessName": "Read",
        "TaskID": "C1F4463CB0F74B26",
        "ParentEventID": [
          "CE9A7BFACEEA5420",
          "722435E83D5424C8"
        ],
        "Label": "Merged current baggage with other baggage",
        "Title": "X-Trace Task",
        "Host": "pinky19.mpi-sws.org",
        "HRT": 26962502074206667,
        "Operation": "join",
        "Timestamp": "1557746142014.185303",
        "TenantClass": 0,
        "Source": "Client.java:1545",
        "ThreadID": 1,
        "ThreadName": "",
        "EventID": "246BB66D1608D8AF",
        "ProcessID": 36430
      },
      {
        "Cycles": 0,
        "Agent": "org.apache.hadoop.ipc.ProtobufRpcEngine",
        "ProcessName": "Read",
        "TaskID": "C1F4463CB0F74B26",
        "ParentEventID": [
          "246BB66D1608D8AF"
        ],
        "Label": "org.apache.hadoop.hdfs.protocol.ClientProtocol.getBlockLocations completed",
        "Title": "X-Trace Task",
        "Host": "pinky19.mpi-sws.org",
        "HRT": 26962502074248051,
        "Timestamp": "1557746142014.226807",
        "TenantClass": 0,
        "Source": "ProtobufRpcEngine.java:275",
        "ThreadID": 1,
        "ThreadName": "",
        "EventID": "18C3571140051928",
        "ProcessID": 36430
      },
      {
        "Cycles": 0,
        "Agent": "edu.brown.cs.systems.xtrace.logging.BaggageWrappers",
        "ProcessName": "Read",
        "TaskID": "C1F4463CB0F74B26",
        "ParentEventID": [
          "18C3571140051928"
        ],
        "Label": "Forking current baggage with Baggage.fork()",
        "Title": "X-Trace Task",
        "Host": "pinky19.mpi-sws.org",
        "HRT": 26962502074317713,
        "Operation": "fork",
        "Timestamp": "1557746142014.296387",
        "TenantClass": 0,
        "Source": "DataTransferProtoUtil.java:94",
        "ThreadID": 1,
        "ThreadName": "",
        "EventID": "9182453E35F91198",
        "ProcessID": 36430
      },
      {
        "Cycles": 0,
        "Agent": "Execution-CPU",
        "ProcessName": "Data",
        "TaskID": "C1F4463CB0F74B26",
        "ParentEventID": [
          "9182453E35F91198"
        ],
        "Label": "set",
        "Title": "X-Trace Task",
        "Host": "pinky19.mpi-sws.org",
        "HRT": 26962502074449492,
        "Operation": "set",
        "Timestamp": "1557746142014.421143",
        "TenantClass": 0,
        "Source": "Receiver.java:117",
        "ThreadID": 36633,
        "ThreadName": "",
        "EventID": "42AFF33CCEBAD773",
        "BaggageBytes": "[[248 5] [240 0] [0 193 244 70 60 176 247 75 38] [240 1] [0 145 130 69 62 53 249 17 152] [240 3] [0 2]]",
        "ProcessID": 2319
      },
      {
        "Cycles": 0,
        "Agent": "edu.brown.cs.systems.xtrace.logging.BaggageWrappers",
        "ProcessName": "Data",
        "TaskID": "C1F4463CB0F74B26",
        "ParentEventID": [
          "A39184E489B4DC4F"
        ],
        "Label": "Forking current baggage with Baggage.fork()",
        "Title": "X-Trace Task",
        "Host": "pinky19.mpi-sws.org",
        "HRT": 26962502074576491,
        "Operation": "fork",
        "Timestamp": "1557746142014.548340",
        "TenantClass": 0,
        "Source": "DataXceiver.java:1257",
        "ThreadID": 36633,
        "ThreadName": "",
        "EventID": "596FECFA72FA75E6",
        "BaggageBytes": "[[248 5] [240 0] [0 193 244 70 60 176 247 75 38] [240 1] [0 163 145 132 228 137 180 220 79] [240 3] [0 2]]",
        "ProcessID": 2319
      },
      {
        "Cycles": 0,
        "Agent": "edu.brown.cs.systems.xtrace.logging.XTraceInit",
        "ProcessName": "Data",
        "TaskID": "C1F4463CB0F74B26",
        "ParentEventID": [
          "42AFF33CCEBAD773"
        ],
        "Label": "Thread.setName: DataXceiver for client DFSClient_NONMAPREDUCE_778905418_1 at /139.19.171.63:43130 [Sending block BP-1633380353-139.19.171.63-1554193446451:blk_1073758715_17891]",
        "Title": "X-Trace Task",
        "Host": "pinky19.mpi-sws.org",
        "HRT": 26962502074484429,
        "Timestamp": "1557746142014.456055",
        "TenantClass": 0,
        "Source": "DataXceiver.java:168",
        "ThreadID": 36633,
        "ThreadName": "",
        "EventID": "A39184E489B4DC4F",
        "BaggageBytes": "[[248 5] [240 0] [0 193 244 70 60 176 247 75 38] [240 1] [0 66 175 243 60 206 186 215 115] [240 3] [0 2]]",
        "ProcessID": 2319
      },
      {
        "Cycles": 0,
        "Agent": "edu.brown.cs.systems.xtrace.logging.BaggageWrappers",
        "ProcessName": "Data",
        "TaskID": "C1F4463CB0F74B26",
        "ParentEventID": [
          "596FECFA72FA75E6"
        ],
        "Label": "Forking current baggage with Baggage.fork()",
        "Title": "X-Trace Task",
        "Host": "pinky19.mpi-sws.org",
        "HRT": 26962502074650021,
        "Operation": "fork",
        "Timestamp": "1557746142014.621826",
        "TenantClass": 0,
        "Source": "PacketHeader.java:95",
        "ThreadID": 36633,
        "ThreadName": "",
        "EventID": "3B54F470C6E8C596",
        "BaggageBytes": "[[248 5] [240 0] [0 193 244 70 60 176 247 75 38] [240 1] [0 89 111 236 250 114 250 117 230] [240 3] [0 2]]",
        "ProcessID": 2319
      },
      {
        "Cycles": 0,
        "Agent": "Execution-Sleep",
        "ProcessName": "Data",
        "TaskID": "C1F4463CB0F74B26",
        "ParentEventID": [
          "3B54F470C6E8C596"
        ],
        "Label": "waited",
        "Title": "X-Trace Task",
        "Host": "pinky19.mpi-sws.org",
        "Duration": "5396",
        "HRT": 26962502074721783,
        "Operation": "waited",
        "Timestamp": "1557746142014.693604",
        "TenantClass": 0,
        "Source": "SocketIOWithTimeout.java:335",
        "ThreadID": 36633,
        "ThreadName": "",
        "EventID": "10930DA129A0EE38",
        "BaggageBytes": "[[248 5] [240 0] [0 193 244 70 60 176 247 75 38] [240 1] [0 59 84 244 112 198 232 197 150] [240 3] [0 2]]",
        "ProcessID": 2319
      },
      {
        "Cycles": 0,
        "Agent": "edu.brown.cs.systems.xtrace.logging.BaggageWrappers",
        "ProcessName": "Read",
        "TaskID": "C1F4463CB0F74B26",
        "ParentEventID": [
          "0D1CF931D6BF6A04",
          "596FECFA72FA75E6"
        ],
        "Label": "Merged current baggage with other baggage",
        "Title": "X-Trace Task",
        "Host": "pinky19.mpi-sws.org",
        "HRT": 26962502074759282,
        "Operation": "join",
        "Timestamp": "1557746142014.738037",
        "TenantClass": 0,
        "Source": "RemoteBlockReader2.java:429",
        "ThreadID": 1,
        "ThreadName": "",
        "EventID": "75FF554E32AFB2A5",
        "ProcessID": 36430
      },
      {
        "Cycles": 0,
        "Agent": "Execution-Sleep",
        "ProcessName": "Read",
        "TaskID": "C1F4463CB0F74B26",
        "ParentEventID": [
          "9182453E35F91198"
        ],
        "Label": "waited",
        "Title": "X-Trace Task",
        "Host": "pinky19.mpi-sws.org",
        "Duration": "253327",
        "HRT": 26962502074670618,
        "Operation": "waited",
        "Timestamp": "1557746142014.649414",
        "TenantClass": 0,
        "Source": "SocketIOWithTimeout.java:335",
        "ThreadID": 1,
        "ThreadName": "",
        "EventID": "0D1CF931D6BF6A04",
        "ProcessID": 36430
      },
      {
        "Cycles": 0,
        "Agent": "edu.brown.cs.systems.xtrace.logging.BaggageWrappers",
        "ProcessName": "Read",
        "TaskID": "C1F4463CB0F74B26",
        "ParentEventID": [
          "3B54F470C6E8C596",
          "75FF554E32AFB2A5"
        ],
        "Label": "Merged current baggage with other baggage",
        "Title": "X-Trace Task",
        "Host": "pinky19.mpi-sws.org",
        "HRT": 26962502074842406,
        "Operation": "join",
        "Timestamp": "1557746142014.821045",
        "TenantClass": 0,
        "Source": "PacketHeader.java:168",
        "ThreadID": 1,
        "ThreadName": "",
        "EventID": "2E48C8DFB5BC32E0",
        "ProcessID": 36430
      },
      {
        "Cycles": 0,
        "Agent": "edu.brown.cs.systems.xtrace.logging.BaggageWrappers",
        "ProcessName": "Data",
        "TaskID": "C1F4463CB0F74B26",
        "ParentEventID": [
          "10930DA129A0EE38"
        ],
        "Label": "Forking current baggage with Baggage.fork()",
        "Title": "X-Trace Task",
        "Host": "pinky19.mpi-sws.org",
        "HRT": 26962502074804544,
        "Operation": "fork",
        "Timestamp": "1557746142014.776367",
        "TenantClass": 0,
        "Source": "PacketHeader.java:95",
        "ThreadID": 36633,
        "ThreadName": "",
        "EventID": "1AFD5CE42EDEC3A1",
        "BaggageBytes": "[[248 5] [240 0] [0 193 244 70 60 176 247 75 38] [240 1] [0 16 147 13 161 41 160 238 56] [240 3] [0 2]]",
        "ProcessID": 2319
      },
      {
        "Cycles": 0,
        "Agent": "edu.brown.cs.systems.xtrace.logging.BaggageWrappers",
        "ProcessName": "Read",
        "TaskID": "C1F4463CB0F74B26",
        "ParentEventID": [
          "2E48C8DFB5BC32E0",
          "1AFD5CE42EDEC3A1"
        ],
        "Label": "Merged current baggage with other baggage",
        "Title": "X-Trace Task",
        "Host": "pinky19.mpi-sws.org",
        "HRT": 26962502074907030,
        "Operation": "join",
        "Timestamp": "1557746142014.885742",
        "TenantClass": 0,
        "Source": "PacketHeader.java:168",
        "ThreadID": 1,
        "ThreadName": "",
        "EventID": "0C3E1C906E3D9852",
        "ProcessID": 36430
      },
      {
        "Cycles": 0,
        "Agent": "edu.brown.cs.systems.xtrace.logging.BaggageWrappers",
        "ProcessName": "Read",
        "TaskID": "C1F4463CB0F74B26",
        "ParentEventID": [
          "0C3E1C906E3D9852"
        ],
        "Label": "Forking current baggage with Baggage.fork()",
        "Title": "X-Trace Task",
        "Host": "pinky19.mpi-sws.org",
        "HRT": 26962502074917132,
        "Operation": "fork",
        "Timestamp": "1557746142014.895752",
        "TenantClass": 0,
        "Source": "RemoteBlockReader2.java:361",
        "ThreadID": 1,
        "ThreadName": "",
        "EventID": "11BEEC19DC3036D8",
        "ProcessID": 36430
      },
      {
        "Cycles": 0,
        "Agent": "edu.brown.cs.systems.xtrace.logging.BaggageWrappers",
        "ProcessName": "Data",
        "TaskID": "C1F4463CB0F74B26",
        "ParentEventID": [
          "11BEEC19DC3036D8",
          "C7F5DC0ACEEE4464"
        ],
        "Label": "Merged current baggage with other baggage",
        "Title": "X-Trace Task",
        "Host": "pinky19.mpi-sws.org",
        "HRT": 26962502075033492,
        "Operation": "join",
        "Timestamp": "1557746142015.005127",
        "TenantClass": 0,
        "Source": "DataXceiver.java:574",
        "ThreadID": 36633,
        "ThreadName": "",
        "EventID": "68B800E6C607C1FD",
        "BaggageBytes": "[[248 5] [240 0] [0 193 244 70 60 176 247 75 38] [240 1] [0 199 245 220 10 206 238 68 100] [0 17 190 236 25 220 48 54 216] [240 3] [0 2]]",
        "ProcessID": 2319
      },
      {
        "Cycles": 0,
        "Agent": "Execution-Sleep",
        "ProcessName": "Data",
        "TaskID": "C1F4463CB0F74B26",
        "ParentEventID": [
          "1AFD5CE42EDEC3A1"
        ],
        "Label": "waited",
        "Title": "X-Trace Task",
        "Host": "pinky19.mpi-sws.org",
        "Duration": "58278",
        "HRT": 26962502074969918,
        "Operation": "waited",
        "Timestamp": "1557746142014.941650",
        "TenantClass": 0,
        "Source": "SocketIOWithTimeout.java:335",
        "ThreadID": 36633,
        "ThreadName": "",
        "EventID": "C7F5DC0ACEEE4464",
        "BaggageBytes": "[[248 5] [240 0] [0 193 244 70 60 176 247 75 38] [240 1] [0 26 253 92 228 46 222 195 161] [240 3] [0 2]]",
        "ProcessID": 2319
      },
      {
        "Cycles": 0,
        "Agent": "Execution-CPU",
        "ProcessName": "Data",
        "TaskID": "C1F4463CB0F74B26",
        "ParentEventID": [
          "68B800E6C607C1FD"
        ],
        "Label": "unset",
        "Title": "X-Trace Task",
        "Host": "pinky19.mpi-sws.org",
        "Duration": "580779",
        "HRT": 26962502075054989,
        "Operation": "unset",
        "Timestamp": "1557746142015.026611",
        "TenantClass": 0,
        "Source": "DataXceiver.java:261",
        "ThreadID": 36633,
        "ThreadName": "",
        "EventID": "42F4C9B2CA7A28FB",
        "BaggageBytes": "[[248 5] [240 0] [0 193 244 70 60 176 247 75 38] [240 1] [0 104 184 0 230 198 7 193 253] [240 3] [0 2]]",
        "ProcessID": 2319
      },
      {
        "Cycles": 0,
        "Agent": "edu.brown.cs.systems.retro.benchmarks.hdfs_client.Reader",
        "ProcessName": "Read",
        "TaskID": "C1F4463CB0F74B26",
        "ParentEventID": [
          "0"
        ],
        "Label": "Reading file",
        "Title": "X-Trace Task",
        "Host": "pinky19.mpi-sws.org",
        "HRT": 26962502073563236,
        "Timestamp": "1557746142013.541992",
        "TenantClass": 0,
        "ThreadID": 1,
        "ThreadName": "",
        "EventID": "6EE4362E06E2B9B6",
        "ProcessID": 36430,
        "Tag": [
          "reader_10kb",
          "Read Size: 10240"
        ]
      }
    ]
  }
]