[
  {
    "id": "978BBA63955FD9DE",
    "reports": [
      {
        "Cycles": 0,
        "Agent": "Execution-CPU",
        "ProcessName": "Read",
        "TaskID": "978BBA63955FD9DE",
        "ParentEventID": [
          "AB93F469F5FE8FAB"
        ],
        "Label": "unset",
        "Title": "X-Trace Task",
        "Host": "pinky19.mpi-sws.org",
        "Duration": "63913288",
        "HRT": 26962444839012018,
        "Operation": "unset",
        "Timestamp": "1557746084779.285156",
        "TenantClass": 0,
        "Source": "Client.java:1027",
        "ThreadID": 1,
        "ThreadName": "",
        "EventID": "1FAD5E278D570709",
        "ProcessID": 36430
      },
      {
        "Cycles": 0,
        "Agent": "edu.brown.cs.systems.retro.benchmarks.hdfs_client.Reader",
        "ProcessName": "Read",
        "TaskID": "978BBA63955FD9DE",
        "ParentEventID": [
          "C6DAC4510B845EB8"
        ],
        "Label": "Reading file",
        "Title": "X-Trace Task",
        "Host": "pinky19.mpi-sws.org",
        "HRT": 26962444838839668,
        "Timestamp": "1557746084779.112793",
        "TenantClass": 0,
        "ThreadID": 1,
        "ThreadName": "",
        "EventID": "B2AFD3F1C7BBB5B7",
        "ProcessID": 36430
      },
      {
        "Cycles": 0,
        "Agent": "edu.brown.cs.systems.retro.benchmarks.hdfs_client.Reader",
        "ProcessName": "Read",
        "TaskID": "978BBA63955FD9DE",
        "ParentEventID": [
          "0"
        ],
        "Label": "Reading file",
        "Title": "X-Trace Task",
        "Host": "pinky19.mpi-sws.org",
        "HRT": 26962444838814075,
        "Timestamp": "1557746084779.087158",
        "TenantClass": 0,
        "ThreadID": 1,
        "ThreadName": "",
        "EventID": "C6DAC4510B845EB8",
        "ProcessID": 36430,
        "Tag": [
          "reader_10kb",
          "Read Size: 10240"
        ]
      },
      {
        "Cycles": 0,
        "Agent": "Execution-CPU",
        "ProcessName": "Read",
        "TaskID": "978BBA63955FD9DE",
        "ParentEventID": [
          "1FAD5E278D570709"
        ],
        "Label": "set",
        "Title": "X-Trace Task",
        "Host": "pinky19.mpi-sws.org",
        "HRT": 26962444839061910,
        "Operation": "set",
        "Timestamp": "1557746084779.334961",
        "TenantClass": 0,
        "Source": "Client.java:1032",
        "ThreadID": 41,
        "ThreadName": "",
        "EventID": "7EBA266E3109769A",
        "ProcessID": 36430
      },
      {
        "Cycles": 0,
        "Agent": "edu.brown.cs.systems.xtrace.logging.BaggageWrappers",
        "ProcessName": "Read",
        "TaskID": "978BBA63955FD9DE",
        "ParentEventID": [
          "7EBA266E3109769A"
        ],
        "Label": "Forking current baggage with Baggage.fork()",
        "Title": "X-Trace Task",
        "Host": "pinky19.mpi-sws.org",
        "HRT": 26962444839085275,
        "Operation": "fork",
        "Timestamp": "1557746084779.358398",
        "TenantClass": 0,
        "Source": "Client.java:1043",
        "ThreadID": 41,
        "ThreadName": "",
        "EventID": "FEE9D84AD5736E30",
        "ProcessID": 36430
      },
      {
        "Cycles": 0,
        "Agent": "org.apache.hadoop.ipc.ProtobufRpcEngine",
        "ProcessName": "Read",
        "TaskID": "978BBA63955FD9DE",
        "ParentEventID": [
          "B2AFD3F1C7BBB5B7"
        ],
        "Label": "Invoking org.apache.hadoop.hdfs.protocol.ClientProtocol.getBlockLocations",
        "Title": "X-Trace Task",
        "Host": "pinky19.mpi-sws.org",
        "HRT": 26962444838938736,
        "Timestamp": "1557746084779.211914",
        "TenantClass": 0,
        "Source": "ProtobufRpcEngine.java:228",
        "ThreadID": 1,
        "ThreadName": "",
        "EventID": "AB93F469F5FE8FAB",
        "ProcessID": 36430
      },
      {
        "Cycles": 0,
        "Agent": "Execution-CPU",
        "ProcessName": "Read",
        "TaskID": "978BBA63955FD9DE",
        "ParentEventID": [
          "FEE9D84AD5736E30"
        ],
        "Label": "unset",
        "Title": "X-Trace Task",
        "Host": "pinky19.mpi-sws.org",
        "Duration": "100294",
        "HRT": 26962444839183252,
        "Operation": "unset",
        "Timestamp": "1557746084779.456299",
        "TenantClass": 0,
        "Source": "Client.java:1062",
        "ThreadID": 41,
        "ThreadName": "",
        "EventID": "DC22B9F8BC28FFBB",
        "ProcessID": 36430
      },
      {
        "Cycles": 0,
        "Agent": "Execution-CPU",
        "ProcessName": "Read",
        "TaskID": "978BBA63955FD9DE",
        "ParentEventID": [
          "DC22B9F8BC28FFBB"
        ],
        "Label": "set",
        "Title": "X-Trace Task",
        "Host": "pinky19.mpi-sws.org",
        "HRT": 26962444839212107,
        "Operation": "set",
        "Timestamp": "1557746084779.485352",
        "TenantClass": 0,
        "Source": "Client.java:1104",
        "ThreadID": 1,
        "ThreadName": "",
        "EventID": "4F0D0CF2A378697B",
        "ProcessID": 36430
      },
      {
        "Cycles": 0,
        "Agent": "Execution-CPU",
        "ProcessName": "Name",
        "TaskID": "978BBA63955FD9DE",
        "ParentEventID": [
          "FEE9D84AD5736E30"
        ],
        "Label": "set",
        "Title": "X-Trace Task",
        "Host": "pinky19.mpi-sws.org",
        "HRT": 26962444839289652,
        "Operation": "set",
        "Timestamp": "1557746084779.575195",
        "TenantClass": 0,
        "Source": "Server.java:1840",
        "ThreadID": 48,
        "ThreadName": "",
        "EventID": "3685069E2193A93B",
        "BaggageBytes": "[[248 5] [240 0] [0 151 139 186 99 149 95 217 222] [240 1] [0 254 233 216 74 213 115 110 48] [240 3] [0 2]]",
        "ProcessID": 2171
      },
      {
        "Cycles": 0,
        "Agent": "edu.brown.cs.systems.xtrace.logging.BaggageWrappers",
        "ProcessName": "Name",
        "TaskID": "978BBA63955FD9DE",
        "ParentEventID": [
          "3685069E2193A93B"
        ],
        "Label": "Forking current baggage with Baggage.fork()",
        "Title": "X-Trace Task",
        "Host": "pinky19.mpi-sws.org",
        "HRT": 26962444839339330,
        "Operation": "fork",
        "Timestamp": "1557746084779.624756",
        "TenantClass": 0,
        "Source": "Server.java:550",
        "ThreadID": 48,
        "ThreadName": "",
        "EventID": "F1451E54A4E998C7",
        "BaggageBytes": "[[248 5] [240 0] [0 151 139 186 99 149 95 217 222] [240 1] [0 54 133 6 158 33 147 169 59] [240 3] [0 2]]",
        "ProcessID": 2171
      },
      {
        "Cycles": 0,
        "Agent": "Execution-CPU",
        "ProcessName": "Name",
        "TaskID": "978BBA63955FD9DE",
        "ParentEventID": [
          "F1451E54A4E998C7"
        ],
        "Label": "unset",
        "Title": "X-Trace Task",
        "Host": "pinky19.mpi-sws.org",
        "Duration": "34292",
        "HRT": 26962444839364870,
        "Operation": "unset",
        "Timestamp": "1557746084779.650391",
        "TenantClass": 0,
        "Source": "Server.java:1828",
        "ThreadID": 48,
        "ThreadName": "",
        "EventID": "5E7BB1E45C625848",
        "BaggageBytes": "[[248 5] [240 0] [0 151 139 186 99 149 95 217 222] [240 1] [0 241 69 30 84 164 233 152 199] [240 3] [0 2]]",
        "ProcessID": 2171
      },
      {
        "Cycles": 0,
        "Agent": "Execution-CPU",
        "ProcessName": "Name",
        "TaskID": "978BBA63955FD9DE",
        "ParentEventID": [
          "F1451E54A4E998C7"
        ],
        "Label": "set",
        "Title": "X-Trace Task",
        "Host": "pinky19.mpi-sws.org",
        "HRT": 26962444839377070,
        "Operation": "set",
        "Timestamp": "1557746084779.662598",
        "TenantClass": 0,
        "Source": "Server.java:2071",
        "ThreadID": 59,
        "ThreadName": "",
        "EventID": "F0080073E8CD07B3",
        "BaggageBytes": "[[248 5] [240 0] [0 151 139 186 99 149 95 217 222] [240 1] [0 241 69 30 84 164 233 152 199] [240 3] [0 2]]",
        "ProcessID": 2171
      },
      {
        "Cycles": 0,
        "Agent": "edu.brown.cs.systems.xtrace.logging.BaggageWrappers",
        "ProcessName": "Name",
        "TaskID": "978BBA63955FD9DE",
        "ParentEventID": [
          "38B952E657930A67"
        ],
        "Label": "Forking current baggage with Baggage.fork()",
        "Title": "X-Trace Task",
        "Host": "pinky19.mpi-sws.org",
        "HRT": 26962444839576142,
        "Operation": "fork",
        "Timestamp": "1557746084779.861572",
        "TenantClass": 0,
        "Source": "Server.java:2398",
        "ThreadID": 59,
        "ThreadName": "",
        "EventID": "45DAD95200F33E8A",
        "BaggageBytes": "[[248 5] [240 0] [0 151 139 186 99 149 95 217 222] [240 1] [0 56 185 82 230 87 147 10 103] [240 3] [0 2]]",
        "ProcessID": 2171
      },
      {
        "Cycles": 0,
        "Agent": "org.apache.hadoop.hdfs.server.namenode.FSNamesystem.audit",
        "ProcessName": "Name",
        "TaskID": "978BBA63955FD9DE",
        "ParentEventID": [
          "31D50EFA2D66FD8C"
        ],
        "Label": "allowed=true\tugi=plascas (auth:SIMPLE)\tip=/139.19.171.63\tcmd=open\tsrc=/ds/EkSdYP4YPKL8GbP3\tdst=null\tperm=null\tproto=rpc",
        "Title": "X-Trace Task",
        "Host": "pinky19.mpi-sws.org",
        "HRT": 26962444839514406,
        "Timestamp": "1557746084779.799805",
        "TenantClass": 0,
        "Source": "FSNamesystem.java:8313",
        "ThreadID": 59,
        "ThreadName": "",
        "EventID": "38B952E657930A67",
        "BaggageBytes": "[[248 5] [240 0] [0 151 139 186 99 149 95 217 222] [240 1] [0 49 213 14 250 45 102 253 140] [240 3] [0 2]]",
        "ProcessID": 2171
      },
      {
        "Cycles": 0,
        "Agent": "Execution-CPU",
        "ProcessName": "Name",
        "TaskID": "978BBA63955FD9DE",
        "ParentEventID": [
          "45DAD95200F33E8A"
        ],
        "Label": "unset",
        "Title": "X-Trace Task",
        "Host": "pinky19.mpi-sws.org",
        "Duration": "302218",
        "HRT": 26962444839701817,
        "Operation": "unset",
        "Timestamp": "1557746084779.987305",
        "TenantClass": 0,
        "Source": "Server.java:1058",
        "ThreadID": 59,
        "ThreadName": "",
        "EventID": "3FA6E27C2BDF2F70",
        "BaggageBytes": "[[248 5] [240 0] [0 151 139 186 99 149 95 217 222] [240 1] [0 69 218 217 82 0 243 62 138] [240 3] [0 2]]",
        "ProcessID": 2171
      },
      {
        "Cycles": 0,
        "Agent": "Execution-CPU",
        "ProcessName": "Read",
        "TaskID": "978BBA63955FD9DE",
        "ParentEventID": [
          "45DAD95200F33E8A"
        ],
        "Label": "set",
        "Title": "X-Trace Task",
        "Host": "pinky19.mpi-sws.org",
        "HRT": 26962444839805037,
        "Operation": "set",
        "Timestamp": "1557746084780.078125",
        "TenantClass": 0,
        "Source": "Client.java:302",
        "ThreadID": 37,
        "ThreadName": "",
        "EventID": "E7FD344AE4EC9621",
        "ProcessID": 36430
      },
      {
        "Cycles": 0,
        "Agent": "Execution-Sleep",
        "ProcessName": "Read",
        "TaskID": "978BBA63955FD9DE",
        "ParentEventID": [
          "4F0D0CF2A378697B"
        ],
        "Label": "waited",
        "Title": "X-Trace Task",
        "Host": "pinky19.mpi-sws.org",
        "Duration": "647325",
        "HRT": 26962444839869575,
        "Operation": "waited",
        "Timestamp": "1557746084780.142822",
        "TenantClass": 0,
        "Source": "Client.java:1537",
        "ThreadID": 1,
        "ThreadName": "",
        "EventID": "5194ED5E5B55CD3D",
        "ProcessID": 36430
      },
      {
        "Cycles": 0,
        "Agent": "org.apache.hadoop.ipc.Server",
        "ProcessName": "Name",
        "TaskID": "978BBA63955FD9DE",
        "ParentEventID": [
          "F0080073E8CD07B3"
        ],
        "Label": "getBlockLocations in org.apache.hadoop.hdfs.protocol.ClientProtocol",
        "Title": "X-Trace Task",
        "Host": "pinky19.mpi-sws.org",
        "HRT": 26962444839426277,
        "Timestamp": "1557746084779.711670",
        "TenantClass": 0,
        "Source": "ProtobufRpcEngine.java:601",
        "ThreadID": 59,
        "ThreadName": "",
        "EventID": "31D50EFA2D66FD8C",
        "BaggageBytes": "[[248 5] [240 0] [0 151 139 186 99 149 95 217 222] [240 1] [0 240 8 0 115 232 205 7 179] [240 3] [0 2]]",
        "ProcessID": 2171
      },
      {
        "Cycles": 0,
        "Agent": "edu.brown.cs.systems.xtrace.logging.BaggageWrappers",
        "ProcessName": "Read",
        "TaskID": "978BBA63955FD9DE",
        "ParentEventID": [
          "5194ED5E5B55CD3D",
          "D028ABFDE0111A12"
        ],
        "Label": "Merged current baggage with other baggage",
        "Title": "X-Trace Task",
        "Host": "pinky19.mpi-sws.org",
        "HRT": 26962444839886437,
        "Operation": "join",
        "Timestamp": "1557746084780.159668",
        "TenantClass": 0,
        "Source": "Client.java:1545",
        "ThreadID": 1,
        "ThreadName": "",
        "EventID": "AD6B0FC71B66F314",
        "ProcessID": 36430
      },
      {
        "Cycles": 0,
        "Agent": "org.apache.hadoop.ipc.ProtobufRpcEngine",
        "ProcessName": "Read",
        "TaskID": "978BBA63955FD9DE",
        "ParentEventID": [
          "AD6B0FC71B66F314"
        ],
        "Label": "org.apache.hadoop.hdfs.protocol.ClientProtocol.getBlockLocations completed",
        "Title": "X-Trace Task",
        "Host": "pinky19.mpi-sws.org",
        "HRT": 26962444840008475,
        "Timestamp": "1557746084780.281738",
        "TenantClass": 0,
        "Source": "ProtobufRpcEngine.java:275",
        "ThreadID": 1,
        "ThreadName": "",
        "EventID": "6CD7FA3A24419EA7",
        "ProcessID": 36430
      },
      {
        "Cycles": 0,
        "Agent": "edu.brown.cs.systems.xtrace.logging.BaggageWrappers",
        "ProcessName": "Read",
        "TaskID": "978BBA63955FD9DE",
        "ParentEventID": [
          "6CD7FA3A24419EA7"
        ],
        "Label": "Forking current baggage with Baggage.fork()",
        "Title": "X-Trace Task",
        "Host": "pinky19.mpi-sws.org",
        "HRT": 26962444840161034,
        "Operation": "fork",
        "Timestamp": "1557746084780.434082",
        "TenantClass": 0,
        "Source": "DataTransferProtoUtil.java:94",
        "ThreadID": 1,
        "ThreadName": "",
        "EventID": "2A1CA1981035B6FF",
        "ProcessID": 36430
      },
      {
        "Cycles": 0,
        "Agent": "Execution-CPU",
        "ProcessName": "Read",
        "TaskID": "978BBA63955FD9DE",
        "ParentEventID": [
          "E7FD344AE4EC9621"
        ],
        "Label": "unset",
        "Title": "X-Trace Task",
        "Host": "pinky19.mpi-sws.org",
        "Duration": "27463",
        "HRT": 26962444839848887,
        "Operation": "unset",
        "Timestamp": "1557746084780.122070",
        "TenantClass": 0,
        "Source": "Client.java:1168",
        "ThreadID": 37,
        "ThreadName": "",
        "EventID": "D028ABFDE0111A12",
        "ProcessID": 36430
      },
      {
        "Cycles": 0,
        "Agent": "edu.brown.cs.systems.xtrace.logging.BaggageWrappers",
        "ProcessName": "Data",
        "TaskID": "978BBA63955FD9DE",
        "ParentEventID": [
          "0F8A38F4082BC522"
        ],
        "Label": "Forking current baggage with Baggage.fork()",
        "Title": "X-Trace Task",
        "Host": "pinky25.mpi-sws.org",
        "HRT": 47511550082458017,
        "Operation": "fork",
        "Timestamp": "1557746084781.152344",
        "TenantClass": 0,
        "Source": "DataXceiver.java:1257",
        "ThreadID": 14040,
        "ThreadName": "",
        "EventID": "78AC1795C3A03DD2",
        "BaggageBytes": "[[248 5] [240 0] [0 151 139 186 99 149 95 217 222] [240 1] [0 15 138 56 244 8 43 197 34] [240 3] [0 2]]",
        "ProcessID": 28198
      },
      {
        "Cycles": 0,
        "Agent": "edu.brown.cs.systems.xtrace.logging.XTraceInit",
        "ProcessName": "Data",
        "TaskID": "978BBA63955FD9DE",
        "ParentEventID": [
          "38D5931C633C5EF2"
        ],
        "Label": "Thread.setName: DataXceiver for client DFSClient_NONMAPREDUCE_778905418_1 at /139.19.171.63:41180 [Sending block BP-1633380353-139.19.171.63-1554193446451:blk_1073755867_15043]",
        "Title": "X-Trace Task",
        "Host": "pinky25.mpi-sws.org",
        "HRT": 47511550082268814,
        "Timestamp": "1557746084780.963135",
        "TenantClass": 0,
        "Source": "DataXceiver.java:168",
        "ThreadID": 14040,
        "ThreadName": "",
        "EventID": "0F8A38F4082BC522",
        "BaggageBytes": "[[248 5] [240 0] [0 151 139 186 99 149 95 217 222] [240 1] [0 56 213 147 28 99 60 94 242] [240 3] [0 2]]",
        "ProcessID": 28198
      },
      {
        "Cycles": 0,
        "Agent": "edu.brown.cs.systems.xtrace.logging.BaggageWrappers",
        "ProcessName": "Data",
        "TaskID": "978BBA63955FD9DE",
        "ParentEventID": [
          "78AC1795C3A03DD2"
        ],
        "Label": "Forking current baggage with Baggage.fork()",
        "Title": "X-Trace Task",
        "Host": "pinky25.mpi-sws.org",
        "HRT": 47511550082581374,
        "Operation": "fork",
        "Timestamp": "1557746084781.275635",
        "TenantClass": 0,
        "Source": "PacketHeader.java:95",
        "ThreadID": 14040,
        "ThreadName": "",
        "EventID": "0121C5E7836FFE6B",
        "BaggageBytes": "[[248 5] [240 0] [0 151 139 186 99 149 95 217 222] [240 1] [0 120 172 23 149 195 160 61 210] [240 3] [0 2]]",
        "ProcessID": 28198
      },
      {
        "Cycles": 0,
        "Agent": "Execution-CPU",
        "ProcessName": "Data",
        "TaskID": "978BBA63955FD9DE",
        "ParentEventID": [
          "2A1CA1981035B6FF"
        ],
        "Label": "set",
        "Title": "X-Trace Task",
        "Host": "pinky25.mpi-sws.org",
        "HRT": 47511550082143342,
        "Operation": "set",
        "Timestamp": "1557746084780.837646",
        "TenantClass": 0,
        "Source": "Receiver.java:117",
        "ThreadID": 14040,
        "ThreadName": "",
        "EventID": "38D5931C633C5EF2",
        "BaggageBytes": "[[248 5] [240 0] [0 151 139 186 99 149 95 217 222] [240 1] [0 42 28 161 152 16 53 182 255] [240 3] [0 2]]",
        "ProcessID": 28198
      },
      {
        "Cycles": 0,
        "Agent": "edu.brown.cs.systems.xtrace.logging.BaggageWrappers",
        "ProcessName": "Read",
        "TaskID": "978BBA63955FD9DE",
        "ParentEventID": [
          "47B1E8887A01401E",
          "78AC1795C3A03DD2"
        ],
        "Label": "Merged current baggage with other baggage",
        "Title": "X-Trace Task",
        "Host": "pinky19.mpi-sws.org",
        "HRT": 26962444841108897,
        "Operation": "join",
        "Timestamp": "1557746084781.382080",
        "TenantClass": 0,
        "Source": "RemoteBlockReader2.java:429",
        "ThreadID": 1,
        "ThreadName": "",
        "EventID": "56AA915BCC576755",
        "ProcessID": 36430
      },
      {
        "Cycles": 0,
        "Agent": "Execution-Sleep",
        "ProcessName": "Data",
        "TaskID": "978BBA63955FD9DE",
        "ParentEventID": [
          "0121C5E7836FFE6B"
        ],
        "Label": "waited",
        "Title": "X-Trace Task",
        "Host": "pinky25.mpi-sws.org",
        "Duration": "7463",
        "HRT": 47511550082706212,
        "Operation": "waited",
        "Timestamp": "1557746084781.400391",
        "TenantClass": 0,
        "Source": "SocketIOWithTimeout.java:335",
        "ThreadID": 14040,
        "ThreadName": "",
        "EventID": "D23B9F4088E7B064",
        "BaggageBytes": "[[248 5] [240 0] [0 151 139 186 99 149 95 217 222] [240 1] [0 1 33 197 231 131 111 254 107] [240 3] [0 2]]",
        "ProcessID": 28198
      },
      {
        "Cycles": 0,
        "Agent": "Execution-Sleep",
        "ProcessName": "Read",
        "TaskID": "978BBA63955FD9DE",
        "ParentEventID": [
          "56AA915BCC576755"
        ],
        "Label": "waited",
        "Title": "X-Trace Task",
        "Host": "pinky19.mpi-sws.org",
        "Duration": "89895",
        "HRT": 26962444841368711,
        "Operation": "waited",
        "Timestamp": "1557746084781.641846",
        "TenantClass": 0,
        "Source": "SocketIOWithTimeout.java:335",
        "ThreadID": 1,
        "ThreadName": "",
        "EventID": "CA1E1F65129BD5CD",
        "ProcessID": 36430
      },
      {
        "Cycles": 0,
        "Agent": "Execution-Sleep",
        "ProcessName": "Read",
        "TaskID": "978BBA63955FD9DE",
        "ParentEventID": [
          "2A1CA1981035B6FF"
        ],
        "Label": "waited",
        "Title": "X-Trace Task",
        "Host": "pinky19.mpi-sws.org",
        "Duration": "674213",
        "HRT": 26962444840978390,
        "Operation": "waited",
        "Timestamp": "1557746084781.251465",
        "TenantClass": 0,
        "Source": "SocketIOWithTimeout.java:335",
        "ThreadID": 1,
        "ThreadName": "",
        "EventID": "47B1E8887A01401E",
        "ProcessID": 36430
      },
      {
        "Cycles": 0,
        "Agent": "edu.brown.cs.systems.xtrace.logging.BaggageWrappers",
        "ProcessName": "Read",
        "TaskID": "978BBA63955FD9DE",
        "ParentEventID": [
          "0121C5E7836FFE6B",
          "CA1E1F65129BD5CD"
        ],
        "Label": "Merged current baggage with other baggage",
        "Title": "X-Trace Task",
        "Host": "pinky19.mpi-sws.org",
        "HRT": 26962444841431761,
        "Operation": "join",
        "Timestamp": "1557746084781.704834",
        "TenantClass": 0,
        "Source": "PacketHeader.java:168",
        "ThreadID": 1,
        "ThreadName": "",
        "EventID": "4F78D497BC2D0A7B",
        "ProcessID": 36430
      },
      {
        "Cycles": 0,
        "Agent": "edu.brown.cs.systems.xtrace.logging.BaggageWrappers",
        "ProcessName": "Data",
        "TaskID": "978BBA63955FD9DE",
        "ParentEventID": [
          "D23B9F4088E7B064"
        ],
        "Label": "Forking current baggage with Baggage.fork()",
        "Title": "X-Trace Task",
        "Host": "pinky25.mpi-sws.org",
        "HRT": 47511550082822433,
        "Operation": "fork",
        "Timestamp": "1557746084781.516602",
        "TenantClass": 0,
        "Source": "PacketHeader.java:95",
        "ThreadID": 14040,
        "ThreadName": "",
        "EventID": "803D65589129AE2B",
        "BaggageBytes": "[[248 5] [240 0] [0 151 139 186 99 149 95 217 222] [240 1] [0 210 59 159 64 136 231 176 100] [240 3] [0 2]]",
        "ProcessID": 28198
      },
      {
        "Cycles": 0,
        "Agent": "edu.brown.cs.systems.xtrace.logging.BaggageWrappers",
        "ProcessName": "Read",
        "TaskID": "978BBA63955FD9DE",
        "ParentEventID": [
          "D9BEF9796B0284CF"
        ],
        "Label": "Forking current baggage with Baggage.fork()",
        "Title": "X-Trace Task",
        "Host": "pinky19.mpi-sws.org",
        "HRT": 26962444841503481,
        "Operation": "fork",
        "Timestamp": "1557746084781.776611",
        "TenantClass": 0,
        "Source": "RemoteBlockReader2.java:361",
        "ThreadID": 1,
        "ThreadName": "",
        "EventID": "9460A09C4D336BE3",
        "ProcessID": 36430
      },
      {
        "Cycles": 0,
        "Agent": "edu.brown.cs.systems.xtrace.logging.BaggageWrappers",
        "ProcessName": "Read",
        "TaskID": "978BBA63955FD9DE",
        "ParentEventID": [
          "4F78D497BC2D0A7B",
          "803D65589129AE2B"
        ],
        "Label": "Merged current baggage with other baggage",
        "Title": "X-Trace Task",
        "Host": "pinky19.mpi-sws.org",
        "HRT": 26962444841492247,
        "Operation": "join",
        "Timestamp": "1557746084781.765381",
        "TenantClass": 0,
        "Source": "PacketHeader.java:168",
        "ThreadID": 1,
        "ThreadName": "",
        "EventID": "D9BEF9796B0284CF",
        "ProcessID": 36430
      },
      {
        "Cycles": 0,
        "Agent": "Execution-Sleep",
        "ProcessName": "Data",
        "TaskID": "978BBA63955FD9DE",
        "ParentEventID": [
          "803D65589129AE2B"
        ],
        "Label": "waited",
        "Title": "X-Trace Task",
        "Host": "pinky25.mpi-sws.org",
        "Duration": "198336",
        "HRT": 47511550083192788,
        "Operation": "waited",
        "Timestamp": "1557746084781.886963",
        "TenantClass": 0,
        "Source": "SocketIOWithTimeout.java:335",
        "ThreadID": 14040,
        "ThreadName": "",
        "EventID": "DD613BE52A2B0F9B",
        "BaggageBytes": "[[248 5] [240 0] [0 151 139 186 99 149 95 217 222] [240 1] [0 128 61 101 88 145 41 174 43] [240 3] [0 2]]",
        "ProcessID": 28198
      },
      {
        "Cycles": 0,
        "Agent": "Execution-CPU",
        "ProcessName": "Data",
        "TaskID": "978BBA63955FD9DE",
        "ParentEventID": [
          "3080B12D77665945"
        ],
        "Label": "unset",
        "Title": "X-Trace Task",
        "Host": "pinky25.mpi-sws.org",
        "Duration": "1117650",
        "HRT": 47511550083364264,
        "Operation": "unset",
        "Timestamp": "1557746084782.058594",
        "TenantClass": 0,
        "Source": "DataXceiver.java:261",
        "ThreadID": 14040,
        "ThreadName": "",
        "EventID": "FEBB7963B44A4719",
        "BaggageBytes": "[[248 5] [240 0] [0 151 139 186 99 149 95 217 222] [240 1] [0 48 128 177 45 119 102 89 69] [240 3] [0 2]]",
        "ProcessID": 28198
      },
      {
        "Cycles": 0,
        "Agent": "edu.brown.cs.systems.xtrace.logging.BaggageWrappers",
        "ProcessName": "Data",
        "TaskID": "978BBA63955FD9DE",
        "ParentEventID": [
          "9460A09C4D336BE3",
          "DD613BE52A2B0F9B"
        ],
        "Label": "Merged current baggage with other baggage",
        "Title": "X-Trace Task",
        "Host": "pinky25.mpi-sws.org",
        "HRT": 47511550083312012,
        "Operation": "join",
        "Timestamp": "1557746084782.006348",
        "TenantClass": 0,
        "Source": "DataXceiver.java:574",
        "ThreadID": 14040,
        "ThreadName": "",
        "EventID": "3080B12D77665945",
        "BaggageBytes": "[[248 5] [240 0] [0 151 139 186 99 149 95 217 222] [240 1] [0 148 96 160 156 77 51 107 227] [0 221 97 59 229 42 43 15 155] [240 3] [0 2]]",
        "ProcessID": 28198
      }
    ]
  }
]