[
  {
    "id": "2027BE4E12657D52",
    "reports": [
      {
        "Cycles": 0,
        "Agent": "Execution-CPU",
        "ProcessName": "Read",
        "TaskID": "2027BE4E12657D52",
        "ParentEventID": [
          "5FBADCFFB8604440"
        ],
        "Label": "unset",
        "Title": "X-Trace Task",
        "Host": "pinky19.mpi-sws.org",
        "Duration": "25599861",
        "HRT": 26966791287695100,
        "Operation": "unset",
        "Timestamp": "1557750431227.684082",
        "TenantClass": 0,
        "Source": "Client.java:1027",
        "ThreadID": 1,
        "ThreadName": "",
        "EventID": "90B9888DAF67A2EB",
        "ProcessID": 2801
      },
      {
        "Cycles": 0,
        "Agent": "edu.brown.cs.systems.retro.benchmarks.hdfs_client.Reader",
        "ProcessName": "Read",
        "TaskID": "2027BE4E12657D52",
        "ParentEventID": [
          "FBB2661194704997"
        ],
        "Label": "Reading file",
        "Title": "X-Trace Task",
        "Host": "pinky19.mpi-sws.org",
        "HRT": 26966791287655457,
        "Timestamp": "1557750431227.644531",
        "TenantClass": 0,
        "ThreadID": 1,
        "ThreadName": "",
        "EventID": "117D0B97097348DC",
        "ProcessID": 2801
      },
      {
        "Cycles": 0,
        "Agent": "Execution-CPU",
        "ProcessName": "Read",
        "TaskID": "2027BE4E12657D52",
        "ParentEventID": [
          "90B9888DAF67A2EB"
        ],
        "Label": "set",
        "Title": "X-Trace Task",
        "Host": "pinky19.mpi-sws.org",
        "HRT": 26966791287718347,
        "Operation": "set",
        "Timestamp": "1557750431227.707520",
        "TenantClass": 0,
        "Source": "Client.java:1032",
        "ThreadID": 41,
        "ThreadName": "",
        "EventID": "14040B1B1164664C",
        "ProcessID": 2801
      },
      {
        "Cycles": 0,
        "Agent": "org.apache.hadoop.ipc.ProtobufRpcEngine",
        "ProcessName": "Read",
        "TaskID": "2027BE4E12657D52",
        "ParentEventID": [
          "117D0B97097348DC"
        ],
        "Label": "Invoking org.apache.hadoop.hdfs.protocol.ClientProtocol.getBlockLocations",
        "Title": "X-Trace Task",
        "Host": "pinky19.mpi-sws.org",
        "HRT": 26966791287678522,
        "Timestamp": "1557750431227.667480",
        "TenantClass": 0,
        "Source": "ProtobufRpcEngine.java:228",
        "ThreadID": 1,
        "ThreadName": "",
        "EventID": "5FBADCFFB8604440",
        "ProcessID": 2801
      },
      {
        "Cycles": 0,
        "Agent": "edu.brown.cs.systems.xtrace.logging.BaggageWrappers",
        "ProcessName": "Read",
        "TaskID": "2027BE4E12657D52",
        "ParentEventID": [
          "14040B1B1164664C"
        ],
        "Label": "Forking current baggage with Baggage.fork()",
        "Title": "X-Trace Task",
        "Host": "pinky19.mpi-sws.org",
        "HRT": 26966791287735419,
        "Operation": "fork",
        "Timestamp": "1557750431227.724365",
        "TenantClass": 0,
        "Source": "Client.java:1043",
        "ThreadID": 41,
        "ThreadName": "",
        "EventID": "9EB600FD264D367D",
        "ProcessID": 2801
      },
      {
        "Cycles": 0,
        "Agent": "Execution-CPU",
        "ProcessName": "Read",
        "TaskID": "2027BE4E12657D52",
        "ParentEventID": [
          "9EB600FD264D367D"
        ],
        "Label": "unset",
        "Title": "X-Trace Task",
        "Host": "pinky19.mpi-sws.org",
        "Duration": "65049",
        "HRT": 26966791287800186,
        "Operation": "unset",
        "Timestamp": "1557750431227.789307",
        "TenantClass": 0,
        "Source": "Client.java:1062",
        "ThreadID": 41,
        "ThreadName": "",
        "EventID": "422CE14A0A3A2C81",
        "ProcessID": 2801
      },
      {
        "Cycles": 0,
        "Agent": "Execution-CPU",
        "ProcessName": "Read",
        "TaskID": "2027BE4E12657D52",
        "ParentEventID": [
          "422CE14A0A3A2C81"
        ],
        "Label": "set",
        "Title": "X-Trace Task",
        "Host": "pinky19.mpi-sws.org",
        "HRT": 26966791287825082,
        "Operation": "set",
        "Timestamp": "1557750431227.814209",
        "TenantClass": 0,
        "Source": "Client.java:1104",
        "ThreadID": 1,
        "ThreadName": "",
        "EventID": "4FC5D19B70B7717E",
        "ProcessID": 2801
      },
      {
        "Cycles": 0,
        "Agent": "edu.brown.cs.systems.xtrace.logging.BaggageWrappers",
        "ProcessName": "Name",
        "TaskID": "2027BE4E12657D52",
        "ParentEventID": [
          "A2A9CB092691F0B5"
        ],
        "Label": "Forking current baggage with Baggage.fork()",
        "Title": "X-Trace Task",
        "Host": "pinky19.mpi-sws.org",
        "HRT": 26966791287892309,
        "Operation": "fork",
        "Timestamp": "1557750431227.891357",
        "TenantClass": 0,
        "Source": "Server.java:550",
        "ThreadID": 48,
        "ThreadName": "",
        "EventID": "C0A09F4FA23D2A69",
        "BaggageBytes": "[[248 5] [240 0] [0 32 39 190 78 18 101 125 82] [240 1] [0 162 169 203 9 38 145 240 181] [240 3] [0 2]]",
        "ProcessID": 2171
      },
      {
        "Cycles": 0,
        "Agent": "Execution-CPU",
        "ProcessName": "Name",
        "TaskID": "2027BE4E12657D52",
        "ParentEventID": [
          "C0A09F4FA23D2A69"
        ],
        "Label": "unset",
        "Title": "X-Trace Task",
        "Host": "pinky19.mpi-sws.org",
        "Duration": "24086",
        "HRT": 26966791287912607,
        "Operation": "unset",
        "Timestamp": "1557750431227.911621",
        "TenantClass": 0,
        "Source": "Server.java:1828",
        "ThreadID": 48,
        "ThreadName": "",
        "EventID": "5D49D13289C1BD3C",
        "BaggageBytes": "[[248 5] [240 0] [0 32 39 190 78 18 101 125 82] [240 1] [0 192 160 159 79 162 61 42 105] [240 3] [0 2]]",
        "ProcessID": 2171
      },
      {
        "Cycles": 0,
        "Agent": "Execution-CPU",
        "ProcessName": "Name",
        "TaskID": "2027BE4E12657D52",
        "ParentEventID": [
          "C0A09F4FA23D2A69"
        ],
        "Label": "set",
        "Title": "X-Trace Task",
        "Host": "pinky19.mpi-sws.org",
        "HRT": 26966791287919946,
        "Operation": "set",
        "Timestamp": "1557750431227.918945",
        "TenantClass": 0,
        "Source": "Server.java:2071",
        "ThreadID": 59,
        "ThreadName": "",
        "EventID": "DBBCA3AD7F2044B3",
        "BaggageBytes": "[[248 5] [240 0] [0 32 39 190 78 18 101 125 82] [240 1] [0 192 160 159 79 162 61 42 105] [240 3] [0 2]]",
        "ProcessID": 2171
      },
      {
        "Cycles": 0,
        "Agent": "Execution-CPU",
        "ProcessName": "Name",
        "TaskID": "2027BE4E12657D52",
        "ParentEventID": [
          "9EB600FD264D367D"
        ],
        "Label": "set",
        "Title": "X-Trace Task",
        "Host": "pinky19.mpi-sws.org",
        "HRT": 26966791287862386,
        "Operation": "set",
        "Timestamp": "1557750431227.861328",
        "TenantClass": 0,
        "Source": "Server.java:1840",
        "ThreadID": 48,
        "ThreadName": "",
        "EventID": "A2A9CB092691F0B5",
        "BaggageBytes": "[[248 5] [240 0] [0 32 39 190 78 18 101 125 82] [240 1] [0 158 182 0 253 38 77 54 125] [240 3] [0 2]]",
        "ProcessID": 2171
      },
      {
        "Cycles": 0,
        "Agent": "org.apache.hadoop.ipc.Server",
        "ProcessName": "Name",
        "TaskID": "2027BE4E12657D52",
        "ParentEventID": [
          "DBBCA3AD7F2044B3"
        ],
        "Label": "getBlockLocations in org.apache.hadoop.hdfs.protocol.ClientProtocol",
        "Title": "X-Trace Task",
        "Host": "pinky19.mpi-sws.org",
        "HRT": 26966791287956494,
        "Timestamp": "1557750431227.955566",
        "TenantClass": 0,
        "Source": "ProtobufRpcEngine.java:601",
        "ThreadID": 59,
        "ThreadName": "",
        "EventID": "79D4CA5EADB25AA3",
        "BaggageBytes": "[[248 5] [240 0] [0 32 39 190 78 18 101 125 82] [240 1] [0 219 188 163 173 127 32 68 179] [240 3] [0 2]]",
        "ProcessID": 2171
      },
      {
        "Cycles": 0,
        "Agent": "edu.brown.cs.systems.xtrace.logging.BaggageWrappers",
        "ProcessName": "Name",
        "TaskID": "2027BE4E12657D52",
        "ParentEventID": [
          "A7AC3CB20DD8B228"
        ],
        "Label": "Forking current baggage with Baggage.fork()",
        "Title": "X-Trace Task",
        "Host": "pinky19.mpi-sws.org",
        "HRT": 26966791288044581,
        "Operation": "fork",
        "Timestamp": "1557750431228.043457",
        "TenantClass": 0,
        "Source": "Server.java:2398",
        "ThreadID": 59,
        "ThreadName": "",
        "EventID": "F60DEACDE4FD8561",
        "BaggageBytes": "[[248 5] [240 0] [0 32 39 190 78 18 101 125 82] [240 1] [0 167 172 60 178 13 216 178 40] [240 3] [0 2]]",
        "ProcessID": 2171
      },
      {
        "Cycles": 0,
        "Agent": "org.apache.hadoop.hdfs.server.namenode.FSNamesystem.audit",
        "ProcessName": "Name",
        "TaskID": "2027BE4E12657D52",
        "ParentEventID": [
          "79D4CA5EADB25AA3"
        ],
        "Label": "allowed=true\tugi=plascas (auth:SIMPLE)\tip=/139.19.171.63\tcmd=open\tsrc=/ds/KOBDfPlQBiBTLSBh\tdst=null\tperm=null\tproto=rpc",
        "Title": "X-Trace Task",
        "Host": "pinky19.mpi-sws.org",
        "HRT": 26966791288000616,
        "Timestamp": "1557750431227.999512",
        "TenantClass": 0,
        "Source": "FSNamesystem.java:8313",
        "ThreadID": 59,
        "ThreadName": "",
        "EventID": "A7AC3CB20DD8B228",
        "BaggageBytes": "[[248 5] [240 0] [0 32 39 190 78 18 101 125 82] [240 1] [0 121 212 202 94 173 178 90 163] [240 3] [0 2]]",
        "ProcessID": 2171
      },
      {
        "Cycles": 0,
        "Agent": "Execution-CPU",
        "ProcessName": "Name",
        "TaskID": "2027BE4E12657D52",
        "ParentEventID": [
          "F60DEACDE4FD8561"
        ],
        "Label": "unset",
        "Title": "X-Trace Task",
        "Host": "pinky19.mpi-sws.org",
        "Duration": "200941",
        "HRT": 26966791288145681,
        "Operation": "unset",
        "Timestamp": "1557750431228.144775",
        "TenantClass": 0,
        "Source": "Server.java:1058",
        "ThreadID": 59,
        "ThreadName": "",
        "EventID": "922FE1E48048FB3B",
        "BaggageBytes": "[[248 5] [240 0] [0 32 39 190 78 18 101 125 82] [240 1] [0 246 13 234 205 228 253 133 97] [240 3] [0 2]]",
        "ProcessID": 2171
      },
      {
        "Cycles": 0,
        "Agent": "Execution-CPU",
        "ProcessName": "Read",
        "TaskID": "2027BE4E12657D52",
        "ParentEventID": [
          "F60DEACDE4FD8561"
        ],
        "Label": "set",
        "Title": "X-Trace Task",
        "Host": "pinky19.mpi-sws.org",
        "HRT": 26966791288191562,
        "Operation": "set",
        "Timestamp": "1557750431228.180664",
        "TenantClass": 0,
        "Source": "Client.java:302",
        "ThreadID": 40,
        "ThreadName": "",
        "EventID": "B91B10AF38CC7519",
        "ProcessID": 2801
      },
      {
        "Cycles": 0,
        "Agent": "Execution-CPU",
        "ProcessName": "Read",
        "TaskID": "2027BE4E12657D52",
        "ParentEventID": [
          "B91B10AF38CC7519"
        ],
        "Label": "unset",
        "Title": "X-Trace Task",
        "Host": "pinky19.mpi-sws.org",
        "Duration": "4730",
        "HRT": 26966791288211502,
        "Operation": "unset",
        "Timestamp": "1557750431228.200439",
        "TenantClass": 0,
        "Source": "Client.java:1168",
        "ThreadID": 40,
        "ThreadName": "",
        "EventID": "E7DB60B0A0DD3AA2",
        "ProcessID": 2801
      },
      {
        "Cycles": 0,
        "Agent": "edu.brown.cs.systems.xtrace.logging.BaggageWrappers",
        "ProcessName": "Read",
        "TaskID": "2027BE4E12657D52",
        "ParentEventID": [
          "E7DB60B0A0DD3AA2",
          "7226EDE4FAC25BB5"
        ],
        "Label": "Merged current baggage with other baggage",
        "Title": "X-Trace Task",
        "Host": "pinky19.mpi-sws.org",
        "HRT": 26966791288246080,
        "Operation": "join",
        "Timestamp": "1557750431228.235107",
        "TenantClass": 0,
        "Source": "Client.java:1545",
        "ThreadID": 1,
        "ThreadName": "",
        "EventID": "39E8FCFFAF48B075",
        "ProcessID": 2801
      },
      {
        "Cycles": 0,
        "Agent": "org.apache.hadoop.ipc.ProtobufRpcEngine",
        "ProcessName": "Read",
        "TaskID": "2027BE4E12657D52",
        "ParentEventID": [
          "39E8FCFFAF48B075"
        ],
        "Label": "org.apache.hadoop.hdfs.protocol.ClientProtocol.getBlockLocations completed",
        "Title": "X-Trace Task",
        "Host": "pinky19.mpi-sws.org",
        "HRT": 26966791288308539,
        "Timestamp": "1557750431228.297607",
        "TenantClass": 0,
        "Source": "ProtobufRpcEngine.java:275",
        "ThreadID": 1,
        "ThreadName": "",
        "EventID": "5E0BC488188B6091",
        "ProcessID": 2801
      },
      {
        "Cycles": 0,
        "Agent": "Execution-Sleep",
        "ProcessName": "Read",
        "TaskID": "2027BE4E12657D52",
        "ParentEventID": [
          "4FC5D19B70B7717E"
        ],
        "Label": "waited",
        "Title": "X-Trace Task",
        "Host": "pinky19.mpi-sws.org",
        "Duration": "396137",
        "HRT": 26966791288228863,
        "Operation": "waited",
        "Timestamp": "1557750431228.218018",
        "TenantClass": 0,
        "Source": "Client.java:1537",
        "ThreadID": 1,
        "ThreadName": "",
        "EventID": "7226EDE4FAC25BB5",
        "ProcessID": 2801
      },
      {
        "Cycles": 0,
        "Agent": "Execution-Sleep",
        "ProcessName": "Read",
        "TaskID": "2027BE4E12657D52",
        "ParentEventID": [
          "5E0BC488188B6091"
        ],
        "Label": "waited",
        "Title": "X-Trace Task",
        "Host": "pinky19.mpi-sws.org",
        "Duration": "4438",
        "HRT": 26966791288402094,
        "Operation": "waited",
        "Timestamp": "1557750431228.391113",
        "TenantClass": 0,
        "Source": "SocketIOWithTimeout.java:335",
        "ThreadID": 1,
        "ThreadName": "",
        "EventID": "3B3646E117DB45AF",
        "ProcessID": 2801
      },
      {
        "Cycles": 0,
        "Agent": "Execution-CPU",
        "ProcessName": "Data",
        "TaskID": "2027BE4E12657D52",
        "ParentEventID": [
          "E68B5EF904AA4EF8"
        ],
        "Label": "set",
        "Title": "X-Trace Task",
        "Host": "pinky19.mpi-sws.org",
        "HRT": 26966791288610384,
        "Operation": "set",
        "Timestamp": "1557750431228.610352",
        "TenantClass": 0,
        "Source": "Receiver.java:117",
        "ThreadID": 38925,
        "ThreadName": "",
        "EventID": "E72152B8D281F24F",
        "BaggageBytes": "[[248 5] [240 0] [0 32 39 190 78 18 101 125 82] [240 1] [0 230 139 94 249 4 170 78 248] [240 3] [0 2]]",
        "ProcessID": 2319
      },
      {
        "Cycles": 0,
        "Agent": "edu.brown.cs.systems.xtrace.logging.BaggageWrappers",
        "ProcessName": "Read",
        "TaskID": "2027BE4E12657D52",
        "ParentEventID": [
          "3B3646E117DB45AF"
        ],
        "Label": "Forking current baggage with Baggage.fork()",
        "Title": "X-Trace Task",
        "Host": "pinky19.mpi-sws.org",
        "HRT": 26966791288437779,
        "Operation": "fork",
        "Timestamp": "1557750431228.426758",
        "TenantClass": 0,
        "Source": "DataTransferProtoUtil.java:94",
        "ThreadID": 1,
        "ThreadName": "",
        "EventID": "E68B5EF904AA4EF8",
        "ProcessID": 2801
      },
      {
        "Cycles": 0,
        "Agent": "edu.brown.cs.systems.xtrace.logging.XTraceInit",
        "ProcessName": "Data",
        "TaskID": "2027BE4E12657D52",
        "ParentEventID": [
          "E72152B8D281F24F"
        ],
        "Label": "Thread.setName: DataXceiver for client DFSClient_NONMAPREDUCE_310321604_1 at /139.19.171.63:33792 [Sending block BP-1633380353-139.19.171.63-1554193446451:blk_1073760963_20139]",
        "Title": "X-Trace Task",
        "Host": "pinky19.mpi-sws.org",
        "HRT": 26966791288676344,
        "Timestamp": "1557750431228.676270",
        "TenantClass": 0,
        "Source": "DataXceiver.java:168",
        "ThreadID": 38925,
        "ThreadName": "",
        "EventID": "8EB446CFAD1E8C97",
        "BaggageBytes": "[[248 5] [240 0] [0 32 39 190 78 18 101 125 82] [240 1] [0 231 33 82 184 210 129 242 79] [240 3] [0 2]]",
        "ProcessID": 2319
      },
      {
        "Cycles": 0,
        "Agent": "Execution-Sleep",
        "ProcessName": "Read",
        "TaskID": "2027BE4E12657D52",
        "ParentEventID": [
          "E68B5EF904AA4EF8"
        ],
        "Label": "waited",
        "Title": "X-Trace Task",
        "Host": "pinky19.mpi-sws.org",
        "Duration": "349022",
        "HRT": 26966791288868458,
        "Operation": "waited",
        "Timestamp": "1557750431228.857422",
        "TenantClass": 0,
        "Source": "SocketIOWithTimeout.java:335",
        "ThreadID": 1,
        "ThreadName": "",
        "EventID": "4C4087ADB806CECC",
        "ProcessID": 2801
      },
      {
        "Cycles": 0,
        "Agent": "edu.brown.cs.systems.xtrace.logging.BaggageWrappers",
        "ProcessName": "Data",
        "TaskID": "2027BE4E12657D52",
        "ParentEventID": [
          "8EB446CFAD1E8C97"
        ],
        "Label": "Forking current baggage with Baggage.fork()",
        "Title": "X-Trace Task",
        "Host": "pinky19.mpi-sws.org",
        "HRT": 26966791288797042,
        "Operation": "fork",
        "Timestamp": "1557750431228.796875",
        "TenantClass": 0,
        "Source": "DataXceiver.java:1257",
        "ThreadID": 38925,
        "ThreadName": "",
        "EventID": "A4B5C241E1745CEA",
        "BaggageBytes": "[[248 5] [240 0] [0 32 39 190 78 18 101 125 82] [240 1] [0 142 180 70 207 173 30 140 151] [240 3] [0 2]]",
        "ProcessID": 2319
      },
      {
        "Cycles": 0,
        "Agent": "edu.brown.cs.systems.xtrace.logging.BaggageWrappers",
        "ProcessName": "Data",
        "TaskID": "2027BE4E12657D52",
        "ParentEventID": [
          "A4B5C241E1745CEA"
        ],
        "Label": "Forking current baggage with Baggage.fork()",
        "Title": "X-Trace Task",
        "Host": "pinky19.mpi-sws.org",
        "HRT": 26966791288883363,
        "Operation": "fork",
        "Timestamp": "1557750431228.883301",
        "TenantClass": 0,
        "Source": "PacketHeader.java:95",
        "ThreadID": 38925,
        "ThreadName": "",
        "EventID": "D4EC985B5456D06A",
        "BaggageBytes": "[[248 5] [240 0] [0 32 39 190 78 18 101 125 82] [240 1] [0 164 181 194 65 225 116 92 234] [240 3] [0 2]]",
        "ProcessID": 2319
      },
      {
        "Cycles": 0,
        "Agent": "edu.brown.cs.systems.xtrace.logging.BaggageWrappers",
        "ProcessName": "Read",
        "TaskID": "2027BE4E12657D52",
        "ParentEventID": [
          "4C4087ADB806CECC",
          "A4B5C241E1745CEA"
        ],
        "Label": "Merged current baggage with other baggage",
        "Title": "X-Trace Task",
        "Host": "pinky19.mpi-sws.org",
        "HRT": 26966791288935586,
        "Operation": "join",
        "Timestamp": "1557750431228.924561",
        "TenantClass": 0,
        "Source": "RemoteBlockReader2.java:429",
        "ThreadID": 1,
        "ThreadName": "",
        "EventID": "AB5BC662632396F9",
        "ProcessID": 2801
      },
      {
        "Cycles": 0,
        "Agent": "Execution-Sleep",
        "ProcessName": "Data",
        "TaskID": "2027BE4E12657D52",
        "ParentEventID": [
          "D4EC985B5456D06A"
        ],
        "Label": "waited",
        "Title": "X-Trace Task",
        "Host": "pinky19.mpi-sws.org",
        "Duration": "6963",
        "HRT": 26966791288969108,
        "Operation": "waited",
        "Timestamp": "1557750431228.968994",
        "TenantClass": 0,
        "Source": "SocketIOWithTimeout.java:335",
        "ThreadID": 38925,
        "ThreadName": "",
        "EventID": "7B48388ED5D41500",
        "BaggageBytes": "[[248 5] [240 0] [0 32 39 190 78 18 101 125 82] [240 1] [0 212 236 152 91 84 86 208 106] [240 3] [0 2]]",
        "ProcessID": 2319
      },
      {
        "Cycles": 0,
        "Agent": "edu.brown.cs.systems.xtrace.logging.BaggageWrappers",
        "ProcessName": "Data",
        "TaskID": "2027BE4E12657D52",
        "ParentEventID": [
          "7B48388ED5D41500"
        ],
        "Label": "Forking current baggage with Baggage.fork()",
        "Title": "X-Trace Task",
        "Host": "pinky19.mpi-sws.org",
        "HRT": 26966791289073157,
        "Operation": "fork",
        "Timestamp": "1557750431229.072998",
        "TenantClass": 0,
        "Source": "PacketHeader.java:95",
        "ThreadID": 38925,
        "ThreadName": "",
        "EventID": "63A36FF97C46D95D",
        "BaggageBytes": "[[248 5] [240 0] [0 32 39 190 78 18 101 125 82] [240 1] [0 123 72 56 142 213 212 21 0] [240 3] [0 2]]",
        "ProcessID": 2319
      },
      {
        "Cycles": 0,
        "Agent": "edu.brown.cs.systems.xtrace.logging.BaggageWrappers",
        "ProcessName": "Read",
        "TaskID": "2027BE4E12657D52",
        "ParentEventID": [
          "D13E9B5FDE1154DC",
          "D4EC985B5456D06A"
        ],
        "Label": "Merged current baggage with other baggage",
        "Title": "X-Trace Task",
        "Host": "pinky19.mpi-sws.org",
        "HRT": 26966791289113144,
        "Operation": "join",
        "Timestamp": "1557750431229.102295",
        "TenantClass": 0,
        "Source": "PacketHeader.java:168",
        "ThreadID": 1,
        "ThreadName": "",
        "EventID": "24E27EF7120B0E5A",
        "ProcessID": 2801
      },
      {
        "Cycles": 0,
        "Agent": "Execution-Sleep",
        "ProcessName": "Read",
        "TaskID": "2027BE4E12657D52",
        "ParentEventID": [
          "AB5BC662632396F9"
        ],
        "Label": "waited",
        "Title": "X-Trace Task",
        "Host": "pinky19.mpi-sws.org",
        "Duration": "48221",
        "HRT": 26966791289056503,
        "Operation": "waited",
        "Timestamp": "1557750431229.045654",
        "TenantClass": 0,
        "Source": "SocketIOWithTimeout.java:335",
        "ThreadID": 1,
        "ThreadName": "",
        "EventID": "D13E9B5FDE1154DC",
        "ProcessID": 2801
      },
      {
        "Cycles": 0,
        "Agent": "edu.brown.cs.systems.xtrace.logging.BaggageWrappers",
        "ProcessName": "Read",
        "TaskID": "2027BE4E12657D52",
        "ParentEventID": [
          "24E27EF7120B0E5A",
          "63A36FF97C46D95D"
        ],
        "Label": "Merged current baggage with other baggage",
        "Title": "X-Trace Task",
        "Host": "pinky19.mpi-sws.org",
        "HRT": 26966791289238406,
        "Operation": "join",
        "Timestamp": "1557750431229.227539",
        "TenantClass": 0,
        "Source": "PacketHeader.java:168",
        "ThreadID": 1,
        "ThreadName": "",
        "EventID": "AAC750794042C197",
        "ProcessID": 2801
      },
      {
        "Cycles": 0,
        "Agent": "edu.brown.cs.systems.xtrace.logging.BaggageWrappers",
        "ProcessName": "Read",
        "TaskID": "2027BE4E12657D52",
        "ParentEventID": [
          "E5B0C47EEB784CCC"
        ],
        "Label": "Forking current baggage with Baggage.fork()",
        "Title": "X-Trace Task",
        "Host": "pinky19.mpi-sws.org",
        "HRT": 26966791289301788,
        "Operation": "fork",
        "Timestamp": "1557750431229.290771",
        "TenantClass": 0,
        "Source": "DataTransferProtoUtil.java:94",
        "ThreadID": 1,
        "ThreadName": "",
        "EventID": "6DA362243938B8B4",
        "ProcessID": 2801
      },
      {
        "Cycles": 0,
        "Agent": "edu.brown.cs.systems.xtrace.logging.BaggageWrappers",
        "ProcessName": "Read",
        "TaskID": "2027BE4E12657D52",
        "ParentEventID": [
          "AAC750794042C197"
        ],
        "Label": "Forking current baggage with Baggage.fork()",
        "Title": "X-Trace Task",
        "Host": "pinky19.mpi-sws.org",
        "HRT": 26966791289247440,
        "Operation": "fork",
        "Timestamp": "1557750431229.236572",
        "TenantClass": 0,
        "Source": "RemoteBlockReader2.java:361",
        "ThreadID": 1,
        "ThreadName": "",
        "EventID": "E5B0C47EEB784CCC",
        "ProcessID": 2801
      },
      {
        "Cycles": 0,
        "Agent": "Execution-Sleep",
        "ProcessName": "Data",
        "TaskID": "2027BE4E12657D52",
        "ParentEventID": [
          "63A36FF97C46D95D"
        ],
        "Label": "waited",
        "Title": "X-Trace Task",
        "Host": "pinky19.mpi-sws.org",
        "Duration": "106693",
        "HRT": 26966791289288958,
        "Operation": "waited",
        "Timestamp": "1557750431229.288818",
        "TenantClass": 0,
        "Source": "SocketIOWithTimeout.java:335",
        "ThreadID": 38925,
        "ThreadName": "",
        "EventID": "E41045FF40C9DA37",
        "BaggageBytes": "[[248 5] [240 0] [0 32 39 190 78 18 101 125 82] [240 1] [0 99 163 111 249 124 70 217 93] [240 3] [0 2]]",
        "ProcessID": 2319
      },
      {
        "Cycles": 0,
        "Agent": "edu.brown.cs.systems.xtrace.logging.BaggageWrappers",
        "ProcessName": "Data",
        "TaskID": "2027BE4E12657D52",
        "ParentEventID": [
          "E5B0C47EEB784CCC",
          "E41045FF40C9DA37"
        ],
        "Label": "Merged current baggage with other baggage",
        "Title": "X-Trace Task",
        "Host": "pinky19.mpi-sws.org",
        "HRT": 26966791289356373,
        "Operation": "join",
        "Timestamp": "1557750431229.356201",
        "TenantClass": 0,
        "Source": "DataXceiver.java:574",
        "ThreadID": 38925,
        "ThreadName": "",
        "EventID": "BDD03D65BCAD52DA",
        "BaggageBytes": "[[248 5] [240 0] [0 32 39 190 78 18 101 125 82] [240 1] [0 228 16 69 255 64 201 218 55] [0 229 176 196 126 235 120 76 204] [240 3] [0 2]]",
        "ProcessID": 2319
      },
      {
        "Cycles": 0,
        "Agent": "Execution-CPU",
        "ProcessName": "Data",
        "TaskID": "2027BE4E12657D52",
        "ParentEventID": [
          "BDD03D65BCAD52DA"
        ],
        "Label": "unset",
        "Title": "X-Trace Task",
        "Host": "pinky19.mpi-sws.org",
        "Duration": "727591",
        "HRT": 26966791289380265,
        "Operation": "unset",
        "Timestamp": "1557750431229.380127",
        "TenantClass": 0,
        "Source": "DataXceiver.java:261",
        "ThreadID": 38925,
        "ThreadName": "",
        "EventID": "0F4D8B21E473AA44",
        "BaggageBytes": "[[248 5] [240 0] [0 32 39 190 78 18 101 125 82] [240 1] [0 189 208 61 101 188 173 82 218] [240 3] [0 2]]",
        "ProcessID": 2319
      },
      {
        "Cycles": 0,
        "Agent": "edu.brown.cs.systems.xtrace.logging.XTraceInit",
        "ProcessName": "Data",
        "TaskID": "2027BE4E12657D52",
        "ParentEventID": [
          "C872F6A58383CB6A"
        ],
        "Label": "Thread.setName: DataXceiver for client DFSClient_NONMAPREDUCE_310321604_1 at /139.19.171.63:33792 [Sending block BP-1633380353-139.19.171.63-1554193446451:blk_1073760963_20139]",
        "Title": "X-Trace Task",
        "Host": "pinky19.mpi-sws.org",
        "HRT": 26966791289467190,
        "Timestamp": "1557750431229.467041",
        "TenantClass": 0,
        "Source": "DataXceiver.java:168",
        "ThreadID": 38925,
        "ThreadName": "",
        "EventID": "48D5A37C69EDCE59",
        "BaggageBytes": "[[248 5] [240 0] [0 32 39 190 78 18 101 125 82] [240 1] [0 200 114 246 165 131 131 203 106] [240 3] [0 2]]",
        "ProcessID": 2319
      },
      {
        "Cycles": 0,
        "Agent": "Execution-CPU",
        "ProcessName": "Data",
        "TaskID": "2027BE4E12657D52",
        "ParentEventID": [
          "6DA362243938B8B4"
        ],
        "Label": "set",
        "Title": "X-Trace Task",
        "Host": "pinky19.mpi-sws.org",
        "HRT": 26966791289442273,
        "Operation": "set",
        "Timestamp": "1557750431229.442139",
        "TenantClass": 0,
        "Source": "Receiver.java:117",
        "ThreadID": 38925,
        "ThreadName": "",
        "EventID": "C872F6A58383CB6A",
        "BaggageBytes": "[[248 5] [240 0] [0 32 39 190 78 18 101 125 82] [240 1] [0 109 163 98 36 57 56 184 180] [240 3] [0 2]]",
        "ProcessID": 2319
      },
      {
        "Cycles": 0,
        "Agent": "edu.brown.cs.systems.xtrace.logging.BaggageWrappers",
        "ProcessName": "Data",
        "TaskID": "2027BE4E12657D52",
        "ParentEventID": [
          "48D5A37C69EDCE59"
        ],
        "Label": "Forking current baggage with Baggage.fork()",
        "Title": "X-Trace Task",
        "Host": "pinky19.mpi-sws.org",
        "HRT": 26966791289541334,
        "Operation": "fork",
        "Timestamp": "1557750431229.541260",
        "TenantClass": 0,
        "Source": "DataXceiver.java:1257",
        "ThreadID": 38925,
        "ThreadName": "",
        "EventID": "6D750A6BB4BBC147",
        "BaggageBytes": "[[248 5] [240 0] [0 32 39 190 78 18 101 125 82] [240 1] [0 72 213 163 124 105 237 206 89] [240 3] [0 2]]",
        "ProcessID": 2319
      },
      {
        "Cycles": 0,
        "Agent": "Execution-Sleep",
        "ProcessName": "Read",
        "TaskID": "2027BE4E12657D52",
        "ParentEventID": [
          "6DA362243938B8B4"
        ],
        "Label": "waited",
        "Title": "X-Trace Task",
        "Host": "pinky19.mpi-sws.org",
        "Duration": "242003",
        "HRT": 26966791289612071,
        "Operation": "waited",
        "Timestamp": "1557750431229.601074",
        "TenantClass": 0,
        "Source": "SocketIOWithTimeout.java:335",
        "ThreadID": 1,
        "ThreadName": "",
        "EventID": "D0E88B1259E81760",
        "ProcessID": 2801
      },
      {
        "Cycles": 0,
        "Agent": "edu.brown.cs.systems.xtrace.logging.BaggageWrappers",
        "ProcessName": "Data",
        "TaskID": "2027BE4E12657D52",
        "ParentEventID": [
          "6D750A6BB4BBC147"
        ],
        "Label": "Forking current baggage with Baggage.fork()",
        "Title": "X-Trace Task",
        "Host": "pinky19.mpi-sws.org",
        "HRT": 26966791289601293,
        "Operation": "fork",
        "Timestamp": "1557750431229.601074",
        "TenantClass": 0,
        "Source": "PacketHeader.java:95",
        "ThreadID": 38925,
        "ThreadName": "",
        "EventID": "C54F78870FDACBDB",
        "BaggageBytes": "[[248 5] [240 0] [0 32 39 190 78 18 101 125 82] [240 1] [0 109 117 10 107 180 187 193 71] [240 3] [0 2]]",
        "ProcessID": 2319
      },
      {
        "Cycles": 0,
        "Agent": "edu.brown.cs.systems.xtrace.logging.BaggageWrappers",
        "ProcessName": "Read",
        "TaskID": "2027BE4E12657D52",
        "ParentEventID": [
          "D0E88B1259E81760",
          "6D750A6BB4BBC147"
        ],
        "Label": "Merged current baggage with other baggage",
        "Title": "X-Trace Task",
        "Host": "pinky19.mpi-sws.org",
        "HRT": 26966791289672118,
        "Operation": "join",
        "Timestamp": "1557750431229.661133",
        "TenantClass": 0,
        "Source": "RemoteBlockReader2.java:429",
        "ThreadID": 1,
        "ThreadName": "",
        "EventID": "BDC270994D8E327A",
        "ProcessID": 2801
      },
      {
        "Cycles": 0,
        "Agent": "Execution-Sleep",
        "ProcessName": "Data",
        "TaskID": "2027BE4E12657D52",
        "ParentEventID": [
          "C54F78870FDACBDB"
        ],
        "Label": "waited",
        "Title": "X-Trace Task",
        "Host": "pinky19.mpi-sws.org",
        "Duration": "4531",
        "HRT": 26966791289666308,
        "Operation": "waited",
        "Timestamp": "1557750431229.666260",
        "TenantClass": 0,
        "Source": "SocketIOWithTimeout.java:335",
        "ThreadID": 38925,
        "ThreadName": "",
        "EventID": "0BBC94BF62E7642F",
        "BaggageBytes": "[[248 5] [240 0] [0 32 39 190 78 18 101 125 82] [240 1] [0 197 79 120 135 15 218 203 219] [240 3] [0 2]]",
        "ProcessID": 2319
      },
      {
        "Cycles": 0,
        "Agent": "edu.brown.cs.systems.xtrace.logging.BaggageWrappers",
        "ProcessName": "Data",
        "TaskID": "2027BE4E12657D52",
        "ParentEventID": [
          "0BBC94BF62E7642F"
        ],
        "Label": "Forking current baggage with Baggage.fork()",
        "Title": "X-Trace Task",
        "Host": "pinky19.mpi-sws.org",
        "HRT": 26966791289740498,
        "Operation": "fork",
        "Timestamp": "1557750431229.740479",
        "TenantClass": 0,
        "Source": "PacketHeader.java:95",
        "ThreadID": 38925,
        "ThreadName": "",
        "EventID": "67A240FDBEAD2C57",
        "BaggageBytes": "[[248 5] [240 0] [0 32 39 190 78 18 101 125 82] [240 1] [0 11 188 148 191 98 231 100 47] [240 3] [0 2]]",
        "ProcessID": 2319
      },
      {
        "Cycles": 0,
        "Agent": "Execution-Sleep",
        "ProcessName": "Data",
        "TaskID": "2027BE4E12657D52",
        "ParentEventID": [
          "67A240FDBEAD2C57"
        ],
        "Label": "waited",
        "Title": "X-Trace Task",
        "Host": "pinky19.mpi-sws.org",
        "Duration": "5312",
        "HRT": 26966791289803620,
        "Operation": "waited",
        "Timestamp": "1557750431229.803467",
        "TenantClass": 0,
        "Source": "SocketIOWithTimeout.java:335",
        "ThreadID": 38925,
        "ThreadName": "",
        "EventID": "512BB9DA8ECC207A",
        "BaggageBytes": "[[248 5] [240 0] [0 32 39 190 78 18 101 125 82] [240 1] [0 103 162 64 253 190 173 44 87] [240 3] [0 2]]",
        "ProcessID": 2319
      },
      {
        "Cycles": 0,
        "Agent": "edu.brown.cs.systems.xtrace.logging.BaggageWrappers",
        "ProcessName": "Read",
        "TaskID": "2027BE4E12657D52",
        "ParentEventID": [
          "C54F78870FDACBDB",
          "BDC270994D8E327A"
        ],
        "Label": "Merged current baggage with other baggage",
        "Title": "X-Trace Task",
        "Host": "pinky19.mpi-sws.org",
        "HRT": 26966791289758764,
        "Operation": "join",
        "Timestamp": "1557750431229.747803",
        "TenantClass": 0,
        "Source": "PacketHeader.java:168",
        "ThreadID": 1,
        "ThreadName": "",
        "EventID": "6FEA4823BD848F39",
        "ProcessID": 2801
      },
      {
        "Cycles": 0,
        "Agent": "Execution-CPU",
        "ProcessName": "Data",
        "TaskID": "2027BE4E12657D52",
        "ParentEventID": [
          "512BB9DA8ECC207A"
        ],
        "Label": "unset",
        "Title": "X-Trace Task",
        "Host": "pinky19.mpi-sws.org",
        "Duration": "520330",
        "HRT": 26966791289979405,
        "Operation": "unset",
        "Timestamp": "1557750431229.979248",
        "TenantClass": 0,
        "Source": "DataXceiver.java:261",
        "ThreadID": 38925,
        "ThreadName": "",
        "EventID": "89BEB0578CB150B6",
        "BaggageBytes": "[[248 5] [240 0] [0 32 39 190 78 18 101 125 82] [240 1] [0 81 43 185 218 142 204 32 122] [240 3] [0 2]]",
        "ProcessID": 2319
      },
      {
        "Cycles": 0,
        "Agent": "edu.brown.cs.systems.retro.benchmarks.hdfs_client.Reader",
        "ProcessName": "Read",
        "TaskID": "2027BE4E12657D52",
        "ParentEventID": [
          "0"
        ],
        "Label": "Reading file",
        "Title": "X-Trace Task",
        "Host": "pinky19.mpi-sws.org",
        "HRT": 26966791287639475,
        "Timestamp": "1557750431227.628418",
        "TenantClass": 0,
        "ThreadID": 1,
        "ThreadName": "",
        "EventID": "FBB2661194704997",
        "ProcessID": 2801,
        "Tag": [
          "reader_100kb",
          "Read Size: 102400"
        ]
      }
    ]
  }
]