[
  {
    "id": "92678AD7B6C6F6E4",
    "reports": [
      {
        "Cycles": 0,
        "Agent": "Execution-CPU",
        "ProcessName": "Read",
        "TaskID": "92678AD7B6C6F6E4",
        "ParentEventID": [
          "3DA82E1D31CE3C9A"
        ],
        "Label": "unset",
        "Title": "X-Trace Task",
        "Host": "pinky19.mpi-sws.org",
        "Duration": "22277403",
        "HRT": 26962550041509215,
        "Operation": "unset",
        "Timestamp": "1557746189982.102051",
        "TenantClass": 0,
        "Source": "Client.java:1027",
        "ThreadID": 1,
        "ThreadName": "",
        "EventID": "58206D51A02A3934",
        "ProcessID": 36430
      },
      {
        "Cycles": 0,
        "Agent": "edu.brown.cs.systems.retro.benchmarks.hdfs_client.Reader",
        "ProcessName": "Read",
        "TaskID": "92678AD7B6C6F6E4",
        "ParentEventID": [
          "D88ADFBF1272AF70"
        ],
        "Label": "Reading file",
        "Title": "X-Trace Task",
        "Host": "pinky19.mpi-sws.org",
        "HRT": 26962550041420574,
        "Timestamp": "1557746189982.013428",
        "TenantClass": 0,
        "ThreadID": 1,
        "ThreadName": "",
        "EventID": "DB7829C12B263320",
        "ProcessID": 36430
      },
      {
        "Cycles": 0,
        "Agent": "org.apache.hadoop.ipc.ProtobufRpcEngine",
        "ProcessName": "Read",
        "TaskID": "92678AD7B6C6F6E4",
        "ParentEventID": [
          "DB7829C12B263320"
        ],
        "Label": "Invoking org.apache.hadoop.hdfs.protocol.ClientProtocol.getBlockLocations",
        "Title": "X-Trace Task",
        "Host": "pinky19.mpi-sws.org",
        "HRT": 26962550041472864,
        "Timestamp": "1557746189982.065674",
        "TenantClass": 0,
        "Source": "ProtobufRpcEngine.java:228",
        "ThreadID": 1,
        "ThreadName": "",
        "EventID": "3DA82E1D31CE3C9A",
        "ProcessID": 36430
      },
      {
        "Cycles": 0,
        "Agent": "Execution-CPU",
        "ProcessName": "Read",
        "TaskID": "92678AD7B6C6F6E4",
        "ParentEventID": [
          "58206D51A02A3934"
        ],
        "Label": "set",
        "Title": "X-Trace Task",
        "Host": "pinky19.mpi-sws.org",
        "HRT": 26962550041541663,
        "Operation": "set",
        "Timestamp": "1557746189982.134521",
        "TenantClass": 0,
        "Source": "Client.java:1032",
        "ThreadID": 41,
        "ThreadName": "",
        "EventID": "CE2346DA734D5188",
        "ProcessID": 36430
      },
      {
        "Cycles": 0,
        "Agent": "edu.brown.cs.systems.xtrace.logging.BaggageWrappers",
        "ProcessName": "Read",
        "TaskID": "92678AD7B6C6F6E4",
        "ParentEventID": [
          "CE2346DA734D5188"
        ],
        "Label": "Forking current baggage with Baggage.fork()",
        "Title": "X-Trace Task",
        "Host": "pinky19.mpi-sws.org",
        "HRT": 26962550041554816,
        "Operation": "fork",
        "Timestamp": "1557746189982.147705",
        "TenantClass": 0,
        "Source": "Client.java:1043",
        "ThreadID": 41,
        "ThreadName": "",
        "EventID": "91BFDB57845CA7D9",
        "ProcessID": 36430
      },
      {
        "Cycles": 0,
        "Agent": "Execution-CPU",
        "ProcessName": "Read",
        "TaskID": "92678AD7B6C6F6E4",
        "ParentEventID": [
          "91BFDB57845CA7D9"
        ],
        "Label": "unset",
        "Title": "X-Trace Task",
        "Host": "pinky19.mpi-sws.org",
        "Duration": "62090",
        "HRT": 26962550041616754,
        "Operation": "unset",
        "Timestamp": "1557746189982.209717",
        "TenantClass": 0,
        "Source": "Client.java:1062",
        "ThreadID": 41,
        "ThreadName": "",
        "EventID": "A1779EC4CEE2D32E",
        "ProcessID": 36430
      },
      {
        "Cycles": 0,
        "Agent": "Execution-CPU",
        "ProcessName": "Name",
        "TaskID": "92678AD7B6C6F6E4",
        "ParentEventID": [
          "91BFDB57845CA7D9"
        ],
        "Label": "set",
        "Title": "X-Trace Task",
        "Host": "pinky19.mpi-sws.org",
        "HRT": 26962550041680600,
        "Operation": "set",
        "Timestamp": "1557746189982.302979",
        "TenantClass": 0,
        "Source": "Server.java:1840",
        "ThreadID": 48,
        "ThreadName": "",
        "EventID": "A6413D88FC510E51",
        "BaggageBytes": "[[248 5] [240 0] [0 146 103 138 215 182 198 246 228] [240 1] [0 145 191 219 87 132 92 167 217] [240 3] [0 2]]",
        "ProcessID": 2171
      },
      {
        "Cycles": 0,
        "Agent": "edu.brown.cs.systems.xtrace.logging.BaggageWrappers",
        "ProcessName": "Name",
        "TaskID": "92678AD7B6C6F6E4",
        "ParentEventID": [
          "A6413D88FC510E51"
        ],
        "Label": "Forking current baggage with Baggage.fork()",
        "Title": "X-Trace Task",
        "Host": "pinky19.mpi-sws.org",
        "HRT": 26962550041719416,
        "Operation": "fork",
        "Timestamp": "1557746189982.341797",
        "TenantClass": 0,
        "Source": "Server.java:550",
        "ThreadID": 48,
        "ThreadName": "",
        "EventID": "EF119B3AAB94377E",
        "BaggageBytes": "[[248 5] [240 0] [0 146 103 138 215 182 198 246 228] [240 1] [0 166 65 61 136 252 81 14 81] [240 3] [0 2]]",
        "ProcessID": 2171
      },
      {
        "Cycles": 0,
        "Agent": "Execution-CPU",
        "ProcessName": "Name",
        "TaskID": "92678AD7B6C6F6E4",
        "ParentEventID": [
          "EF119B3AAB94377E"
        ],
        "Label": "unset",
        "Title": "X-Trace Task",
        "Host": "pinky19.mpi-sws.org",
        "Duration": "30146",
        "HRT": 26962550041743975,
        "Operation": "unset",
        "Timestamp": "1557746189982.366211",
        "TenantClass": 0,
        "Source": "Server.java:1828",
        "ThreadID": 48,
        "ThreadName": "",
        "EventID": "733301A12C8F6E08",
        "BaggageBytes": "[[248 5] [240 0] [0 146 103 138 215 182 198 246 228] [240 1] [0 239 17 155 58 171 148 55 126] [240 3] [0 2]]",
        "ProcessID": 2171
      },
      {
        "Cycles": 0,
        "Agent": "Execution-CPU",
        "ProcessName": "Name",
        "TaskID": "92678AD7B6C6F6E4",
        "ParentEventID": [
          "EF119B3AAB94377E"
        ],
        "Label": "set",
        "Title": "X-Trace Task",
        "Host": "pinky19.mpi-sws.org",
        "HRT": 26962550041751054,
        "Operation": "set",
        "Timestamp": "1557746189982.373291",
        "TenantClass": 0,
        "Source": "Server.java:2071",
        "ThreadID": 60,
        "ThreadName": "",
        "EventID": "EAA08907B3E9976F",
        "BaggageBytes": "[[248 5] [240 0] [0 146 103 138 215 182 198 246 228] [240 1] [0 239 17 155 58 171 148 55 126] [240 3] [0 2]]",
        "ProcessID": 2171
      },
      {
        "Cycles": 0,
        "Agent": "Execution-CPU",
        "ProcessName": "Read",
        "TaskID": "92678AD7B6C6F6E4",
        "ParentEventID": [
          "A1779EC4CEE2D32E"
        ],
        "Label": "set",
        "Title": "X-Trace Task",
        "Host": "pinky19.mpi-sws.org",
        "HRT": 26962550041637581,
        "Operation": "set",
        "Timestamp": "1557746189982.230469",
        "TenantClass": 0,
        "Source": "Client.java:1104",
        "ThreadID": 1,
        "ThreadName": "",
        "EventID": "6B88FB5AD7187C50",
        "ProcessID": 36430
      },
      {
        "Cycles": 0,
        "Agent": "org.apache.hadoop.ipc.Server",
        "ProcessName": "Name",
        "TaskID": "92678AD7B6C6F6E4",
        "ParentEventID": [
          "EAA08907B3E9976F"
        ],
        "Label": "getBlockLocations in org.apache.hadoop.hdfs.protocol.ClientProtocol",
        "Title": "X-Trace Task",
        "Host": "pinky19.mpi-sws.org",
        "HRT": 26962550041796094,
        "Timestamp": "1557746189982.418457",
        "TenantClass": 0,
        "Source": "ProtobufRpcEngine.java:601",
        "ThreadID": 60,
        "ThreadName": "",
        "EventID": "7B2335CD430C091E",
        "BaggageBytes": "[[248 5] [240 0] [0 146 103 138 215 182 198 246 228] [240 1] [0 234 160 137 7 179 233 151 111] [240 3] [0 2]]",
        "ProcessID": 2171
      },
      {
        "Cycles": 0,
        "Agent": "org.apache.hadoop.hdfs.server.namenode.FSNamesystem.audit",
        "ProcessName": "Name",
        "TaskID": "92678AD7B6C6F6E4",
        "ParentEventID": [
          "7B2335CD430C091E"
        ],
        "Label": "allowed=true\tugi=plascas (auth:SIMPLE)\tip=/139.19.171.63\tcmd=open\tsrc=/ds/y7m68lW3bBRZKGWY\tdst=null\tperm=null\tproto=rpc",
        "Title": "X-Trace Task",
        "Host": "pinky19.mpi-sws.org",
        "HRT": 26962550041847715,
        "Timestamp": "1557746189982.469971",
        "TenantClass": 0,
        "Source": "FSNamesystem.java:8313",
        "ThreadID": 60,
        "ThreadName": "",
        "EventID": "30B3DA97FCA2BA6D",
        "BaggageBytes": "[[248 5] [240 0] [0 146 103 138 215 182 198 246 228] [240 1] [0 123 35 53 205 67 12 9 30] [240 3] [0 2]]",
        "ProcessID": 2171
      },
      {
        "Cycles": 0,
        "Agent": "Execution-CPU",
        "ProcessName": "Name",
        "TaskID": "92678AD7B6C6F6E4",
        "ParentEventID": [
          "5C134BDC8890A8AC"
        ],
        "Label": "unset",
        "Title": "X-Trace Task",
        "Host": "pinky19.mpi-sws.org",
        "Duration": "214486",
        "HRT": 26962550041999292,
        "Operation": "unset",
        "Timestamp": "1557746189982.621582",
        "TenantClass": 0,
        "Source": "Server.java:1058",
        "ThreadID": 60,
        "ThreadName": "",
        "EventID": "4C36C45CE46197D7",
        "BaggageBytes": "[[248 5] [240 0] [0 146 103 138 215 182 198 246 228] [240 1] [0 92 19 75 220 136 144 168 172] [240 3] [0 2]]",
        "ProcessID": 2171
      },
      {
        "Cycles": 0,
        "Agent": "Execution-CPU",
        "ProcessName": "Read",
        "TaskID": "92678AD7B6C6F6E4",
        "ParentEventID": [
          "5C134BDC8890A8AC"
        ],
        "Label": "set",
        "Title": "X-Trace Task",
        "Host": "pinky19.mpi-sws.org",
        "HRT": 26962550042076242,
        "Operation": "set",
        "Timestamp": "1557746189982.669189",
        "TenantClass": 0,
        "Source": "Client.java:302",
        "ThreadID": 37,
        "ThreadName": "",
        "EventID": "62758757A76AAA12",
        "ProcessID": 36430
      },
      {
        "Cycles": 0,
        "Agent": "edu.brown.cs.systems.xtrace.logging.BaggageWrappers",
        "ProcessName": "Name",
        "TaskID": "92678AD7B6C6F6E4",
        "ParentEventID": [
          "30B3DA97FCA2BA6D"
        ],
        "Label": "Forking current baggage with Baggage.fork()",
        "Title": "X-Trace Task",
        "Host": "pinky19.mpi-sws.org",
        "HRT": 26962550041891720,
        "Operation": "fork",
        "Timestamp": "1557746189982.513916",
        "TenantClass": 0,
        "Source": "Server.java:2398",
        "ThreadID": 60,
        "ThreadName": "",
        "EventID": "5C134BDC8890A8AC",
        "BaggageBytes": "[[248 5] [240 0] [0 146 103 138 215 182 198 246 228] [240 1] [0 48 179 218 151 252 162 186 109] [240 3] [0 2]]",
        "ProcessID": 2171
      },
      {
        "Cycles": 0,
        "Agent": "Execution-CPU",
        "ProcessName": "Read",
        "TaskID": "92678AD7B6C6F6E4",
        "ParentEventID": [
          "62758757A76AAA12"
        ],
        "Label": "unset",
        "Title": "X-Trace Task",
        "Host": "pinky19.mpi-sws.org",
        "Duration": "10781",
        "HRT": 26962550042104913,
        "Operation": "unset",
        "Timestamp": "1557746189982.697754",
        "TenantClass": 0,
        "Source": "Client.java:1168",
        "ThreadID": 37,
        "ThreadName": "",
        "EventID": "479372CB4E86CC86",
        "ProcessID": 36430
      },
      {
        "Cycles": 0,
        "Agent": "Execution-Sleep",
        "ProcessName": "Read",
        "TaskID": "92678AD7B6C6F6E4",
        "ParentEventID": [
          "6B88FB5AD7187C50"
        ],
        "Label": "waited",
        "Title": "X-Trace Task",
        "Host": "pinky19.mpi-sws.org",
        "Duration": "480147",
        "HRT": 26962550042129196,
        "Operation": "waited",
        "Timestamp": "1557746189982.722168",
        "TenantClass": 0,
        "Source": "Client.java:1537",
        "ThreadID": 1,
        "ThreadName": "",
        "EventID": "5C49C8085C17830F",
        "ProcessID": 36430
      },
      {
        "Cycles": 0,
        "Agent": "edu.brown.cs.systems.xtrace.logging.BaggageWrappers",
        "ProcessName": "Read",
        "TaskID": "92678AD7B6C6F6E4",
        "ParentEventID": [
          "5C49C8085C17830F",
          "479372CB4E86CC86"
        ],
        "Label": "Merged current baggage with other baggage",
        "Title": "X-Trace Task",
        "Host": "pinky19.mpi-sws.org",
        "HRT": 26962550042152796,
        "Operation": "join",
        "Timestamp": "1557746189982.745605",
        "TenantClass": 0,
        "Source": "Client.java:1545",
        "ThreadID": 1,
        "ThreadName": "",
        "EventID": "3A77307960AA7F72",
        "ProcessID": 36430
      },
      {
        "Cycles": 0,
        "Agent": "edu.brown.cs.systems.xtrace.logging.BaggageWrappers",
        "ProcessName": "Read",
        "TaskID": "92678AD7B6C6F6E4",
        "ParentEventID": [
          "9054F8DDE8F55855"
        ],
        "Label": "Forking current baggage with Baggage.fork()",
        "Title": "X-Trace Task",
        "Host": "pinky19.mpi-sws.org",
        "HRT": 26962550042332849,
        "Operation": "fork",
        "Timestamp": "1557746189982.925781",
        "TenantClass": 0,
        "Source": "DataTransferProtoUtil.java:94",
        "ThreadID": 1,
        "ThreadName": "",
        "EventID": "71AA5B4863C4A7C2",
        "ProcessID": 36430
      },
      {
        "Cycles": 0,
        "Agent": "org.apache.hadoop.ipc.ProtobufRpcEngine",
        "ProcessName": "Read",
        "TaskID": "92678AD7B6C6F6E4",
        "ParentEventID": [
          "3A77307960AA7F72"
        ],
        "Label": "org.apache.hadoop.hdfs.protocol.ClientProtocol.getBlockLocations completed",
        "Title": "X-Trace Task",
        "Host": "pinky19.mpi-sws.org",
        "HRT": 26962550042231807,
        "Timestamp": "1557746189982.824707",
        "TenantClass": 0,
        "Source": "ProtobufRpcEngine.java:275",
        "ThreadID": 1,
        "ThreadName": "",
        "EventID": "9054F8DDE8F55855",
        "ProcessID": 36430
      },
      {
        "Cycles": 0,
        "Agent": "Execution-CPU",
        "ProcessName": "Data",
        "TaskID": "92678AD7B6C6F6E4",
        "ParentEventID": [
          "71AA5B4863C4A7C2"
        ],
        "Label": "set",
        "Title": "X-Trace Task",
        "Host": "pinky19.mpi-sws.org",
        "HRT": 26962550042477154,
        "Operation": "set",
        "Timestamp": "1557746189983.074951",
        "TenantClass": 0,
        "Source": "Receiver.java:117",
        "ThreadID": 36633,
        "ThreadName": "",
        "EventID": "9095D37444717FAB",
        "BaggageBytes": "[[248 5] [240 0] [0 146 103 138 215 182 198 246 228] [240 1] [0 113 170 91 72 99 196 167 194] [240 3] [0 2]]",
        "ProcessID": 2319
      },
      {
        "Cycles": 0,
        "Agent": "edu.brown.cs.systems.xtrace.logging.BaggageWrappers",
        "ProcessName": "Data",
        "TaskID": "92678AD7B6C6F6E4",
        "ParentEventID": [
          "B1A08A958D524551"
        ],
        "Label": "Forking current baggage with Baggage.fork()",
        "Title": "X-Trace Task",
        "Host": "pinky19.mpi-sws.org",
        "HRT": 26962550042590741,
        "Operation": "fork",
        "Timestamp": "1557746189983.188721",
        "TenantClass": 0,
        "Source": "DataXceiver.java:1257",
        "ThreadID": 36633,
        "ThreadName": "",
        "EventID": "D493C0741D423CB4",
        "BaggageBytes": "[[248 5] [240 0] [0 146 103 138 215 182 198 246 228] [240 1] [0 177 160 138 149 141 82 69 81] [240 3] [0 2]]",
        "ProcessID": 2319
      },
      {
        "Cycles": 0,
        "Agent": "edu.brown.cs.systems.xtrace.logging.XTraceInit",
        "ProcessName": "Data",
        "TaskID": "92678AD7B6C6F6E4",
        "ParentEventID": [
          "9095D37444717FAB"
        ],
        "Label": "Thread.setName: DataXceiver for client DFSClient_NONMAPREDUCE_778905418_1 at /139.19.171.63:43130 [Sending block BP-1633380353-139.19.171.63-1554193446451:blk_1073756595_15771]",
        "Title": "X-Trace Task",
        "Host": "pinky19.mpi-sws.org",
        "HRT": 26962550042511671,
        "Timestamp": "1557746189983.109619",
        "TenantClass": 0,
        "Source": "DataXceiver.java:168",
        "ThreadID": 36633,
        "ThreadName": "",
        "EventID": "B1A08A958D524551",
        "BaggageBytes": "[[248 5] [240 0] [0 146 103 138 215 182 198 246 228] [240 1] [0 144 149 211 116 68 113 127 171] [240 3] [0 2]]",
        "ProcessID": 2319
      },
      {
        "Cycles": 0,
        "Agent": "edu.brown.cs.systems.xtrace.logging.BaggageWrappers",
        "ProcessName": "Data",
        "TaskID": "92678AD7B6C6F6E4",
        "ParentEventID": [
          "D493C0741D423CB4"
        ],
        "Label": "Forking current baggage with Baggage.fork()",
        "Title": "X-Trace Task",
        "Host": "pinky19.mpi-sws.org",
        "HRT": 26962550042660237,
        "Operation": "fork",
        "Timestamp": "1557746189983.258057",
        "TenantClass": 0,
        "Source": "PacketHeader.java:95",
        "ThreadID": 36633,
        "ThreadName": "",
        "EventID": "BA79CD1ED4FC3740",
        "BaggageBytes": "[[248 5] [240 0] [0 146 103 138 215 182 198 246 228] [240 1] [0 212 147 192 116 29 66 60 180] [240 3] [0 2]]",
        "ProcessID": 2319
      },
      {
        "Cycles": 0,
        "Agent": "Execution-Sleep",
        "ProcessName": "Data",
        "TaskID": "92678AD7B6C6F6E4",
        "ParentEventID": [
          "BA79CD1ED4FC3740"
        ],
        "Label": "waited",
        "Title": "X-Trace Task",
        "Host": "pinky19.mpi-sws.org",
        "Duration": "4108",
        "HRT": 26962550042729604,
        "Operation": "waited",
        "Timestamp": "1557746189983.327393",
        "TenantClass": 0,
        "Source": "SocketIOWithTimeout.java:335",
        "ThreadID": 36633,
        "ThreadName": "",
        "EventID": "E5054E00E19B7D63",
        "BaggageBytes": "[[248 5] [240 0] [0 146 103 138 215 182 198 246 228] [240 1] [0 186 121 205 30 212 252 55 64] [240 3] [0 2]]",
        "ProcessID": 2319
      },
      {
        "Cycles": 0,
        "Agent": "Execution-Sleep",
        "ProcessName": "Read",
        "TaskID": "92678AD7B6C6F6E4",
        "ParentEventID": [
          "71AA5B4863C4A7C2"
        ],
        "Label": "waited",
        "Title": "X-Trace Task",
        "Host": "pinky19.mpi-sws.org",
        "Duration": "218523",
        "HRT": 26962550042658758,
        "Operation": "waited",
        "Timestamp": "1557746189983.251709",
        "TenantClass": 0,
        "Source": "SocketIOWithTimeout.java:335",
        "ThreadID": 1,
        "ThreadName": "",
        "EventID": "71857247691D06B3",
        "ProcessID": 36430
      },
      {
        "Cycles": 0,
        "Agent": "edu.brown.cs.systems.xtrace.logging.BaggageWrappers",
        "ProcessName": "Read",
        "TaskID": "92678AD7B6C6F6E4",
        "ParentEventID": [
          "71857247691D06B3",
          "D493C0741D423CB4"
        ],
        "Label": "Merged current baggage with other baggage",
        "Title": "X-Trace Task",
        "Host": "pinky19.mpi-sws.org",
        "HRT": 26962550042754137,
        "Operation": "join",
        "Timestamp": "1557746189983.347168",
        "TenantClass": 0,
        "Source": "RemoteBlockReader2.java:429",
        "ThreadID": 1,
        "ThreadName": "",
        "EventID": "8E42F823C2D164B5",
        "ProcessID": 36430
      },
      {
        "Cycles": 0,
        "Agent": "edu.brown.cs.systems.xtrace.logging.BaggageWrappers",
        "ProcessName": "Read",
        "TaskID": "92678AD7B6C6F6E4",
        "ParentEventID": [
          "8E42F823C2D164B5",
          "BA79CD1ED4FC3740"
        ],
        "Label": "Merged current baggage with other baggage",
        "Title": "X-Trace Task",
        "Host": "pinky19.mpi-sws.org",
        "HRT": 26962550042859966,
        "Operation": "join",
        "Timestamp": "1557746189983.452881",
        "TenantClass": 0,
        "Source": "PacketHeader.java:168",
        "ThreadID": 1,
        "ThreadName": "",
        "EventID": "79BFE62724357318",
        "ProcessID": 36430
      },
      {
        "Cycles": 0,
        "Agent": "edu.brown.cs.systems.xtrace.logging.BaggageWrappers",
        "ProcessName": "Data",
        "TaskID": "92678AD7B6C6F6E4",
        "ParentEventID": [
          "E5054E00E19B7D63"
        ],
        "Label": "Forking current baggage with Baggage.fork()",
        "Title": "X-Trace Task",
        "Host": "pinky19.mpi-sws.org",
        "HRT": 26962550042808056,
        "Operation": "fork",
        "Timestamp": "1557746189983.406006",
        "TenantClass": 0,
        "Source": "PacketHeader.java:95",
        "ThreadID": 36633,
        "ThreadName": "",
        "EventID": "DE9C7DA4CBADD4EA",
        "BaggageBytes": "[[248 5] [240 0] [0 146 103 138 215 182 198 246 228] [240 1] [0 229 5 78 0 225 155 125 99] [240 3] [0 2]]",
        "ProcessID": 2319
      },
      {
        "Cycles": 0,
        "Agent": "edu.brown.cs.systems.xtrace.logging.BaggageWrappers",
        "ProcessName": "Read",
        "TaskID": "92678AD7B6C6F6E4",
        "ParentEventID": [
          "DE9C7DA4CBADD4EA",
          "79BFE62724357318"
        ],
        "Label": "Merged current baggage with other baggage",
        "Title": "X-Trace Task",
        "Host": "pinky19.mpi-sws.org",
        "HRT": 26962550042947055,
        "Operation": "join",
        "Timestamp": "1557746189983.540039",
        "TenantClass": 0,
        "Source": "PacketHeader.java:168",
        "ThreadID": 1,
        "ThreadName": "",
        "EventID": "7A587B3174776D4A",
        "ProcessID": 36430
      },
      {
        "Cycles": 0,
        "Agent": "Execution-Sleep",
        "ProcessName": "Data",
        "TaskID": "92678AD7B6C6F6E4",
        "ParentEventID": [
          "DE9C7DA4CBADD4EA"
        ],
        "Label": "waited",
        "Title": "X-Trace Task",
        "Host": "pinky19.mpi-sws.org",
        "Duration": "129305",
        "HRT": 26962550043044397,
        "Operation": "waited",
        "Timestamp": "1557746189983.642334",
        "TenantClass": 0,
        "Source": "SocketIOWithTimeout.java:335",
        "ThreadID": 36633,
        "ThreadName": "",
        "EventID": "DCC9AD88FD0381F9",
        "BaggageBytes": "[[248 5] [240 0] [0 146 103 138 215 182 198 246 228] [240 1] [0 222 156 125 164 203 173 212 234] [240 3] [0 2]]",
        "ProcessID": 2319
      },
      {
        "Cycles": 0,
        "Agent": "edu.brown.cs.systems.xtrace.logging.BaggageWrappers",
        "ProcessName": "Read",
        "TaskID": "92678AD7B6C6F6E4",
        "ParentEventID": [
          "7A587B3174776D4A"
        ],
        "Label": "Forking current baggage with Baggage.fork()",
        "Title": "X-Trace Task",
        "Host": "pinky19.mpi-sws.org",
        "HRT": 26962550042980459,
        "Operation": "fork",
        "Timestamp": "1557746189983.573486",
        "TenantClass": 0,
        "Source": "RemoteBlockReader2.java:361",
        "ThreadID": 1,
        "ThreadName": "",
        "EventID": "820FF6332FA30456",
        "ProcessID": 36430
      },
      {
        "Cycles": 0,
        "Agent": "edu.brown.cs.systems.xtrace.logging.BaggageWrappers",
        "ProcessName": "Data",
        "TaskID": "92678AD7B6C6F6E4",
        "ParentEventID": [
          "820FF6332FA30456",
          "DCC9AD88FD0381F9"
        ],
        "Label": "Merged current baggage with other baggage",
        "Title": "X-Trace Task",
        "Host": "pinky19.mpi-sws.org",
        "HRT": 26962550043109679,
        "Operation": "join",
        "Timestamp": "1557746189983.707520",
        "TenantClass": 0,
        "Source": "DataXceiver.java:574",
        "ThreadID": 36633,
        "ThreadName": "",
        "EventID": "C6DBB63E681587B2",
        "BaggageBytes": "[[248 5] [240 0] [0 146 103 138 215 182 198 246 228] [240 1] [0 130 15 246 51 47 163 4 86] [0 220 201 173 136 253 3 129 249] [240 3] [0 2]]",
        "ProcessID": 2319
      },
      {
        "Cycles": 0,
        "Agent": "Execution-CPU",
        "ProcessName": "Data",
        "TaskID": "92678AD7B6C6F6E4",
        "ParentEventID": [
          "C6DBB63E681587B2"
        ],
        "Label": "unset",
        "Title": "X-Trace Task",
        "Host": "pinky19.mpi-sws.org",
        "Duration": "628911",
        "HRT": 26962550043130808,
        "Operation": "unset",
        "Timestamp": "1557746189983.728760",
        "TenantClass": 0,
        "Source": "DataXceiver.java:261",
        "ThreadID": 36633,
        "ThreadName": "",
        "EventID": "4030F2245968C8D9",
        "BaggageBytes": "[[248 5] [240 0] [0 146 103 138 215 182 198 246 228] [240 1] [0 198 219 182 62 104 21 135 178] [240 3] [0 2]]",
        "ProcessID": 2319
      },
      {
        "Cycles": 0,
        "Agent": "edu.brown.cs.systems.retro.benchmarks.hdfs_client.Reader",
        "ProcessName": "Read",
        "TaskID": "92678AD7B6C6F6E4",
        "ParentEventID": [
          "0"
        ],
        "Label": "Reading file",
        "Title": "X-Trace Task",
        "Host": "pinky19.mpi-sws.org",
        "HRT": 26962550041402506,
        "Timestamp": "1557746189981.995361",
        "TenantClass": 0,
        "ThreadID": 1,
        "ThreadName": "",
        "EventID": "D88ADFBF1272AF70",
        "ProcessID": 36430,
        "Tag": [
          "reader_10kb",
          "Read Size: 10240"
        ]
      }
    ]
  }
]