[
  {
    "id": "5B426D1B8BD6889C",
    "reports": [
      {
        "Cycles": 0,
        "Agent": "org.apache.hadoop.ipc.ProtobufRpcEngine",
        "ProcessName": "Read",
        "TaskID": "5B426D1B8BD6889C",
        "ParentEventID": [
          "7C18FEF45780C6C5"
        ],
        "Label": "Invoking org.apache.hadoop.hdfs.protocol.ClientProtocol.getBlockLocations",
        "Title": "X-Trace Task",
        "Host": "pinky19.mpi-sws.org",
        "HRT": 25491838551854717,
        "Timestamp": "1556275478492.275146",
        "TenantClass": 0,
        "Source": "ProtobufRpcEngine.java:228",
        "ThreadID": 1,
        "ThreadName": "",
        "EventID": "87AF7217724DA115",
        "ProcessID": 21035
      },
      {
        "Cycles": 0,
        "Agent": "Execution-CPU",
        "ProcessName": "Read",
        "TaskID": "5B426D1B8BD6889C",
        "ParentEventID": [
          "87AF7217724DA115"
        ],
        "Label": "unset",
        "Title": "X-Trace Task",
        "Host": "pinky19.mpi-sws.org",
        "Duration": "22459130",
        "HRT": 25491838551901409,
        "Operation": "unset",
        "Timestamp": "1556275478492.321777",
        "TenantClass": 0,
        "Source": "Client.java:1027",
        "ThreadID": 1,
        "ThreadName": "",
        "EventID": "5BF9B100582FBF16",
        "ProcessID": 21035
      },
      {
        "Cycles": 0,
        "Agent": "edu.brown.cs.systems.retro.benchmarks.hdfs_client.Reader",
        "ProcessName": "Read",
        "TaskID": "5B426D1B8BD6889C",
        "ParentEventID": [
          "B3E3D1304AB26E02"
        ],
        "Label": "Reading file",
        "Title": "X-Trace Task",
        "Host": "pinky19.mpi-sws.org",
        "HRT": 25491838551791528,
        "Timestamp": "1556275478492.211914",
        "TenantClass": 0,
        "ThreadID": 1,
        "ThreadName": "",
        "EventID": "7C18FEF45780C6C5",
        "ProcessID": 21035
      },
      {
        "Cycles": 0,
        "Agent": "Execution-CPU",
        "ProcessName": "Read",
        "TaskID": "5B426D1B8BD6889C",
        "ParentEventID": [
          "5BF9B100582FBF16"
        ],
        "Label": "set",
        "Title": "X-Trace Task",
        "Host": "pinky19.mpi-sws.org",
        "HRT": 25491838551965833,
        "Operation": "set",
        "Timestamp": "1556275478492.386230",
        "TenantClass": 0,
        "Source": "Client.java:1032",
        "ThreadID": 41,
        "ThreadName": "",
        "EventID": "499064BEB7F4F7FF",
        "ProcessID": 21035
      },
      {
        "Cycles": 0,
        "Agent": "Execution-CPU",
        "ProcessName": "Read",
        "TaskID": "5B426D1B8BD6889C",
        "ParentEventID": [
          "2C505CEB224CC826"
        ],
        "Label": "unset",
        "Title": "X-Trace Task",
        "Host": "pinky19.mpi-sws.org",
        "Duration": "108620",
        "HRT": 25491838552097326,
        "Operation": "unset",
        "Timestamp": "1556275478492.517822",
        "TenantClass": 0,
        "Source": "Client.java:1062",
        "ThreadID": 41,
        "ThreadName": "",
        "EventID": "4CED16A8346A5C31",
        "ProcessID": 21035
      },
      {
        "Cycles": 0,
        "Agent": "edu.brown.cs.systems.xtrace.logging.BaggageWrappers",
        "ProcessName": "Read",
        "TaskID": "5B426D1B8BD6889C",
        "ParentEventID": [
          "499064BEB7F4F7FF"
        ],
        "Label": "Forking current baggage with Baggage.fork()",
        "Title": "X-Trace Task",
        "Host": "pinky19.mpi-sws.org",
        "HRT": 25491838551991998,
        "Operation": "fork",
        "Timestamp": "1556275478492.412354",
        "TenantClass": 0,
        "Source": "Client.java:1043",
        "ThreadID": 41,
        "ThreadName": "",
        "EventID": "2C505CEB224CC826",
        "ProcessID": 21035
      },
      {
        "Cycles": 0,
        "Agent": "Execution-CPU",
        "ProcessName": "Read",
        "TaskID": "5B426D1B8BD6889C",
        "ParentEventID": [
          "4CED16A8346A5C31"
        ],
        "Label": "set",
        "Title": "X-Trace Task",
        "Host": "pinky19.mpi-sws.org",
        "HRT": 25491838552122981,
        "Operation": "set",
        "Timestamp": "1556275478492.543457",
        "TenantClass": 0,
        "Source": "Client.java:1104",
        "ThreadID": 1,
        "ThreadName": "",
        "EventID": "35EC563CB1569688",
        "ProcessID": 21035
      },
      {
        "Cycles": 0,
        "Agent": "Execution-CPU",
        "ProcessName": "Name",
        "TaskID": "5B426D1B8BD6889C",
        "ParentEventID": [
          "2C505CEB224CC826"
        ],
        "Label": "set",
        "Title": "X-Trace Task",
        "Host": "pinky19.mpi-sws.org",
        "HRT": 25491838552198804,
        "Operation": "set",
        "Timestamp": "1556275478492.621826",
        "TenantClass": 0,
        "Source": "Server.java:1840",
        "ThreadID": 48,
        "ThreadName": "",
        "EventID": "AF1BB6D1B0ECA5A4",
        "BaggageBytes": "[[248 5] [240 0] [0 91 66 109 27 139 214 136 156] [240 1] [0 44 80 92 235 34 76 200 38] [240 3] [0 2]]",
        "ProcessID": 2171
      },
      {
        "Cycles": 0,
        "Agent": "Execution-CPU",
        "ProcessName": "Name",
        "TaskID": "5B426D1B8BD6889C",
        "ParentEventID": [
          "F1C54A9F9967ABFD"
        ],
        "Label": "unset",
        "Title": "X-Trace Task",
        "Host": "pinky19.mpi-sws.org",
        "Duration": "40314",
        "HRT": 25491838552298244,
        "Operation": "unset",
        "Timestamp": "1556275478492.721191",
        "TenantClass": 0,
        "Source": "Server.java:1828",
        "ThreadID": 48,
        "ThreadName": "",
        "EventID": "EFF2B05906B35642",
        "BaggageBytes": "[[248 5] [240 0] [0 91 66 109 27 139 214 136 156] [240 1] [0 241 197 74 159 153 103 171 253] [240 3] [0 2]]",
        "ProcessID": 2171
      },
      {
        "Cycles": 0,
        "Agent": "edu.brown.cs.systems.xtrace.logging.BaggageWrappers",
        "ProcessName": "Name",
        "TaskID": "5B426D1B8BD6889C",
        "ParentEventID": [
          "AF1BB6D1B0ECA5A4"
        ],
        "Label": "Forking current baggage with Baggage.fork()",
        "Title": "X-Trace Task",
        "Host": "pinky19.mpi-sws.org",
        "HRT": 25491838552268958,
        "Operation": "fork",
        "Timestamp": "1556275478492.691895",
        "TenantClass": 0,
        "Source": "Server.java:550",
        "ThreadID": 48,
        "ThreadName": "",
        "EventID": "F1C54A9F9967ABFD",
        "BaggageBytes": "[[248 5] [240 0] [0 91 66 109 27 139 214 136 156] [240 1] [0 175 27 182 209 176 236 165 164] [240 3] [0 2]]",
        "ProcessID": 2171
      },
      {
        "Cycles": 0,
        "Agent": "Execution-CPU",
        "ProcessName": "Name",
        "TaskID": "5B426D1B8BD6889C",
        "ParentEventID": [
          "F1C54A9F9967ABFD"
        ],
        "Label": "set",
        "Title": "X-Trace Task",
        "Host": "pinky19.mpi-sws.org",
        "HRT": 25491838552308827,
        "Operation": "set",
        "Timestamp": "1556275478492.731689",
        "TenantClass": 0,
        "Source": "Server.java:2071",
        "ThreadID": 62,
        "ThreadName": "",
        "EventID": "EF1956E65B0A3648",
        "BaggageBytes": "[[248 5] [240 0] [0 91 66 109 27 139 214 136 156] [240 1] [0 241 197 74 159 153 103 171 253] [240 3] [0 2]]",
        "ProcessID": 2171
      },
      {
        "Cycles": 0,
        "Agent": "org.apache.hadoop.hdfs.server.namenode.FSNamesystem.audit",
        "ProcessName": "Name",
        "TaskID": "5B426D1B8BD6889C",
        "ParentEventID": [
          "85D8BB34F05D9ADE"
        ],
        "Label": "allowed=true\tugi=plascas (auth:SIMPLE)\tip=/139.19.171.63\tcmd=open\tsrc=/ds/9aOtPTuIktGHvqJ6\tdst=null\tperm=null\tproto=rpc",
        "Title": "X-Trace Task",
        "Host": "pinky19.mpi-sws.org",
        "HRT": 25491838552463484,
        "Timestamp": "1556275478492.886475",
        "TenantClass": 0,
        "Source": "FSNamesystem.java:8313",
        "ThreadID": 62,
        "ThreadName": "",
        "EventID": "BDF5DEA2A10F93A9",
        "BaggageBytes": "[[248 5] [240 0] [0 91 66 109 27 139 214 136 156] [240 1] [0 133 216 187 52 240 93 154 222] [240 3] [0 2]]",
        "ProcessID": 2171
      },
      {
        "Cycles": 0,
        "Agent": "edu.brown.cs.systems.xtrace.logging.BaggageWrappers",
        "ProcessName": "Name",
        "TaskID": "5B426D1B8BD6889C",
        "ParentEventID": [
          "BDF5DEA2A10F93A9"
        ],
        "Label": "Forking current baggage with Baggage.fork()",
        "Title": "X-Trace Task",
        "Host": "pinky19.mpi-sws.org",
        "HRT": 25491838556947598,
        "Operation": "fork",
        "Timestamp": "1556275478497.370605",
        "TenantClass": 0,
        "Source": "Server.java:2398",
        "ThreadID": 62,
        "ThreadName": "",
        "EventID": "1A7AE3BC76913EEE",
        "BaggageBytes": "[[248 5] [240 0] [0 91 66 109 27 139 214 136 156] [240 1] [0 189 245 222 162 161 15 147 169] [240 3] [0 2]]",
        "ProcessID": 2171
      },
      {
        "Cycles": 0,
        "Agent": "org.apache.hadoop.ipc.Server",
        "ProcessName": "Name",
        "TaskID": "5B426D1B8BD6889C",
        "ParentEventID": [
          "EF1956E65B0A3648"
        ],
        "Label": "getBlockLocations in org.apache.hadoop.hdfs.protocol.ClientProtocol",
        "Title": "X-Trace Task",
        "Host": "pinky19.mpi-sws.org",
        "HRT": 25491838552357850,
        "Timestamp": "1556275478492.780762",
        "TenantClass": 0,
        "Source": "ProtobufRpcEngine.java:601",
        "ThreadID": 62,
        "ThreadName": "",
        "EventID": "85D8BB34F05D9ADE",
        "BaggageBytes": "[[248 5] [240 0] [0 91 66 109 27 139 214 136 156] [240 1] [0 239 25 86 230 91 10 54 72] [240 3] [0 2]]",
        "ProcessID": 2171
      },
      {
        "Cycles": 0,
        "Agent": "Execution-CPU",
        "ProcessName": "Name",
        "TaskID": "5B426D1B8BD6889C",
        "ParentEventID": [
          "1A7AE3BC76913EEE"
        ],
        "Label": "unset",
        "Title": "X-Trace Task",
        "Host": "pinky19.mpi-sws.org",
        "Duration": "4756050",
        "HRT": 25491838557087068,
        "Operation": "unset",
        "Timestamp": "1556275478497.510010",
        "TenantClass": 0,
        "Source": "Server.java:1058",
        "ThreadID": 62,
        "ThreadName": "",
        "EventID": "8F89DF7C8766583D",
        "BaggageBytes": "[[248 5] [240 0] [0 91 66 109 27 139 214 136 156] [240 1] [0 26 122 227 188 118 145 62 238] [240 3] [0 2]]",
        "ProcessID": 2171
      },
      {
        "Cycles": 0,
        "Agent": "Execution-CPU",
        "ProcessName": "Read",
        "TaskID": "5B426D1B8BD6889C",
        "ParentEventID": [
          "1A7AE3BC76913EEE"
        ],
        "Label": "set",
        "Title": "X-Trace Task",
        "Host": "pinky19.mpi-sws.org",
        "HRT": 25491838557159637,
        "Operation": "set",
        "Timestamp": "1556275478497.580078",
        "TenantClass": 0,
        "Source": "Client.java:302",
        "ThreadID": 37,
        "ThreadName": "",
        "EventID": "C0D3B4CA051713AD",
        "ProcessID": 21035
      },
      {
        "Cycles": 0,
        "Agent": "Execution-CPU",
        "ProcessName": "Read",
        "TaskID": "5B426D1B8BD6889C",
        "ParentEventID": [
          "C0D3B4CA051713AD"
        ],
        "Label": "unset",
        "Title": "X-Trace Task",
        "Host": "pinky19.mpi-sws.org",
        "Duration": "29798",
        "HRT": 25491838557209921,
        "Operation": "unset",
        "Timestamp": "1556275478497.630371",
        "TenantClass": 0,
        "Source": "Client.java:1168",
        "ThreadID": 37,
        "ThreadName": "",
        "EventID": "29BD40277906593C",
        "ProcessID": 21035
      },
      {
        "Cycles": 0,
        "Agent": "Execution-Sleep",
        "ProcessName": "Read",
        "TaskID": "5B426D1B8BD6889C",
        "ParentEventID": [
          "35EC563CB1569688"
        ],
        "Label": "waited",
        "Title": "X-Trace Task",
        "Host": "pinky19.mpi-sws.org",
        "Duration": "5108095",
        "HRT": 25491838557242377,
        "Operation": "waited",
        "Timestamp": "1556275478497.662842",
        "TenantClass": 0,
        "Source": "Client.java:1537",
        "ThreadID": 1,
        "ThreadName": "",
        "EventID": "274780FB02E0F491",
        "ProcessID": 21035
      },
      {
        "Cycles": 0,
        "Agent": "edu.brown.cs.systems.xtrace.logging.BaggageWrappers",
        "ProcessName": "Read",
        "TaskID": "5B426D1B8BD6889C",
        "ParentEventID": [
          "274780FB02E0F491",
          "29BD40277906593C"
        ],
        "Label": "Merged current baggage with other baggage",
        "Title": "X-Trace Task",
        "Host": "pinky19.mpi-sws.org",
        "HRT": 25491838557266408,
        "Operation": "join",
        "Timestamp": "1556275478497.686768",
        "TenantClass": 0,
        "Source": "Client.java:1545",
        "ThreadID": 1,
        "ThreadName": "",
        "EventID": "6A60FB7F1E45A968",
        "ProcessID": 21035
      },
      {
        "Cycles": 0,
        "Agent": "org.apache.hadoop.ipc.ProtobufRpcEngine",
        "ProcessName": "Read",
        "TaskID": "5B426D1B8BD6889C",
        "ParentEventID": [
          "6A60FB7F1E45A968"
        ],
        "Label": "org.apache.hadoop.hdfs.protocol.ClientProtocol.getBlockLocations completed",
        "Title": "X-Trace Task",
        "Host": "pinky19.mpi-sws.org",
        "HRT": 25491838557355904,
        "Timestamp": "1556275478497.776367",
        "TenantClass": 0,
        "Source": "ProtobufRpcEngine.java:275",
        "ThreadID": 1,
        "ThreadName": "",
        "EventID": "1D439992ADE6BDF4",
        "ProcessID": 21035
      },
      {
        "Cycles": 0,
        "Agent": "edu.brown.cs.systems.xtrace.logging.BaggageWrappers",
        "ProcessName": "Read",
        "TaskID": "5B426D1B8BD6889C",
        "ParentEventID": [
          "1D439992ADE6BDF4"
        ],
        "Label": "Forking current baggage with Baggage.fork()",
        "Title": "X-Trace Task",
        "Host": "pinky19.mpi-sws.org",
        "HRT": 25491838557536938,
        "Operation": "fork",
        "Timestamp": "1556275478497.957275",
        "TenantClass": 0,
        "Source": "DataTransferProtoUtil.java:94",
        "ThreadID": 1,
        "ThreadName": "",
        "EventID": "5E93F107E2674147",
        "ProcessID": 21035
      },
      {
        "Cycles": 0,
        "Agent": "Execution-CPU",
        "ProcessName": "Data",
        "TaskID": "5B426D1B8BD6889C",
        "ParentEventID": [
          "5E93F107E2674147"
        ],
        "Label": "set",
        "Title": "X-Trace Task",
        "Host": "pinky25.mpi-sws.org",
        "HRT": 46040943800548711,
        "Operation": "set",
        "Timestamp": "1556275478498.200439",
        "TenantClass": 0,
        "Source": "Receiver.java:117",
        "ThreadID": 5334,
        "ThreadName": "",
        "EventID": "981ACBBE8375C155",
        "BaggageBytes": "[[248 5] [240 0] [0 91 66 109 27 139 214 136 156] [240 1] [0 94 147 241 7 226 103 65 71] [240 3] [0 2]]",
        "ProcessID": 28198
      },
      {
        "Cycles": 0,
        "Agent": "edu.brown.cs.systems.xtrace.logging.XTraceInit",
        "ProcessName": "Data",
        "TaskID": "5B426D1B8BD6889C",
        "ParentEventID": [
          "981ACBBE8375C155"
        ],
        "Label": "Thread.setName: DataXceiver for client DFSClient_NONMAPREDUCE_1377588049_1 at /139.19.171.63:34128 [Sending block BP-1633380353-139.19.171.63-1554193446451:blk_1073769630_28806]",
        "Title": "X-Trace Task",
        "Host": "pinky25.mpi-sws.org",
        "HRT": 46040943800638746,
        "Timestamp": "1556275478498.290527",
        "TenantClass": 0,
        "Source": "DataXceiver.java:168",
        "ThreadID": 5334,
        "ThreadName": "",
        "EventID": "C549D182E42788E5",
        "BaggageBytes": "[[248 5] [240 0] [0 91 66 109 27 139 214 136 156] [240 1] [0 152 26 203 190 131 117 193 85] [240 3] [0 2]]",
        "ProcessID": 28198
      },
      {
        "Cycles": 0,
        "Agent": "edu.brown.cs.systems.xtrace.logging.BaggageWrappers",
        "ProcessName": "Data",
        "TaskID": "5B426D1B8BD6889C",
        "ParentEventID": [
          "C549D182E42788E5"
        ],
        "Label": "Forking current baggage with Baggage.fork()",
        "Title": "X-Trace Task",
        "Host": "pinky25.mpi-sws.org",
        "HRT": 46040943800793166,
        "Operation": "fork",
        "Timestamp": "1556275478498.444824",
        "TenantClass": 0,
        "Source": "DataXceiver.java:1257",
        "ThreadID": 5334,
        "ThreadName": "",
        "EventID": "4F3FD3BBE201AC41",
        "BaggageBytes": "[[248 5] [240 0] [0 91 66 109 27 139 214 136 156] [240 1] [0 197 73 209 130 228 39 136 229] [240 3] [0 2]]",
        "ProcessID": 28198
      },
      {
        "Cycles": 0,
        "Agent": "edu.brown.cs.systems.xtrace.logging.BaggageWrappers",
        "ProcessName": "Data",
        "TaskID": "5B426D1B8BD6889C",
        "ParentEventID": [
          "4F3FD3BBE201AC41"
        ],
        "Label": "Forking current baggage with Baggage.fork()",
        "Title": "X-Trace Task",
        "Host": "pinky25.mpi-sws.org",
        "HRT": 46040943800921196,
        "Operation": "fork",
        "Timestamp": "1556275478498.572754",
        "TenantClass": 0,
        "Source": "PacketHeader.java:95",
        "ThreadID": 5334,
        "ThreadName": "",
        "EventID": "393BB152DC66C81D",
        "BaggageBytes": "[[248 5] [240 0] [0 91 66 109 27 139 214 136 156] [240 1] [0 79 63 211 187 226 1 172 65] [240 3] [0 2]]",
        "ProcessID": 28198
      },
      {
        "Cycles": 0,
        "Agent": "Execution-Sleep",
        "ProcessName": "Read",
        "TaskID": "5B426D1B8BD6889C",
        "ParentEventID": [
          "5E93F107E2674147"
        ],
        "Label": "waited",
        "Title": "X-Trace Task",
        "Host": "pinky19.mpi-sws.org",
        "Duration": "522878",
        "HRT": 25491838558230282,
        "Operation": "waited",
        "Timestamp": "1556275478498.650635",
        "TenantClass": 0,
        "Source": "SocketIOWithTimeout.java:335",
        "ThreadID": 1,
        "ThreadName": "",
        "EventID": "373017518A68A9F5",
        "ProcessID": 21035
      },
      {
        "Cycles": 0,
        "Agent": "edu.brown.cs.systems.xtrace.logging.BaggageWrappers",
        "ProcessName": "Read",
        "TaskID": "5B426D1B8BD6889C",
        "ParentEventID": [
          "4F3FD3BBE201AC41",
          "373017518A68A9F5"
        ],
        "Label": "Merged current baggage with other baggage",
        "Title": "X-Trace Task",
        "Host": "pinky19.mpi-sws.org",
        "HRT": 25491838558323559,
        "Operation": "join",
        "Timestamp": "1556275478498.743896",
        "TenantClass": 0,
        "Source": "RemoteBlockReader2.java:429",
        "ThreadID": 1,
        "ThreadName": "",
        "EventID": "F5E53BF6ABBFAE60",
        "ProcessID": 21035
      },
      {
        "Cycles": 0,
        "Agent": "Execution-Sleep",
        "ProcessName": "Data",
        "TaskID": "5B426D1B8BD6889C",
        "ParentEventID": [
          "393BB152DC66C81D"
        ],
        "Label": "waited",
        "Title": "X-Trace Task",
        "Host": "pinky25.mpi-sws.org",
        "Duration": "8250",
        "HRT": 46040943801029223,
        "Operation": "waited",
        "Timestamp": "1556275478498.680908",
        "TenantClass": 0,
        "Source": "SocketIOWithTimeout.java:335",
        "ThreadID": 5334,
        "ThreadName": "",
        "EventID": "1B4071BAF7EBC843",
        "BaggageBytes": "[[248 5] [240 0] [0 91 66 109 27 139 214 136 156] [240 1] [0 57 59 177 82 220 102 200 29] [240 3] [0 2]]",
        "ProcessID": 28198
      },
      {
        "Cycles": 0,
        "Agent": "Execution-Sleep",
        "ProcessName": "Read",
        "TaskID": "5B426D1B8BD6889C",
        "ParentEventID": [
          "F5E53BF6ABBFAE60"
        ],
        "Label": "waited",
        "Title": "X-Trace Task",
        "Host": "pinky19.mpi-sws.org",
        "Duration": "85414",
        "HRT": 25491838558510792,
        "Operation": "waited",
        "Timestamp": "1556275478498.931152",
        "TenantClass": 0,
        "Source": "SocketIOWithTimeout.java:335",
        "ThreadID": 1,
        "ThreadName": "",
        "EventID": "39F0A58001DF8D10",
        "ProcessID": 21035
      },
      {
        "Cycles": 0,
        "Agent": "edu.brown.cs.systems.xtrace.logging.BaggageWrappers",
        "ProcessName": "Data",
        "TaskID": "5B426D1B8BD6889C",
        "ParentEventID": [
          "1B4071BAF7EBC843"
        ],
        "Label": "Forking current baggage with Baggage.fork()",
        "Title": "X-Trace Task",
        "Host": "pinky25.mpi-sws.org",
        "HRT": 46040943801187520,
        "Operation": "fork",
        "Timestamp": "1556275478498.839111",
        "TenantClass": 0,
        "Source": "PacketHeader.java:95",
        "ThreadID": 5334,
        "ThreadName": "",
        "EventID": "4D88886FD03E81F6",
        "BaggageBytes": "[[248 5] [240 0] [0 91 66 109 27 139 214 136 156] [240 1] [0 27 64 113 186 247 235 200 67] [240 3] [0 2]]",
        "ProcessID": 28198
      },
      {
        "Cycles": 0,
        "Agent": "edu.brown.cs.systems.xtrace.logging.BaggageWrappers",
        "ProcessName": "Read",
        "TaskID": "5B426D1B8BD6889C",
        "ParentEventID": [
          "39F0A58001DF8D10",
          "393BB152DC66C81D"
        ],
        "Label": "Merged current baggage with other baggage",
        "Title": "X-Trace Task",
        "Host": "pinky19.mpi-sws.org",
        "HRT": 25491838558552046,
        "Operation": "join",
        "Timestamp": "1556275478498.972412",
        "TenantClass": 0,
        "Source": "PacketHeader.java:168",
        "ThreadID": 1,
        "ThreadName": "",
        "EventID": "FF2478B20EDA72FB",
        "ProcessID": 21035
      },
      {
        "Cycles": 0,
        "Agent": "Execution-Sleep",
        "ProcessName": "Read",
        "TaskID": "5B426D1B8BD6889C",
        "ParentEventID": [
          "FF2478B20EDA72FB"
        ],
        "Label": "waited",
        "Title": "X-Trace Task",
        "Host": "pinky19.mpi-sws.org",
        "Duration": "31215",
        "HRT": 25491838558616681,
        "Operation": "waited",
        "Timestamp": "1556275478499.037109",
        "TenantClass": 0,
        "Source": "SocketIOWithTimeout.java:335",
        "ThreadID": 1,
        "ThreadName": "",
        "EventID": "3181F855589616B3",
        "ProcessID": 21035
      },
      {
        "Cycles": 0,
        "Agent": "edu.brown.cs.systems.xtrace.logging.BaggageWrappers",
        "ProcessName": "Read",
        "TaskID": "5B426D1B8BD6889C",
        "ParentEventID": [
          "3181F855589616B3",
          "4D88886FD03E81F6"
        ],
        "Label": "Merged current baggage with other baggage",
        "Title": "X-Trace Task",
        "Host": "pinky19.mpi-sws.org",
        "HRT": 25491838558661557,
        "Operation": "join",
        "Timestamp": "1556275478499.082031",
        "TenantClass": 0,
        "Source": "PacketHeader.java:168",
        "ThreadID": 1,
        "ThreadName": "",
        "EventID": "4B173BDA4E5B4AD0",
        "ProcessID": 21035
      },
      {
        "Cycles": 0,
        "Agent": "edu.brown.cs.systems.xtrace.logging.BaggageWrappers",
        "ProcessName": "Read",
        "TaskID": "5B426D1B8BD6889C",
        "ParentEventID": [
          "4B173BDA4E5B4AD0"
        ],
        "Label": "Forking current baggage with Baggage.fork()",
        "Title": "X-Trace Task",
        "Host": "pinky19.mpi-sws.org",
        "HRT": 25491838558672340,
        "Operation": "fork",
        "Timestamp": "1556275478499.092773",
        "TenantClass": 0,
        "Source": "RemoteBlockReader2.java:361",
        "ThreadID": 1,
        "ThreadName": "",
        "EventID": "358DC59AC13D0711",
        "ProcessID": 21035
      },
      {
        "Cycles": 0,
        "Agent": "Execution-Sleep",
        "ProcessName": "Data",
        "TaskID": "5B426D1B8BD6889C",
        "ParentEventID": [
          "4D88886FD03E81F6"
        ],
        "Label": "waited",
        "Title": "X-Trace Task",
        "Host": "pinky25.mpi-sws.org",
        "Duration": "420622",
        "HRT": 46040943801807142,
        "Operation": "waited",
        "Timestamp": "1556275478499.458740",
        "TenantClass": 0,
        "Source": "SocketIOWithTimeout.java:335",
        "ThreadID": 5334,
        "ThreadName": "",
        "EventID": "64EB9FCB838EB1CA",
        "BaggageBytes": "[[248 5] [240 0] [0 91 66 109 27 139 214 136 156] [240 1] [0 77 136 136 111 208 62 129 246] [240 3] [0 2]]",
        "ProcessID": 28198
      },
      {
        "Cycles": 0,
        "Agent": "edu.brown.cs.systems.xtrace.logging.BaggageWrappers",
        "ProcessName": "Data",
        "TaskID": "5B426D1B8BD6889C",
        "ParentEventID": [
          "64EB9FCB838EB1CA",
          "358DC59AC13D0711"
        ],
        "Label": "Merged current baggage with other baggage",
        "Title": "X-Trace Task",
        "Host": "pinky25.mpi-sws.org",
        "HRT": 46040943801980310,
        "Operation": "join",
        "Timestamp": "1556275478499.632080",
        "TenantClass": 0,
        "Source": "DataXceiver.java:574",
        "ThreadID": 5334,
        "ThreadName": "",
        "EventID": "0E670E15BF34A9C4",
        "BaggageBytes": "[[248 5] [240 0] [0 91 66 109 27 139 214 136 156] [240 1] [0 53 141 197 154 193 61 7 17] [0 100 235 159 203 131 142 177 202] [240 3] [0 2]]",
        "ProcessID": 28198
      },
      {
        "Cycles": 0,
        "Agent": "Execution-CPU",
        "ProcessName": "Data",
        "TaskID": "5B426D1B8BD6889C",
        "ParentEventID": [
          "0E670E15BF34A9C4"
        ],
        "Label": "unset",
        "Title": "X-Trace Task",
        "Host": "pinky25.mpi-sws.org",
        "Duration": "1425314",
        "HRT": 46040943802037965,
        "Operation": "unset",
        "Timestamp": "1556275478499.689697",
        "TenantClass": 0,
        "Source": "DataXceiver.java:261",
        "ThreadID": 5334,
        "ThreadName": "",
        "EventID": "33E455E85567FDCB",
        "BaggageBytes": "[[248 5] [240 0] [0 91 66 109 27 139 214 136 156] [240 1] [0 14 103 14 21 191 52 169 196] [240 3] [0 2]]",
        "ProcessID": 28198
      },
      {
        "Cycles": 0,
        "Agent": "edu.brown.cs.systems.retro.benchmarks.hdfs_client.Reader",
        "ProcessName": "Read",
        "TaskID": "5B426D1B8BD6889C",
        "ParentEventID": [
          "0"
        ],
        "Label": "Reading file",
        "Title": "X-Trace Task",
        "Host": "pinky19.mpi-sws.org",
        "HRT": 25491838551762294,
        "Timestamp": "1556275478492.182861",
        "TenantClass": 0,
        "ThreadID": 1,
        "ThreadName": "",
        "EventID": "B3E3D1304AB26E02",
        "ProcessID": 21035,
        "Tag": [
          "reader_1kb",
          "Read Size: 1024"
        ]
      }
    ]
  }
]