[
  {
    "id": "0476DB66C4060DD4",
    "reports": [
      {
        "Cycles": 0,
        "Agent": "Execution-CPU",
        "ProcessName": "Read",
        "TaskID": "0476DB66C4060DD4",
        "ParentEventID": [
          "7A01FFEA0F98F82E"
        ],
        "Label": "unset",
        "Title": "X-Trace Task",
        "Host": "pinky19.mpi-sws.org",
        "Duration": "21190888",
        "HRT": 26962670768829925,
        "Operation": "unset",
        "Timestamp": "1557746310709.165039",
        "TenantClass": 0,
        "Source": "Client.java:1027",
        "ThreadID": 1,
        "ThreadName": "",
        "EventID": "08DFFFF5BAE63A22",
        "ProcessID": 36430
      },
      {
        "Cycles": 0,
        "Agent": "org.apache.hadoop.ipc.ProtobufRpcEngine",
        "ProcessName": "Read",
        "TaskID": "0476DB66C4060DD4",
        "ParentEventID": [
          "73FB7FC00B02BCAE"
        ],
        "Label": "Invoking org.apache.hadoop.hdfs.protocol.ClientProtocol.getBlockLocations",
        "Title": "X-Trace Task",
        "Host": "pinky19.mpi-sws.org",
        "HRT": 26962670768812467,
        "Timestamp": "1557746310709.147461",
        "TenantClass": 0,
        "Source": "ProtobufRpcEngine.java:228",
        "ThreadID": 1,
        "ThreadName": "",
        "EventID": "7A01FFEA0F98F82E",
        "ProcessID": 36430
      },
      {
        "Cycles": 0,
        "Agent": "Execution-CPU",
        "ProcessName": "Read",
        "TaskID": "0476DB66C4060DD4",
        "ParentEventID": [
          "08DFFFF5BAE63A22"
        ],
        "Label": "set",
        "Title": "X-Trace Task",
        "Host": "pinky19.mpi-sws.org",
        "HRT": 26962670768874914,
        "Operation": "set",
        "Timestamp": "1557746310709.209961",
        "TenantClass": 0,
        "Source": "Client.java:1032",
        "ThreadID": 41,
        "ThreadName": "",
        "EventID": "B94621F88919238C",
        "ProcessID": 36430
      },
      {
        "Cycles": 0,
        "Agent": "edu.brown.cs.systems.retro.benchmarks.hdfs_client.Reader",
        "ProcessName": "Read",
        "TaskID": "0476DB66C4060DD4",
        "ParentEventID": [
          "D2CDDE7A15456FD5"
        ],
        "Label": "Reading file",
        "Title": "X-Trace Task",
        "Host": "pinky19.mpi-sws.org",
        "HRT": 26962670768788199,
        "Timestamp": "1557746310709.123291",
        "TenantClass": 0,
        "ThreadID": 1,
        "ThreadName": "",
        "EventID": "73FB7FC00B02BCAE",
        "ProcessID": 36430
      },
      {
        "Cycles": 0,
        "Agent": "edu.brown.cs.systems.xtrace.logging.BaggageWrappers",
        "ProcessName": "Read",
        "TaskID": "0476DB66C4060DD4",
        "ParentEventID": [
          "B94621F88919238C"
        ],
        "Label": "Forking current baggage with Baggage.fork()",
        "Title": "X-Trace Task",
        "Host": "pinky19.mpi-sws.org",
        "HRT": 26962670768893882,
        "Operation": "fork",
        "Timestamp": "1557746310709.229004",
        "TenantClass": 0,
        "Source": "Client.java:1043",
        "ThreadID": 41,
        "ThreadName": "",
        "EventID": "CC09EBB272C652C6",
        "ProcessID": 36430
      },
      {
        "Cycles": 0,
        "Agent": "Execution-CPU",
        "ProcessName": "Read",
        "TaskID": "0476DB66C4060DD4",
        "ParentEventID": [
          "CC09EBB272C652C6"
        ],
        "Label": "unset",
        "Title": "X-Trace Task",
        "Host": "pinky19.mpi-sws.org",
        "Duration": "69532",
        "HRT": 26962670768963195,
        "Operation": "unset",
        "Timestamp": "1557746310709.298340",
        "TenantClass": 0,
        "Source": "Client.java:1062",
        "ThreadID": 41,
        "ThreadName": "",
        "EventID": "0DAA54E383DA2BE6",
        "ProcessID": 36430
      },
      {
        "Cycles": 0,
        "Agent": "Execution-CPU",
        "ProcessName": "Read",
        "TaskID": "0476DB66C4060DD4",
        "ParentEventID": [
          "0DAA54E383DA2BE6"
        ],
        "Label": "set",
        "Title": "X-Trace Task",
        "Host": "pinky19.mpi-sws.org",
        "HRT": 26962670768987034,
        "Operation": "set",
        "Timestamp": "1557746310709.322021",
        "TenantClass": 0,
        "Source": "Client.java:1104",
        "ThreadID": 1,
        "ThreadName": "",
        "EventID": "32A9CEC885940D19",
        "ProcessID": 36430
      },
      {
        "Cycles": 0,
        "Agent": "edu.brown.cs.systems.xtrace.logging.BaggageWrappers",
        "ProcessName": "Name",
        "TaskID": "0476DB66C4060DD4",
        "ParentEventID": [
          "EDA3FFD99F50DB10"
        ],
        "Label": "Forking current baggage with Baggage.fork()",
        "Title": "X-Trace Task",
        "Host": "pinky19.mpi-sws.org",
        "HRT": 26962670769058759,
        "Operation": "fork",
        "Timestamp": "1557746310709.405029",
        "TenantClass": 0,
        "Source": "Server.java:550",
        "ThreadID": 48,
        "ThreadName": "",
        "EventID": "A3EDDBF8004827F8",
        "BaggageBytes": "[[248 5] [240 0] [0 4 118 219 102 196 6 13 212] [240 1] [0 237 163 255 217 159 80 219 16] [240 3] [0 2]]",
        "ProcessID": 2171
      },
      {
        "Cycles": 0,
        "Agent": "Execution-CPU",
        "ProcessName": "Name",
        "TaskID": "0476DB66C4060DD4",
        "ParentEventID": [
          "CC09EBB272C652C6"
        ],
        "Label": "set",
        "Title": "X-Trace Task",
        "Host": "pinky19.mpi-sws.org",
        "HRT": 26962670769027072,
        "Operation": "set",
        "Timestamp": "1557746310709.373291",
        "TenantClass": 0,
        "Source": "Server.java:1840",
        "ThreadID": 48,
        "ThreadName": "",
        "EventID": "EDA3FFD99F50DB10",
        "BaggageBytes": "[[248 5] [240 0] [0 4 118 219 102 196 6 13 212] [240 1] [0 204 9 235 178 114 198 82 198] [240 3] [0 2]]",
        "ProcessID": 2171
      },
      {
        "Cycles": 0,
        "Agent": "Execution-CPU",
        "ProcessName": "Name",
        "TaskID": "0476DB66C4060DD4",
        "ParentEventID": [
          "A3EDDBF8004827F8"
        ],
        "Label": "unset",
        "Title": "X-Trace Task",
        "Host": "pinky19.mpi-sws.org",
        "Duration": "24868",
        "HRT": 26962670769079959,
        "Operation": "unset",
        "Timestamp": "1557746310709.426025",
        "TenantClass": 0,
        "Source": "Server.java:1828",
        "ThreadID": 48,
        "ThreadName": "",
        "EventID": "3702E914E68BB9E8",
        "BaggageBytes": "[[248 5] [240 0] [0 4 118 219 102 196 6 13 212] [240 1] [0 163 237 219 248 0 72 39 248] [240 3] [0 2]]",
        "ProcessID": 2171
      },
      {
        "Cycles": 0,
        "Agent": "org.apache.hadoop.ipc.Server",
        "ProcessName": "Name",
        "TaskID": "0476DB66C4060DD4",
        "ParentEventID": [
          "CB18FBF1F189AFB6"
        ],
        "Label": "getBlockLocations in org.apache.hadoop.hdfs.protocol.ClientProtocol",
        "Title": "X-Trace Task",
        "Host": "pinky19.mpi-sws.org",
        "HRT": 26962670769114650,
        "Timestamp": "1557746310709.460693",
        "TenantClass": 0,
        "Source": "ProtobufRpcEngine.java:601",
        "ThreadID": 56,
        "ThreadName": "",
        "EventID": "CA2BD419A5F22FCA",
        "BaggageBytes": "[[248 5] [240 0] [0 4 118 219 102 196 6 13 212] [240 1] [0 203 24 251 241 241 137 175 182] [240 3] [0 2]]",
        "ProcessID": 2171
      },
      {
        "Cycles": 0,
        "Agent": "org.apache.hadoop.hdfs.server.namenode.FSNamesystem.audit",
        "ProcessName": "Name",
        "TaskID": "0476DB66C4060DD4",
        "ParentEventID": [
          "CA2BD419A5F22FCA"
        ],
        "Label": "allowed=true\tugi=plascas (auth:SIMPLE)\tip=/139.19.171.63\tcmd=open\tsrc=/ds/xjjqhNZTOPf0NVbE\tdst=null\tperm=null\tproto=rpc",
        "Title": "X-Trace Task",
        "Host": "pinky19.mpi-sws.org",
        "HRT": 26962670769158235,
        "Timestamp": "1557746310709.504395",
        "TenantClass": 0,
        "Source": "FSNamesystem.java:8313",
        "ThreadID": 56,
        "ThreadName": "",
        "EventID": "ACA9D51629B1BE8E",
        "BaggageBytes": "[[248 5] [240 0] [0 4 118 219 102 196 6 13 212] [240 1] [0 202 43 212 25 165 242 47 202] [240 3] [0 2]]",
        "ProcessID": 2171
      },
      {
        "Cycles": 0,
        "Agent": "Execution-CPU",
        "ProcessName": "Name",
        "TaskID": "0476DB66C4060DD4",
        "ParentEventID": [
          "A3EDDBF8004827F8"
        ],
        "Label": "set",
        "Title": "X-Trace Task",
        "Host": "pinky19.mpi-sws.org",
        "HRT": 26962670769085370,
        "Operation": "set",
        "Timestamp": "1557746310709.431641",
        "TenantClass": 0,
        "Source": "Server.java:2071",
        "ThreadID": 56,
        "ThreadName": "",
        "EventID": "CB18FBF1F189AFB6",
        "BaggageBytes": "[[248 5] [240 0] [0 4 118 219 102 196 6 13 212] [240 1] [0 163 237 219 248 0 72 39 248] [240 3] [0 2]]",
        "ProcessID": 2171
      },
      {
        "Cycles": 0,
        "Agent": "edu.brown.cs.systems.xtrace.logging.BaggageWrappers",
        "ProcessName": "Name",
        "TaskID": "0476DB66C4060DD4",
        "ParentEventID": [
          "ACA9D51629B1BE8E"
        ],
        "Label": "Forking current baggage with Baggage.fork()",
        "Title": "X-Trace Task",
        "Host": "pinky19.mpi-sws.org",
        "HRT": 26962670769200148,
        "Operation": "fork",
        "Timestamp": "1557746310709.546387",
        "TenantClass": 0,
        "Source": "Server.java:2398",
        "ThreadID": 56,
        "ThreadName": "",
        "EventID": "98E42A82B12B0945",
        "BaggageBytes": "[[248 5] [240 0] [0 4 118 219 102 196 6 13 212] [240 1] [0 172 169 213 22 41 177 190 142] [240 3] [0 2]]",
        "ProcessID": 2171
      },
      {
        "Cycles": 0,
        "Agent": "Execution-CPU",
        "ProcessName": "Read",
        "TaskID": "0476DB66C4060DD4",
        "ParentEventID": [
          "98E42A82B12B0945"
        ],
        "Label": "set",
        "Title": "X-Trace Task",
        "Host": "pinky19.mpi-sws.org",
        "HRT": 26962670769355520,
        "Operation": "set",
        "Timestamp": "1557746310709.690674",
        "TenantClass": 0,
        "Source": "Client.java:302",
        "ThreadID": 37,
        "ThreadName": "",
        "EventID": "4611C723C3F632CC",
        "ProcessID": 36430
      },
      {
        "Cycles": 0,
        "Agent": "Execution-CPU",
        "ProcessName": "Read",
        "TaskID": "0476DB66C4060DD4",
        "ParentEventID": [
          "4611C723C3F632CC"
        ],
        "Label": "unset",
        "Title": "X-Trace Task",
        "Host": "pinky19.mpi-sws.org",
        "Duration": "6366",
        "HRT": 26962670769381004,
        "Operation": "unset",
        "Timestamp": "1557746310709.716064",
        "TenantClass": 0,
        "Source": "Client.java:1168",
        "ThreadID": 37,
        "ThreadName": "",
        "EventID": "E8AE00B12A5035E8",
        "ProcessID": 36430
      },
      {
        "Cycles": 0,
        "Agent": "Execution-Sleep",
        "ProcessName": "Read",
        "TaskID": "0476DB66C4060DD4",
        "ParentEventID": [
          "32A9CEC885940D19"
        ],
        "Label": "waited",
        "Title": "X-Trace Task",
        "Host": "pinky19.mpi-sws.org",
        "Duration": "408861",
        "HRT": 26962670769403758,
        "Operation": "waited",
        "Timestamp": "1557746310709.738770",
        "TenantClass": 0,
        "Source": "Client.java:1537",
        "ThreadID": 1,
        "ThreadName": "",
        "EventID": "63E464059816BE63",
        "ProcessID": 36430
      },
      {
        "Cycles": 0,
        "Agent": "edu.brown.cs.systems.xtrace.logging.BaggageWrappers",
        "ProcessName": "Read",
        "TaskID": "0476DB66C4060DD4",
        "ParentEventID": [
          "63E464059816BE63",
          "E8AE00B12A5035E8"
        ],
        "Label": "Merged current baggage with other baggage",
        "Title": "X-Trace Task",
        "Host": "pinky19.mpi-sws.org",
        "HRT": 26962670769417901,
        "Operation": "join",
        "Timestamp": "1557746310709.752930",
        "TenantClass": 0,
        "Source": "Client.java:1545",
        "ThreadID": 1,
        "ThreadName": "",
        "EventID": "714E772FCCD1CEF3",
        "ProcessID": 36430
      },
      {
        "Cycles": 0,
        "Agent": "org.apache.hadoop.ipc.ProtobufRpcEngine",
        "ProcessName": "Read",
        "TaskID": "0476DB66C4060DD4",
        "ParentEventID": [
          "714E772FCCD1CEF3"
        ],
        "Label": "org.apache.hadoop.hdfs.protocol.ClientProtocol.getBlockLocations completed",
        "Title": "X-Trace Task",
        "Host": "pinky19.mpi-sws.org",
        "HRT": 26962670769452052,
        "Timestamp": "1557746310709.787109",
        "TenantClass": 0,
        "Source": "ProtobufRpcEngine.java:275",
        "ThreadID": 1,
        "ThreadName": "",
        "EventID": "7E23477A88AA82AE",
        "ProcessID": 36430
      },
      {
        "Cycles": 0,
        "Agent": "Execution-CPU",
        "ProcessName": "Name",
        "TaskID": "0476DB66C4060DD4",
        "ParentEventID": [
          "98E42A82B12B0945"
        ],
        "Label": "unset",
        "Title": "X-Trace Task",
        "Host": "pinky19.mpi-sws.org",
        "Duration": "205731",
        "HRT": 26962670769307360,
        "Operation": "unset",
        "Timestamp": "1557746310709.653564",
        "TenantClass": 0,
        "Source": "Server.java:1058",
        "ThreadID": 56,
        "ThreadName": "",
        "EventID": "6032391DC3E36048",
        "BaggageBytes": "[[248 5] [240 0] [0 4 118 219 102 196 6 13 212] [240 1] [0 152 228 42 130 177 43 9 69] [240 3] [0 2]]",
        "ProcessID": 2171
      },
      {
        "Cycles": 0,
        "Agent": "edu.brown.cs.systems.xtrace.logging.BaggageWrappers",
        "ProcessName": "Read",
        "TaskID": "0476DB66C4060DD4",
        "ParentEventID": [
          "7E23477A88AA82AE"
        ],
        "Label": "Forking current baggage with Baggage.fork()",
        "Title": "X-Trace Task",
        "Host": "pinky19.mpi-sws.org",
        "HRT": 26962670769503167,
        "Operation": "fork",
        "Timestamp": "1557746310709.838135",
        "TenantClass": 0,
        "Source": "DataTransferProtoUtil.java:94",
        "ThreadID": 1,
        "ThreadName": "",
        "EventID": "967690554E3243D0",
        "ProcessID": 36430
      },
      {
        "Cycles": 0,
        "Agent": "edu.brown.cs.systems.xtrace.logging.XTraceInit",
        "ProcessName": "Data",
        "TaskID": "0476DB66C4060DD4",
        "ParentEventID": [
          "11CBDEA4E058088B"
        ],
        "Label": "Thread.setName: DataXceiver for client DFSClient_NONMAPREDUCE_778905418_1 at /139.19.171.63:35320 [Sending block BP-1633380353-139.19.171.63-1554193446451:blk_1073766259_25435]",
        "Title": "X-Trace Task",
        "Host": "pinky21.mpi-sws.org",
        "HRT": 10808980476224497,
        "Timestamp": "1557746310710.284424",
        "TenantClass": 0,
        "Source": "DataXceiver.java:168",
        "ThreadID": 14875,
        "ThreadName": "",
        "EventID": "794C0B70D3F96000",
        "BaggageBytes": "[[248 5] [240 0] [0 4 118 219 102 196 6 13 212] [240 1] [0 17 203 222 164 224 88 8 139] [240 3] [0 2]]",
        "ProcessID": 20775
      },
      {
        "Cycles": 0,
        "Agent": "edu.brown.cs.systems.xtrace.logging.BaggageWrappers",
        "ProcessName": "Data",
        "TaskID": "0476DB66C4060DD4",
        "ParentEventID": [
          "794C0B70D3F96000"
        ],
        "Label": "Forking current baggage with Baggage.fork()",
        "Title": "X-Trace Task",
        "Host": "pinky21.mpi-sws.org",
        "HRT": 10808980476458021,
        "Operation": "fork",
        "Timestamp": "1557746310710.517822",
        "TenantClass": 0,
        "Source": "DataXceiver.java:1257",
        "ThreadID": 14875,
        "ThreadName": "",
        "EventID": "95F8DF3DF6F9506F",
        "BaggageBytes": "[[248 5] [240 0] [0 4 118 219 102 196 6 13 212] [240 1] [0 121 76 11 112 211 249 96 0] [240 3] [0 2]]",
        "ProcessID": 20775
      },
      {
        "Cycles": 0,
        "Agent": "Execution-Sleep",
        "ProcessName": "Read",
        "TaskID": "0476DB66C4060DD4",
        "ParentEventID": [
          "967690554E3243D0"
        ],
        "Label": "waited",
        "Title": "X-Trace Task",
        "Host": "pinky19.mpi-sws.org",
        "Duration": "750489",
        "HRT": 26962670770329970,
        "Operation": "waited",
        "Timestamp": "1557746310710.665039",
        "TenantClass": 0,
        "Source": "SocketIOWithTimeout.java:335",
        "ThreadID": 1,
        "ThreadName": "",
        "EventID": "E1301B2C23D7FB0E",
        "ProcessID": 36430
      },
      {
        "Cycles": 0,
        "Agent": "Execution-CPU",
        "ProcessName": "Data",
        "TaskID": "0476DB66C4060DD4",
        "ParentEventID": [
          "967690554E3243D0"
        ],
        "Label": "set",
        "Title": "X-Trace Task",
        "Host": "pinky21.mpi-sws.org",
        "HRT": 10808980476122620,
        "Operation": "set",
        "Timestamp": "1557746310710.182373",
        "TenantClass": 0,
        "Source": "Receiver.java:117",
        "ThreadID": 14875,
        "ThreadName": "",
        "EventID": "11CBDEA4E058088B",
        "BaggageBytes": "[[248 5] [240 0] [0 4 118 219 102 196 6 13 212] [240 1] [0 150 118 144 85 78 50 67 208] [240 3] [0 2]]",
        "ProcessID": 20775
      },
      {
        "Cycles": 0,
        "Agent": "edu.brown.cs.systems.xtrace.logging.BaggageWrappers",
        "ProcessName": "Read",
        "TaskID": "0476DB66C4060DD4",
        "ParentEventID": [
          "E1301B2C23D7FB0E",
          "95F8DF3DF6F9506F"
        ],
        "Label": "Merged current baggage with other baggage",
        "Title": "X-Trace Task",
        "Host": "pinky19.mpi-sws.org",
        "HRT": 26962670770414930,
        "Operation": "join",
        "Timestamp": "1557746310710.750000",
        "TenantClass": 0,
        "Source": "RemoteBlockReader2.java:429",
        "ThreadID": 1,
        "ThreadName": "",
        "EventID": "32AD07AB86CD8910",
        "ProcessID": 36430
      },
      {
        "Cycles": 0,
        "Agent": "Execution-Sleep",
        "ProcessName": "Read",
        "TaskID": "0476DB66C4060DD4",
        "ParentEventID": [
          "32AD07AB86CD8910"
        ],
        "Label": "waited",
        "Title": "X-Trace Task",
        "Host": "pinky19.mpi-sws.org",
        "Duration": "59968",
        "HRT": 26962670770522502,
        "Operation": "waited",
        "Timestamp": "1557746310710.857666",
        "TenantClass": 0,
        "Source": "SocketIOWithTimeout.java:335",
        "ThreadID": 1,
        "ThreadName": "",
        "EventID": "7204B0D14E41980B",
        "ProcessID": 36430
      },
      {
        "Cycles": 0,
        "Agent": "edu.brown.cs.systems.xtrace.logging.BaggageWrappers",
        "ProcessName": "Data",
        "TaskID": "0476DB66C4060DD4",
        "ParentEventID": [
          "95F8DF3DF6F9506F"
        ],
        "Label": "Forking current baggage with Baggage.fork()",
        "Title": "X-Trace Task",
        "Host": "pinky21.mpi-sws.org",
        "HRT": 10808980476618038,
        "Operation": "fork",
        "Timestamp": "1557746310710.677979",
        "TenantClass": 0,
        "Source": "PacketHeader.java:95",
        "ThreadID": 14875,
        "ThreadName": "",
        "EventID": "CE333FF4A0DDD9AB",
        "BaggageBytes": "[[248 5] [240 0] [0 4 118 219 102 196 6 13 212] [240 1] [0 149 248 223 61 246 249 80 111] [240 3] [0 2]]",
        "ProcessID": 20775
      },
      {
        "Cycles": 0,
        "Agent": "Execution-Sleep",
        "ProcessName": "Data",
        "TaskID": "0476DB66C4060DD4",
        "ParentEventID": [
          "CE333FF4A0DDD9AB"
        ],
        "Label": "waited",
        "Title": "X-Trace Task",
        "Host": "pinky21.mpi-sws.org",
        "Duration": "11637",
        "HRT": 10808980476825739,
        "Operation": "waited",
        "Timestamp": "1557746310710.885498",
        "TenantClass": 0,
        "Source": "SocketIOWithTimeout.java:335",
        "ThreadID": 14875,
        "ThreadName": "",
        "EventID": "E0F7BABC4556B090",
        "BaggageBytes": "[[248 5] [240 0] [0 4 118 219 102 196 6 13 212] [240 1] [0 206 51 63 244 160 221 217 171] [240 3] [0 2]]",
        "ProcessID": 20775
      },
      {
        "Cycles": 0,
        "Agent": "Execution-Sleep",
        "ProcessName": "Read",
        "TaskID": "0476DB66C4060DD4",
        "ParentEventID": [
          "7204B0D14E41980B"
        ],
        "Label": "waited",
        "Title": "X-Trace Task",
        "Host": "pinky19.mpi-sws.org",
        "Duration": "234576",
        "HRT": 26962670770837183,
        "Operation": "waited",
        "Timestamp": "1557746310711.172363",
        "TenantClass": 0,
        "Source": "SocketIOWithTimeout.java:335",
        "ThreadID": 1,
        "ThreadName": "",
        "EventID": "FE698AAC0A02899F",
        "ProcessID": 36430
      },
      {
        "Cycles": 0,
        "Agent": "edu.brown.cs.systems.xtrace.logging.BaggageWrappers",
        "ProcessName": "Read",
        "TaskID": "0476DB66C4060DD4",
        "ParentEventID": [
          "CE333FF4A0DDD9AB",
          "FE698AAC0A02899F"
        ],
        "Label": "Merged current baggage with other baggage",
        "Title": "X-Trace Task",
        "Host": "pinky19.mpi-sws.org",
        "HRT": 26962670770901853,
        "Operation": "join",
        "Timestamp": "1557746310711.236816",
        "TenantClass": 0,
        "Source": "PacketHeader.java:168",
        "ThreadID": 1,
        "ThreadName": "",
        "EventID": "79996DC366B88554",
        "ProcessID": 36430
      },
      {
        "Cycles": 0,
        "Agent": "edu.brown.cs.systems.xtrace.logging.BaggageWrappers",
        "ProcessName": "Data",
        "TaskID": "0476DB66C4060DD4",
        "ParentEventID": [
          "E0F7BABC4556B090"
        ],
        "Label": "Forking current baggage with Baggage.fork()",
        "Title": "X-Trace Task",
        "Host": "pinky21.mpi-sws.org",
        "HRT": 10808980477013829,
        "Operation": "fork",
        "Timestamp": "1557746310711.073730",
        "TenantClass": 0,
        "Source": "PacketHeader.java:95",
        "ThreadID": 14875,
        "ThreadName": "",
        "EventID": "74CE6B160CC6844D",
        "BaggageBytes": "[[248 5] [240 0] [0 4 118 219 102 196 6 13 212] [240 1] [0 224 247 186 188 69 86 176 144] [240 3] [0 2]]",
        "ProcessID": 20775
      },
      {
        "Cycles": 0,
        "Agent": "edu.brown.cs.systems.xtrace.logging.BaggageWrappers",
        "ProcessName": "Read",
        "TaskID": "0476DB66C4060DD4",
        "ParentEventID": [
          "74CE6B160CC6844D",
          "79996DC366B88554"
        ],
        "Label": "Merged current baggage with other baggage",
        "Title": "X-Trace Task",
        "Host": "pinky19.mpi-sws.org",
        "HRT": 26962670770958726,
        "Operation": "join",
        "Timestamp": "1557746310711.293701",
        "TenantClass": 0,
        "Source": "PacketHeader.java:168",
        "ThreadID": 1,
        "ThreadName": "",
        "EventID": "64CAA073D7C28670",
        "ProcessID": 36430
      },
      {
        "Cycles": 0,
        "Agent": "Execution-Sleep",
        "ProcessName": "Data",
        "TaskID": "0476DB66C4060DD4",
        "ParentEventID": [
          "74CE6B160CC6844D"
        ],
        "Label": "waited",
        "Title": "X-Trace Task",
        "Host": "pinky21.mpi-sws.org",
        "Duration": "82113",
        "HRT": 10808980477336077,
        "Operation": "waited",
        "Timestamp": "1557746310711.395996",
        "TenantClass": 0,
        "Source": "SocketIOWithTimeout.java:335",
        "ThreadID": 14875,
        "ThreadName": "",
        "EventID": "D3E3D43B9E81690E",
        "BaggageBytes": "[[248 5] [240 0] [0 4 118 219 102 196 6 13 212] [240 1] [0 116 206 107 22 12 198 132 77] [240 3] [0 2]]",
        "ProcessID": 20775
      },
      {
        "Cycles": 0,
        "Agent": "edu.brown.cs.systems.xtrace.logging.BaggageWrappers",
        "ProcessName": "Read",
        "TaskID": "0476DB66C4060DD4",
        "ParentEventID": [
          "64CAA073D7C28670"
        ],
        "Label": "Forking current baggage with Baggage.fork()",
        "Title": "X-Trace Task",
        "Host": "pinky19.mpi-sws.org",
        "HRT": 26962670770967689,
        "Operation": "fork",
        "Timestamp": "1557746310711.302734",
        "TenantClass": 0,
        "Source": "RemoteBlockReader2.java:361",
        "ThreadID": 1,
        "ThreadName": "",
        "EventID": "720E5BCEE1474C04",
        "ProcessID": 36430
      },
      {
        "Cycles": 0,
        "Agent": "edu.brown.cs.systems.xtrace.logging.BaggageWrappers",
        "ProcessName": "Data",
        "TaskID": "0476DB66C4060DD4",
        "ParentEventID": [
          "D3E3D43B9E81690E",
          "720E5BCEE1474C04"
        ],
        "Label": "Merged current baggage with other baggage",
        "Title": "X-Trace Task",
        "Host": "pinky21.mpi-sws.org",
        "HRT": 10808980477462544,
        "Operation": "join",
        "Timestamp": "1557746310711.522461",
        "TenantClass": 0,
        "Source": "DataXceiver.java:574",
        "ThreadID": 14875,
        "ThreadName": "",
        "EventID": "2543CAD29A2D617A",
        "BaggageBytes": "[[248 5] [240 0] [0 4 118 219 102 196 6 13 212] [240 1] [0 211 227 212 59 158 129 105 14] [0 114 14 91 206 225 71 76 4] [240 3] [0 2]]",
        "ProcessID": 20775
      },
      {
        "Cycles": 0,
        "Agent": "Execution-CPU",
        "ProcessName": "Data",
        "TaskID": "0476DB66C4060DD4",
        "ParentEventID": [
          "2543CAD29A2D617A"
        ],
        "Label": "unset",
        "Title": "X-Trace Task",
        "Host": "pinky21.mpi-sws.org",
        "Duration": "1318314",
        "HRT": 10808980477514707,
        "Operation": "unset",
        "Timestamp": "1557746310711.574463",
        "TenantClass": 0,
        "Source": "DataXceiver.java:261",
        "ThreadID": 14875,
        "ThreadName": "",
        "EventID": "8E9010251AB56292",
        "BaggageBytes": "[[248 5] [240 0] [0 4 118 219 102 196 6 13 212] [240 1] [0 37 67 202 210 154 45 97 122] [240 3] [0 2]]",
        "ProcessID": 20775
      },
      {
        "Cycles": 0,
        "Agent": "edu.brown.cs.systems.retro.benchmarks.hdfs_client.Reader",
        "ProcessName": "Read",
        "TaskID": "0476DB66C4060DD4",
        "ParentEventID": [
          "0"
        ],
        "Label": "Reading file",
        "Title": "X-Trace Task",
        "Host": "pinky19.mpi-sws.org",
        "HRT": 26962670768772621,
        "Timestamp": "1557746310709.107666",
        "TenantClass": 0,
        "ThreadID": 1,
        "ThreadName": "",
        "EventID": "D2CDDE7A15456FD5",
        "ProcessID": 36430,
        "Tag": [
          "reader_10kb",
          "Read Size: 10240"
        ]
      }
    ]
  }
]