[
  {
    "id": "5B8CE4DB315262EA",
    "reports": [
      {
        "Cycles": 0,
        "Agent": "edu.brown.cs.systems.retro.benchmarks.hdfs_client.Reader",
        "ProcessName": "Read",
        "TaskID": "5B8CE4DB315262EA",
        "ParentEventID": [
          "0"
        ],
        "Label": "Reading file",
        "Title": "X-Trace Task",
        "Host": "pinky19.mpi-sws.org",
        "HRT": 26966732975682416,
        "Timestamp": "1557750372915.574707",
        "TenantClass": 0,
        "ThreadID": 1,
        "ThreadName": "",
        "EventID": "A604990F3CBC2B80",
        "ProcessID": 2801,
        "Tag": [
          "reader_100kb",
          "Read Size: 102400"
        ]
      },
      {
        "Cycles": 0,
        "Agent": "org.apache.hadoop.ipc.ProtobufRpcEngine",
        "ProcessName": "Read",
        "TaskID": "5B8CE4DB315262EA",
        "ParentEventID": [
          "76AC0479325913DD"
        ],
        "Label": "Invoking org.apache.hadoop.hdfs.protocol.ClientProtocol.getBlockLocations",
        "Title": "X-Trace Task",
        "Host": "pinky19.mpi-sws.org",
        "HRT": 26966732975723198,
        "Timestamp": "1557750372915.615479",
        "TenantClass": 0,
        "Source": "ProtobufRpcEngine.java:228",
        "ThreadID": 1,
        "ThreadName": "",
        "EventID": "B8622E7E948CD8B7",
        "ProcessID": 2801
      },
      {
        "Cycles": 0,
        "Agent": "Execution-CPU",
        "ProcessName": "Read",
        "TaskID": "5B8CE4DB315262EA",
        "ParentEventID": [
          "B8622E7E948CD8B7"
        ],
        "Label": "unset",
        "Title": "X-Trace Task",
        "Host": "pinky19.mpi-sws.org",
        "Duration": "24823949",
        "HRT": 26966732975743537,
        "Operation": "unset",
        "Timestamp": "1557750372915.635986",
        "TenantClass": 0,
        "Source": "Client.java:1027",
        "ThreadID": 1,
        "ThreadName": "",
        "EventID": "367D99E62598B55A",
        "ProcessID": 2801
      },
      {
        "Cycles": 0,
        "Agent": "Execution-CPU",
        "ProcessName": "Read",
        "TaskID": "5B8CE4DB315262EA",
        "ParentEventID": [
          "367D99E62598B55A"
        ],
        "Label": "set",
        "Title": "X-Trace Task",
        "Host": "pinky19.mpi-sws.org",
        "HRT": 26966732975770784,
        "Operation": "set",
        "Timestamp": "1557750372915.663086",
        "TenantClass": 0,
        "Source": "Client.java:1032",
        "ThreadID": 41,
        "ThreadName": "",
        "EventID": "04057BA20ED810C4",
        "ProcessID": 2801
      },
      {
        "Cycles": 0,
        "Agent": "edu.brown.cs.systems.xtrace.logging.BaggageWrappers",
        "ProcessName": "Read",
        "TaskID": "5B8CE4DB315262EA",
        "ParentEventID": [
          "04057BA20ED810C4"
        ],
        "Label": "Forking current baggage with Baggage.fork()",
        "Title": "X-Trace Task",
        "Host": "pinky19.mpi-sws.org",
        "HRT": 26966732975784956,
        "Operation": "fork",
        "Timestamp": "1557750372915.677246",
        "TenantClass": 0,
        "Source": "Client.java:1043",
        "ThreadID": 41,
        "ThreadName": "",
        "EventID": "87499B2642B2D5EA",
        "ProcessID": 2801
      },
      {
        "Cycles": 0,
        "Agent": "Execution-CPU",
        "ProcessName": "Read",
        "TaskID": "5B8CE4DB315262EA",
        "ParentEventID": [
          "A14C1BFB9AA21CD9"
        ],
        "Label": "set",
        "Title": "X-Trace Task",
        "Host": "pinky19.mpi-sws.org",
        "HRT": 26966732975869858,
        "Operation": "set",
        "Timestamp": "1557750372915.762207",
        "TenantClass": 0,
        "Source": "Client.java:1104",
        "ThreadID": 1,
        "ThreadName": "",
        "EventID": "86C176EC29C0F3C7",
        "ProcessID": 2801
      },
      {
        "Cycles": 0,
        "Agent": "Execution-CPU",
        "ProcessName": "Read",
        "TaskID": "5B8CE4DB315262EA",
        "ParentEventID": [
          "87499B2642B2D5EA"
        ],
        "Label": "unset",
        "Title": "X-Trace Task",
        "Host": "pinky19.mpi-sws.org",
        "Duration": "59523",
        "HRT": 26966732975845347,
        "Operation": "unset",
        "Timestamp": "1557750372915.737793",
        "TenantClass": 0,
        "Source": "Client.java:1062",
        "ThreadID": 41,
        "ThreadName": "",
        "EventID": "A14C1BFB9AA21CD9",
        "ProcessID": 2801
      },
      {
        "Cycles": 0,
        "Agent": "Execution-CPU",
        "ProcessName": "Name",
        "TaskID": "5B8CE4DB315262EA",
        "ParentEventID": [
          "87499B2642B2D5EA"
        ],
        "Label": "set",
        "Title": "X-Trace Task",
        "Host": "pinky19.mpi-sws.org",
        "HRT": 26966732975903815,
        "Operation": "set",
        "Timestamp": "1557750372915.810303",
        "TenantClass": 0,
        "Source": "Server.java:1840",
        "ThreadID": 48,
        "ThreadName": "",
        "EventID": "9577E8977284785D",
        "BaggageBytes": "[[248 5] [240 0] [0 91 140 228 219 49 82 98 234] [240 1] [0 135 73 155 38 66 178 213 234] [240 3] [0 2]]",
        "ProcessID": 2171
      },
      {
        "Cycles": 0,
        "Agent": "edu.brown.cs.systems.xtrace.logging.BaggageWrappers",
        "ProcessName": "Name",
        "TaskID": "5B8CE4DB315262EA",
        "ParentEventID": [
          "9577E8977284785D"
        ],
        "Label": "Forking current baggage with Baggage.fork()",
        "Title": "X-Trace Task",
        "Host": "pinky19.mpi-sws.org",
        "HRT": 26966732975927330,
        "Operation": "fork",
        "Timestamp": "1557750372915.833740",
        "TenantClass": 0,
        "Source": "Server.java:550",
        "ThreadID": 48,
        "ThreadName": "",
        "EventID": "A3BF0225C24A8EFE",
        "BaggageBytes": "[[248 5] [240 0] [0 91 140 228 219 49 82 98 234] [240 1] [0 149 119 232 151 114 132 120 93] [240 3] [0 2]]",
        "ProcessID": 2171
      },
      {
        "Cycles": 0,
        "Agent": "Execution-CPU",
        "ProcessName": "Name",
        "TaskID": "5B8CE4DB315262EA",
        "ParentEventID": [
          "A3BF0225C24A8EFE"
        ],
        "Label": "unset",
        "Title": "X-Trace Task",
        "Host": "pinky19.mpi-sws.org",
        "Duration": "21501",
        "HRT": 26966732975945755,
        "Operation": "unset",
        "Timestamp": "1557750372915.852051",
        "TenantClass": 0,
        "Source": "Server.java:1828",
        "ThreadID": 48,
        "ThreadName": "",
        "EventID": "3F6BF76541FF741F",
        "BaggageBytes": "[[248 5] [240 0] [0 91 140 228 219 49 82 98 234] [240 1] [0 163 191 2 37 194 74 142 254] [240 3] [0 2]]",
        "ProcessID": 2171
      },
      {
        "Cycles": 0,
        "Agent": "Execution-CPU",
        "ProcessName": "Name",
        "TaskID": "5B8CE4DB315262EA",
        "ParentEventID": [
          "A3BF0225C24A8EFE"
        ],
        "Label": "set",
        "Title": "X-Trace Task",
        "Host": "pinky19.mpi-sws.org",
        "HRT": 26966732975957127,
        "Operation": "set",
        "Timestamp": "1557750372915.863525",
        "TenantClass": 0,
        "Source": "Server.java:2071",
        "ThreadID": 57,
        "ThreadName": "",
        "EventID": "8103C02AD3CD288B",
        "BaggageBytes": "[[248 5] [240 0] [0 91 140 228 219 49 82 98 234] [240 1] [0 163 191 2 37 194 74 142 254] [240 3] [0 2]]",
        "ProcessID": 2171
      },
      {
        "Cycles": 0,
        "Agent": "org.apache.hadoop.hdfs.server.namenode.FSNamesystem.audit",
        "ProcessName": "Name",
        "TaskID": "5B8CE4DB315262EA",
        "ParentEventID": [
          "972159C082B61E31"
        ],
        "Label": "allowed=true\tugi=plascas (auth:SIMPLE)\tip=/139.19.171.63\tcmd=open\tsrc=/ds/ztwNzgja6ons4vs8\tdst=null\tperm=null\tproto=rpc",
        "Title": "X-Trace Task",
        "Host": "pinky19.mpi-sws.org",
        "HRT": 26966732976042740,
        "Timestamp": "1557750372915.949219",
        "TenantClass": 0,
        "Source": "FSNamesystem.java:8313",
        "ThreadID": 57,
        "ThreadName": "",
        "EventID": "512FF15C96E213AC",
        "BaggageBytes": "[[248 5] [240 0] [0 91 140 228 219 49 82 98 234] [240 1] [0 151 33 89 192 130 182 30 49] [240 3] [0 2]]",
        "ProcessID": 2171
      },
      {
        "Cycles": 0,
        "Agent": "org.apache.hadoop.ipc.Server",
        "ProcessName": "Name",
        "TaskID": "5B8CE4DB315262EA",
        "ParentEventID": [
          "8103C02AD3CD288B"
        ],
        "Label": "getBlockLocations in org.apache.hadoop.hdfs.protocol.ClientProtocol",
        "Title": "X-Trace Task",
        "Host": "pinky19.mpi-sws.org",
        "HRT": 26966732975996381,
        "Timestamp": "1557750372915.902832",
        "TenantClass": 0,
        "Source": "ProtobufRpcEngine.java:601",
        "ThreadID": 57,
        "ThreadName": "",
        "EventID": "972159C082B61E31",
        "BaggageBytes": "[[248 5] [240 0] [0 91 140 228 219 49 82 98 234] [240 1] [0 129 3 192 42 211 205 40 139] [240 3] [0 2]]",
        "ProcessID": 2171
      },
      {
        "Cycles": 0,
        "Agent": "edu.brown.cs.systems.xtrace.logging.BaggageWrappers",
        "ProcessName": "Name",
        "TaskID": "5B8CE4DB315262EA",
        "ParentEventID": [
          "512FF15C96E213AC"
        ],
        "Label": "Forking current baggage with Baggage.fork()",
        "Title": "X-Trace Task",
        "Host": "pinky19.mpi-sws.org",
        "HRT": 26966732976084786,
        "Operation": "fork",
        "Timestamp": "1557750372915.991211",
        "TenantClass": 0,
        "Source": "Server.java:2398",
        "ThreadID": 57,
        "ThreadName": "",
        "EventID": "BD8B103FA7A37AC2",
        "BaggageBytes": "[[248 5] [240 0] [0 91 140 228 219 49 82 98 234] [240 1] [0 81 47 241 92 150 226 19 172] [240 3] [0 2]]",
        "ProcessID": 2171
      },
      {
        "Cycles": 0,
        "Agent": "Execution-CPU",
        "ProcessName": "Read",
        "TaskID": "5B8CE4DB315262EA",
        "ParentEventID": [
          "BD8B103FA7A37AC2"
        ],
        "Label": "set",
        "Title": "X-Trace Task",
        "Host": "pinky19.mpi-sws.org",
        "HRT": 26966732976232242,
        "Operation": "set",
        "Timestamp": "1557750372916.124512",
        "TenantClass": 0,
        "Source": "Client.java:302",
        "ThreadID": 40,
        "ThreadName": "",
        "EventID": "D1E4F90732F5825B",
        "ProcessID": 2801
      },
      {
        "Cycles": 0,
        "Agent": "Execution-CPU",
        "ProcessName": "Name",
        "TaskID": "5B8CE4DB315262EA",
        "ParentEventID": [
          "BD8B103FA7A37AC2"
        ],
        "Label": "unset",
        "Title": "X-Trace Task",
        "Host": "pinky19.mpi-sws.org",
        "Duration": "205943",
        "HRT": 26966732976189893,
        "Operation": "unset",
        "Timestamp": "1557750372916.096191",
        "TenantClass": 0,
        "Source": "Server.java:1058",
        "ThreadID": 57,
        "ThreadName": "",
        "EventID": "2BE61030537B6F62",
        "BaggageBytes": "[[248 5] [240 0] [0 91 140 228 219 49 82 98 234] [240 1] [0 189 139 16 63 167 163 122 194] [240 3] [0 2]]",
        "ProcessID": 2171
      },
      {
        "Cycles": 0,
        "Agent": "Execution-CPU",
        "ProcessName": "Read",
        "TaskID": "5B8CE4DB315262EA",
        "ParentEventID": [
          "D1E4F90732F5825B"
        ],
        "Label": "unset",
        "Title": "X-Trace Task",
        "Host": "pinky19.mpi-sws.org",
        "Duration": "5196",
        "HRT": 26966732976252260,
        "Operation": "unset",
        "Timestamp": "1557750372916.144531",
        "TenantClass": 0,
        "Source": "Client.java:1168",
        "ThreadID": 40,
        "ThreadName": "",
        "EventID": "3C13493F43FD3EAF",
        "ProcessID": 2801
      },
      {
        "Cycles": 0,
        "Agent": "Execution-Sleep",
        "ProcessName": "Read",
        "TaskID": "5B8CE4DB315262EA",
        "ParentEventID": [
          "86C176EC29C0F3C7"
        ],
        "Label": "waited",
        "Title": "X-Trace Task",
        "Host": "pinky19.mpi-sws.org",
        "Duration": "386738",
        "HRT": 26966732976267990,
        "Operation": "waited",
        "Timestamp": "1557750372916.160400",
        "TenantClass": 0,
        "Source": "Client.java:1537",
        "ThreadID": 1,
        "ThreadName": "",
        "EventID": "4E3F497DDB2CCAD7",
        "ProcessID": 2801
      },
      {
        "Cycles": 0,
        "Agent": "edu.brown.cs.systems.xtrace.logging.BaggageWrappers",
        "ProcessName": "Read",
        "TaskID": "5B8CE4DB315262EA",
        "ParentEventID": [
          "3C13493F43FD3EAF",
          "4E3F497DDB2CCAD7"
        ],
        "Label": "Merged current baggage with other baggage",
        "Title": "X-Trace Task",
        "Host": "pinky19.mpi-sws.org",
        "HRT": 26966732976277467,
        "Operation": "join",
        "Timestamp": "1557750372916.169922",
        "TenantClass": 0,
        "Source": "Client.java:1545",
        "ThreadID": 1,
        "ThreadName": "",
        "EventID": "39E9365AAB5522FA",
        "ProcessID": 2801
      },
      {
        "Cycles": 0,
        "Agent": "Execution-Sleep",
        "ProcessName": "Read",
        "TaskID": "5B8CE4DB315262EA",
        "ParentEventID": [
          "1653C0D78AFC5736"
        ],
        "Label": "waited",
        "Title": "X-Trace Task",
        "Host": "pinky19.mpi-sws.org",
        "Duration": "101008",
        "HRT": 26966732976523181,
        "Operation": "waited",
        "Timestamp": "1557750372916.415527",
        "TenantClass": 0,
        "Source": "SocketIOWithTimeout.java:335",
        "ThreadID": 1,
        "ThreadName": "",
        "EventID": "BE490FD52030F1EE",
        "ProcessID": 2801
      },
      {
        "Cycles": 0,
        "Agent": "org.apache.hadoop.ipc.ProtobufRpcEngine",
        "ProcessName": "Read",
        "TaskID": "5B8CE4DB315262EA",
        "ParentEventID": [
          "39E9365AAB5522FA"
        ],
        "Label": "org.apache.hadoop.hdfs.protocol.ClientProtocol.getBlockLocations completed",
        "Title": "X-Trace Task",
        "Host": "pinky19.mpi-sws.org",
        "HRT": 26966732976314889,
        "Timestamp": "1557750372916.207275",
        "TenantClass": 0,
        "Source": "ProtobufRpcEngine.java:275",
        "ThreadID": 1,
        "ThreadName": "",
        "EventID": "1653C0D78AFC5736",
        "ProcessID": 2801
      },
      {
        "Cycles": 0,
        "Agent": "edu.brown.cs.systems.xtrace.logging.BaggageWrappers",
        "ProcessName": "Read",
        "TaskID": "5B8CE4DB315262EA",
        "ParentEventID": [
          "BE490FD52030F1EE"
        ],
        "Label": "Forking current baggage with Baggage.fork()",
        "Title": "X-Trace Task",
        "Host": "pinky19.mpi-sws.org",
        "HRT": 26966732976559998,
        "Operation": "fork",
        "Timestamp": "1557750372916.452393",
        "TenantClass": 0,
        "Source": "DataTransferProtoUtil.java:94",
        "ThreadID": 1,
        "ThreadName": "",
        "EventID": "7E52B311F969B230",
        "ProcessID": 2801
      },
      {
        "Cycles": 0,
        "Agent": "edu.brown.cs.systems.xtrace.logging.XTraceInit",
        "ProcessName": "Data",
        "TaskID": "5B8CE4DB315262EA",
        "ParentEventID": [
          "274BF1801F9BDBBA"
        ],
        "Label": "Thread.setName: DataXceiver for client DFSClient_NONMAPREDUCE_310321604_1 at /139.19.171.63:49702 [Sending block BP-1633380353-139.19.171.63-1554193446451:blk_1073768214_27390]",
        "Title": "X-Trace Task",
        "Host": "pinky21.mpi-sws.org",
        "HRT": 10813042683065636,
        "Timestamp": "1557750372916.791016",
        "TenantClass": 0,
        "Source": "DataXceiver.java:168",
        "ThreadID": 15724,
        "ThreadName": "",
        "EventID": "BCDEBECEB816B5AA",
        "BaggageBytes": "[[248 5] [240 0] [0 91 140 228 219 49 82 98 234] [240 1] [0 39 75 241 128 31 155 219 186] [240 3] [0 2]]",
        "ProcessID": 20775
      },
      {
        "Cycles": 0,
        "Agent": "Execution-CPU",
        "ProcessName": "Data",
        "TaskID": "5B8CE4DB315262EA",
        "ParentEventID": [
          "7E52B311F969B230"
        ],
        "Label": "set",
        "Title": "X-Trace Task",
        "Host": "pinky21.mpi-sws.org",
        "HRT": 10813042683004792,
        "Operation": "set",
        "Timestamp": "1557750372916.730225",
        "TenantClass": 0,
        "Source": "Receiver.java:117",
        "ThreadID": 15724,
        "ThreadName": "",
        "EventID": "274BF1801F9BDBBA",
        "BaggageBytes": "[[248 5] [240 0] [0 91 140 228 219 49 82 98 234] [240 1] [0 126 82 179 17 249 105 178 48] [240 3] [0 2]]",
        "ProcessID": 20775
      },
      {
        "Cycles": 0,
        "Agent": "edu.brown.cs.systems.xtrace.logging.BaggageWrappers",
        "ProcessName": "Data",
        "TaskID": "5B8CE4DB315262EA",
        "ParentEventID": [
          "BCDEBECEB816B5AA"
        ],
        "Label": "Forking current baggage with Baggage.fork()",
        "Title": "X-Trace Task",
        "Host": "pinky21.mpi-sws.org",
        "HRT": 10813042683196882,
        "Operation": "fork",
        "Timestamp": "1557750372916.922363",
        "TenantClass": 0,
        "Source": "DataXceiver.java:1257",
        "ThreadID": 15724,
        "ThreadName": "",
        "EventID": "A9616364231AC5AC",
        "BaggageBytes": "[[248 5] [240 0] [0 91 140 228 219 49 82 98 234] [240 1] [0 188 222 190 206 184 22 181 170] [240 3] [0 2]]",
        "ProcessID": 20775
      },
      {
        "Cycles": 0,
        "Agent": "Execution-Sleep",
        "ProcessName": "Read",
        "TaskID": "5B8CE4DB315262EA",
        "ParentEventID": [
          "7E52B311F969B230"
        ],
        "Label": "waited",
        "Title": "X-Trace Task",
        "Host": "pinky19.mpi-sws.org",
        "Duration": "560371",
        "HRT": 26966732977200299,
        "Operation": "waited",
        "Timestamp": "1557750372917.092773",
        "TenantClass": 0,
        "Source": "SocketIOWithTimeout.java:335",
        "ThreadID": 1,
        "ThreadName": "",
        "EventID": "ECE6A8016D9D3B52",
        "ProcessID": 2801
      },
      {
        "Cycles": 0,
        "Agent": "edu.brown.cs.systems.xtrace.logging.BaggageWrappers",
        "ProcessName": "Data",
        "TaskID": "5B8CE4DB315262EA",
        "ParentEventID": [
          "A9616364231AC5AC"
        ],
        "Label": "Forking current baggage with Baggage.fork()",
        "Title": "X-Trace Task",
        "Host": "pinky21.mpi-sws.org",
        "HRT": 10813042683293591,
        "Operation": "fork",
        "Timestamp": "1557750372917.019043",
        "TenantClass": 0,
        "Source": "PacketHeader.java:95",
        "ThreadID": 15724,
        "ThreadName": "",
        "EventID": "231F96E13D4A29D5",
        "BaggageBytes": "[[248 5] [240 0] [0 91 140 228 219 49 82 98 234] [240 1] [0 169 97 99 100 35 26 197 172] [240 3] [0 2]]",
        "ProcessID": 20775
      },
      {
        "Cycles": 0,
        "Agent": "Execution-Sleep",
        "ProcessName": "Data",
        "TaskID": "5B8CE4DB315262EA",
        "ParentEventID": [
          "231F96E13D4A29D5"
        ],
        "Label": "waited",
        "Title": "X-Trace Task",
        "Host": "pinky21.mpi-sws.org",
        "Duration": "8189",
        "HRT": 10813042683405234,
        "Operation": "waited",
        "Timestamp": "1557750372917.130615",
        "TenantClass": 0,
        "Source": "SocketIOWithTimeout.java:335",
        "ThreadID": 15724,
        "ThreadName": "",
        "EventID": "C6D1C5AEF5F3FE70",
        "BaggageBytes": "[[248 5] [240 0] [0 91 140 228 219 49 82 98 234] [240 1] [0 35 31 150 225 61 74 41 213] [240 3] [0 2]]",
        "ProcessID": 20775
      },
      {
        "Cycles": 0,
        "Agent": "edu.brown.cs.systems.xtrace.logging.BaggageWrappers",
        "ProcessName": "Read",
        "TaskID": "5B8CE4DB315262EA",
        "ParentEventID": [
          "ECE6A8016D9D3B52",
          "A9616364231AC5AC"
        ],
        "Label": "Merged current baggage with other baggage",
        "Title": "X-Trace Task",
        "Host": "pinky19.mpi-sws.org",
        "HRT": 26966732977257560,
        "Operation": "join",
        "Timestamp": "1557750372917.149902",
        "TenantClass": 0,
        "Source": "RemoteBlockReader2.java:429",
        "ThreadID": 1,
        "ThreadName": "",
        "EventID": "E72A30B0F6C115FE",
        "ProcessID": 2801
      },
      {
        "Cycles": 0,
        "Agent": "edu.brown.cs.systems.xtrace.logging.BaggageWrappers",
        "ProcessName": "Data",
        "TaskID": "5B8CE4DB315262EA",
        "ParentEventID": [
          "C6D1C5AEF5F3FE70"
        ],
        "Label": "Forking current baggage with Baggage.fork()",
        "Title": "X-Trace Task",
        "Host": "pinky21.mpi-sws.org",
        "HRT": 10813042683513801,
        "Operation": "fork",
        "Timestamp": "1557750372917.239258",
        "TenantClass": 0,
        "Source": "PacketHeader.java:95",
        "ThreadID": 15724,
        "ThreadName": "",
        "EventID": "5EC5973149433D7E",
        "BaggageBytes": "[[248 5] [240 0] [0 91 140 228 219 49 82 98 234] [240 1] [0 198 209 197 174 245 243 254 112] [240 3] [0 2]]",
        "ProcessID": 20775
      },
      {
        "Cycles": 0,
        "Agent": "Execution-Sleep",
        "ProcessName": "Read",
        "TaskID": "5B8CE4DB315262EA",
        "ParentEventID": [
          "E72A30B0F6C115FE"
        ],
        "Label": "waited",
        "Title": "X-Trace Task",
        "Host": "pinky19.mpi-sws.org",
        "Duration": "287601",
        "HRT": 26966732977638149,
        "Operation": "waited",
        "Timestamp": "1557750372917.530518",
        "TenantClass": 0,
        "Source": "SocketIOWithTimeout.java:335",
        "ThreadID": 1,
        "ThreadName": "",
        "EventID": "0CBD779699B7AC40",
        "ProcessID": 2801
      },
      {
        "Cycles": 0,
        "Agent": "Execution-Sleep",
        "ProcessName": "Read",
        "TaskID": "5B8CE4DB315262EA",
        "ParentEventID": [
          "70835F0729711953"
        ],
        "Label": "waited",
        "Title": "X-Trace Task",
        "Host": "pinky19.mpi-sws.org",
        "Duration": "148517",
        "HRT": 26966732978133784,
        "Operation": "waited",
        "Timestamp": "1557750372918.026123",
        "TenantClass": 0,
        "Source": "SocketIOWithTimeout.java:335",
        "ThreadID": 1,
        "ThreadName": "",
        "EventID": "57EC79945C0A873F",
        "ProcessID": 2801
      },
      {
        "Cycles": 0,
        "Agent": "Execution-Sleep",
        "ProcessName": "Read",
        "TaskID": "5B8CE4DB315262EA",
        "ParentEventID": [
          "0CBD779699B7AC40"
        ],
        "Label": "waited",
        "Title": "X-Trace Task",
        "Host": "pinky19.mpi-sws.org",
        "Duration": "239369",
        "HRT": 26966732977926335,
        "Operation": "waited",
        "Timestamp": "1557750372917.818604",
        "TenantClass": 0,
        "Source": "SocketIOWithTimeout.java:335",
        "ThreadID": 1,
        "ThreadName": "",
        "EventID": "70835F0729711953",
        "ProcessID": 2801
      },
      {
        "Cycles": 0,
        "Agent": "edu.brown.cs.systems.xtrace.logging.BaggageWrappers",
        "ProcessName": "Read",
        "TaskID": "5B8CE4DB315262EA",
        "ParentEventID": [
          "231F96E13D4A29D5",
          "57EC79945C0A873F"
        ],
        "Label": "Merged current baggage with other baggage",
        "Title": "X-Trace Task",
        "Host": "pinky19.mpi-sws.org",
        "HRT": 26966732978206796,
        "Operation": "join",
        "Timestamp": "1557750372918.099121",
        "TenantClass": 0,
        "Source": "PacketHeader.java:168",
        "ThreadID": 1,
        "ThreadName": "",
        "EventID": "960690B443BFB78C",
        "ProcessID": 2801
      },
      {
        "Cycles": 0,
        "Agent": "edu.brown.cs.systems.xtrace.logging.BaggageWrappers",
        "ProcessName": "Read",
        "TaskID": "5B8CE4DB315262EA",
        "ParentEventID": [
          "2719615CDA9F0990"
        ],
        "Label": "Forking current baggage with Baggage.fork()",
        "Title": "X-Trace Task",
        "Host": "pinky19.mpi-sws.org",
        "HRT": 26966732978319312,
        "Operation": "fork",
        "Timestamp": "1557750372918.211670",
        "TenantClass": 0,
        "Source": "RemoteBlockReader2.java:361",
        "ThreadID": 1,
        "ThreadName": "",
        "EventID": "78A9E26F57CB2825",
        "ProcessID": 2801
      },
      {
        "Cycles": 0,
        "Agent": "edu.brown.cs.systems.xtrace.logging.BaggageWrappers",
        "ProcessName": "Read",
        "TaskID": "5B8CE4DB315262EA",
        "ParentEventID": [
          "5EC5973149433D7E",
          "960690B443BFB78C"
        ],
        "Label": "Merged current baggage with other baggage",
        "Title": "X-Trace Task",
        "Host": "pinky19.mpi-sws.org",
        "HRT": 26966732978310536,
        "Operation": "join",
        "Timestamp": "1557750372918.202881",
        "TenantClass": 0,
        "Source": "PacketHeader.java:168",
        "ThreadID": 1,
        "ThreadName": "",
        "EventID": "2719615CDA9F0990",
        "ProcessID": 2801
      },
      {
        "Cycles": 0,
        "Agent": "edu.brown.cs.systems.xtrace.logging.BaggageWrappers",
        "ProcessName": "Read",
        "TaskID": "5B8CE4DB315262EA",
        "ParentEventID": [
          "78A9E26F57CB2825"
        ],
        "Label": "Forking current baggage with Baggage.fork()",
        "Title": "X-Trace Task",
        "Host": "pinky19.mpi-sws.org",
        "HRT": 26966732978373603,
        "Operation": "fork",
        "Timestamp": "1557750372918.265869",
        "TenantClass": 0,
        "Source": "DataTransferProtoUtil.java:94",
        "ThreadID": 1,
        "ThreadName": "",
        "EventID": "AE4E8F29824051C8",
        "ProcessID": 2801
      },
      {
        "Cycles": 0,
        "Agent": "edu.brown.cs.systems.xtrace.logging.BaggageWrappers",
        "ProcessName": "Data",
        "TaskID": "5B8CE4DB315262EA",
        "ParentEventID": [
          "78A9E26F57CB2825",
          "5C0740DB3E8F664D"
        ],
        "Label": "Merged current baggage with other baggage",
        "Title": "X-Trace Task",
        "Host": "pinky21.mpi-sws.org",
        "HRT": 10813042684713619,
        "Operation": "join",
        "Timestamp": "1557750372918.438965",
        "TenantClass": 0,
        "Source": "DataXceiver.java:574",
        "ThreadID": 15724,
        "ThreadName": "",
        "EventID": "90BF81F587B93153",
        "BaggageBytes": "[[248 5] [240 0] [0 91 140 228 219 49 82 98 234] [240 1] [0 92 7 64 219 62 143 102 77] [0 120 169 226 111 87 203 40 37] [240 3] [0 2]]",
        "ProcessID": 20775
      },
      {
        "Cycles": 0,
        "Agent": "Execution-Sleep",
        "ProcessName": "Data",
        "TaskID": "5B8CE4DB315262EA",
        "ParentEventID": [
          "5EC5973149433D7E"
        ],
        "Label": "waited",
        "Title": "X-Trace Task",
        "Host": "pinky21.mpi-sws.org",
        "Duration": "892242",
        "HRT": 10813042684515487,
        "Operation": "waited",
        "Timestamp": "1557750372918.240967",
        "TenantClass": 0,
        "Source": "SocketIOWithTimeout.java:335",
        "ThreadID": 15724,
        "ThreadName": "",
        "EventID": "5C0740DB3E8F664D",
        "BaggageBytes": "[[248 5] [240 0] [0 91 140 228 219 49 82 98 234] [240 1] [0 94 197 151 49 73 67 61 126] [240 3] [0 2]]",
        "ProcessID": 20775
      },
      {
        "Cycles": 0,
        "Agent": "Execution-CPU",
        "ProcessName": "Data",
        "TaskID": "5B8CE4DB315262EA",
        "ParentEventID": [
          "AE4E8F29824051C8"
        ],
        "Label": "set",
        "Title": "X-Trace Task",
        "Host": "pinky21.mpi-sws.org",
        "HRT": 10813042684868122,
        "Operation": "set",
        "Timestamp": "1557750372918.593506",
        "TenantClass": 0,
        "Source": "Receiver.java:117",
        "ThreadID": 15724,
        "ThreadName": "",
        "EventID": "15C77F0E5B4D3806",
        "BaggageBytes": "[[248 5] [240 0] [0 91 140 228 219 49 82 98 234] [240 1] [0 174 78 143 41 130 64 81 200] [240 3] [0 2]]",
        "ProcessID": 20775
      },
      {
        "Cycles": 0,
        "Agent": "Execution-CPU",
        "ProcessName": "Data",
        "TaskID": "5B8CE4DB315262EA",
        "ParentEventID": [
          "90BF81F587B93153"
        ],
        "Label": "unset",
        "Title": "X-Trace Task",
        "Host": "pinky21.mpi-sws.org",
        "Duration": "1739910",
        "HRT": 10813042684790125,
        "Operation": "unset",
        "Timestamp": "1557750372918.515625",
        "TenantClass": 0,
        "Source": "DataXceiver.java:261",
        "ThreadID": 15724,
        "ThreadName": "",
        "EventID": "F9A13CFFF352D4B1",
        "BaggageBytes": "[[248 5] [240 0] [0 91 140 228 219 49 82 98 234] [240 1] [0 144 191 129 245 135 185 49 83] [240 3] [0 2]]",
        "ProcessID": 20775
      },
      {
        "Cycles": 0,
        "Agent": "edu.brown.cs.systems.xtrace.logging.XTraceInit",
        "ProcessName": "Data",
        "TaskID": "5B8CE4DB315262EA",
        "ParentEventID": [
          "15C77F0E5B4D3806"
        ],
        "Label": "Thread.setName: DataXceiver for client DFSClient_NONMAPREDUCE_310321604_1 at /139.19.171.63:49702 [Sending block BP-1633380353-139.19.171.63-1554193446451:blk_1073768214_27390]",
        "Title": "X-Trace Task",
        "Host": "pinky21.mpi-sws.org",
        "HRT": 10813042684965617,
        "Timestamp": "1557750372918.691162",
        "TenantClass": 0,
        "Source": "DataXceiver.java:168",
        "ThreadID": 15724,
        "ThreadName": "",
        "EventID": "8EDC32A989E47A79",
        "BaggageBytes": "[[248 5] [240 0] [0 91 140 228 219 49 82 98 234] [240 1] [0 21 199 127 14 91 77 56 6] [240 3] [0 2]]",
        "ProcessID": 20775
      },
      {
        "Cycles": 0,
        "Agent": "Execution-Sleep",
        "ProcessName": "Read",
        "TaskID": "5B8CE4DB315262EA",
        "ParentEventID": [
          "AE4E8F29824051C8"
        ],
        "Label": "waited",
        "Title": "X-Trace Task",
        "Host": "pinky19.mpi-sws.org",
        "Duration": "759080",
        "HRT": 26966732979199316,
        "Operation": "waited",
        "Timestamp": "1557750372919.091797",
        "TenantClass": 0,
        "Source": "SocketIOWithTimeout.java:335",
        "ThreadID": 1,
        "ThreadName": "",
        "EventID": "F6C66005AF7C396F",
        "ProcessID": 2801
      },
      {
        "Cycles": 0,
        "Agent": "edu.brown.cs.systems.xtrace.logging.BaggageWrappers",
        "ProcessName": "Data",
        "TaskID": "5B8CE4DB315262EA",
        "ParentEventID": [
          "8EDC32A989E47A79"
        ],
        "Label": "Forking current baggage with Baggage.fork()",
        "Title": "X-Trace Task",
        "Host": "pinky21.mpi-sws.org",
        "HRT": 10813042685167041,
        "Operation": "fork",
        "Timestamp": "1557750372918.892578",
        "TenantClass": 0,
        "Source": "DataXceiver.java:1257",
        "ThreadID": 15724,
        "ThreadName": "",
        "EventID": "D8A00AED811B6C2C",
        "BaggageBytes": "[[248 5] [240 0] [0 91 140 228 219 49 82 98 234] [240 1] [0 142 220 50 169 137 228 122 121] [240 3] [0 2]]",
        "ProcessID": 20775
      },
      {
        "Cycles": 0,
        "Agent": "edu.brown.cs.systems.xtrace.logging.BaggageWrappers",
        "ProcessName": "Read",
        "TaskID": "5B8CE4DB315262EA",
        "ParentEventID": [
          "F6C66005AF7C396F",
          "D8A00AED811B6C2C"
        ],
        "Label": "Merged current baggage with other baggage",
        "Title": "X-Trace Task",
        "Host": "pinky19.mpi-sws.org",
        "HRT": 26966732979249676,
        "Operation": "join",
        "Timestamp": "1557750372919.142090",
        "TenantClass": 0,
        "Source": "RemoteBlockReader2.java:429",
        "ThreadID": 1,
        "ThreadName": "",
        "EventID": "629966A0A3ED9B9E",
        "ProcessID": 2801
      },
      {
        "Cycles": 0,
        "Agent": "edu.brown.cs.systems.xtrace.logging.BaggageWrappers",
        "ProcessName": "Data",
        "TaskID": "5B8CE4DB315262EA",
        "ParentEventID": [
          "D8A00AED811B6C2C"
        ],
        "Label": "Forking current baggage with Baggage.fork()",
        "Title": "X-Trace Task",
        "Host": "pinky21.mpi-sws.org",
        "HRT": 10813042685325141,
        "Operation": "fork",
        "Timestamp": "1557750372919.050537",
        "TenantClass": 0,
        "Source": "PacketHeader.java:95",
        "ThreadID": 15724,
        "ThreadName": "",
        "EventID": "B16534F23CBAA46F",
        "BaggageBytes": "[[248 5] [240 0] [0 91 140 228 219 49 82 98 234] [240 1] [0 216 160 10 237 129 27 108 44] [240 3] [0 2]]",
        "ProcessID": 20775
      },
      {
        "Cycles": 0,
        "Agent": "Execution-Sleep",
        "ProcessName": "Read",
        "TaskID": "5B8CE4DB315262EA",
        "ParentEventID": [
          "629966A0A3ED9B9E"
        ],
        "Label": "waited",
        "Title": "X-Trace Task",
        "Host": "pinky19.mpi-sws.org",
        "Duration": "89497",
        "HRT": 26966732979380710,
        "Operation": "waited",
        "Timestamp": "1557750372919.273193",
        "TenantClass": 0,
        "Source": "SocketIOWithTimeout.java:335",
        "ThreadID": 1,
        "ThreadName": "",
        "EventID": "56EBF5A35637227F",
        "ProcessID": 2801
      },
      {
        "Cycles": 0,
        "Agent": "Execution-Sleep",
        "ProcessName": "Read",
        "TaskID": "5B8CE4DB315262EA",
        "ParentEventID": [
          "56EBF5A35637227F"
        ],
        "Label": "waited",
        "Title": "X-Trace Task",
        "Host": "pinky19.mpi-sws.org",
        "Duration": "338350",
        "HRT": 26966732979787250,
        "Operation": "waited",
        "Timestamp": "1557750372919.679688",
        "TenantClass": 0,
        "Source": "SocketIOWithTimeout.java:335",
        "ThreadID": 1,
        "ThreadName": "",
        "EventID": "9BE4EBC12213E506",
        "ProcessID": 2801
      },
      {
        "Cycles": 0,
        "Agent": "Execution-Sleep",
        "ProcessName": "Data",
        "TaskID": "5B8CE4DB315262EA",
        "ParentEventID": [
          "B16534F23CBAA46F"
        ],
        "Label": "waited",
        "Title": "X-Trace Task",
        "Host": "pinky21.mpi-sws.org",
        "Duration": "10150",
        "HRT": 10813042685491184,
        "Operation": "waited",
        "Timestamp": "1557750372919.216553",
        "TenantClass": 0,
        "Source": "SocketIOWithTimeout.java:335",
        "ThreadID": 15724,
        "ThreadName": "",
        "EventID": "E2BC60D2F7CAC068",
        "BaggageBytes": "[[248 5] [240 0] [0 91 140 228 219 49 82 98 234] [240 1] [0 177 101 52 242 60 186 164 111] [240 3] [0 2]]",
        "ProcessID": 20775
      },
      {
        "Cycles": 0,
        "Agent": "edu.brown.cs.systems.xtrace.logging.BaggageWrappers",
        "ProcessName": "Data",
        "TaskID": "5B8CE4DB315262EA",
        "ParentEventID": [
          "E2BC60D2F7CAC068"
        ],
        "Label": "Forking current baggage with Baggage.fork()",
        "Title": "X-Trace Task",
        "Host": "pinky21.mpi-sws.org",
        "HRT": 10813042685667397,
        "Operation": "fork",
        "Timestamp": "1557750372919.392822",
        "TenantClass": 0,
        "Source": "PacketHeader.java:95",
        "ThreadID": 15724,
        "ThreadName": "",
        "EventID": "EA1388CBCD86A213",
        "BaggageBytes": "[[248 5] [240 0] [0 91 140 228 219 49 82 98 234] [240 1] [0 226 188 96 210 247 202 192 104] [240 3] [0 2]]",
        "ProcessID": 20775
      },
      {
        "Cycles": 0,
        "Agent": "Execution-Sleep",
        "ProcessName": "Read",
        "TaskID": "5B8CE4DB315262EA",
        "ParentEventID": [
          "5A2CB1505D730069"
        ],
        "Label": "waited",
        "Title": "X-Trace Task",
        "Host": "pinky19.mpi-sws.org",
        "Duration": "100716",
        "HRT": 26966732980150285,
        "Operation": "waited",
        "Timestamp": "1557750372920.042725",
        "TenantClass": 0,
        "Source": "SocketIOWithTimeout.java:335",
        "ThreadID": 1,
        "ThreadName": "",
        "EventID": "67E6CA010114507E",
        "ProcessID": 2801
      },
      {
        "Cycles": 0,
        "Agent": "Execution-Sleep",
        "ProcessName": "Read",
        "TaskID": "5B8CE4DB315262EA",
        "ParentEventID": [
          "9BE4EBC12213E506"
        ],
        "Label": "waited",
        "Title": "X-Trace Task",
        "Host": "pinky19.mpi-sws.org",
        "Duration": "174052",
        "HRT": 26966732980004316,
        "Operation": "waited",
        "Timestamp": "1557750372919.896729",
        "TenantClass": 0,
        "Source": "SocketIOWithTimeout.java:335",
        "ThreadID": 1,
        "ThreadName": "",
        "EventID": "5A2CB1505D730069",
        "ProcessID": 2801
      },
      {
        "Cycles": 0,
        "Agent": "edu.brown.cs.systems.xtrace.logging.BaggageWrappers",
        "ProcessName": "Read",
        "TaskID": "5B8CE4DB315262EA",
        "ParentEventID": [
          "67E6CA010114507E",
          "B16534F23CBAA46F"
        ],
        "Label": "Merged current baggage with other baggage",
        "Title": "X-Trace Task",
        "Host": "pinky19.mpi-sws.org",
        "HRT": 26966732980187319,
        "Operation": "join",
        "Timestamp": "1557750372920.079590",
        "TenantClass": 0,
        "Source": "PacketHeader.java:168",
        "ThreadID": 1,
        "ThreadName": "",
        "EventID": "FF1C18BC532F72AE",
        "ProcessID": 2801
      },
      {
        "Cycles": 0,
        "Agent": "Execution-Sleep",
        "ProcessName": "Data",
        "TaskID": "5B8CE4DB315262EA",
        "ParentEventID": [
          "EA1388CBCD86A213"
        ],
        "Label": "waited",
        "Title": "X-Trace Task",
        "Host": "pinky21.mpi-sws.org",
        "Duration": "196397",
        "HRT": 10813042685970608,
        "Operation": "waited",
        "Timestamp": "1557750372919.696045",
        "TenantClass": 0,
        "Source": "SocketIOWithTimeout.java:335",
        "ThreadID": 15724,
        "ThreadName": "",
        "EventID": "E3C8D43D43E94DC8",
        "BaggageBytes": "[[248 5] [240 0] [0 91 140 228 219 49 82 98 234] [240 1] [0 234 19 136 203 205 134 162 19] [240 3] [0 2]]",
        "ProcessID": 20775
      },
      {
        "Cycles": 0,
        "Agent": "edu.brown.cs.systems.xtrace.logging.BaggageWrappers",
        "ProcessName": "Data",
        "TaskID": "5B8CE4DB315262EA",
        "ParentEventID": [
          "E3C8D43D43E94DC8"
        ],
        "Label": "Forking current baggage with Baggage.fork()",
        "Title": "X-Trace Task",
        "Host": "pinky21.mpi-sws.org",
        "HRT": 10813042686150286,
        "Operation": "fork",
        "Timestamp": "1557750372919.875732",
        "TenantClass": 0,
        "Source": "PacketHeader.java:95",
        "ThreadID": 15724,
        "ThreadName": "",
        "EventID": "BAD3DD9BDFA0D49E",
        "BaggageBytes": "[[248 5] [240 0] [0 91 140 228 219 49 82 98 234] [240 1] [0 227 200 212 61 67 233 77 200] [240 3] [0 2]]",
        "ProcessID": 20775
      },
      {
        "Cycles": 0,
        "Agent": "Execution-CPU",
        "ProcessName": "Data",
        "TaskID": "5B8CE4DB315262EA",
        "ParentEventID": [
          "16DACD9D3054A46E"
        ],
        "Label": "unset",
        "Title": "X-Trace Task",
        "Host": "pinky21.mpi-sws.org",
        "Duration": "1681057",
        "HRT": 10813042686624988,
        "Operation": "unset",
        "Timestamp": "1557750372920.350342",
        "TenantClass": 0,
        "Source": "DataXceiver.java:261",
        "ThreadID": 15724,
        "ThreadName": "",
        "EventID": "D2B5FB0E83782A43",
        "BaggageBytes": "[[248 5] [240 0] [0 91 140 228 219 49 82 98 234] [240 1] [0 22 218 205 157 48 84 164 110] [240 3] [0 2]]",
        "ProcessID": 20775
      },
      {
        "Cycles": 0,
        "Agent": "Execution-Sleep",
        "ProcessName": "Data",
        "TaskID": "5B8CE4DB315262EA",
        "ParentEventID": [
          "BAD3DD9BDFA0D49E"
        ],
        "Label": "waited",
        "Title": "X-Trace Task",
        "Host": "pinky21.mpi-sws.org",
        "Duration": "8197",
        "HRT": 10813042686268035,
        "Operation": "waited",
        "Timestamp": "1557750372919.993408",
        "TenantClass": 0,
        "Source": "SocketIOWithTimeout.java:335",
        "ThreadID": 15724,
        "ThreadName": "",
        "EventID": "16DACD9D3054A46E",
        "BaggageBytes": "[[248 5] [240 0] [0 91 140 228 219 49 82 98 234] [240 1] [0 186 211 221 155 223 160 212 158] [240 3] [0 2]]",
        "ProcessID": 20775
      },
      {
        "Cycles": 0,
        "Agent": "edu.brown.cs.systems.retro.benchmarks.hdfs_client.Reader",
        "ProcessName": "Read",
        "TaskID": "5B8CE4DB315262EA",
        "ParentEventID": [
          "A604990F3CBC2B80"
        ],
        "Label": "Reading file",
        "Title": "X-Trace Task",
        "Host": "pinky19.mpi-sws.org",
        "HRT": 26966732975698912,
        "Timestamp": "1557750372915.591309",
        "TenantClass": 0,
        "ThreadID": 1,
        "ThreadName": "",
        "EventID": "76AC0479325913DD",
        "ProcessID": 2801
      }
    ]
  }
]