[
  {
    "id": "33E8B5A400C751CE",
    "reports": [
      {
        "Cycles": 0,
        "Agent": "edu.brown.cs.systems.retro.benchmarks.hdfs_client.Reader",
        "ProcessName": "Read",
        "TaskID": "33E8B5A400C751CE",
        "ParentEventID": [
          "0"
        ],
        "Label": "Reading file",
        "Title": "X-Trace Task",
        "Host": "pinky19.mpi-sws.org",
        "HRT": 26962421081870971,
        "Timestamp": "1557746061022.014160",
        "TenantClass": 0,
        "ThreadID": 1,
        "ThreadName": "",
        "EventID": "A4FB7FDF66C7C5C4",
        "ProcessID": 36430,
        "Tag": [
          "reader_10kb",
          "Read Size: 10240"
        ]
      },
      {
        "Cycles": 0,
        "Agent": "Execution-CPU",
        "ProcessName": "Read",
        "TaskID": "33E8B5A400C751CE",
        "ParentEventID": [
          "76819E8A9E6E2AAB"
        ],
        "Label": "unset",
        "Title": "X-Trace Task",
        "Host": "pinky19.mpi-sws.org",
        "Duration": "22795642",
        "HRT": 26962421082097267,
        "Operation": "unset",
        "Timestamp": "1557746061022.240479",
        "TenantClass": 0,
        "Source": "Client.java:1027",
        "ThreadID": 1,
        "ThreadName": "",
        "EventID": "71A71C9A978EC605",
        "ProcessID": 36430
      },
      {
        "Cycles": 0,
        "Agent": "org.apache.hadoop.ipc.ProtobufRpcEngine",
        "ProcessName": "Read",
        "TaskID": "33E8B5A400C751CE",
        "ParentEventID": [
          "7DD65E3290693458"
        ],
        "Label": "Invoking org.apache.hadoop.hdfs.protocol.ClientProtocol.getBlockLocations",
        "Title": "X-Trace Task",
        "Host": "pinky19.mpi-sws.org",
        "HRT": 26962421082035512,
        "Timestamp": "1557746061022.178711",
        "TenantClass": 0,
        "Source": "ProtobufRpcEngine.java:228",
        "ThreadID": 1,
        "ThreadName": "",
        "EventID": "76819E8A9E6E2AAB",
        "ProcessID": 36430
      },
      {
        "Cycles": 0,
        "Agent": "edu.brown.cs.systems.retro.benchmarks.hdfs_client.Reader",
        "ProcessName": "Read",
        "TaskID": "33E8B5A400C751CE",
        "ParentEventID": [
          "A4FB7FDF66C7C5C4"
        ],
        "Label": "Reading file",
        "Title": "X-Trace Task",
        "Host": "pinky19.mpi-sws.org",
        "HRT": 26962421081907110,
        "Timestamp": "1557746061022.050293",
        "TenantClass": 0,
        "ThreadID": 1,
        "ThreadName": "",
        "EventID": "7DD65E3290693458",
        "ProcessID": 36430
      },
      {
        "Cycles": 0,
        "Agent": "edu.brown.cs.systems.xtrace.logging.BaggageWrappers",
        "ProcessName": "Read",
        "TaskID": "33E8B5A400C751CE",
        "ParentEventID": [
          "76D52BF077DE5978"
        ],
        "Label": "Forking current baggage with Baggage.fork()",
        "Title": "X-Trace Task",
        "Host": "pinky19.mpi-sws.org",
        "HRT": 26962421082224989,
        "Operation": "fork",
        "Timestamp": "1557746061022.368164",
        "TenantClass": 0,
        "Source": "Client.java:1043",
        "ThreadID": 41,
        "ThreadName": "",
        "EventID": "11A139CA699083BF",
        "ProcessID": 36430
      },
      {
        "Cycles": 0,
        "Agent": "Execution-CPU",
        "ProcessName": "Read",
        "TaskID": "33E8B5A400C751CE",
        "ParentEventID": [
          "71A71C9A978EC605"
        ],
        "Label": "set",
        "Title": "X-Trace Task",
        "Host": "pinky19.mpi-sws.org",
        "HRT": 26962421082175270,
        "Operation": "set",
        "Timestamp": "1557746061022.318359",
        "TenantClass": 0,
        "Source": "Client.java:1032",
        "ThreadID": 41,
        "ThreadName": "",
        "EventID": "76D52BF077DE5978",
        "ProcessID": 36430
      },
      {
        "Cycles": 0,
        "Agent": "Execution-CPU",
        "ProcessName": "Read",
        "TaskID": "33E8B5A400C751CE",
        "ParentEventID": [
          "11A139CA699083BF"
        ],
        "Label": "unset",
        "Title": "X-Trace Task",
        "Host": "pinky19.mpi-sws.org",
        "Duration": "135288",
        "HRT": 26962421082353511,
        "Operation": "unset",
        "Timestamp": "1557746061022.496582",
        "TenantClass": 0,
        "Source": "Client.java:1062",
        "ThreadID": 41,
        "ThreadName": "",
        "EventID": "DE9AD4131FA62D1C",
        "ProcessID": 36430
      },
      {
        "Cycles": 0,
        "Agent": "Execution-CPU",
        "ProcessName": "Name",
        "TaskID": "33E8B5A400C751CE",
        "ParentEventID": [
          "11A139CA699083BF"
        ],
        "Label": "set",
        "Title": "X-Trace Task",
        "Host": "pinky19.mpi-sws.org",
        "HRT": 26962421082419680,
        "Operation": "set",
        "Timestamp": "1557746061022.568604",
        "TenantClass": 0,
        "Source": "Server.java:1840",
        "ThreadID": 48,
        "ThreadName": "",
        "EventID": "56A009608E75BAEF",
        "BaggageBytes": "[[248 5] [240 0] [0 51 232 181 164 0 199 81 206] [240 1] [0 17 161 57 202 105 144 131 191] [240 3] [0 2]]",
        "ProcessID": 2171
      },
      {
        "Cycles": 0,
        "Agent": "edu.brown.cs.systems.xtrace.logging.BaggageWrappers",
        "ProcessName": "Name",
        "TaskID": "33E8B5A400C751CE",
        "ParentEventID": [
          "56A009608E75BAEF"
        ],
        "Label": "Forking current baggage with Baggage.fork()",
        "Title": "X-Trace Task",
        "Host": "pinky19.mpi-sws.org",
        "HRT": 26962421082449506,
        "Operation": "fork",
        "Timestamp": "1557746061022.598389",
        "TenantClass": 0,
        "Source": "Server.java:550",
        "ThreadID": 48,
        "ThreadName": "",
        "EventID": "23BA99FC79136692",
        "BaggageBytes": "[[248 5] [240 0] [0 51 232 181 164 0 199 81 206] [240 1] [0 86 160 9 96 142 117 186 239] [240 3] [0 2]]",
        "ProcessID": 2171
      },
      {
        "Cycles": 0,
        "Agent": "Execution-CPU",
        "ProcessName": "Name",
        "TaskID": "33E8B5A400C751CE",
        "ParentEventID": [
          "23BA99FC79136692"
        ],
        "Label": "unset",
        "Title": "X-Trace Task",
        "Host": "pinky19.mpi-sws.org",
        "Duration": "24085",
        "HRT": 26962421082469635,
        "Operation": "unset",
        "Timestamp": "1557746061022.618652",
        "TenantClass": 0,
        "Source": "Server.java:1828",
        "ThreadID": 48,
        "ThreadName": "",
        "EventID": "6E96774DA380113C",
        "BaggageBytes": "[[248 5] [240 0] [0 51 232 181 164 0 199 81 206] [240 1] [0 35 186 153 252 121 19 102 146] [240 3] [0 2]]",
        "ProcessID": 2171
      },
      {
        "Cycles": 0,
        "Agent": "Execution-CPU",
        "ProcessName": "Read",
        "TaskID": "33E8B5A400C751CE",
        "ParentEventID": [
          "DE9AD4131FA62D1C"
        ],
        "Label": "set",
        "Title": "X-Trace Task",
        "Host": "pinky19.mpi-sws.org",
        "HRT": 26962421082412471,
        "Operation": "set",
        "Timestamp": "1557746061022.555664",
        "TenantClass": 0,
        "Source": "Client.java:1104",
        "ThreadID": 1,
        "ThreadName": "",
        "EventID": "B28AF7EA96281103",
        "ProcessID": 36430
      },
      {
        "Cycles": 0,
        "Agent": "org.apache.hadoop.ipc.Server",
        "ProcessName": "Name",
        "TaskID": "33E8B5A400C751CE",
        "ParentEventID": [
          "706B58C935F608B4"
        ],
        "Label": "getBlockLocations in org.apache.hadoop.hdfs.protocol.ClientProtocol",
        "Title": "X-Trace Task",
        "Host": "pinky19.mpi-sws.org",
        "HRT": 26962421082539357,
        "Timestamp": "1557746061022.688232",
        "TenantClass": 0,
        "Source": "ProtobufRpcEngine.java:601",
        "ThreadID": 60,
        "ThreadName": "",
        "EventID": "CC4B5C3775C1AEAA",
        "BaggageBytes": "[[248 5] [240 0] [0 51 232 181 164 0 199 81 206] [240 1] [0 112 107 88 201 53 246 8 180] [240 3] [0 2]]",
        "ProcessID": 2171
      },
      {
        "Cycles": 0,
        "Agent": "org.apache.hadoop.hdfs.server.namenode.FSNamesystem.audit",
        "ProcessName": "Name",
        "TaskID": "33E8B5A400C751CE",
        "ParentEventID": [
          "CC4B5C3775C1AEAA"
        ],
        "Label": "allowed=true\tugi=plascas (auth:SIMPLE)\tip=/139.19.171.63\tcmd=open\tsrc=/ds/eVOrjY4Ft76EaCN1\tdst=null\tperm=null\tproto=rpc",
        "Title": "X-Trace Task",
        "Host": "pinky19.mpi-sws.org",
        "HRT": 26962421082592472,
        "Timestamp": "1557746061022.741455",
        "TenantClass": 0,
        "Source": "FSNamesystem.java:8313",
        "ThreadID": 60,
        "ThreadName": "",
        "EventID": "D3B197F714481A91",
        "BaggageBytes": "[[248 5] [240 0] [0 51 232 181 164 0 199 81 206] [240 1] [0 204 75 92 55 117 193 174 170] [240 3] [0 2]]",
        "ProcessID": 2171
      },
      {
        "Cycles": 0,
        "Agent": "edu.brown.cs.systems.xtrace.logging.BaggageWrappers",
        "ProcessName": "Name",
        "TaskID": "33E8B5A400C751CE",
        "ParentEventID": [
          "D3B197F714481A91"
        ],
        "Label": "Forking current baggage with Baggage.fork()",
        "Title": "X-Trace Task",
        "Host": "pinky19.mpi-sws.org",
        "HRT": 26962421082649247,
        "Operation": "fork",
        "Timestamp": "1557746061022.798340",
        "TenantClass": 0,
        "Source": "Server.java:2398",
        "ThreadID": 60,
        "ThreadName": "",
        "EventID": "DC6E4A6F541E1626",
        "BaggageBytes": "[[248 5] [240 0] [0 51 232 181 164 0 199 81 206] [240 1] [0 211 177 151 247 20 72 26 145] [240 3] [0 2]]",
        "ProcessID": 2171
      },
      {
        "Cycles": 0,
        "Agent": "Execution-CPU",
        "ProcessName": "Name",
        "TaskID": "33E8B5A400C751CE",
        "ParentEventID": [
          "23BA99FC79136692"
        ],
        "Label": "set",
        "Title": "X-Trace Task",
        "Host": "pinky19.mpi-sws.org",
        "HRT": 26962421082497043,
        "Operation": "set",
        "Timestamp": "1557746061022.645996",
        "TenantClass": 0,
        "Source": "Server.java:2071",
        "ThreadID": 60,
        "ThreadName": "",
        "EventID": "706B58C935F608B4",
        "BaggageBytes": "[[248 5] [240 0] [0 51 232 181 164 0 199 81 206] [240 1] [0 35 186 153 252 121 19 102 146] [240 3] [0 2]]",
        "ProcessID": 2171
      },
      {
        "Cycles": 0,
        "Agent": "Execution-CPU",
        "ProcessName": "Name",
        "TaskID": "33E8B5A400C751CE",
        "ParentEventID": [
          "DC6E4A6F541E1626"
        ],
        "Label": "unset",
        "Title": "X-Trace Task",
        "Host": "pinky19.mpi-sws.org",
        "Duration": "229003",
        "HRT": 26962421082757666,
        "Operation": "unset",
        "Timestamp": "1557746061022.906738",
        "TenantClass": 0,
        "Source": "Server.java:1058",
        "ThreadID": 60,
        "ThreadName": "",
        "EventID": "0A7D1339433F0CF7",
        "BaggageBytes": "[[248 5] [240 0] [0 51 232 181 164 0 199 81 206] [240 1] [0 220 110 74 111 84 30 22 38] [240 3] [0 2]]",
        "ProcessID": 2171
      },
      {
        "Cycles": 0,
        "Agent": "Execution-CPU",
        "ProcessName": "Read",
        "TaskID": "33E8B5A400C751CE",
        "ParentEventID": [
          "DC6E4A6F541E1626"
        ],
        "Label": "set",
        "Title": "X-Trace Task",
        "Host": "pinky19.mpi-sws.org",
        "HRT": 26962421082855869,
        "Operation": "set",
        "Timestamp": "1557746061022.999023",
        "TenantClass": 0,
        "Source": "Client.java:302",
        "ThreadID": 37,
        "ThreadName": "",
        "EventID": "44A8E19A06461DD2",
        "ProcessID": 36430
      },
      {
        "Cycles": 0,
        "Agent": "Execution-CPU",
        "ProcessName": "Read",
        "TaskID": "33E8B5A400C751CE",
        "ParentEventID": [
          "44A8E19A06461DD2"
        ],
        "Label": "unset",
        "Title": "X-Trace Task",
        "Host": "pinky19.mpi-sws.org",
        "Duration": "24559",
        "HRT": 26962421082906598,
        "Operation": "unset",
        "Timestamp": "1557746061023.049805",
        "TenantClass": 0,
        "Source": "Client.java:1168",
        "ThreadID": 37,
        "ThreadName": "",
        "EventID": "B06EE0F7080EA4E7",
        "ProcessID": 36430
      },
      {
        "Cycles": 0,
        "Agent": "edu.brown.cs.systems.xtrace.logging.BaggageWrappers",
        "ProcessName": "Read",
        "TaskID": "33E8B5A400C751CE",
        "ParentEventID": [
          "F51D407B50EE1FCC",
          "B06EE0F7080EA4E7"
        ],
        "Label": "Merged current baggage with other baggage",
        "Title": "X-Trace Task",
        "Host": "pinky19.mpi-sws.org",
        "HRT": 26962421082985094,
        "Operation": "join",
        "Timestamp": "1557746061023.128174",
        "TenantClass": 0,
        "Source": "Client.java:1545",
        "ThreadID": 1,
        "ThreadName": "",
        "EventID": "963DEA9270A6C35D",
        "ProcessID": 36430
      },
      {
        "Cycles": 0,
        "Agent": "Execution-Sleep",
        "ProcessName": "Read",
        "TaskID": "33E8B5A400C751CE",
        "ParentEventID": [
          "B28AF7EA96281103"
        ],
        "Label": "waited",
        "Title": "X-Trace Task",
        "Host": "pinky19.mpi-sws.org",
        "Duration": "498859",
        "HRT": 26962421082944534,
        "Operation": "waited",
        "Timestamp": "1557746061023.087646",
        "TenantClass": 0,
        "Source": "Client.java:1537",
        "ThreadID": 1,
        "ThreadName": "",
        "EventID": "F51D407B50EE1FCC",
        "ProcessID": 36430
      },
      {
        "Cycles": 0,
        "Agent": "org.apache.hadoop.ipc.ProtobufRpcEngine",
        "ProcessName": "Read",
        "TaskID": "33E8B5A400C751CE",
        "ParentEventID": [
          "963DEA9270A6C35D"
        ],
        "Label": "org.apache.hadoop.hdfs.protocol.ClientProtocol.getBlockLocations completed",
        "Title": "X-Trace Task",
        "Host": "pinky19.mpi-sws.org",
        "HRT": 26962421083081769,
        "Timestamp": "1557746061023.224854",
        "TenantClass": 0,
        "Source": "ProtobufRpcEngine.java:275",
        "ThreadID": 1,
        "ThreadName": "",
        "EventID": "07C477F5ECD7480F",
        "ProcessID": 36430
      },
      {
        "Cycles": 0,
        "Agent": "edu.brown.cs.systems.xtrace.logging.XTraceInit",
        "ProcessName": "Data",
        "TaskID": "33E8B5A400C751CE",
        "ParentEventID": [
          "8A192A908D383FF5"
        ],
        "Label": "Thread.setName: DataXceiver for client DFSClient_NONMAPREDUCE_778905418_1 at /139.19.171.63:39908 [Sending block BP-1633380353-139.19.171.63-1554193446451:blk_1073762259_21435]",
        "Title": "X-Trace Task",
        "Host": "pinky20.mpi-sws.org",
        "HRT": 6565625442547084,
        "Timestamp": "1557746061023.736084",
        "TenantClass": 0,
        "Source": "DataXceiver.java:168",
        "ThreadID": 14317,
        "ThreadName": "",
        "EventID": "F0EE837A52360666",
        "BaggageBytes": "[[248 5] [240 0] [0 51 232 181 164 0 199 81 206] [240 1] [0 138 25 42 144 141 56 63 245] [240 3] [0 2]]",
        "ProcessID": 13111
      },
      {
        "Cycles": 0,
        "Agent": "edu.brown.cs.systems.xtrace.logging.BaggageWrappers",
        "ProcessName": "Data",
        "TaskID": "33E8B5A400C751CE",
        "ParentEventID": [
          "F0EE837A52360666"
        ],
        "Label": "Forking current baggage with Baggage.fork()",
        "Title": "X-Trace Task",
        "Host": "pinky20.mpi-sws.org",
        "HRT": 6565625442643278,
        "Operation": "fork",
        "Timestamp": "1557746061023.832275",
        "TenantClass": 0,
        "Source": "DataXceiver.java:1257",
        "ThreadID": 14317,
        "ThreadName": "",
        "EventID": "3ACD46D9654ECB08",
        "BaggageBytes": "[[248 5] [240 0] [0 51 232 181 164 0 199 81 206] [240 1] [0 240 238 131 122 82 54 6 102] [240 3] [0 2]]",
        "ProcessID": 13111
      },
      {
        "Cycles": 0,
        "Agent": "Execution-CPU",
        "ProcessName": "Data",
        "TaskID": "33E8B5A400C751CE",
        "ParentEventID": [
          "9F4F8313DDB1C6B9"
        ],
        "Label": "set",
        "Title": "X-Trace Task",
        "Host": "pinky20.mpi-sws.org",
        "HRT": 6565625442491966,
        "Operation": "set",
        "Timestamp": "1557746061023.681152",
        "TenantClass": 0,
        "Source": "Receiver.java:117",
        "ThreadID": 14317,
        "ThreadName": "",
        "EventID": "8A192A908D383FF5",
        "BaggageBytes": "[[248 5] [240 0] [0 51 232 181 164 0 199 81 206] [240 1] [0 159 79 131 19 221 177 198 185] [240 3] [0 2]]",
        "ProcessID": 13111
      },
      {
        "Cycles": 0,
        "Agent": "edu.brown.cs.systems.xtrace.logging.BaggageWrappers",
        "ProcessName": "Data",
        "TaskID": "33E8B5A400C751CE",
        "ParentEventID": [
          "3ACD46D9654ECB08"
        ],
        "Label": "Forking current baggage with Baggage.fork()",
        "Title": "X-Trace Task",
        "Host": "pinky20.mpi-sws.org",
        "HRT": 6565625442724363,
        "Operation": "fork",
        "Timestamp": "1557746061023.913574",
        "TenantClass": 0,
        "Source": "PacketHeader.java:95",
        "ThreadID": 14317,
        "ThreadName": "",
        "EventID": "E02D64530E011D5A",
        "BaggageBytes": "[[248 5] [240 0] [0 51 232 181 164 0 199 81 206] [240 1] [0 58 205 70 217 101 78 203 8] [240 3] [0 2]]",
        "ProcessID": 13111
      },
      {
        "Cycles": 0,
        "Agent": "Execution-Sleep",
        "ProcessName": "Data",
        "TaskID": "33E8B5A400C751CE",
        "ParentEventID": [
          "E02D64530E011D5A"
        ],
        "Label": "waited",
        "Title": "X-Trace Task",
        "Host": "pinky20.mpi-sws.org",
        "Duration": "13931",
        "HRT": 6565625442821745,
        "Operation": "waited",
        "Timestamp": "1557746061024.010742",
        "TenantClass": 0,
        "Source": "SocketIOWithTimeout.java:335",
        "ThreadID": 14317,
        "ThreadName": "",
        "EventID": "74E1856D3CCAFE79",
        "BaggageBytes": "[[248 5] [240 0] [0 51 232 181 164 0 199 81 206] [240 1] [0 224 45 100 83 14 1 29 90] [240 3] [0 2]]",
        "ProcessID": 13111
      },
      {
        "Cycles": 0,
        "Agent": "edu.brown.cs.systems.xtrace.logging.BaggageWrappers",
        "ProcessName": "Read",
        "TaskID": "33E8B5A400C751CE",
        "ParentEventID": [
          "07C477F5ECD7480F"
        ],
        "Label": "Forking current baggage with Baggage.fork()",
        "Title": "X-Trace Task",
        "Host": "pinky19.mpi-sws.org",
        "HRT": 26962421083284128,
        "Operation": "fork",
        "Timestamp": "1557746061023.427246",
        "TenantClass": 0,
        "Source": "DataTransferProtoUtil.java:94",
        "ThreadID": 1,
        "ThreadName": "",
        "EventID": "9F4F8313DDB1C6B9",
        "ProcessID": 36430
      },
      {
        "Cycles": 0,
        "Agent": "edu.brown.cs.systems.xtrace.logging.BaggageWrappers",
        "ProcessName": "Read",
        "TaskID": "33E8B5A400C751CE",
        "ParentEventID": [
          "75A1CFC46F985B9A",
          "3ACD46D9654ECB08"
        ],
        "Label": "Merged current baggage with other baggage",
        "Title": "X-Trace Task",
        "Host": "pinky19.mpi-sws.org",
        "HRT": 26962421083943107,
        "Operation": "join",
        "Timestamp": "1557746061024.086182",
        "TenantClass": 0,
        "Source": "RemoteBlockReader2.java:429",
        "ThreadID": 1,
        "ThreadName": "",
        "EventID": "612CDBE50715FD70",
        "ProcessID": 36430
      },
      {
        "Cycles": 0,
        "Agent": "Execution-Sleep",
        "ProcessName": "Read",
        "TaskID": "33E8B5A400C751CE",
        "ParentEventID": [
          "9F4F8313DDB1C6B9"
        ],
        "Label": "waited",
        "Title": "X-Trace Task",
        "Host": "pinky19.mpi-sws.org",
        "Duration": "347283",
        "HRT": 26962421083777117,
        "Operation": "waited",
        "Timestamp": "1557746061023.920166",
        "TenantClass": 0,
        "Source": "SocketIOWithTimeout.java:335",
        "ThreadID": 1,
        "ThreadName": "",
        "EventID": "75A1CFC46F985B9A",
        "ProcessID": 36430
      },
      {
        "Cycles": 0,
        "Agent": "edu.brown.cs.systems.xtrace.logging.BaggageWrappers",
        "ProcessName": "Read",
        "TaskID": "33E8B5A400C751CE",
        "ParentEventID": [
          "612CDBE50715FD70",
          "E02D64530E011D5A"
        ],
        "Label": "Merged current baggage with other baggage",
        "Title": "X-Trace Task",
        "Host": "pinky19.mpi-sws.org",
        "HRT": 26962421084105464,
        "Operation": "join",
        "Timestamp": "1557746061024.248535",
        "TenantClass": 0,
        "Source": "PacketHeader.java:168",
        "ThreadID": 1,
        "ThreadName": "",
        "EventID": "9DB8148FB411ACCD",
        "ProcessID": 36430
      },
      {
        "Cycles": 0,
        "Agent": "edu.brown.cs.systems.xtrace.logging.BaggageWrappers",
        "ProcessName": "Read",
        "TaskID": "33E8B5A400C751CE",
        "ParentEventID": [
          "5516050D37C26022"
        ],
        "Label": "Forking current baggage with Baggage.fork()",
        "Title": "X-Trace Task",
        "Host": "pinky19.mpi-sws.org",
        "HRT": 26962421084265659,
        "Operation": "fork",
        "Timestamp": "1557746061024.408936",
        "TenantClass": 0,
        "Source": "RemoteBlockReader2.java:361",
        "ThreadID": 1,
        "ThreadName": "",
        "EventID": "4735AFA6566EEB09",
        "ProcessID": 36430
      },
      {
        "Cycles": 0,
        "Agent": "Execution-Sleep",
        "ProcessName": "Data",
        "TaskID": "33E8B5A400C751CE",
        "ParentEventID": [
          "1596E055D0E3AD03"
        ],
        "Label": "waited",
        "Title": "X-Trace Task",
        "Host": "pinky20.mpi-sws.org",
        "Duration": "342555",
        "HRT": 6565625443356983,
        "Operation": "waited",
        "Timestamp": "1557746061024.546143",
        "TenantClass": 0,
        "Source": "SocketIOWithTimeout.java:335",
        "ThreadID": 14317,
        "ThreadName": "",
        "EventID": "4E1A632F03D33953",
        "BaggageBytes": "[[248 5] [240 0] [0 51 232 181 164 0 199 81 206] [240 1] [0 21 150 224 85 208 227 173 3] [240 3] [0 2]]",
        "ProcessID": 13111
      },
      {
        "Cycles": 0,
        "Agent": "edu.brown.cs.systems.xtrace.logging.BaggageWrappers",
        "ProcessName": "Data",
        "TaskID": "33E8B5A400C751CE",
        "ParentEventID": [
          "4735AFA6566EEB09",
          "4E1A632F03D33953"
        ],
        "Label": "Merged current baggage with other baggage",
        "Title": "X-Trace Task",
        "Host": "pinky20.mpi-sws.org",
        "HRT": 6565625443487702,
        "Operation": "join",
        "Timestamp": "1557746061024.676758",
        "TenantClass": 0,
        "Source": "DataXceiver.java:574",
        "ThreadID": 14317,
        "ThreadName": "",
        "EventID": "C5648992EAB49697",
        "BaggageBytes": "[[248 5] [240 0] [0 51 232 181 164 0 199 81 206] [240 1] [0 71 53 175 166 86 110 235 9] [0 78 26 99 47 3 211 57 83] [240 3] [0 2]]",
        "ProcessID": 13111
      },
      {
        "Cycles": 0,
        "Agent": "Execution-CPU",
        "ProcessName": "Data",
        "TaskID": "33E8B5A400C751CE",
        "ParentEventID": [
          "C5648992EAB49697"
        ],
        "Label": "unset",
        "Title": "X-Trace Task",
        "Host": "pinky20.mpi-sws.org",
        "Duration": "989729",
        "HRT": 6565625443521161,
        "Operation": "unset",
        "Timestamp": "1557746061024.710205",
        "TenantClass": 0,
        "Source": "DataXceiver.java:261",
        "ThreadID": 14317,
        "ThreadName": "",
        "EventID": "1126EA25BA25848F",
        "BaggageBytes": "[[248 5] [240 0] [0 51 232 181 164 0 199 81 206] [240 1] [0 197 100 137 146 234 180 150 151] [240 3] [0 2]]",
        "ProcessID": 13111
      },
      {
        "Cycles": 0,
        "Agent": "edu.brown.cs.systems.xtrace.logging.BaggageWrappers",
        "ProcessName": "Data",
        "TaskID": "33E8B5A400C751CE",
        "ParentEventID": [
          "74E1856D3CCAFE79"
        ],
        "Label": "Forking current baggage with Baggage.fork()",
        "Title": "X-Trace Task",
        "Host": "pinky20.mpi-sws.org",
        "HRT": 6565625442910088,
        "Operation": "fork",
        "Timestamp": "1557746061024.099121",
        "TenantClass": 0,
        "Source": "PacketHeader.java:95",
        "ThreadID": 14317,
        "ThreadName": "",
        "EventID": "1596E055D0E3AD03",
        "BaggageBytes": "[[248 5] [240 0] [0 51 232 181 164 0 199 81 206] [240 1] [0 116 225 133 109 60 202 254 121] [240 3] [0 2]]",
        "ProcessID": 13111
      },
      {
        "Cycles": 0,
        "Agent": "edu.brown.cs.systems.xtrace.logging.BaggageWrappers",
        "ProcessName": "Read",
        "TaskID": "33E8B5A400C751CE",
        "ParentEventID": [
          "9DB8148FB411ACCD",
          "1596E055D0E3AD03"
        ],
        "Label": "Merged current baggage with other baggage",
        "Title": "X-Trace Task",
        "Host": "pinky19.mpi-sws.org",
        "HRT": 26962421084236196,
        "Operation": "join",
        "Timestamp": "1557746061024.379395",
        "TenantClass": 0,
        "Source": "PacketHeader.java:168",
        "ThreadID": 1,
        "ThreadName": "",
        "EventID": "5516050D37C26022",
        "ProcessID": 36430
      }
    ]
  }
]