[
  {
    "id": "3D647D8A70C3E8C2",
    "reports": [
      {
        "Cycles": 0,
        "Agent": "Execution-CPU",
        "ProcessName": "Read",
        "TaskID": "3D647D8A70C3E8C2",
        "ParentEventID": [
          "67D71B1FAFEB8C7A"
        ],
        "Label": "unset",
        "Title": "X-Trace Task",
        "Host": "pinky19.mpi-sws.org",
        "Duration": "25244032",
        "HRT": 26966786684538584,
        "Operation": "unset",
        "Timestamp": "1557750426624.690430",
        "TenantClass": 0,
        "Source": "Client.java:1027",
        "ThreadID": 1,
        "ThreadName": "",
        "EventID": "AEE2DDDE6DB95362",
        "ProcessID": 2801
      },
      {
        "Cycles": 0,
        "Agent": "org.apache.hadoop.ipc.ProtobufRpcEngine",
        "ProcessName": "Read",
        "TaskID": "3D647D8A70C3E8C2",
        "ParentEventID": [
          "AF1088837989B700"
        ],
        "Label": "Invoking org.apache.hadoop.hdfs.protocol.ClientProtocol.getBlockLocations",
        "Title": "X-Trace Task",
        "Host": "pinky19.mpi-sws.org",
        "HRT": 26966786684524451,
        "Timestamp": "1557750426624.676270",
        "TenantClass": 0,
        "Source": "ProtobufRpcEngine.java:228",
        "ThreadID": 1,
        "ThreadName": "",
        "EventID": "67D71B1FAFEB8C7A",
        "ProcessID": 2801
      },
      {
        "Cycles": 0,
        "Agent": "Execution-CPU",
        "ProcessName": "Read",
        "TaskID": "3D647D8A70C3E8C2",
        "ParentEventID": [
          "AEE2DDDE6DB95362"
        ],
        "Label": "set",
        "Title": "X-Trace Task",
        "Host": "pinky19.mpi-sws.org",
        "HRT": 26966786684584457,
        "Operation": "set",
        "Timestamp": "1557750426624.736084",
        "TenantClass": 0,
        "Source": "Client.java:1032",
        "ThreadID": 41,
        "ThreadName": "",
        "EventID": "3A3886AA41D58645",
        "ProcessID": 2801
      },
      {
        "Cycles": 0,
        "Agent": "edu.brown.cs.systems.retro.benchmarks.hdfs_client.Reader",
        "ProcessName": "Read",
        "TaskID": "3D647D8A70C3E8C2",
        "ParentEventID": [
          "A815193A8555BE9B"
        ],
        "Label": "Reading file",
        "Title": "X-Trace Task",
        "Host": "pinky19.mpi-sws.org",
        "HRT": 26966786684499547,
        "Timestamp": "1557750426624.651367",
        "TenantClass": 0,
        "ThreadID": 1,
        "ThreadName": "",
        "EventID": "AF1088837989B700",
        "ProcessID": 2801
      },
      {
        "Cycles": 0,
        "Agent": "edu.brown.cs.systems.xtrace.logging.BaggageWrappers",
        "ProcessName": "Read",
        "TaskID": "3D647D8A70C3E8C2",
        "ParentEventID": [
          "3A3886AA41D58645"
        ],
        "Label": "Forking current baggage with Baggage.fork()",
        "Title": "X-Trace Task",
        "Host": "pinky19.mpi-sws.org",
        "HRT": 26966786684603300,
        "Operation": "fork",
        "Timestamp": "1557750426624.755127",
        "TenantClass": 0,
        "Source": "Client.java:1043",
        "ThreadID": 41,
        "ThreadName": "",
        "EventID": "626CE339DBB62373",
        "ProcessID": 2801
      },
      {
        "Cycles": 0,
        "Agent": "Execution-CPU",
        "ProcessName": "Read",
        "TaskID": "3D647D8A70C3E8C2",
        "ParentEventID": [
          "626CE339DBB62373"
        ],
        "Label": "unset",
        "Title": "X-Trace Task",
        "Host": "pinky19.mpi-sws.org",
        "Duration": "64822",
        "HRT": 26966786684667406,
        "Operation": "unset",
        "Timestamp": "1557750426624.819092",
        "TenantClass": 0,
        "Source": "Client.java:1062",
        "ThreadID": 41,
        "ThreadName": "",
        "EventID": "DBEDD27425AB44B6",
        "ProcessID": 2801
      },
      {
        "Cycles": 0,
        "Agent": "Execution-CPU",
        "ProcessName": "Read",
        "TaskID": "3D647D8A70C3E8C2",
        "ParentEventID": [
          "DBEDD27425AB44B6"
        ],
        "Label": "set",
        "Title": "X-Trace Task",
        "Host": "pinky19.mpi-sws.org",
        "HRT": 26966786684690045,
        "Operation": "set",
        "Timestamp": "1557750426624.841797",
        "TenantClass": 0,
        "Source": "Client.java:1104",
        "ThreadID": 1,
        "ThreadName": "",
        "EventID": "5BCAB101DDAC9582",
        "ProcessID": 2801
      },
      {
        "Cycles": 0,
        "Agent": "edu.brown.cs.systems.xtrace.logging.BaggageWrappers",
        "ProcessName": "Name",
        "TaskID": "3D647D8A70C3E8C2",
        "ParentEventID": [
          "63541C8907D6393D"
        ],
        "Label": "Forking current baggage with Baggage.fork()",
        "Title": "X-Trace Task",
        "Host": "pinky19.mpi-sws.org",
        "HRT": 26966786684734200,
        "Operation": "fork",
        "Timestamp": "1557750426624.907715",
        "TenantClass": 0,
        "Source": "Server.java:550",
        "ThreadID": 48,
        "ThreadName": "",
        "EventID": "084D41395DE94AD8",
        "BaggageBytes": "[[248 5] [240 0] [0 61 100 125 138 112 195 232 194] [240 1] [0 99 84 28 137 7 214 57 61] [240 3] [0 2]]",
        "ProcessID": 2171
      },
      {
        "Cycles": 0,
        "Agent": "Execution-CPU",
        "ProcessName": "Name",
        "TaskID": "3D647D8A70C3E8C2",
        "ParentEventID": [
          "626CE339DBB62373"
        ],
        "Label": "set",
        "Title": "X-Trace Task",
        "Host": "pinky19.mpi-sws.org",
        "HRT": 26966786684710266,
        "Operation": "set",
        "Timestamp": "1557750426624.883789",
        "TenantClass": 0,
        "Source": "Server.java:1840",
        "ThreadID": 48,
        "ThreadName": "",
        "EventID": "63541C8907D6393D",
        "BaggageBytes": "[[248 5] [240 0] [0 61 100 125 138 112 195 232 194] [240 1] [0 98 108 227 57 219 182 35 115] [240 3] [0 2]]",
        "ProcessID": 2171
      },
      {
        "Cycles": 0,
        "Agent": "Execution-CPU",
        "ProcessName": "Name",
        "TaskID": "3D647D8A70C3E8C2",
        "ParentEventID": [
          "084D41395DE94AD8"
        ],
        "Label": "unset",
        "Title": "X-Trace Task",
        "Host": "pinky19.mpi-sws.org",
        "Duration": "22408",
        "HRT": 26966786684752884,
        "Operation": "unset",
        "Timestamp": "1557750426624.926270",
        "TenantClass": 0,
        "Source": "Server.java:1828",
        "ThreadID": 48,
        "ThreadName": "",
        "EventID": "74297FEA79935941",
        "BaggageBytes": "[[248 5] [240 0] [0 61 100 125 138 112 195 232 194] [240 1] [0 8 77 65 57 93 233 74 216] [240 3] [0 2]]",
        "ProcessID": 2171
      },
      {
        "Cycles": 0,
        "Agent": "Execution-CPU",
        "ProcessName": "Name",
        "TaskID": "3D647D8A70C3E8C2",
        "ParentEventID": [
          "084D41395DE94AD8"
        ],
        "Label": "set",
        "Title": "X-Trace Task",
        "Host": "pinky19.mpi-sws.org",
        "HRT": 26966786684763109,
        "Operation": "set",
        "Timestamp": "1557750426624.936523",
        "TenantClass": 0,
        "Source": "Server.java:2071",
        "ThreadID": 63,
        "ThreadName": "",
        "EventID": "A80BACF983B8EB9B",
        "BaggageBytes": "[[248 5] [240 0] [0 61 100 125 138 112 195 232 194] [240 1] [0 8 77 65 57 93 233 74 216] [240 3] [0 2]]",
        "ProcessID": 2171
      },
      {
        "Cycles": 0,
        "Agent": "org.apache.hadoop.ipc.Server",
        "ProcessName": "Name",
        "TaskID": "3D647D8A70C3E8C2",
        "ParentEventID": [
          "A80BACF983B8EB9B"
        ],
        "Label": "getBlockLocations in org.apache.hadoop.hdfs.protocol.ClientProtocol",
        "Title": "X-Trace Task",
        "Host": "pinky19.mpi-sws.org",
        "HRT": 26966786684796910,
        "Timestamp": "1557750426624.970459",
        "TenantClass": 0,
        "Source": "ProtobufRpcEngine.java:601",
        "ThreadID": 63,
        "ThreadName": "",
        "EventID": "33C117F648047986",
        "BaggageBytes": "[[248 5] [240 0] [0 61 100 125 138 112 195 232 194] [240 1] [0 168 11 172 249 131 184 235 155] [240 3] [0 2]]",
        "ProcessID": 2171
      },
      {
        "Cycles": 0,
        "Agent": "org.apache.hadoop.hdfs.server.namenode.FSNamesystem.audit",
        "ProcessName": "Name",
        "TaskID": "3D647D8A70C3E8C2",
        "ParentEventID": [
          "33C117F648047986"
        ],
        "Label": "allowed=true\tugi=plascas (auth:SIMPLE)\tip=/139.19.171.63\tcmd=open\tsrc=/ds/HECeC8og5rcjMyLq\tdst=null\tperm=null\tproto=rpc",
        "Title": "X-Trace Task",
        "Host": "pinky19.mpi-sws.org",
        "HRT": 26966786684844154,
        "Timestamp": "1557750426625.017578",
        "TenantClass": 0,
        "Source": "FSNamesystem.java:8313",
        "ThreadID": 63,
        "ThreadName": "",
        "EventID": "7F20BF4DA1B49D5D",
        "BaggageBytes": "[[248 5] [240 0] [0 61 100 125 138 112 195 232 194] [240 1] [0 51 193 23 246 72 4 121 134] [240 3] [0 2]]",
        "ProcessID": 2171
      },
      {
        "Cycles": 0,
        "Agent": "edu.brown.cs.systems.xtrace.logging.BaggageWrappers",
        "ProcessName": "Name",
        "TaskID": "3D647D8A70C3E8C2",
        "ParentEventID": [
          "7F20BF4DA1B49D5D"
        ],
        "Label": "Forking current baggage with Baggage.fork()",
        "Title": "X-Trace Task",
        "Host": "pinky19.mpi-sws.org",
        "HRT": 26966786684888882,
        "Operation": "fork",
        "Timestamp": "1557750426625.062256",
        "TenantClass": 0,
        "Source": "Server.java:2398",
        "ThreadID": 63,
        "ThreadName": "",
        "EventID": "3898D2220CF0C99F",
        "BaggageBytes": "[[248 5] [240 0] [0 61 100 125 138 112 195 232 194] [240 1] [0 127 32 191 77 161 180 157 93] [240 3] [0 2]]",
        "ProcessID": 2171
      },
      {
        "Cycles": 0,
        "Agent": "Execution-CPU",
        "ProcessName": "Name",
        "TaskID": "3D647D8A70C3E8C2",
        "ParentEventID": [
          "3898D2220CF0C99F"
        ],
        "Label": "unset",
        "Title": "X-Trace Task",
        "Host": "pinky19.mpi-sws.org",
        "Duration": "207382",
        "HRT": 26966786684992916,
        "Operation": "unset",
        "Timestamp": "1557750426625.166504",
        "TenantClass": 0,
        "Source": "Server.java:1058",
        "ThreadID": 63,
        "ThreadName": "",
        "EventID": "0D26E1098F4A3471",
        "BaggageBytes": "[[248 5] [240 0] [0 61 100 125 138 112 195 232 194] [240 1] [0 56 152 210 34 12 240 201 159] [240 3] [0 2]]",
        "ProcessID": 2171
      },
      {
        "Cycles": 0,
        "Agent": "Execution-CPU",
        "ProcessName": "Read",
        "TaskID": "3D647D8A70C3E8C2",
        "ParentEventID": [
          "3898D2220CF0C99F"
        ],
        "Label": "set",
        "Title": "X-Trace Task",
        "Host": "pinky19.mpi-sws.org",
        "HRT": 26966786685039177,
        "Operation": "set",
        "Timestamp": "1557750426625.190918",
        "TenantClass": 0,
        "Source": "Client.java:302",
        "ThreadID": 40,
        "ThreadName": "",
        "EventID": "D1A29BB80808991E",
        "ProcessID": 2801
      },
      {
        "Cycles": 0,
        "Agent": "Execution-CPU",
        "ProcessName": "Read",
        "TaskID": "3D647D8A70C3E8C2",
        "ParentEventID": [
          "D1A29BB80808991E"
        ],
        "Label": "unset",
        "Title": "X-Trace Task",
        "Host": "pinky19.mpi-sws.org",
        "Duration": "5625",
        "HRT": 26966786685063724,
        "Operation": "unset",
        "Timestamp": "1557750426625.215576",
        "TenantClass": 0,
        "Source": "Client.java:1168",
        "ThreadID": 40,
        "ThreadName": "",
        "EventID": "6AD18EAB74B22195",
        "ProcessID": 2801
      },
      {
        "Cycles": 0,
        "Agent": "Execution-Sleep",
        "ProcessName": "Read",
        "TaskID": "3D647D8A70C3E8C2",
        "ParentEventID": [
          "5BCAB101DDAC9582"
        ],
        "Label": "waited",
        "Title": "X-Trace Task",
        "Host": "pinky19.mpi-sws.org",
        "Duration": "386298",
        "HRT": 26966786685087029,
        "Operation": "waited",
        "Timestamp": "1557750426625.238770",
        "TenantClass": 0,
        "Source": "Client.java:1537",
        "ThreadID": 1,
        "ThreadName": "",
        "EventID": "6E654635E3377975",
        "ProcessID": 2801
      },
      {
        "Cycles": 0,
        "Agent": "edu.brown.cs.systems.xtrace.logging.BaggageWrappers",
        "ProcessName": "Read",
        "TaskID": "3D647D8A70C3E8C2",
        "ParentEventID": [
          "6E654635E3377975",
          "6AD18EAB74B22195"
        ],
        "Label": "Merged current baggage with other baggage",
        "Title": "X-Trace Task",
        "Host": "pinky19.mpi-sws.org",
        "HRT": 26966786685106652,
        "Operation": "join",
        "Timestamp": "1557750426625.258301",
        "TenantClass": 0,
        "Source": "Client.java:1545",
        "ThreadID": 1,
        "ThreadName": "",
        "EventID": "B8F36F3A0C2FE59E",
        "ProcessID": 2801
      },
      {
        "Cycles": 0,
        "Agent": "org.apache.hadoop.ipc.ProtobufRpcEngine",
        "ProcessName": "Read",
        "TaskID": "3D647D8A70C3E8C2",
        "ParentEventID": [
          "B8F36F3A0C2FE59E"
        ],
        "Label": "org.apache.hadoop.hdfs.protocol.ClientProtocol.getBlockLocations completed",
        "Title": "X-Trace Task",
        "Host": "pinky19.mpi-sws.org",
        "HRT": 26966786685165140,
        "Timestamp": "1557750426625.316895",
        "TenantClass": 0,
        "Source": "ProtobufRpcEngine.java:275",
        "ThreadID": 1,
        "ThreadName": "",
        "EventID": "A852365A338419B2",
        "ProcessID": 2801
      },
      {
        "Cycles": 0,
        "Agent": "Execution-Sleep",
        "ProcessName": "Read",
        "TaskID": "3D647D8A70C3E8C2",
        "ParentEventID": [
          "A852365A338419B2"
        ],
        "Label": "waited",
        "Title": "X-Trace Task",
        "Host": "pinky19.mpi-sws.org",
        "Duration": "150590",
        "HRT": 26966786685417220,
        "Operation": "waited",
        "Timestamp": "1557750426625.568848",
        "TenantClass": 0,
        "Source": "SocketIOWithTimeout.java:335",
        "ThreadID": 1,
        "ThreadName": "",
        "EventID": "D13F3208C8DE50EC",
        "ProcessID": 2801
      },
      {
        "Cycles": 0,
        "Agent": "edu.brown.cs.systems.xtrace.logging.BaggageWrappers",
        "ProcessName": "Read",
        "TaskID": "3D647D8A70C3E8C2",
        "ParentEventID": [
          "D13F3208C8DE50EC"
        ],
        "Label": "Forking current baggage with Baggage.fork()",
        "Title": "X-Trace Task",
        "Host": "pinky19.mpi-sws.org",
        "HRT": 26966786685455894,
        "Operation": "fork",
        "Timestamp": "1557750426625.607666",
        "TenantClass": 0,
        "Source": "DataTransferProtoUtil.java:94",
        "ThreadID": 1,
        "ThreadName": "",
        "EventID": "7CB6099D0CA8C65D",
        "ProcessID": 2801
      },
      {
        "Cycles": 0,
        "Agent": "Execution-CPU",
        "ProcessName": "Data",
        "TaskID": "3D647D8A70C3E8C2",
        "ParentEventID": [
          "7CB6099D0CA8C65D"
        ],
        "Label": "set",
        "Title": "X-Trace Task",
        "Host": "pinky23.mpi-sws.org",
        "HRT": 12368282659533853,
        "Operation": "set",
        "Timestamp": "1557750426626.082520",
        "TenantClass": 0,
        "Source": "Receiver.java:117",
        "ThreadID": 16313,
        "ThreadName": "",
        "EventID": "D9D53FC83CB85D8A",
        "BaggageBytes": "[[248 5] [240 0] [0 61 100 125 138 112 195 232 194] [240 1] [0 124 182 9 157 12 168 198 93] [240 3] [0 2]]",
        "ProcessID": 24612
      },
      {
        "Cycles": 0,
        "Agent": "edu.brown.cs.systems.xtrace.logging.XTraceInit",
        "ProcessName": "Data",
        "TaskID": "3D647D8A70C3E8C2",
        "ParentEventID": [
          "D9D53FC83CB85D8A"
        ],
        "Label": "Thread.setName: DataXceiver for client DFSClient_NONMAPREDUCE_310321604_1 at /139.19.171.63:55322 [Sending block BP-1633380353-139.19.171.63-1554193446451:blk_1073766950_26126]",
        "Title": "X-Trace Task",
        "Host": "pinky23.mpi-sws.org",
        "HRT": 12368282659637406,
        "Timestamp": "1557750426626.186035",
        "TenantClass": 0,
        "Source": "DataXceiver.java:168",
        "ThreadID": 16313,
        "ThreadName": "",
        "EventID": "C3056DE23C3D4725",
        "BaggageBytes": "[[248 5] [240 0] [0 61 100 125 138 112 195 232 194] [240 1] [0 217 213 63 200 60 184 93 138] [240 3] [0 2]]",
        "ProcessID": 24612
      },
      {
        "Cycles": 0,
        "Agent": "edu.brown.cs.systems.xtrace.logging.BaggageWrappers",
        "ProcessName": "Data",
        "TaskID": "3D647D8A70C3E8C2",
        "ParentEventID": [
          "C3056DE23C3D4725"
        ],
        "Label": "Forking current baggage with Baggage.fork()",
        "Title": "X-Trace Task",
        "Host": "pinky23.mpi-sws.org",
        "HRT": 12368282659920157,
        "Operation": "fork",
        "Timestamp": "1557750426626.468750",
        "TenantClass": 0,
        "Source": "DataXceiver.java:1257",
        "ThreadID": 16313,
        "ThreadName": "",
        "EventID": "A17473315301952E",
        "BaggageBytes": "[[248 5] [240 0] [0 61 100 125 138 112 195 232 194] [240 1] [0 195 5 109 226 60 61 71 37] [240 3] [0 2]]",
        "ProcessID": 24612
      },
      {
        "Cycles": 0,
        "Agent": "Execution-Sleep",
        "ProcessName": "Read",
        "TaskID": "3D647D8A70C3E8C2",
        "ParentEventID": [
          "7CB6099D0CA8C65D"
        ],
        "Label": "waited",
        "Title": "X-Trace Task",
        "Host": "pinky19.mpi-sws.org",
        "Duration": "1024368",
        "HRT": 26966786686548893,
        "Operation": "waited",
        "Timestamp": "1557750426626.700684",
        "TenantClass": 0,
        "Source": "SocketIOWithTimeout.java:335",
        "ThreadID": 1,
        "ThreadName": "",
        "EventID": "7E1DABC8900B92E4",
        "ProcessID": 2801
      },
      {
        "Cycles": 0,
        "Agent": "edu.brown.cs.systems.xtrace.logging.BaggageWrappers",
        "ProcessName": "Data",
        "TaskID": "3D647D8A70C3E8C2",
        "ParentEventID": [
          "A17473315301952E"
        ],
        "Label": "Forking current baggage with Baggage.fork()",
        "Title": "X-Trace Task",
        "Host": "pinky23.mpi-sws.org",
        "HRT": 12368282660088030,
        "Operation": "fork",
        "Timestamp": "1557750426626.636719",
        "TenantClass": 0,
        "Source": "PacketHeader.java:95",
        "ThreadID": 16313,
        "ThreadName": "",
        "EventID": "9CB5CA4E06862D07",
        "BaggageBytes": "[[248 5] [240 0] [0 61 100 125 138 112 195 232 194] [240 1] [0 161 116 115 49 83 1 149 46] [240 3] [0 2]]",
        "ProcessID": 24612
      },
      {
        "Cycles": 0,
        "Agent": "edu.brown.cs.systems.xtrace.logging.BaggageWrappers",
        "ProcessName": "Read",
        "TaskID": "3D647D8A70C3E8C2",
        "ParentEventID": [
          "7E1DABC8900B92E4",
          "A17473315301952E"
        ],
        "Label": "Merged current baggage with other baggage",
        "Title": "X-Trace Task",
        "Host": "pinky19.mpi-sws.org",
        "HRT": 26966786686631867,
        "Operation": "join",
        "Timestamp": "1557750426626.783691",
        "TenantClass": 0,
        "Source": "RemoteBlockReader2.java:429",
        "ThreadID": 1,
        "ThreadName": "",
        "EventID": "76707129E9845461",
        "ProcessID": 2801
      },
      {
        "Cycles": 0,
        "Agent": "Execution-Sleep",
        "ProcessName": "Data",
        "TaskID": "3D647D8A70C3E8C2",
        "ParentEventID": [
          "9CB5CA4E06862D07"
        ],
        "Label": "waited",
        "Title": "X-Trace Task",
        "Host": "pinky23.mpi-sws.org",
        "Duration": "13663",
        "HRT": 12368282660239897,
        "Operation": "waited",
        "Timestamp": "1557750426626.788574",
        "TenantClass": 0,
        "Source": "SocketIOWithTimeout.java:335",
        "ThreadID": 16313,
        "ThreadName": "",
        "EventID": "85489DF22510121B",
        "BaggageBytes": "[[248 5] [240 0] [0 61 100 125 138 112 195 232 194] [240 1] [0 156 181 202 78 6 134 45 7] [240 3] [0 2]]",
        "ProcessID": 24612
      },
      {
        "Cycles": 0,
        "Agent": "edu.brown.cs.systems.xtrace.logging.BaggageWrappers",
        "ProcessName": "Data",
        "TaskID": "3D647D8A70C3E8C2",
        "ParentEventID": [
          "85489DF22510121B"
        ],
        "Label": "Forking current baggage with Baggage.fork()",
        "Title": "X-Trace Task",
        "Host": "pinky23.mpi-sws.org",
        "HRT": 12368282660422851,
        "Operation": "fork",
        "Timestamp": "1557750426626.971436",
        "TenantClass": 0,
        "Source": "PacketHeader.java:95",
        "ThreadID": 16313,
        "ThreadName": "",
        "EventID": "3F521DEDD05C8D0F",
        "BaggageBytes": "[[248 5] [240 0] [0 61 100 125 138 112 195 232 194] [240 1] [0 133 72 157 242 37 16 18 27] [240 3] [0 2]]",
        "ProcessID": 24612
      },
      {
        "Cycles": 0,
        "Agent": "Execution-Sleep",
        "ProcessName": "Read",
        "TaskID": "3D647D8A70C3E8C2",
        "ParentEventID": [
          "76707129E9845461"
        ],
        "Label": "waited",
        "Title": "X-Trace Task",
        "Host": "pinky19.mpi-sws.org",
        "Duration": "339029",
        "HRT": 26966786687084833,
        "Operation": "waited",
        "Timestamp": "1557750426627.236572",
        "TenantClass": 0,
        "Source": "SocketIOWithTimeout.java:335",
        "ThreadID": 1,
        "ThreadName": "",
        "EventID": "11E7BBCA594DC0F0",
        "ProcessID": 2801
      },
      {
        "Cycles": 0,
        "Agent": "Execution-Sleep",
        "ProcessName": "Read",
        "TaskID": "3D647D8A70C3E8C2",
        "ParentEventID": [
          "11E7BBCA594DC0F0"
        ],
        "Label": "waited",
        "Title": "X-Trace Task",
        "Host": "pinky19.mpi-sws.org",
        "Duration": "249260",
        "HRT": 26966786687386491,
        "Operation": "waited",
        "Timestamp": "1557750426627.538330",
        "TenantClass": 0,
        "Source": "SocketIOWithTimeout.java:335",
        "ThreadID": 1,
        "ThreadName": "",
        "EventID": "19D792C4EF273A26",
        "ProcessID": 2801
      },
      {
        "Cycles": 0,
        "Agent": "Execution-Sleep",
        "ProcessName": "Read",
        "TaskID": "3D647D8A70C3E8C2",
        "ParentEventID": [
          "19D792C4EF273A26"
        ],
        "Label": "waited",
        "Title": "X-Trace Task",
        "Host": "pinky19.mpi-sws.org",
        "Duration": "127582",
        "HRT": 26966786687588319,
        "Operation": "waited",
        "Timestamp": "1557750426627.739990",
        "TenantClass": 0,
        "Source": "SocketIOWithTimeout.java:335",
        "ThreadID": 1,
        "ThreadName": "",
        "EventID": "2E71F179A95CE7B6",
        "ProcessID": 2801
      },
      {
        "Cycles": 0,
        "Agent": "Execution-Sleep",
        "ProcessName": "Read",
        "TaskID": "3D647D8A70C3E8C2",
        "ParentEventID": [
          "2E71F179A95CE7B6"
        ],
        "Label": "waited",
        "Title": "X-Trace Task",
        "Host": "pinky19.mpi-sws.org",
        "Duration": "12319",
        "HRT": 26966786687646397,
        "Operation": "waited",
        "Timestamp": "1557750426627.798096",
        "TenantClass": 0,
        "Source": "SocketIOWithTimeout.java:335",
        "ThreadID": 1,
        "ThreadName": "",
        "EventID": "12F613E7D870A5DF",
        "ProcessID": 2801
      },
      {
        "Cycles": 0,
        "Agent": "edu.brown.cs.systems.xtrace.logging.BaggageWrappers",
        "ProcessName": "Read",
        "TaskID": "3D647D8A70C3E8C2",
        "ParentEventID": [
          "3F521DEDD05C8D0F",
          "A66E8629C7E07B8C"
        ],
        "Label": "Merged current baggage with other baggage",
        "Title": "X-Trace Task",
        "Host": "pinky19.mpi-sws.org",
        "HRT": 26966786687779645,
        "Operation": "join",
        "Timestamp": "1557750426627.931396",
        "TenantClass": 0,
        "Source": "PacketHeader.java:168",
        "ThreadID": 1,
        "ThreadName": "",
        "EventID": "F3FC332DC9362520",
        "ProcessID": 2801
      },
      {
        "Cycles": 0,
        "Agent": "edu.brown.cs.systems.xtrace.logging.BaggageWrappers",
        "ProcessName": "Read",
        "TaskID": "3D647D8A70C3E8C2",
        "ParentEventID": [
          "12F613E7D870A5DF",
          "9CB5CA4E06862D07"
        ],
        "Label": "Merged current baggage with other baggage",
        "Title": "X-Trace Task",
        "Host": "pinky19.mpi-sws.org",
        "HRT": 26966786687682977,
        "Operation": "join",
        "Timestamp": "1557750426627.834717",
        "TenantClass": 0,
        "Source": "PacketHeader.java:168",
        "ThreadID": 1,
        "ThreadName": "",
        "EventID": "A66E8629C7E07B8C",
        "ProcessID": 2801
      },
      {
        "Cycles": 0,
        "Agent": "edu.brown.cs.systems.xtrace.logging.BaggageWrappers",
        "ProcessName": "Read",
        "TaskID": "3D647D8A70C3E8C2",
        "ParentEventID": [
          "F3FC332DC9362520"
        ],
        "Label": "Forking current baggage with Baggage.fork()",
        "Title": "X-Trace Task",
        "Host": "pinky19.mpi-sws.org",
        "HRT": 26966786687787969,
        "Operation": "fork",
        "Timestamp": "1557750426627.939697",
        "TenantClass": 0,
        "Source": "RemoteBlockReader2.java:361",
        "ThreadID": 1,
        "ThreadName": "",
        "EventID": "DA4EAF17CEBEDC2C",
        "ProcessID": 2801
      },
      {
        "Cycles": 0,
        "Agent": "edu.brown.cs.systems.xtrace.logging.BaggageWrappers",
        "ProcessName": "Read",
        "TaskID": "3D647D8A70C3E8C2",
        "ParentEventID": [
          "DA4EAF17CEBEDC2C"
        ],
        "Label": "Forking current baggage with Baggage.fork()",
        "Title": "X-Trace Task",
        "Host": "pinky19.mpi-sws.org",
        "HRT": 26966786687842152,
        "Operation": "fork",
        "Timestamp": "1557750426627.993896",
        "TenantClass": 0,
        "Source": "DataTransferProtoUtil.java:94",
        "ThreadID": 1,
        "ThreadName": "",
        "EventID": "AC5E93F4A485B1B2",
        "ProcessID": 2801
      },
      {
        "Cycles": 0,
        "Agent": "Execution-Sleep",
        "ProcessName": "Data",
        "TaskID": "3D647D8A70C3E8C2",
        "ParentEventID": [
          "3F521DEDD05C8D0F"
        ],
        "Label": "waited",
        "Title": "X-Trace Task",
        "Host": "pinky23.mpi-sws.org",
        "Duration": "835765",
        "HRT": 12368282661437919,
        "Operation": "waited",
        "Timestamp": "1557750426627.986572",
        "TenantClass": 0,
        "Source": "SocketIOWithTimeout.java:335",
        "ThreadID": 16313,
        "ThreadName": "",
        "EventID": "C9B804FBBF391559",
        "BaggageBytes": "[[248 5] [240 0] [0 61 100 125 138 112 195 232 194] [240 1] [0 63 82 29 237 208 92 141 15] [240 3] [0 2]]",
        "ProcessID": 24612
      },
      {
        "Cycles": 0,
        "Agent": "Execution-CPU",
        "ProcessName": "Data",
        "TaskID": "3D647D8A70C3E8C2",
        "ParentEventID": [
          "0FF7A191D1FDE83C"
        ],
        "Label": "unset",
        "Title": "X-Trace Task",
        "Host": "pinky23.mpi-sws.org",
        "Duration": "2155490",
        "HRT": 12368282661761560,
        "Operation": "unset",
        "Timestamp": "1557750426628.310303",
        "TenantClass": 0,
        "Source": "DataXceiver.java:261",
        "ThreadID": 16313,
        "ThreadName": "",
        "EventID": "14CCA41A2DA80384",
        "BaggageBytes": "[[248 5] [240 0] [0 61 100 125 138 112 195 232 194] [240 1] [0 15 247 161 145 209 253 232 60] [240 3] [0 2]]",
        "ProcessID": 24612
      },
      {
        "Cycles": 0,
        "Agent": "edu.brown.cs.systems.xtrace.logging.BaggageWrappers",
        "ProcessName": "Data",
        "TaskID": "3D647D8A70C3E8C2",
        "ParentEventID": [
          "C9B804FBBF391559",
          "DA4EAF17CEBEDC2C"
        ],
        "Label": "Merged current baggage with other baggage",
        "Title": "X-Trace Task",
        "Host": "pinky23.mpi-sws.org",
        "HRT": 12368282661677800,
        "Operation": "join",
        "Timestamp": "1557750426628.226562",
        "TenantClass": 0,
        "Source": "DataXceiver.java:574",
        "ThreadID": 16313,
        "ThreadName": "",
        "EventID": "0FF7A191D1FDE83C",
        "BaggageBytes": "[[248 5] [240 0] [0 61 100 125 138 112 195 232 194] [240 1] [0 201 184 4 251 191 57 21 89] [0 218 78 175 23 206 190 220 44] [240 3] [0 2]]",
        "ProcessID": 24612
      },
      {
        "Cycles": 0,
        "Agent": "Execution-CPU",
        "ProcessName": "Data",
        "TaskID": "3D647D8A70C3E8C2",
        "ParentEventID": [
          "AC5E93F4A485B1B2"
        ],
        "Label": "set",
        "Title": "X-Trace Task",
        "Host": "pinky23.mpi-sws.org",
        "HRT": 12368282661838037,
        "Operation": "set",
        "Timestamp": "1557750426628.386719",
        "TenantClass": 0,
        "Source": "Receiver.java:117",
        "ThreadID": 16313,
        "ThreadName": "",
        "EventID": "8325FF3F70181773",
        "BaggageBytes": "[[248 5] [240 0] [0 61 100 125 138 112 195 232 194] [240 1] [0 172 94 147 244 164 133 177 178] [240 3] [0 2]]",
        "ProcessID": 24612
      },
      {
        "Cycles": 0,
        "Agent": "edu.brown.cs.systems.xtrace.logging.BaggageWrappers",
        "ProcessName": "Data",
        "TaskID": "3D647D8A70C3E8C2",
        "ParentEventID": [
          "FC34DB31410342BE"
        ],
        "Label": "Forking current baggage with Baggage.fork()",
        "Title": "X-Trace Task",
        "Host": "pinky23.mpi-sws.org",
        "HRT": 12368282662168957,
        "Operation": "fork",
        "Timestamp": "1557750426628.717529",
        "TenantClass": 0,
        "Source": "DataXceiver.java:1257",
        "ThreadID": 16313,
        "ThreadName": "",
        "EventID": "2B4B0B0D1F93DC91",
        "BaggageBytes": "[[248 5] [240 0] [0 61 100 125 138 112 195 232 194] [240 1] [0 252 52 219 49 65 3 66 190] [240 3] [0 2]]",
        "ProcessID": 24612
      },
      {
        "Cycles": 0,
        "Agent": "edu.brown.cs.systems.xtrace.logging.XTraceInit",
        "ProcessName": "Data",
        "TaskID": "3D647D8A70C3E8C2",
        "ParentEventID": [
          "8325FF3F70181773"
        ],
        "Label": "Thread.setName: DataXceiver for client DFSClient_NONMAPREDUCE_310321604_1 at /139.19.171.63:55322 [Sending block BP-1633380353-139.19.171.63-1554193446451:blk_1073766950_26126]",
        "Title": "X-Trace Task",
        "Host": "pinky23.mpi-sws.org",
        "HRT": 12368282661931017,
        "Timestamp": "1557750426628.479736",
        "TenantClass": 0,
        "Source": "DataXceiver.java:168",
        "ThreadID": 16313,
        "ThreadName": "",
        "EventID": "FC34DB31410342BE",
        "BaggageBytes": "[[248 5] [240 0] [0 61 100 125 138 112 195 232 194] [240 1] [0 131 37 255 63 112 24 23 115] [240 3] [0 2]]",
        "ProcessID": 24612
      },
      {
        "Cycles": 0,
        "Agent": "Execution-Sleep",
        "ProcessName": "Read",
        "TaskID": "3D647D8A70C3E8C2",
        "ParentEventID": [
          "AC5E93F4A485B1B2"
        ],
        "Label": "waited",
        "Title": "X-Trace Task",
        "Host": "pinky19.mpi-sws.org",
        "Duration": "894071",
        "HRT": 26966786688796515,
        "Operation": "waited",
        "Timestamp": "1557750426628.948242",
        "TenantClass": 0,
        "Source": "SocketIOWithTimeout.java:335",
        "ThreadID": 1,
        "ThreadName": "",
        "EventID": "75588BA97F34DFA4",
        "ProcessID": 2801
      },
      {
        "Cycles": 0,
        "Agent": "edu.brown.cs.systems.xtrace.logging.BaggageWrappers",
        "ProcessName": "Read",
        "TaskID": "3D647D8A70C3E8C2",
        "ParentEventID": [
          "2B4B0B0D1F93DC91",
          "75588BA97F34DFA4"
        ],
        "Label": "Merged current baggage with other baggage",
        "Title": "X-Trace Task",
        "Host": "pinky19.mpi-sws.org",
        "HRT": 26966786688852453,
        "Operation": "join",
        "Timestamp": "1557750426629.004150",
        "TenantClass": 0,
        "Source": "RemoteBlockReader2.java:429",
        "ThreadID": 1,
        "ThreadName": "",
        "EventID": "1BA3A03D0A3B37AA",
        "ProcessID": 2801
      },
      {
        "Cycles": 0,
        "Agent": "edu.brown.cs.systems.xtrace.logging.BaggageWrappers",
        "ProcessName": "Data",
        "TaskID": "3D647D8A70C3E8C2",
        "ParentEventID": [
          "2B4B0B0D1F93DC91"
        ],
        "Label": "Forking current baggage with Baggage.fork()",
        "Title": "X-Trace Task",
        "Host": "pinky23.mpi-sws.org",
        "HRT": 12368282662349217,
        "Operation": "fork",
        "Timestamp": "1557750426628.897949",
        "TenantClass": 0,
        "Source": "PacketHeader.java:95",
        "ThreadID": 16313,
        "ThreadName": "",
        "EventID": "174B2BC95DAC83E7",
        "BaggageBytes": "[[248 5] [240 0] [0 61 100 125 138 112 195 232 194] [240 1] [0 43 75 11 13 31 147 220 145] [240 3] [0 2]]",
        "ProcessID": 24612
      },
      {
        "Cycles": 0,
        "Agent": "Execution-Sleep",
        "ProcessName": "Data",
        "TaskID": "3D647D8A70C3E8C2",
        "ParentEventID": [
          "174B2BC95DAC83E7"
        ],
        "Label": "waited",
        "Title": "X-Trace Task",
        "Host": "pinky23.mpi-sws.org",
        "Duration": "11597",
        "HRT": 12368282662502974,
        "Operation": "waited",
        "Timestamp": "1557750426629.051514",
        "TenantClass": 0,
        "Source": "SocketIOWithTimeout.java:335",
        "ThreadID": 16313,
        "ThreadName": "",
        "EventID": "4CD6A651ED4EF0C3",
        "BaggageBytes": "[[248 5] [240 0] [0 61 100 125 138 112 195 232 194] [240 1] [0 23 75 43 201 93 172 131 231] [240 3] [0 2]]",
        "ProcessID": 24612
      },
      {
        "Cycles": 0,
        "Agent": "Execution-Sleep",
        "ProcessName": "Read",
        "TaskID": "3D647D8A70C3E8C2",
        "ParentEventID": [
          "1BA3A03D0A3B37AA"
        ],
        "Label": "waited",
        "Title": "X-Trace Task",
        "Host": "pinky19.mpi-sws.org",
        "Duration": "45581",
        "HRT": 26966786688947518,
        "Operation": "waited",
        "Timestamp": "1557750426629.099365",
        "TenantClass": 0,
        "Source": "SocketIOWithTimeout.java:335",
        "ThreadID": 1,
        "ThreadName": "",
        "EventID": "AF3733F572E6988F",
        "ProcessID": 2801
      },
      {
        "Cycles": 0,
        "Agent": "Execution-Sleep",
        "ProcessName": "Read",
        "TaskID": "3D647D8A70C3E8C2",
        "ParentEventID": [
          "AF3733F572E6988F"
        ],
        "Label": "waited",
        "Title": "X-Trace Task",
        "Host": "pinky19.mpi-sws.org",
        "Duration": "365661",
        "HRT": 26966786689389515,
        "Operation": "waited",
        "Timestamp": "1557750426629.541260",
        "TenantClass": 0,
        "Source": "SocketIOWithTimeout.java:335",
        "ThreadID": 1,
        "ThreadName": "",
        "EventID": "D78AA4D6021FE8B8",
        "ProcessID": 2801
      },
      {
        "Cycles": 0,
        "Agent": "Execution-Sleep",
        "ProcessName": "Read",
        "TaskID": "3D647D8A70C3E8C2",
        "ParentEventID": [
          "D78AA4D6021FE8B8"
        ],
        "Label": "waited",
        "Title": "X-Trace Task",
        "Host": "pinky19.mpi-sws.org",
        "Duration": "158031",
        "HRT": 26966786689593023,
        "Operation": "waited",
        "Timestamp": "1557750426629.744873",
        "TenantClass": 0,
        "Source": "SocketIOWithTimeout.java:335",
        "ThreadID": 1,
        "ThreadName": "",
        "EventID": "F69EAB88D479CB89",
        "ProcessID": 2801
      },
      {
        "Cycles": 0,
        "Agent": "edu.brown.cs.systems.xtrace.logging.BaggageWrappers",
        "ProcessName": "Data",
        "TaskID": "3D647D8A70C3E8C2",
        "ParentEventID": [
          "4CD6A651ED4EF0C3"
        ],
        "Label": "Forking current baggage with Baggage.fork()",
        "Title": "X-Trace Task",
        "Host": "pinky23.mpi-sws.org",
        "HRT": 12368282662709161,
        "Operation": "fork",
        "Timestamp": "1557750426629.257812",
        "TenantClass": 0,
        "Source": "PacketHeader.java:95",
        "ThreadID": 16313,
        "ThreadName": "",
        "EventID": "FF9DCACADB1FEB0B",
        "BaggageBytes": "[[248 5] [240 0] [0 61 100 125 138 112 195 232 194] [240 1] [0 76 214 166 81 237 78 240 195] [240 3] [0 2]]",
        "ProcessID": 24612
      },
      {
        "Cycles": 0,
        "Agent": "Execution-Sleep",
        "ProcessName": "Data",
        "TaskID": "3D647D8A70C3E8C2",
        "ParentEventID": [
          "FF9DCACADB1FEB0B"
        ],
        "Label": "waited",
        "Title": "X-Trace Task",
        "Host": "pinky23.mpi-sws.org",
        "Duration": "191911",
        "HRT": 12368282663018218,
        "Operation": "waited",
        "Timestamp": "1557750426629.566895",
        "TenantClass": 0,
        "Source": "SocketIOWithTimeout.java:335",
        "ThreadID": 16313,
        "ThreadName": "",
        "EventID": "DB0731000F382414",
        "BaggageBytes": "[[248 5] [240 0] [0 61 100 125 138 112 195 232 194] [240 1] [0 255 157 202 202 219 31 235 11] [240 3] [0 2]]",
        "ProcessID": 24612
      },
      {
        "Cycles": 0,
        "Agent": "Execution-Sleep",
        "ProcessName": "Read",
        "TaskID": "3D647D8A70C3E8C2",
        "ParentEventID": [
          "F69EAB88D479CB89"
        ],
        "Label": "waited",
        "Title": "X-Trace Task",
        "Host": "pinky19.mpi-sws.org",
        "Duration": "94354",
        "HRT": 26966786689749062,
        "Operation": "waited",
        "Timestamp": "1557750426629.900879",
        "TenantClass": 0,
        "Source": "SocketIOWithTimeout.java:335",
        "ThreadID": 1,
        "ThreadName": "",
        "EventID": "6A460BBA575AF0BC",
        "ProcessID": 2801
      },
      {
        "Cycles": 0,
        "Agent": "edu.brown.cs.systems.xtrace.logging.BaggageWrappers",
        "ProcessName": "Read",
        "TaskID": "3D647D8A70C3E8C2",
        "ParentEventID": [
          "174B2BC95DAC83E7",
          "6A460BBA575AF0BC"
        ],
        "Label": "Merged current baggage with other baggage",
        "Title": "X-Trace Task",
        "Host": "pinky19.mpi-sws.org",
        "HRT": 26966786689788941,
        "Operation": "join",
        "Timestamp": "1557750426629.940674",
        "TenantClass": 0,
        "Source": "PacketHeader.java:168",
        "ThreadID": 1,
        "ThreadName": "",
        "EventID": "F2F5BC670F5DC7DF",
        "ProcessID": 2801
      },
      {
        "Cycles": 0,
        "Agent": "Execution-Sleep",
        "ProcessName": "Data",
        "TaskID": "3D647D8A70C3E8C2",
        "ParentEventID": [
          "D2B70A8B8938CB1C"
        ],
        "Label": "waited",
        "Title": "X-Trace Task",
        "Host": "pinky23.mpi-sws.org",
        "Duration": "14196",
        "HRT": 12368282663424089,
        "Operation": "waited",
        "Timestamp": "1557750426629.972656",
        "TenantClass": 0,
        "Source": "SocketIOWithTimeout.java:335",
        "ThreadID": 16313,
        "ThreadName": "",
        "EventID": "18C12D4B30556247",
        "BaggageBytes": "[[248 5] [240 0] [0 61 100 125 138 112 195 232 194] [240 1] [0 210 183 10 139 137 56 203 28] [240 3] [0 2]]",
        "ProcessID": 24612
      },
      {
        "Cycles": 0,
        "Agent": "edu.brown.cs.systems.xtrace.logging.BaggageWrappers",
        "ProcessName": "Data",
        "TaskID": "3D647D8A70C3E8C2",
        "ParentEventID": [
          "DB0731000F382414"
        ],
        "Label": "Forking current baggage with Baggage.fork()",
        "Title": "X-Trace Task",
        "Host": "pinky23.mpi-sws.org",
        "HRT": 12368282663246415,
        "Operation": "fork",
        "Timestamp": "1557750426629.795166",
        "TenantClass": 0,
        "Source": "PacketHeader.java:95",
        "ThreadID": 16313,
        "ThreadName": "",
        "EventID": "D2B70A8B8938CB1C",
        "BaggageBytes": "[[248 5] [240 0] [0 61 100 125 138 112 195 232 194] [240 1] [0 219 7 49 0 15 56 36 20] [240 3] [0 2]]",
        "ProcessID": 24612
      },
      {
        "Cycles": 0,
        "Agent": "Execution-CPU",
        "ProcessName": "Data",
        "TaskID": "3D647D8A70C3E8C2",
        "ParentEventID": [
          "18C12D4B30556247"
        ],
        "Label": "unset",
        "Title": "X-Trace Task",
        "Host": "pinky23.mpi-sws.org",
        "Duration": "1904937",
        "HRT": 12368282663810270,
        "Operation": "unset",
        "Timestamp": "1557750426630.358887",
        "TenantClass": 0,
        "Source": "DataXceiver.java:261",
        "ThreadID": 16313,
        "ThreadName": "",
        "EventID": "4473E108FA59E8E0",
        "BaggageBytes": "[[248 5] [240 0] [0 61 100 125 138 112 195 232 194] [240 1] [0 24 193 45 75 48 85 98 71] [240 3] [0 2]]",
        "ProcessID": 24612
      },
      {
        "Cycles": 0,
        "Agent": "edu.brown.cs.systems.retro.benchmarks.hdfs_client.Reader",
        "ProcessName": "Read",
        "TaskID": "3D647D8A70C3E8C2",
        "ParentEventID": [
          "0"
        ],
        "Label": "Reading file",
        "Title": "X-Trace Task",
        "Host": "pinky19.mpi-sws.org",
        "HRT": 26966786684487951,
        "Timestamp": "1557750426624.639648",
        "TenantClass": 0,
        "ThreadID": 1,
        "ThreadName": "",
        "EventID": "A815193A8555BE9B",
        "ProcessID": 2801,
        "Tag": [
          "reader_100kb",
          "Read Size: 102400"
        ]
      }
    ]
  }
]