[
  {
    "id": "446C8222326747F7",
    "reports": [
      {
        "Cycles": 0,
        "Agent": "org.apache.hadoop.ipc.ProtobufRpcEngine",
        "ProcessName": "Read",
        "TaskID": "446C8222326747F7",
        "ParentEventID": [
          "609401F7FA82FB4A"
        ],
        "Label": "Invoking org.apache.hadoop.hdfs.protocol.ClientProtocol.getBlockLocations",
        "Title": "X-Trace Task",
        "Host": "pinky19.mpi-sws.org",
        "HRT": 26966712832393981,
        "Timestamp": "1557750352772.576172",
        "TenantClass": 0,
        "Source": "ProtobufRpcEngine.java:228",
        "ThreadID": 1,
        "ThreadName": "",
        "EventID": "2E5D94B36D9993CA",
        "ProcessID": 2801
      },
      {
        "Cycles": 0,
        "Agent": "edu.brown.cs.systems.retro.benchmarks.hdfs_client.Reader",
        "ProcessName": "Read",
        "TaskID": "446C8222326747F7",
        "ParentEventID": [
          "A0D8CE69A224D39F"
        ],
        "Label": "Reading file",
        "Title": "X-Trace Task",
        "Host": "pinky19.mpi-sws.org",
        "HRT": 26966712832338396,
        "Timestamp": "1557750352772.520508",
        "TenantClass": 0,
        "ThreadID": 1,
        "ThreadName": "",
        "EventID": "609401F7FA82FB4A",
        "ProcessID": 2801
      },
      {
        "Cycles": 0,
        "Agent": "Execution-CPU",
        "ProcessName": "Read",
        "TaskID": "446C8222326747F7",
        "ParentEventID": [
          "71B92D3896AAB69C"
        ],
        "Label": "set",
        "Title": "X-Trace Task",
        "Host": "pinky19.mpi-sws.org",
        "HRT": 26966712832446695,
        "Operation": "set",
        "Timestamp": "1557750352772.628906",
        "TenantClass": 0,
        "Source": "Client.java:1032",
        "ThreadID": 41,
        "ThreadName": "",
        "EventID": "63E2330E089CFD3C",
        "ProcessID": 2801
      },
      {
        "Cycles": 0,
        "Agent": "Execution-CPU",
        "ProcessName": "Read",
        "TaskID": "446C8222326747F7",
        "ParentEventID": [
          "2E5D94B36D9993CA"
        ],
        "Label": "unset",
        "Title": "X-Trace Task",
        "Host": "pinky19.mpi-sws.org",
        "Duration": "24026673",
        "HRT": 26966712832416684,
        "Operation": "unset",
        "Timestamp": "1557750352772.598877",
        "TenantClass": 0,
        "Source": "Client.java:1027",
        "ThreadID": 1,
        "ThreadName": "",
        "EventID": "71B92D3896AAB69C",
        "ProcessID": 2801
      },
      {
        "Cycles": 0,
        "Agent": "Execution-CPU",
        "ProcessName": "Read",
        "TaskID": "446C8222326747F7",
        "ParentEventID": [
          "96E4BFA3B03AE16F"
        ],
        "Label": "unset",
        "Title": "X-Trace Task",
        "Host": "pinky19.mpi-sws.org",
        "Duration": "72103",
        "HRT": 26966712832546216,
        "Operation": "unset",
        "Timestamp": "1557750352772.728271",
        "TenantClass": 0,
        "Source": "Client.java:1062",
        "ThreadID": 41,
        "ThreadName": "",
        "EventID": "461E9D1388A02B50",
        "ProcessID": 2801
      },
      {
        "Cycles": 0,
        "Agent": "edu.brown.cs.systems.xtrace.logging.BaggageWrappers",
        "ProcessName": "Read",
        "TaskID": "446C8222326747F7",
        "ParentEventID": [
          "63E2330E089CFD3C"
        ],
        "Label": "Forking current baggage with Baggage.fork()",
        "Title": "X-Trace Task",
        "Host": "pinky19.mpi-sws.org",
        "HRT": 26966712832465942,
        "Operation": "fork",
        "Timestamp": "1557750352772.647949",
        "TenantClass": 0,
        "Source": "Client.java:1043",
        "ThreadID": 41,
        "ThreadName": "",
        "EventID": "96E4BFA3B03AE16F",
        "ProcessID": 2801
      },
      {
        "Cycles": 0,
        "Agent": "Execution-CPU",
        "ProcessName": "Read",
        "TaskID": "446C8222326747F7",
        "ParentEventID": [
          "461E9D1388A02B50"
        ],
        "Label": "set",
        "Title": "X-Trace Task",
        "Host": "pinky19.mpi-sws.org",
        "HRT": 26966712832569443,
        "Operation": "set",
        "Timestamp": "1557750352772.751465",
        "TenantClass": 0,
        "Source": "Client.java:1104",
        "ThreadID": 1,
        "ThreadName": "",
        "EventID": "8C571FBE7EF4B730",
        "ProcessID": 2801
      },
      {
        "Cycles": 0,
        "Agent": "edu.brown.cs.systems.xtrace.logging.BaggageWrappers",
        "ProcessName": "Name",
        "TaskID": "446C8222326747F7",
        "ParentEventID": [
          "10E719AE8CBC2940"
        ],
        "Label": "Forking current baggage with Baggage.fork()",
        "Title": "X-Trace Task",
        "Host": "pinky19.mpi-sws.org",
        "HRT": 26966712832619880,
        "Operation": "fork",
        "Timestamp": "1557750352772.809570",
        "TenantClass": 0,
        "Source": "Server.java:550",
        "ThreadID": 48,
        "ThreadName": "",
        "EventID": "DDBD3C434590C1C5",
        "BaggageBytes": "[[248 5] [240 0] [0 68 108 130 34 50 103 71 247] [240 1] [0 16 231 25 174 140 188 41 64] [240 3] [0 2]]",
        "ProcessID": 2171
      },
      {
        "Cycles": 0,
        "Agent": "Execution-CPU",
        "ProcessName": "Name",
        "TaskID": "446C8222326747F7",
        "ParentEventID": [
          "96E4BFA3B03AE16F"
        ],
        "Label": "set",
        "Title": "X-Trace Task",
        "Host": "pinky19.mpi-sws.org",
        "HRT": 26966712832590653,
        "Operation": "set",
        "Timestamp": "1557750352772.780273",
        "TenantClass": 0,
        "Source": "Server.java:1840",
        "ThreadID": 48,
        "ThreadName": "",
        "EventID": "10E719AE8CBC2940",
        "BaggageBytes": "[[248 5] [240 0] [0 68 108 130 34 50 103 71 247] [240 1] [0 150 228 191 163 176 58 225 111] [240 3] [0 2]]",
        "ProcessID": 2171
      },
      {
        "Cycles": 0,
        "Agent": "Execution-CPU",
        "ProcessName": "Name",
        "TaskID": "446C8222326747F7",
        "ParentEventID": [
          "DDBD3C434590C1C5"
        ],
        "Label": "unset",
        "Title": "X-Trace Task",
        "Host": "pinky19.mpi-sws.org",
        "Duration": "25827",
        "HRT": 26966712832641911,
        "Operation": "unset",
        "Timestamp": "1557750352772.831543",
        "TenantClass": 0,
        "Source": "Server.java:1828",
        "ThreadID": 48,
        "ThreadName": "",
        "EventID": "DABD27DADD8217B0",
        "BaggageBytes": "[[248 5] [240 0] [0 68 108 130 34 50 103 71 247] [240 1] [0 221 189 60 67 69 144 193 197] [240 3] [0 2]]",
        "ProcessID": 2171
      },
      {
        "Cycles": 0,
        "Agent": "Execution-CPU",
        "ProcessName": "Name",
        "TaskID": "446C8222326747F7",
        "ParentEventID": [
          "DDBD3C434590C1C5"
        ],
        "Label": "set",
        "Title": "X-Trace Task",
        "Host": "pinky19.mpi-sws.org",
        "HRT": 26966712832653221,
        "Operation": "set",
        "Timestamp": "1557750352772.843018",
        "TenantClass": 0,
        "Source": "Server.java:2071",
        "ThreadID": 55,
        "ThreadName": "",
        "EventID": "A3618ED8A15700FB",
        "BaggageBytes": "[[248 5] [240 0] [0 68 108 130 34 50 103 71 247] [240 1] [0 221 189 60 67 69 144 193 197] [240 3] [0 2]]",
        "ProcessID": 2171
      },
      {
        "Cycles": 0,
        "Agent": "org.apache.hadoop.ipc.Server",
        "ProcessName": "Name",
        "TaskID": "446C8222326747F7",
        "ParentEventID": [
          "A3618ED8A15700FB"
        ],
        "Label": "getBlockLocations in org.apache.hadoop.hdfs.protocol.ClientProtocol",
        "Title": "X-Trace Task",
        "Host": "pinky19.mpi-sws.org",
        "HRT": 26966712832684471,
        "Timestamp": "1557750352772.874268",
        "TenantClass": 0,
        "Source": "ProtobufRpcEngine.java:601",
        "ThreadID": 55,
        "ThreadName": "",
        "EventID": "10BEE1F90B5DC5F8",
        "BaggageBytes": "[[248 5] [240 0] [0 68 108 130 34 50 103 71 247] [240 1] [0 163 97 142 216 161 87 0 251] [240 3] [0 2]]",
        "ProcessID": 2171
      },
      {
        "Cycles": 0,
        "Agent": "edu.brown.cs.systems.xtrace.logging.BaggageWrappers",
        "ProcessName": "Name",
        "TaskID": "446C8222326747F7",
        "ParentEventID": [
          "B19DACF364B1616F"
        ],
        "Label": "Forking current baggage with Baggage.fork()",
        "Title": "X-Trace Task",
        "Host": "pinky19.mpi-sws.org",
        "HRT": 26966712832771881,
        "Operation": "fork",
        "Timestamp": "1557750352772.961670",
        "TenantClass": 0,
        "Source": "Server.java:2398",
        "ThreadID": 55,
        "ThreadName": "",
        "EventID": "C1A4DA9C132E38B3",
        "BaggageBytes": "[[248 5] [240 0] [0 68 108 130 34 50 103 71 247] [240 1] [0 177 157 172 243 100 177 97 111] [240 3] [0 2]]",
        "ProcessID": 2171
      },
      {
        "Cycles": 0,
        "Agent": "org.apache.hadoop.hdfs.server.namenode.FSNamesystem.audit",
        "ProcessName": "Name",
        "TaskID": "446C8222326747F7",
        "ParentEventID": [
          "10BEE1F90B5DC5F8"
        ],
        "Label": "allowed=true\tugi=plascas (auth:SIMPLE)\tip=/139.19.171.63\tcmd=open\tsrc=/ds/ZF0xWz7bVvmpcO4s\tdst=null\tperm=null\tproto=rpc",
        "Title": "X-Trace Task",
        "Host": "pinky19.mpi-sws.org",
        "HRT": 26966712832726736,
        "Timestamp": "1557750352772.916504",
        "TenantClass": 0,
        "Source": "FSNamesystem.java:8313",
        "ThreadID": 55,
        "ThreadName": "",
        "EventID": "B19DACF364B1616F",
        "BaggageBytes": "[[248 5] [240 0] [0 68 108 130 34 50 103 71 247] [240 1] [0 16 190 225 249 11 93 197 248] [240 3] [0 2]]",
        "ProcessID": 2171
      },
      {
        "Cycles": 0,
        "Agent": "Execution-CPU",
        "ProcessName": "Name",
        "TaskID": "446C8222326747F7",
        "ParentEventID": [
          "C1A4DA9C132E38B3"
        ],
        "Label": "unset",
        "Title": "X-Trace Task",
        "Host": "pinky19.mpi-sws.org",
        "Duration": "202265",
        "HRT": 26966712832875329,
        "Operation": "unset",
        "Timestamp": "1557750352773.065186",
        "TenantClass": 0,
        "Source": "Server.java:1058",
        "ThreadID": 55,
        "ThreadName": "",
        "EventID": "6174F6EE32EE45E7",
        "BaggageBytes": "[[248 5] [240 0] [0 68 108 130 34 50 103 71 247] [240 1] [0 193 164 218 156 19 46 56 179] [240 3] [0 2]]",
        "ProcessID": 2171
      },
      {
        "Cycles": 0,
        "Agent": "Execution-CPU",
        "ProcessName": "Read",
        "TaskID": "446C8222326747F7",
        "ParentEventID": [
          "C1A4DA9C132E38B3"
        ],
        "Label": "set",
        "Title": "X-Trace Task",
        "Host": "pinky19.mpi-sws.org",
        "HRT": 26966712832911655,
        "Operation": "set",
        "Timestamp": "1557750352773.093750",
        "TenantClass": 0,
        "Source": "Client.java:302",
        "ThreadID": 40,
        "ThreadName": "",
        "EventID": "F1A3902DD32E408A",
        "ProcessID": 2801
      },
      {
        "Cycles": 0,
        "Agent": "Execution-CPU",
        "ProcessName": "Read",
        "TaskID": "446C8222326747F7",
        "ParentEventID": [
          "F1A3902DD32E408A"
        ],
        "Label": "unset",
        "Title": "X-Trace Task",
        "Host": "pinky19.mpi-sws.org",
        "Duration": "10361",
        "HRT": 26966712832932749,
        "Operation": "unset",
        "Timestamp": "1557750352773.114746",
        "TenantClass": 0,
        "Source": "Client.java:1168",
        "ThreadID": 40,
        "ThreadName": "",
        "EventID": "69359CF5B2C6148B",
        "ProcessID": 2801
      },
      {
        "Cycles": 0,
        "Agent": "Execution-Sleep",
        "ProcessName": "Read",
        "TaskID": "446C8222326747F7",
        "ParentEventID": [
          "8C571FBE7EF4B730"
        ],
        "Label": "waited",
        "Title": "X-Trace Task",
        "Host": "pinky19.mpi-sws.org",
        "Duration": "370615",
        "HRT": 26966712832951625,
        "Operation": "waited",
        "Timestamp": "1557750352773.133789",
        "TenantClass": 0,
        "Source": "Client.java:1537",
        "ThreadID": 1,
        "ThreadName": "",
        "EventID": "C8D6785B5E64E60F",
        "ProcessID": 2801
      },
      {
        "Cycles": 0,
        "Agent": "org.apache.hadoop.ipc.ProtobufRpcEngine",
        "ProcessName": "Read",
        "TaskID": "446C8222326747F7",
        "ParentEventID": [
          "EC4AEC0975B045FB"
        ],
        "Label": "org.apache.hadoop.hdfs.protocol.ClientProtocol.getBlockLocations completed",
        "Title": "X-Trace Task",
        "Host": "pinky19.mpi-sws.org",
        "HRT": 26966712833049042,
        "Timestamp": "1557750352773.231201",
        "TenantClass": 0,
        "Source": "ProtobufRpcEngine.java:275",
        "ThreadID": 1,
        "ThreadName": "",
        "EventID": "69405D2E8430CE57",
        "ProcessID": 2801
      },
      {
        "Cycles": 0,
        "Agent": "Execution-Sleep",
        "ProcessName": "Read",
        "TaskID": "446C8222326747F7",
        "ParentEventID": [
          "69405D2E8430CE57"
        ],
        "Label": "waited",
        "Title": "X-Trace Task",
        "Host": "pinky19.mpi-sws.org",
        "Duration": "3970",
        "HRT": 26966712833202845,
        "Operation": "waited",
        "Timestamp": "1557750352773.385010",
        "TenantClass": 0,
        "Source": "SocketIOWithTimeout.java:335",
        "ThreadID": 1,
        "ThreadName": "",
        "EventID": "E02885A68034AB9F",
        "ProcessID": 2801
      },
      {
        "Cycles": 0,
        "Agent": "edu.brown.cs.systems.xtrace.logging.BaggageWrappers",
        "ProcessName": "Read",
        "TaskID": "446C8222326747F7",
        "ParentEventID": [
          "69359CF5B2C6148B",
          "C8D6785B5E64E60F"
        ],
        "Label": "Merged current baggage with other baggage",
        "Title": "X-Trace Task",
        "Host": "pinky19.mpi-sws.org",
        "HRT": 26966712832968443,
        "Operation": "join",
        "Timestamp": "1557750352773.150635",
        "TenantClass": 0,
        "Source": "Client.java:1545",
        "ThreadID": 1,
        "ThreadName": "",
        "EventID": "EC4AEC0975B045FB",
        "ProcessID": 2801
      },
      {
        "Cycles": 0,
        "Agent": "edu.brown.cs.systems.xtrace.logging.BaggageWrappers",
        "ProcessName": "Read",
        "TaskID": "446C8222326747F7",
        "ParentEventID": [
          "E02885A68034AB9F"
        ],
        "Label": "Forking current baggage with Baggage.fork()",
        "Title": "X-Trace Task",
        "Host": "pinky19.mpi-sws.org",
        "HRT": 26966712833243958,
        "Operation": "fork",
        "Timestamp": "1557750352773.426025",
        "TenantClass": 0,
        "Source": "DataTransferProtoUtil.java:94",
        "ThreadID": 1,
        "ThreadName": "",
        "EventID": "D8701B1DA0C32F20",
        "ProcessID": 2801
      },
      {
        "Cycles": 0,
        "Agent": "edu.brown.cs.systems.xtrace.logging.XTraceInit",
        "ProcessName": "Data",
        "TaskID": "446C8222326747F7",
        "ParentEventID": [
          "4A5DD0C74FAFF709"
        ],
        "Label": "Thread.setName: DataXceiver for client DFSClient_NONMAPREDUCE_310321604_1 at /139.19.171.63:56000 [Sending block BP-1633380353-139.19.171.63-1554193446451:blk_1073759379_18555]",
        "Title": "X-Trace Task",
        "Host": "pinky19.mpi-sws.org",
        "HRT": 26966712833425546,
        "Timestamp": "1557750352773.640137",
        "TenantClass": 0,
        "Source": "DataXceiver.java:168",
        "ThreadID": 38196,
        "ThreadName": "",
        "EventID": "5C9C78B11A5CAD69",
        "BaggageBytes": "[[248 5] [240 0] [0 68 108 130 34 50 103 71 247] [240 1] [0 74 93 208 199 79 175 247 9] [240 3] [0 2]]",
        "ProcessID": 2319
      },
      {
        "Cycles": 0,
        "Agent": "Execution-CPU",
        "ProcessName": "Data",
        "TaskID": "446C8222326747F7",
        "ParentEventID": [
          "D8701B1DA0C32F20"
        ],
        "Label": "set",
        "Title": "X-Trace Task",
        "Host": "pinky19.mpi-sws.org",
        "HRT": 26966712833388711,
        "Operation": "set",
        "Timestamp": "1557750352773.603271",
        "TenantClass": 0,
        "Source": "Receiver.java:117",
        "ThreadID": 38196,
        "ThreadName": "",
        "EventID": "4A5DD0C74FAFF709",
        "BaggageBytes": "[[248 5] [240 0] [0 68 108 130 34 50 103 71 247] [240 1] [0 216 112 27 29 160 195 47 32] [240 3] [0 2]]",
        "ProcessID": 2319
      },
      {
        "Cycles": 0,
        "Agent": "edu.brown.cs.systems.xtrace.logging.BaggageWrappers",
        "ProcessName": "Data",
        "TaskID": "446C8222326747F7",
        "ParentEventID": [
          "5C9C78B11A5CAD69"
        ],
        "Label": "Forking current baggage with Baggage.fork()",
        "Title": "X-Trace Task",
        "Host": "pinky19.mpi-sws.org",
        "HRT": 26966712833502444,
        "Operation": "fork",
        "Timestamp": "1557750352773.717041",
        "TenantClass": 0,
        "Source": "DataXceiver.java:1257",
        "ThreadID": 38196,
        "ThreadName": "",
        "EventID": "E98E1FAAA7075090",
        "BaggageBytes": "[[248 5] [240 0] [0 68 108 130 34 50 103 71 247] [240 1] [0 92 156 120 177 26 92 173 105] [240 3] [0 2]]",
        "ProcessID": 2319
      },
      {
        "Cycles": 0,
        "Agent": "edu.brown.cs.systems.xtrace.logging.BaggageWrappers",
        "ProcessName": "Data",
        "TaskID": "446C8222326747F7",
        "ParentEventID": [
          "E98E1FAAA7075090"
        ],
        "Label": "Forking current baggage with Baggage.fork()",
        "Title": "X-Trace Task",
        "Host": "pinky19.mpi-sws.org",
        "HRT": 26966712833572625,
        "Operation": "fork",
        "Timestamp": "1557750352773.787109",
        "TenantClass": 0,
        "Source": "PacketHeader.java:95",
        "ThreadID": 38196,
        "ThreadName": "",
        "EventID": "43B5DD32E9FAF22D",
        "BaggageBytes": "[[248 5] [240 0] [0 68 108 130 34 50 103 71 247] [240 1] [0 233 142 31 170 167 7 80 144] [240 3] [0 2]]",
        "ProcessID": 2319
      },
      {
        "Cycles": 0,
        "Agent": "Execution-Sleep",
        "ProcessName": "Read",
        "TaskID": "446C8222326747F7",
        "ParentEventID": [
          "D8701B1DA0C32F20"
        ],
        "Label": "waited",
        "Title": "X-Trace Task",
        "Host": "pinky19.mpi-sws.org",
        "Duration": "216425",
        "HRT": 26966712833567829,
        "Operation": "waited",
        "Timestamp": "1557750352773.750000",
        "TenantClass": 0,
        "Source": "SocketIOWithTimeout.java:335",
        "ThreadID": 1,
        "ThreadName": "",
        "EventID": "A3ACCB5679C74654",
        "ProcessID": 2801
      },
      {
        "Cycles": 0,
        "Agent": "edu.brown.cs.systems.xtrace.logging.BaggageWrappers",
        "ProcessName": "Read",
        "TaskID": "446C8222326747F7",
        "ParentEventID": [
          "E98E1FAAA7075090",
          "A3ACCB5679C74654"
        ],
        "Label": "Merged current baggage with other baggage",
        "Title": "X-Trace Task",
        "Host": "pinky19.mpi-sws.org",
        "HRT": 26966712833650945,
        "Operation": "join",
        "Timestamp": "1557750352773.833008",
        "TenantClass": 0,
        "Source": "RemoteBlockReader2.java:429",
        "ThreadID": 1,
        "ThreadName": "",
        "EventID": "E5F06CFA129066A5",
        "ProcessID": 2801
      },
      {
        "Cycles": 0,
        "Agent": "Execution-Sleep",
        "ProcessName": "Data",
        "TaskID": "446C8222326747F7",
        "ParentEventID": [
          "43B5DD32E9FAF22D"
        ],
        "Label": "waited",
        "Title": "X-Trace Task",
        "Host": "pinky19.mpi-sws.org",
        "Duration": "4892",
        "HRT": 26966712833639641,
        "Operation": "waited",
        "Timestamp": "1557750352773.854248",
        "TenantClass": 0,
        "Source": "SocketIOWithTimeout.java:335",
        "ThreadID": 38196,
        "ThreadName": "",
        "EventID": "40962ADBA822DEE8",
        "BaggageBytes": "[[248 5] [240 0] [0 68 108 130 34 50 103 71 247] [240 1] [0 67 181 221 50 233 250 242 45] [240 3] [0 2]]",
        "ProcessID": 2319
      },
      {
        "Cycles": 0,
        "Agent": "edu.brown.cs.systems.xtrace.logging.BaggageWrappers",
        "ProcessName": "Data",
        "TaskID": "446C8222326747F7",
        "ParentEventID": [
          "40962ADBA822DEE8"
        ],
        "Label": "Forking current baggage with Baggage.fork()",
        "Title": "X-Trace Task",
        "Host": "pinky19.mpi-sws.org",
        "HRT": 26966712833720478,
        "Operation": "fork",
        "Timestamp": "1557750352773.935059",
        "TenantClass": 0,
        "Source": "PacketHeader.java:95",
        "ThreadID": 38196,
        "ThreadName": "",
        "EventID": "2D57196A41E3C008",
        "BaggageBytes": "[[248 5] [240 0] [0 68 108 130 34 50 103 71 247] [240 1] [0 64 150 42 219 168 34 222 232] [240 3] [0 2]]",
        "ProcessID": 2319
      },
      {
        "Cycles": 0,
        "Agent": "edu.brown.cs.systems.xtrace.logging.BaggageWrappers",
        "ProcessName": "Read",
        "TaskID": "446C8222326747F7",
        "ParentEventID": [
          "E5F06CFA129066A5",
          "43B5DD32E9FAF22D"
        ],
        "Label": "Merged current baggage with other baggage",
        "Title": "X-Trace Task",
        "Host": "pinky19.mpi-sws.org",
        "HRT": 26966712833761501,
        "Operation": "join",
        "Timestamp": "1557750352773.943604",
        "TenantClass": 0,
        "Source": "PacketHeader.java:168",
        "ThreadID": 1,
        "ThreadName": "",
        "EventID": "55CC16976E3481FF",
        "ProcessID": 2801
      },
      {
        "Cycles": 0,
        "Agent": "edu.brown.cs.systems.xtrace.logging.BaggageWrappers",
        "ProcessName": "Read",
        "TaskID": "446C8222326747F7",
        "ParentEventID": [
          "F8D689B94A77400F"
        ],
        "Label": "Forking current baggage with Baggage.fork()",
        "Title": "X-Trace Task",
        "Host": "pinky19.mpi-sws.org",
        "HRT": 26966712833900567,
        "Operation": "fork",
        "Timestamp": "1557750352774.082764",
        "TenantClass": 0,
        "Source": "RemoteBlockReader2.java:361",
        "ThreadID": 1,
        "ThreadName": "",
        "EventID": "B0B9164631E8D12A",
        "ProcessID": 2801
      },
      {
        "Cycles": 0,
        "Agent": "edu.brown.cs.systems.xtrace.logging.BaggageWrappers",
        "ProcessName": "Read",
        "TaskID": "446C8222326747F7",
        "ParentEventID": [
          "2D57196A41E3C008",
          "55CC16976E3481FF"
        ],
        "Label": "Merged current baggage with other baggage",
        "Title": "X-Trace Task",
        "Host": "pinky19.mpi-sws.org",
        "HRT": 26966712833889591,
        "Operation": "join",
        "Timestamp": "1557750352774.071777",
        "TenantClass": 0,
        "Source": "PacketHeader.java:168",
        "ThreadID": 1,
        "ThreadName": "",
        "EventID": "F8D689B94A77400F",
        "ProcessID": 2801
      },
      {
        "Cycles": 0,
        "Agent": "Execution-Sleep",
        "ProcessName": "Data",
        "TaskID": "446C8222326747F7",
        "ParentEventID": [
          "2D57196A41E3C008"
        ],
        "Label": "waited",
        "Title": "X-Trace Task",
        "Host": "pinky19.mpi-sws.org",
        "Duration": "137023",
        "HRT": 26966712833945258,
        "Operation": "waited",
        "Timestamp": "1557750352774.159668",
        "TenantClass": 0,
        "Source": "SocketIOWithTimeout.java:335",
        "ThreadID": 38196,
        "ThreadName": "",
        "EventID": "93211891EB670515",
        "BaggageBytes": "[[248 5] [240 0] [0 68 108 130 34 50 103 71 247] [240 1] [0 45 87 25 106 65 227 192 8] [240 3] [0 2]]",
        "ProcessID": 2319
      },
      {
        "Cycles": 0,
        "Agent": "edu.brown.cs.systems.xtrace.logging.BaggageWrappers",
        "ProcessName": "Data",
        "TaskID": "446C8222326747F7",
        "ParentEventID": [
          "93211891EB670515",
          "B0B9164631E8D12A"
        ],
        "Label": "Merged current baggage with other baggage",
        "Title": "X-Trace Task",
        "Host": "pinky19.mpi-sws.org",
        "HRT": 26966712833999635,
        "Operation": "join",
        "Timestamp": "1557750352774.214111",
        "TenantClass": 0,
        "Source": "DataXceiver.java:574",
        "ThreadID": 38196,
        "ThreadName": "",
        "EventID": "0DA2800E7F7562F0",
        "BaggageBytes": "[[248 5] [240 0] [0 68 108 130 34 50 103 71 247] [240 1] [0 147 33 24 145 235 103 5 21] [0 176 185 22 70 49 232 209 42] [240 3] [0 2]]",
        "ProcessID": 2319
      },
      {
        "Cycles": 0,
        "Agent": "edu.brown.cs.systems.xtrace.logging.BaggageWrappers",
        "ProcessName": "Read",
        "TaskID": "446C8222326747F7",
        "ParentEventID": [
          "B0B9164631E8D12A"
        ],
        "Label": "Forking current baggage with Baggage.fork()",
        "Title": "X-Trace Task",
        "Host": "pinky19.mpi-sws.org",
        "HRT": 26966712833991028,
        "Operation": "fork",
        "Timestamp": "1557750352774.173096",
        "TenantClass": 0,
        "Source": "DataTransferProtoUtil.java:94",
        "ThreadID": 1,
        "ThreadName": "",
        "EventID": "DC765A7C20B38B2B",
        "ProcessID": 2801
      },
      {
        "Cycles": 0,
        "Agent": "Execution-CPU",
        "ProcessName": "Data",
        "TaskID": "446C8222326747F7",
        "ParentEventID": [
          "DC765A7C20B38B2B"
        ],
        "Label": "set",
        "Title": "X-Trace Task",
        "Host": "pinky19.mpi-sws.org",
        "HRT": 26966712834073299,
        "Operation": "set",
        "Timestamp": "1557750352774.287842",
        "TenantClass": 0,
        "Source": "Receiver.java:117",
        "ThreadID": 38196,
        "ThreadName": "",
        "EventID": "6F8A443EC3EF8FE4",
        "BaggageBytes": "[[248 5] [240 0] [0 68 108 130 34 50 103 71 247] [240 1] [0 220 118 90 124 32 179 139 43] [240 3] [0 2]]",
        "ProcessID": 2319
      },
      {
        "Cycles": 0,
        "Agent": "Execution-CPU",
        "ProcessName": "Data",
        "TaskID": "446C8222326747F7",
        "ParentEventID": [
          "0DA2800E7F7562F0"
        ],
        "Label": "unset",
        "Title": "X-Trace Task",
        "Host": "pinky19.mpi-sws.org",
        "Duration": "609000",
        "HRT": 26966712834022440,
        "Operation": "unset",
        "Timestamp": "1557750352774.236816",
        "TenantClass": 0,
        "Source": "DataXceiver.java:261",
        "ThreadID": 38196,
        "ThreadName": "",
        "EventID": "B30B8CEE40B80534",
        "BaggageBytes": "[[248 5] [240 0] [0 68 108 130 34 50 103 71 247] [240 1] [0 13 162 128 14 127 117 98 240] [240 3] [0 2]]",
        "ProcessID": 2319
      },
      {
        "Cycles": 0,
        "Agent": "edu.brown.cs.systems.xtrace.logging.XTraceInit",
        "ProcessName": "Data",
        "TaskID": "446C8222326747F7",
        "ParentEventID": [
          "6F8A443EC3EF8FE4"
        ],
        "Label": "Thread.setName: DataXceiver for client DFSClient_NONMAPREDUCE_310321604_1 at /139.19.171.63:56000 [Sending block BP-1633380353-139.19.171.63-1554193446451:blk_1073759379_18555]",
        "Title": "X-Trace Task",
        "Host": "pinky19.mpi-sws.org",
        "HRT": 26966712834099975,
        "Timestamp": "1557750352774.314453",
        "TenantClass": 0,
        "Source": "DataXceiver.java:168",
        "ThreadID": 38196,
        "ThreadName": "",
        "EventID": "77913485820092AC",
        "BaggageBytes": "[[248 5] [240 0] [0 68 108 130 34 50 103 71 247] [240 1] [0 111 138 68 62 195 239 143 228] [240 3] [0 2]]",
        "ProcessID": 2319
      },
      {
        "Cycles": 0,
        "Agent": "edu.brown.cs.systems.xtrace.logging.BaggageWrappers",
        "ProcessName": "Data",
        "TaskID": "446C8222326747F7",
        "ParentEventID": [
          "77913485820092AC"
        ],
        "Label": "Forking current baggage with Baggage.fork()",
        "Title": "X-Trace Task",
        "Host": "pinky19.mpi-sws.org",
        "HRT": 26966712834163714,
        "Operation": "fork",
        "Timestamp": "1557750352774.378174",
        "TenantClass": 0,
        "Source": "DataXceiver.java:1257",
        "ThreadID": 38196,
        "ThreadName": "",
        "EventID": "DF6771A5F2DB6440",
        "BaggageBytes": "[[248 5] [240 0] [0 68 108 130 34 50 103 71 247] [240 1] [0 119 145 52 133 130 0 146 172] [240 3] [0 2]]",
        "ProcessID": 2319
      },
      {
        "Cycles": 0,
        "Agent": "Execution-Sleep",
        "ProcessName": "Read",
        "TaskID": "446C8222326747F7",
        "ParentEventID": [
          "DC765A7C20B38B2B"
        ],
        "Label": "waited",
        "Title": "X-Trace Task",
        "Host": "pinky19.mpi-sws.org",
        "Duration": "133970",
        "HRT": 26966712834218088,
        "Operation": "waited",
        "Timestamp": "1557750352774.400146",
        "TenantClass": 0,
        "Source": "SocketIOWithTimeout.java:335",
        "ThreadID": 1,
        "ThreadName": "",
        "EventID": "1B6B1E4626DDEDD2",
        "ProcessID": 2801
      },
      {
        "Cycles": 0,
        "Agent": "edu.brown.cs.systems.xtrace.logging.BaggageWrappers",
        "ProcessName": "Data",
        "TaskID": "446C8222326747F7",
        "ParentEventID": [
          "DF6771A5F2DB6440"
        ],
        "Label": "Forking current baggage with Baggage.fork()",
        "Title": "X-Trace Task",
        "Host": "pinky19.mpi-sws.org",
        "HRT": 26966712834219678,
        "Operation": "fork",
        "Timestamp": "1557750352774.434082",
        "TenantClass": 0,
        "Source": "PacketHeader.java:95",
        "ThreadID": 38196,
        "ThreadName": "",
        "EventID": "B869F320CB52D3A2",
        "BaggageBytes": "[[248 5] [240 0] [0 68 108 130 34 50 103 71 247] [240 1] [0 223 103 113 165 242 219 100 64] [240 3] [0 2]]",
        "ProcessID": 2319
      },
      {
        "Cycles": 0,
        "Agent": "Execution-Sleep",
        "ProcessName": "Data",
        "TaskID": "446C8222326747F7",
        "ParentEventID": [
          "B869F320CB52D3A2"
        ],
        "Label": "waited",
        "Title": "X-Trace Task",
        "Host": "pinky19.mpi-sws.org",
        "Duration": "3817",
        "HRT": 26966712834275937,
        "Operation": "waited",
        "Timestamp": "1557750352774.490479",
        "TenantClass": 0,
        "Source": "SocketIOWithTimeout.java:335",
        "ThreadID": 38196,
        "ThreadName": "",
        "EventID": "6745C2DA1D238652",
        "BaggageBytes": "[[248 5] [240 0] [0 68 108 130 34 50 103 71 247] [240 1] [0 184 105 243 32 203 82 211 162] [240 3] [0 2]]",
        "ProcessID": 2319
      },
      {
        "Cycles": 0,
        "Agent": "edu.brown.cs.systems.xtrace.logging.BaggageWrappers",
        "ProcessName": "Data",
        "TaskID": "446C8222326747F7",
        "ParentEventID": [
          "6745C2DA1D238652"
        ],
        "Label": "Forking current baggage with Baggage.fork()",
        "Title": "X-Trace Task",
        "Host": "pinky19.mpi-sws.org",
        "HRT": 26966712834341084,
        "Operation": "fork",
        "Timestamp": "1557750352774.555664",
        "TenantClass": 0,
        "Source": "PacketHeader.java:95",
        "ThreadID": 38196,
        "ThreadName": "",
        "EventID": "F4C4BABDA09385B2",
        "BaggageBytes": "[[248 5] [240 0] [0 68 108 130 34 50 103 71 247] [240 1] [0 103 69 194 218 29 35 134 82] [240 3] [0 2]]",
        "ProcessID": 2319
      },
      {
        "Cycles": 0,
        "Agent": "edu.brown.cs.systems.xtrace.logging.BaggageWrappers",
        "ProcessName": "Read",
        "TaskID": "446C8222326747F7",
        "ParentEventID": [
          "1B6B1E4626DDEDD2",
          "DF6771A5F2DB6440"
        ],
        "Label": "Merged current baggage with other baggage",
        "Title": "X-Trace Task",
        "Host": "pinky19.mpi-sws.org",
        "HRT": 26966712834310835,
        "Operation": "join",
        "Timestamp": "1557750352774.492920",
        "TenantClass": 0,
        "Source": "RemoteBlockReader2.java:429",
        "ThreadID": 1,
        "ThreadName": "",
        "EventID": "5D158CCC3E35FB5E",
        "ProcessID": 2801
      },
      {
        "Cycles": 0,
        "Agent": "edu.brown.cs.systems.xtrace.logging.BaggageWrappers",
        "ProcessName": "Read",
        "TaskID": "446C8222326747F7",
        "ParentEventID": [
          "5D158CCC3E35FB5E",
          "B869F320CB52D3A2"
        ],
        "Label": "Merged current baggage with other baggage",
        "Title": "X-Trace Task",
        "Host": "pinky19.mpi-sws.org",
        "HRT": 26966712834414895,
        "Operation": "join",
        "Timestamp": "1557750352774.596924",
        "TenantClass": 0,
        "Source": "PacketHeader.java:168",
        "ThreadID": 1,
        "ThreadName": "",
        "EventID": "97474D5D0BDAD37E",
        "ProcessID": 2801
      },
      {
        "Cycles": 0,
        "Agent": "Execution-Sleep",
        "ProcessName": "Data",
        "TaskID": "446C8222326747F7",
        "ParentEventID": [
          "F4C4BABDA09385B2"
        ],
        "Label": "waited",
        "Title": "X-Trace Task",
        "Host": "pinky19.mpi-sws.org",
        "Duration": "3441",
        "HRT": 26966712834397566,
        "Operation": "waited",
        "Timestamp": "1557750352774.612061",
        "TenantClass": 0,
        "Source": "SocketIOWithTimeout.java:335",
        "ThreadID": 38196,
        "ThreadName": "",
        "EventID": "49ABFA03F7353B2C",
        "BaggageBytes": "[[248 5] [240 0] [0 68 108 130 34 50 103 71 247] [240 1] [0 244 196 186 189 160 147 133 178] [240 3] [0 2]]",
        "ProcessID": 2319
      },
      {
        "Cycles": 0,
        "Agent": "edu.brown.cs.systems.xtrace.logging.BaggageWrappers",
        "ProcessName": "Data",
        "TaskID": "446C8222326747F7",
        "ParentEventID": [
          "49ABFA03F7353B2C"
        ],
        "Label": "Forking current baggage with Baggage.fork()",
        "Title": "X-Trace Task",
        "Host": "pinky19.mpi-sws.org",
        "HRT": 26966712834462583,
        "Operation": "fork",
        "Timestamp": "1557750352774.677002",
        "TenantClass": 0,
        "Source": "PacketHeader.java:95",
        "ThreadID": 38196,
        "ThreadName": "",
        "EventID": "506A4EDAEB6639DB",
        "BaggageBytes": "[[248 5] [240 0] [0 68 108 130 34 50 103 71 247] [240 1] [0 73 171 250 3 247 53 59 44] [240 3] [0 2]]",
        "ProcessID": 2319
      },
      {
        "Cycles": 0,
        "Agent": "Execution-Sleep",
        "ProcessName": "Data",
        "TaskID": "446C8222326747F7",
        "ParentEventID": [
          "506A4EDAEB6639DB"
        ],
        "Label": "waited",
        "Title": "X-Trace Task",
        "Host": "pinky19.mpi-sws.org",
        "Duration": "3264",
        "HRT": 26966712834515748,
        "Operation": "waited",
        "Timestamp": "1557750352774.730225",
        "TenantClass": 0,
        "Source": "SocketIOWithTimeout.java:335",
        "ThreadID": 38196,
        "ThreadName": "",
        "EventID": "39FE9FC544BC85BB",
        "BaggageBytes": "[[248 5] [240 0] [0 68 108 130 34 50 103 71 247] [240 1] [0 80 106 78 218 235 102 57 219] [240 3] [0 2]]",
        "ProcessID": 2319
      },
      {
        "Cycles": 0,
        "Agent": "Execution-CPU",
        "ProcessName": "Data",
        "TaskID": "446C8222326747F7",
        "ParentEventID": [
          "753277F33C0CDBBA"
        ],
        "Label": "unset",
        "Title": "X-Trace Task",
        "Host": "pinky19.mpi-sws.org",
        "Duration": "619474",
        "HRT": 26966712834711688,
        "Operation": "unset",
        "Timestamp": "1557750352774.926270",
        "TenantClass": 0,
        "Source": "DataXceiver.java:261",
        "ThreadID": 38196,
        "ThreadName": "",
        "EventID": "8B154C56731AA318",
        "BaggageBytes": "[[248 5] [240 0] [0 68 108 130 34 50 103 71 247] [240 1] [0 117 50 119 243 60 12 219 186] [240 3] [0 2]]",
        "ProcessID": 2319
      },
      {
        "Cycles": 0,
        "Agent": "edu.brown.cs.systems.xtrace.logging.BaggageWrappers",
        "ProcessName": "Data",
        "TaskID": "446C8222326747F7",
        "ParentEventID": [
          "39FE9FC544BC85BB"
        ],
        "Label": "Forking current baggage with Baggage.fork()",
        "Title": "X-Trace Task",
        "Host": "pinky19.mpi-sws.org",
        "HRT": 26966712834578817,
        "Operation": "fork",
        "Timestamp": "1557750352774.793213",
        "TenantClass": 0,
        "Source": "PacketHeader.java:95",
        "ThreadID": 38196,
        "ThreadName": "",
        "EventID": "753277F33C0CDBBA",
        "BaggageBytes": "[[248 5] [240 0] [0 68 108 130 34 50 103 71 247] [240 1] [0 57 254 159 197 68 188 133 187] [240 3] [0 2]]",
        "ProcessID": 2319
      },
      {
        "Cycles": 0,
        "Agent": "edu.brown.cs.systems.retro.benchmarks.hdfs_client.Reader",
        "ProcessName": "Read",
        "TaskID": "446C8222326747F7",
        "ParentEventID": [
          "0"
        ],
        "Label": "Reading file",
        "Title": "X-Trace Task",
        "Host": "pinky19.mpi-sws.org",
        "HRT": 26966712832316600,
        "Timestamp": "1557750352772.498779",
        "TenantClass": 0,
        "ThreadID": 1,
        "ThreadName": "",
        "EventID": "A0D8CE69A224D39F",
        "ProcessID": 2801,
        "Tag": [
          "reader_100kb",
          "Read Size: 102400"
        ]
      }
    ]
  }
]