[
  {
    "id": "1AA6D8F482692938",
    "reports": [
      {
        "Cycles": 0,
        "Agent": "Execution-CPU",
        "ProcessName": "Read",
        "TaskID": "1AA6D8F482692938",
        "ParentEventID": [
          "68B1266AF66DD7F3"
        ],
        "Label": "unset",
        "Title": "X-Trace Task",
        "Host": "pinky19.mpi-sws.org",
        "Duration": "22059853",
        "HRT": 25491937106580794,
        "Operation": "unset",
        "Timestamp": "1556275577046.977539",
        "TenantClass": 0,
        "Source": "Client.java:1027",
        "ThreadID": 1,
        "ThreadName": "",
        "EventID": "4769376D1556855D",
        "ProcessID": 21035
      },
      {
        "Cycles": 0,
        "Agent": "org.apache.hadoop.ipc.ProtobufRpcEngine",
        "ProcessName": "Read",
        "TaskID": "1AA6D8F482692938",
        "ParentEventID": [
          "2B5230320A36A769"
        ],
        "Label": "Invoking org.apache.hadoop.hdfs.protocol.ClientProtocol.getBlockLocations",
        "Title": "X-Trace Task",
        "Host": "pinky19.mpi-sws.org",
        "HRT": 25491937106559606,
        "Timestamp": "1556275577046.956299",
        "TenantClass": 0,
        "Source": "ProtobufRpcEngine.java:228",
        "ThreadID": 1,
        "ThreadName": "",
        "EventID": "68B1266AF66DD7F3",
        "ProcessID": 21035
      },
      {
        "Cycles": 0,
        "Agent": "edu.brown.cs.systems.retro.benchmarks.hdfs_client.Reader",
        "ProcessName": "Read",
        "TaskID": "1AA6D8F482692938",
        "ParentEventID": [
          "71997CD239F8BB1F"
        ],
        "Label": "Reading file",
        "Title": "X-Trace Task",
        "Host": "pinky19.mpi-sws.org",
        "HRT": 25491937106509460,
        "Timestamp": "1556275577046.906250",
        "TenantClass": 0,
        "ThreadID": 1,
        "ThreadName": "",
        "EventID": "2B5230320A36A769",
        "ProcessID": 21035
      },
      {
        "Cycles": 0,
        "Agent": "Execution-CPU",
        "ProcessName": "Read",
        "TaskID": "1AA6D8F482692938",
        "ParentEventID": [
          "4769376D1556855D"
        ],
        "Label": "set",
        "Title": "X-Trace Task",
        "Host": "pinky19.mpi-sws.org",
        "HRT": 25491937106631530,
        "Operation": "set",
        "Timestamp": "1556275577047.028320",
        "TenantClass": 0,
        "Source": "Client.java:1032",
        "ThreadID": 41,
        "ThreadName": "",
        "EventID": "12EE3E91C0B15277",
        "ProcessID": 21035
      },
      {
        "Cycles": 0,
        "Agent": "edu.brown.cs.systems.xtrace.logging.BaggageWrappers",
        "ProcessName": "Read",
        "TaskID": "1AA6D8F482692938",
        "ParentEventID": [
          "12EE3E91C0B15277"
        ],
        "Label": "Forking current baggage with Baggage.fork()",
        "Title": "X-Trace Task",
        "Host": "pinky19.mpi-sws.org",
        "HRT": 25491937106655455,
        "Operation": "fork",
        "Timestamp": "1556275577047.052246",
        "TenantClass": 0,
        "Source": "Client.java:1043",
        "ThreadID": 41,
        "ThreadName": "",
        "EventID": "4D6A3947E2C3D9AC",
        "ProcessID": 21035
      },
      {
        "Cycles": 0,
        "Agent": "Execution-CPU",
        "ProcessName": "Read",
        "TaskID": "1AA6D8F482692938",
        "ParentEventID": [
          "4D6A3947E2C3D9AC"
        ],
        "Label": "unset",
        "Title": "X-Trace Task",
        "Host": "pinky19.mpi-sws.org",
        "Duration": "70615",
        "HRT": 25491937106725047,
        "Operation": "unset",
        "Timestamp": "1556275577047.121826",
        "TenantClass": 0,
        "Source": "Client.java:1062",
        "ThreadID": 41,
        "ThreadName": "",
        "EventID": "79553C64F6A0DD37",
        "ProcessID": 21035
      },
      {
        "Cycles": 0,
        "Agent": "Execution-CPU",
        "ProcessName": "Name",
        "TaskID": "1AA6D8F482692938",
        "ParentEventID": [
          "4D6A3947E2C3D9AC"
        ],
        "Label": "set",
        "Title": "X-Trace Task",
        "Host": "pinky19.mpi-sws.org",
        "HRT": 25491937106800484,
        "Operation": "set",
        "Timestamp": "1556275577047.199219",
        "TenantClass": 0,
        "Source": "Server.java:1840",
        "ThreadID": 48,
        "ThreadName": "",
        "EventID": "D802B1210FA885F0",
        "BaggageBytes": "[[248 5] [240 0] [0 26 166 216 244 130 105 41 56] [240 1] [0 77 106 57 71 226 195 217 172] [240 3] [0 2]]",
        "ProcessID": 2171
      },
      {
        "Cycles": 0,
        "Agent": "Execution-CPU",
        "ProcessName": "Read",
        "TaskID": "1AA6D8F482692938",
        "ParentEventID": [
          "79553C64F6A0DD37"
        ],
        "Label": "set",
        "Title": "X-Trace Task",
        "Host": "pinky19.mpi-sws.org",
        "HRT": 25491937106750008,
        "Operation": "set",
        "Timestamp": "1556275577047.146729",
        "TenantClass": 0,
        "Source": "Client.java:1104",
        "ThreadID": 1,
        "ThreadName": "",
        "EventID": "DB9AB56BE031EC17",
        "ProcessID": 21035
      },
      {
        "Cycles": 0,
        "Agent": "edu.brown.cs.systems.xtrace.logging.BaggageWrappers",
        "ProcessName": "Name",
        "TaskID": "1AA6D8F482692938",
        "ParentEventID": [
          "D802B1210FA885F0"
        ],
        "Label": "Forking current baggage with Baggage.fork()",
        "Title": "X-Trace Task",
        "Host": "pinky19.mpi-sws.org",
        "HRT": 25491937106830941,
        "Operation": "fork",
        "Timestamp": "1556275577047.229736",
        "TenantClass": 0,
        "Source": "Server.java:550",
        "ThreadID": 48,
        "ThreadName": "",
        "EventID": "14C595D630AF9FC8",
        "BaggageBytes": "[[248 5] [240 0] [0 26 166 216 244 130 105 41 56] [240 1] [0 216 2 177 33 15 168 133 240] [240 3] [0 2]]",
        "ProcessID": 2171
      },
      {
        "Cycles": 0,
        "Agent": "Execution-CPU",
        "ProcessName": "Name",
        "TaskID": "1AA6D8F482692938",
        "ParentEventID": [
          "14C595D630AF9FC8"
        ],
        "Label": "unset",
        "Title": "X-Trace Task",
        "Host": "pinky19.mpi-sws.org",
        "Duration": "23691",
        "HRT": 25491937106851113,
        "Operation": "unset",
        "Timestamp": "1556275577047.250000",
        "TenantClass": 0,
        "Source": "Server.java:1828",
        "ThreadID": 48,
        "ThreadName": "",
        "EventID": "947F763C4BD43788",
        "BaggageBytes": "[[248 5] [240 0] [0 26 166 216 244 130 105 41 56] [240 1] [0 20 197 149 214 48 175 159 200] [240 3] [0 2]]",
        "ProcessID": 2171
      },
      {
        "Cycles": 0,
        "Agent": "Execution-CPU",
        "ProcessName": "Name",
        "TaskID": "1AA6D8F482692938",
        "ParentEventID": [
          "14C595D630AF9FC8"
        ],
        "Label": "set",
        "Title": "X-Trace Task",
        "Host": "pinky19.mpi-sws.org",
        "HRT": 25491937106859532,
        "Operation": "set",
        "Timestamp": "1556275577047.258301",
        "TenantClass": 0,
        "Source": "Server.java:2071",
        "ThreadID": 59,
        "ThreadName": "",
        "EventID": "303C0B36B860568C",
        "BaggageBytes": "[[248 5] [240 0] [0 26 166 216 244 130 105 41 56] [240 1] [0 20 197 149 214 48 175 159 200] [240 3] [0 2]]",
        "ProcessID": 2171
      },
      {
        "Cycles": 0,
        "Agent": "org.apache.hadoop.ipc.Server",
        "ProcessName": "Name",
        "TaskID": "1AA6D8F482692938",
        "ParentEventID": [
          "303C0B36B860568C"
        ],
        "Label": "getBlockLocations in org.apache.hadoop.hdfs.protocol.ClientProtocol",
        "Title": "X-Trace Task",
        "Host": "pinky19.mpi-sws.org",
        "HRT": 25491937106896726,
        "Timestamp": "1556275577047.295410",
        "TenantClass": 0,
        "Source": "ProtobufRpcEngine.java:601",
        "ThreadID": 59,
        "ThreadName": "",
        "EventID": "F41C12A9974DB451",
        "BaggageBytes": "[[248 5] [240 0] [0 26 166 216 244 130 105 41 56] [240 1] [0 48 60 11 54 184 96 86 140] [240 3] [0 2]]",
        "ProcessID": 2171
      },
      {
        "Cycles": 0,
        "Agent": "edu.brown.cs.systems.xtrace.logging.BaggageWrappers",
        "ProcessName": "Name",
        "TaskID": "1AA6D8F482692938",
        "ParentEventID": [
          "9D92B3323E950BE9"
        ],
        "Label": "Forking current baggage with Baggage.fork()",
        "Title": "X-Trace Task",
        "Host": "pinky19.mpi-sws.org",
        "HRT": 25491937106985325,
        "Operation": "fork",
        "Timestamp": "1556275577047.384033",
        "TenantClass": 0,
        "Source": "Server.java:2398",
        "ThreadID": 59,
        "ThreadName": "",
        "EventID": "8414CD2B5F7B0F95",
        "BaggageBytes": "[[248 5] [240 0] [0 26 166 216 244 130 105 41 56] [240 1] [0 157 146 179 50 62 149 11 233] [240 3] [0 2]]",
        "ProcessID": 2171
      },
      {
        "Cycles": 0,
        "Agent": "org.apache.hadoop.hdfs.server.namenode.FSNamesystem.audit",
        "ProcessName": "Name",
        "TaskID": "1AA6D8F482692938",
        "ParentEventID": [
          "F41C12A9974DB451"
        ],
        "Label": "allowed=true\tugi=plascas (auth:SIMPLE)\tip=/139.19.171.63\tcmd=open\tsrc=/ds/vlf97RTvItqatkla\tdst=null\tperm=null\tproto=rpc",
        "Title": "X-Trace Task",
        "Host": "pinky19.mpi-sws.org",
        "HRT": 25491937106943644,
        "Timestamp": "1556275577047.342529",
        "TenantClass": 0,
        "Source": "FSNamesystem.java:8313",
        "ThreadID": 59,
        "ThreadName": "",
        "EventID": "9D92B3323E950BE9",
        "BaggageBytes": "[[248 5] [240 0] [0 26 166 216 244 130 105 41 56] [240 1] [0 244 28 18 169 151 77 180 81] [240 3] [0 2]]",
        "ProcessID": 2171
      },
      {
        "Cycles": 0,
        "Agent": "Execution-CPU",
        "ProcessName": "Name",
        "TaskID": "1AA6D8F482692938",
        "ParentEventID": [
          "8414CD2B5F7B0F95"
        ],
        "Label": "unset",
        "Title": "X-Trace Task",
        "Host": "pinky19.mpi-sws.org",
        "Duration": "201441",
        "HRT": 25491937107087152,
        "Operation": "unset",
        "Timestamp": "1556275577047.485840",
        "TenantClass": 0,
        "Source": "Server.java:1058",
        "ThreadID": 59,
        "ThreadName": "",
        "EventID": "ED2778A9D2F004ED",
        "BaggageBytes": "[[248 5] [240 0] [0 26 166 216 244 130 105 41 56] [240 1] [0 132 20 205 43 95 123 15 149] [240 3] [0 2]]",
        "ProcessID": 2171
      },
      {
        "Cycles": 0,
        "Agent": "Execution-CPU",
        "ProcessName": "Read",
        "TaskID": "1AA6D8F482692938",
        "ParentEventID": [
          "5D09950FC209F12C"
        ],
        "Label": "unset",
        "Title": "X-Trace Task",
        "Host": "pinky19.mpi-sws.org",
        "Duration": "8812",
        "HRT": 25491937107162499,
        "Operation": "unset",
        "Timestamp": "1556275577047.559082",
        "TenantClass": 0,
        "Source": "Client.java:1168",
        "ThreadID": 37,
        "ThreadName": "",
        "EventID": "FDFB02AC4FA496DD",
        "ProcessID": 21035
      },
      {
        "Cycles": 0,
        "Agent": "Execution-CPU",
        "ProcessName": "Read",
        "TaskID": "1AA6D8F482692938",
        "ParentEventID": [
          "8414CD2B5F7B0F95"
        ],
        "Label": "set",
        "Title": "X-Trace Task",
        "Host": "pinky19.mpi-sws.org",
        "HRT": 25491937107134257,
        "Operation": "set",
        "Timestamp": "1556275577047.531006",
        "TenantClass": 0,
        "Source": "Client.java:302",
        "ThreadID": 37,
        "ThreadName": "",
        "EventID": "5D09950FC209F12C",
        "ProcessID": 21035
      },
      {
        "Cycles": 0,
        "Agent": "Execution-Sleep",
        "ProcessName": "Read",
        "TaskID": "1AA6D8F482692938",
        "ParentEventID": [
          "DB9AB56BE031EC17"
        ],
        "Label": "waited",
        "Title": "X-Trace Task",
        "Host": "pinky19.mpi-sws.org",
        "Duration": "423624",
        "HRT": 25491937107187377,
        "Operation": "waited",
        "Timestamp": "1556275577047.583984",
        "TenantClass": 0,
        "Source": "Client.java:1537",
        "ThreadID": 1,
        "ThreadName": "",
        "EventID": "3210A49487770130",
        "ProcessID": 21035
      },
      {
        "Cycles": 0,
        "Agent": "org.apache.hadoop.ipc.ProtobufRpcEngine",
        "ProcessName": "Read",
        "TaskID": "1AA6D8F482692938",
        "ParentEventID": [
          "BECF6F69991CE94C"
        ],
        "Label": "org.apache.hadoop.hdfs.protocol.ClientProtocol.getBlockLocations completed",
        "Title": "X-Trace Task",
        "Host": "pinky19.mpi-sws.org",
        "HRT": 25491937107253757,
        "Timestamp": "1556275577047.650391",
        "TenantClass": 0,
        "Source": "ProtobufRpcEngine.java:275",
        "ThreadID": 1,
        "ThreadName": "",
        "EventID": "3853DECF2BD7F0AE",
        "ProcessID": 21035
      },
      {
        "Cycles": 0,
        "Agent": "edu.brown.cs.systems.xtrace.logging.BaggageWrappers",
        "ProcessName": "Read",
        "TaskID": "1AA6D8F482692938",
        "ParentEventID": [
          "3853DECF2BD7F0AE"
        ],
        "Label": "Forking current baggage with Baggage.fork()",
        "Title": "X-Trace Task",
        "Host": "pinky19.mpi-sws.org",
        "HRT": 25491937107331238,
        "Operation": "fork",
        "Timestamp": "1556275577047.728027",
        "TenantClass": 0,
        "Source": "DataTransferProtoUtil.java:94",
        "ThreadID": 1,
        "ThreadName": "",
        "EventID": "AFF0843884D4DF9A",
        "ProcessID": 21035
      },
      {
        "Cycles": 0,
        "Agent": "edu.brown.cs.systems.xtrace.logging.BaggageWrappers",
        "ProcessName": "Read",
        "TaskID": "1AA6D8F482692938",
        "ParentEventID": [
          "FDFB02AC4FA496DD",
          "3210A49487770130"
        ],
        "Label": "Merged current baggage with other baggage",
        "Title": "X-Trace Task",
        "Host": "pinky19.mpi-sws.org",
        "HRT": 25491937107200746,
        "Operation": "join",
        "Timestamp": "1556275577047.597412",
        "TenantClass": 0,
        "Source": "Client.java:1545",
        "ThreadID": 1,
        "ThreadName": "",
        "EventID": "BECF6F69991CE94C",
        "ProcessID": 21035
      },
      {
        "Cycles": 0,
        "Agent": "Execution-CPU",
        "ProcessName": "Data",
        "TaskID": "1AA6D8F482692938",
        "ParentEventID": [
          "AFF0843884D4DF9A"
        ],
        "Label": "set",
        "Title": "X-Trace Task",
        "Host": "pinky19.mpi-sws.org",
        "HRT": 25491937107444720,
        "Operation": "set",
        "Timestamp": "1556275577047.852539",
        "TenantClass": 0,
        "Source": "Receiver.java:117",
        "ThreadID": 9602,
        "ThreadName": "",
        "EventID": "47975B912CC8B142",
        "BaggageBytes": "[[248 5] [240 0] [0 26 166 216 244 130 105 41 56] [240 1] [0 175 240 132 56 132 212 223 154] [240 3] [0 2]]",
        "ProcessID": 2319
      },
      {
        "Cycles": 0,
        "Agent": "edu.brown.cs.systems.xtrace.logging.BaggageWrappers",
        "ProcessName": "Data",
        "TaskID": "1AA6D8F482692938",
        "ParentEventID": [
          "E366AD794337696F"
        ],
        "Label": "Forking current baggage with Baggage.fork()",
        "Title": "X-Trace Task",
        "Host": "pinky19.mpi-sws.org",
        "HRT": 25491937107550690,
        "Operation": "fork",
        "Timestamp": "1556275577047.958496",
        "TenantClass": 0,
        "Source": "DataXceiver.java:1257",
        "ThreadID": 9602,
        "ThreadName": "",
        "EventID": "36EB2D755D46C5BC",
        "BaggageBytes": "[[248 5] [240 0] [0 26 166 216 244 130 105 41 56] [240 1] [0 227 102 173 121 67 55 105 111] [240 3] [0 2]]",
        "ProcessID": 2319
      },
      {
        "Cycles": 0,
        "Agent": "edu.brown.cs.systems.xtrace.logging.XTraceInit",
        "ProcessName": "Data",
        "TaskID": "1AA6D8F482692938",
        "ParentEventID": [
          "47975B912CC8B142"
        ],
        "Label": "Thread.setName: DataXceiver for client DFSClient_NONMAPREDUCE_1377588049_1 at /139.19.171.63:36074 [Sending block BP-1633380353-139.19.171.63-1554193446451:blk_1073760547_19723]",
        "Title": "X-Trace Task",
        "Host": "pinky19.mpi-sws.org",
        "HRT": 25491937107482245,
        "Timestamp": "1556275577047.890137",
        "TenantClass": 0,
        "Source": "DataXceiver.java:168",
        "ThreadID": 9602,
        "ThreadName": "",
        "EventID": "E366AD794337696F",
        "BaggageBytes": "[[248 5] [240 0] [0 26 166 216 244 130 105 41 56] [240 1] [0 71 151 91 145 44 200 177 66] [240 3] [0 2]]",
        "ProcessID": 2319
      },
      {
        "Cycles": 0,
        "Agent": "edu.brown.cs.systems.xtrace.logging.BaggageWrappers",
        "ProcessName": "Data",
        "TaskID": "1AA6D8F482692938",
        "ParentEventID": [
          "36EB2D755D46C5BC"
        ],
        "Label": "Forking current baggage with Baggage.fork()",
        "Title": "X-Trace Task",
        "Host": "pinky19.mpi-sws.org",
        "HRT": 25491937107611667,
        "Operation": "fork",
        "Timestamp": "1556275577048.019531",
        "TenantClass": 0,
        "Source": "PacketHeader.java:95",
        "ThreadID": 9602,
        "ThreadName": "",
        "EventID": "A5BB23C2F27106CF",
        "BaggageBytes": "[[248 5] [240 0] [0 26 166 216 244 130 105 41 56] [240 1] [0 54 235 45 117 93 70 197 188] [240 3] [0 2]]",
        "ProcessID": 2319
      },
      {
        "Cycles": 0,
        "Agent": "Execution-Sleep",
        "ProcessName": "Data",
        "TaskID": "1AA6D8F482692938",
        "ParentEventID": [
          "A5BB23C2F27106CF"
        ],
        "Label": "waited",
        "Title": "X-Trace Task",
        "Host": "pinky19.mpi-sws.org",
        "Duration": "3978",
        "HRT": 25491937107667806,
        "Operation": "waited",
        "Timestamp": "1556275577048.075684",
        "TenantClass": 0,
        "Source": "SocketIOWithTimeout.java:335",
        "ThreadID": 9602,
        "ThreadName": "",
        "EventID": "BE090B79C53CCD4E",
        "BaggageBytes": "[[248 5] [240 0] [0 26 166 216 244 130 105 41 56] [240 1] [0 165 187 35 194 242 113 6 207] [240 3] [0 2]]",
        "ProcessID": 2319
      },
      {
        "Cycles": 0,
        "Agent": "Execution-Sleep",
        "ProcessName": "Read",
        "TaskID": "1AA6D8F482692938",
        "ParentEventID": [
          "AFF0843884D4DF9A"
        ],
        "Label": "waited",
        "Title": "X-Trace Task",
        "Host": "pinky19.mpi-sws.org",
        "Duration": "181772",
        "HRT": 25491937107611976,
        "Operation": "waited",
        "Timestamp": "1556275577048.008545",
        "TenantClass": 0,
        "Source": "SocketIOWithTimeout.java:335",
        "ThreadID": 1,
        "ThreadName": "",
        "EventID": "3DA68CB34BAEC198",
        "ProcessID": 21035
      },
      {
        "Cycles": 0,
        "Agent": "edu.brown.cs.systems.xtrace.logging.BaggageWrappers",
        "ProcessName": "Data",
        "TaskID": "1AA6D8F482692938",
        "ParentEventID": [
          "BE090B79C53CCD4E"
        ],
        "Label": "Forking current baggage with Baggage.fork()",
        "Title": "X-Trace Task",
        "Host": "pinky19.mpi-sws.org",
        "HRT": 25491937107725404,
        "Operation": "fork",
        "Timestamp": "1556275577048.133301",
        "TenantClass": 0,
        "Source": "PacketHeader.java:95",
        "ThreadID": 9602,
        "ThreadName": "",
        "EventID": "3B023B5E5A23B751",
        "BaggageBytes": "[[248 5] [240 0] [0 26 166 216 244 130 105 41 56] [240 1] [0 190 9 11 121 197 60 205 78] [240 3] [0 2]]",
        "ProcessID": 2319
      },
      {
        "Cycles": 0,
        "Agent": "edu.brown.cs.systems.xtrace.logging.BaggageWrappers",
        "ProcessName": "Read",
        "TaskID": "1AA6D8F482692938",
        "ParentEventID": [
          "36EB2D755D46C5BC",
          "3DA68CB34BAEC198"
        ],
        "Label": "Merged current baggage with other baggage",
        "Title": "X-Trace Task",
        "Host": "pinky19.mpi-sws.org",
        "HRT": 25491937107695402,
        "Operation": "join",
        "Timestamp": "1556275577048.092041",
        "TenantClass": 0,
        "Source": "RemoteBlockReader2.java:429",
        "ThreadID": 1,
        "ThreadName": "",
        "EventID": "820A4CC366DE43F5",
        "ProcessID": 21035
      },
      {
        "Cycles": 0,
        "Agent": "edu.brown.cs.systems.xtrace.logging.BaggageWrappers",
        "ProcessName": "Read",
        "TaskID": "1AA6D8F482692938",
        "ParentEventID": [
          "820A4CC366DE43F5",
          "A5BB23C2F27106CF"
        ],
        "Label": "Merged current baggage with other baggage",
        "Title": "X-Trace Task",
        "Host": "pinky19.mpi-sws.org",
        "HRT": 25491937107778796,
        "Operation": "join",
        "Timestamp": "1556275577048.175537",
        "TenantClass": 0,
        "Source": "PacketHeader.java:168",
        "ThreadID": 1,
        "ThreadName": "",
        "EventID": "C51399D8CB84AD9E",
        "ProcessID": 21035
      },
      {
        "Cycles": 0,
        "Agent": "edu.brown.cs.systems.xtrace.logging.BaggageWrappers",
        "ProcessName": "Read",
        "TaskID": "1AA6D8F482692938",
        "ParentEventID": [
          "3B023B5E5A23B751",
          "C51399D8CB84AD9E"
        ],
        "Label": "Merged current baggage with other baggage",
        "Title": "X-Trace Task",
        "Host": "pinky19.mpi-sws.org",
        "HRT": 25491937107847414,
        "Operation": "join",
        "Timestamp": "1556275577048.244141",
        "TenantClass": 0,
        "Source": "PacketHeader.java:168",
        "ThreadID": 1,
        "ThreadName": "",
        "EventID": "0F0CCAECF5A60CD8",
        "ProcessID": 21035
      },
      {
        "Cycles": 0,
        "Agent": "edu.brown.cs.systems.xtrace.logging.BaggageWrappers",
        "ProcessName": "Read",
        "TaskID": "1AA6D8F482692938",
        "ParentEventID": [
          "0F0CCAECF5A60CD8"
        ],
        "Label": "Forking current baggage with Baggage.fork()",
        "Title": "X-Trace Task",
        "Host": "pinky19.mpi-sws.org",
        "HRT": 25491937107858141,
        "Operation": "fork",
        "Timestamp": "1556275577048.254883",
        "TenantClass": 0,
        "Source": "RemoteBlockReader2.java:361",
        "ThreadID": 1,
        "ThreadName": "",
        "EventID": "30FC363A64FB1E9C",
        "ProcessID": 21035
      },
      {
        "Cycles": 0,
        "Agent": "Execution-Sleep",
        "ProcessName": "Data",
        "TaskID": "1AA6D8F482692938",
        "ParentEventID": [
          "3B023B5E5A23B751"
        ],
        "Label": "waited",
        "Title": "X-Trace Task",
        "Host": "pinky19.mpi-sws.org",
        "Duration": "101910",
        "HRT": 25491937107907543,
        "Operation": "waited",
        "Timestamp": "1556275577048.315430",
        "TenantClass": 0,
        "Source": "SocketIOWithTimeout.java:335",
        "ThreadID": 9602,
        "ThreadName": "",
        "EventID": "17B65E83361B3FCE",
        "BaggageBytes": "[[248 5] [240 0] [0 26 166 216 244 130 105 41 56] [240 1] [0 59 2 59 94 90 35 183 81] [240 3] [0 2]]",
        "ProcessID": 2319
      },
      {
        "Cycles": 0,
        "Agent": "Execution-CPU",
        "ProcessName": "Data",
        "TaskID": "1AA6D8F482692938",
        "ParentEventID": [
          "A49A53A8F81E90C4"
        ],
        "Label": "unset",
        "Title": "X-Trace Task",
        "Host": "pinky19.mpi-sws.org",
        "Duration": "510028",
        "HRT": 25491937107976670,
        "Operation": "unset",
        "Timestamp": "1556275577048.384521",
        "TenantClass": 0,
        "Source": "DataXceiver.java:261",
        "ThreadID": 9602,
        "ThreadName": "",
        "EventID": "5A2B6878DD779A3E",
        "BaggageBytes": "[[248 5] [240 0] [0 26 166 216 244 130 105 41 56] [240 1] [0 164 154 83 168 248 30 144 196] [240 3] [0 2]]",
        "ProcessID": 2319
      },
      {
        "Cycles": 0,
        "Agent": "edu.brown.cs.systems.xtrace.logging.BaggageWrappers",
        "ProcessName": "Data",
        "TaskID": "1AA6D8F482692938",
        "ParentEventID": [
          "17B65E83361B3FCE",
          "30FC363A64FB1E9C"
        ],
        "Label": "Merged current baggage with other baggage",
        "Title": "X-Trace Task",
        "Host": "pinky19.mpi-sws.org",
        "HRT": 25491937107957560,
        "Operation": "join",
        "Timestamp": "1556275577048.365479",
        "TenantClass": 0,
        "Source": "DataXceiver.java:574",
        "ThreadID": 9602,
        "ThreadName": "",
        "EventID": "A49A53A8F81E90C4",
        "BaggageBytes": "[[248 5] [240 0] [0 26 166 216 244 130 105 41 56] [240 1] [0 23 182 94 131 54 27 63 206] [0 48 252 54 58 100 251 30 156] [240 3] [0 2]]",
        "ProcessID": 2319
      },
      {
        "Cycles": 0,
        "Agent": "edu.brown.cs.systems.retro.benchmarks.hdfs_client.Reader",
        "ProcessName": "Read",
        "TaskID": "1AA6D8F482692938",
        "ParentEventID": [
          "0"
        ],
        "Label": "Reading file",
        "Title": "X-Trace Task",
        "Host": "pinky19.mpi-sws.org",
        "HRT": 25491937106452236,
        "Timestamp": "1556275577046.848877",
        "TenantClass": 0,
        "ThreadID": 1,
        "ThreadName": "",
        "EventID": "71997CD239F8BB1F",
        "ProcessID": 21035,
        "Tag": [
          "reader_1kb",
          "Read Size: 1024"
        ]
      }
    ]
  }
]