[
  {
    "id": "370F3AE2C369CA49",
    "reports": [
      {
        "Cycles": 0,
        "Agent": "Execution-CPU",
        "ProcessName": "Read",
        "TaskID": "370F3AE2C369CA49",
        "ParentEventID": [
          "DDFEA6B4718D5462"
        ],
        "Label": "unset",
        "Title": "X-Trace Task",
        "Host": "pinky19.mpi-sws.org",
        "Duration": "22203132",
        "HRT": 26962598640865136,
        "Operation": "unset",
        "Timestamp": "1557746238581.022949",
        "TenantClass": 0,
        "Source": "Client.java:1027",
        "ThreadID": 1,
        "ThreadName": "",
        "EventID": "41D983973B7FBEC5",
        "ProcessID": 36430
      },
      {
        "Cycles": 0,
        "Agent": "org.apache.hadoop.ipc.ProtobufRpcEngine",
        "ProcessName": "Read",
        "TaskID": "370F3AE2C369CA49",
        "ParentEventID": [
          "FD673C1B0C9C46C9"
        ],
        "Label": "Invoking org.apache.hadoop.hdfs.protocol.ClientProtocol.getBlockLocations",
        "Title": "X-Trace Task",
        "Host": "pinky19.mpi-sws.org",
        "HRT": 26962598640849686,
        "Timestamp": "1557746238581.007568",
        "TenantClass": 0,
        "Source": "ProtobufRpcEngine.java:228",
        "ThreadID": 1,
        "ThreadName": "",
        "EventID": "DDFEA6B4718D5462",
        "ProcessID": 36430
      },
      {
        "Cycles": 0,
        "Agent": "edu.brown.cs.systems.xtrace.logging.BaggageWrappers",
        "ProcessName": "Read",
        "TaskID": "370F3AE2C369CA49",
        "ParentEventID": [
          "796D31B897F30AB6"
        ],
        "Label": "Forking current baggage with Baggage.fork()",
        "Title": "X-Trace Task",
        "Host": "pinky19.mpi-sws.org",
        "HRT": 26962598640890623,
        "Operation": "fork",
        "Timestamp": "1557746238581.048584",
        "TenantClass": 0,
        "Source": "Client.java:1043",
        "ThreadID": 41,
        "ThreadName": "",
        "EventID": "18E4E66C184C4C2E",
        "ProcessID": 36430
      },
      {
        "Cycles": 0,
        "Agent": "Execution-CPU",
        "ProcessName": "Read",
        "TaskID": "370F3AE2C369CA49",
        "ParentEventID": [
          "41D983973B7FBEC5"
        ],
        "Label": "set",
        "Title": "X-Trace Task",
        "Host": "pinky19.mpi-sws.org",
        "HRT": 26962598640883019,
        "Operation": "set",
        "Timestamp": "1557746238581.040771",
        "TenantClass": 0,
        "Source": "Client.java:1032",
        "ThreadID": 41,
        "ThreadName": "",
        "EventID": "796D31B897F30AB6",
        "ProcessID": 36430
      },
      {
        "Cycles": 0,
        "Agent": "edu.brown.cs.systems.retro.benchmarks.hdfs_client.Reader",
        "ProcessName": "Read",
        "TaskID": "370F3AE2C369CA49",
        "ParentEventID": [
          "ADD48F16BDB12D43"
        ],
        "Label": "Reading file",
        "Title": "X-Trace Task",
        "Host": "pinky19.mpi-sws.org",
        "HRT": 26962598640825190,
        "Timestamp": "1557746238580.983154",
        "TenantClass": 0,
        "ThreadID": 1,
        "ThreadName": "",
        "EventID": "FD673C1B0C9C46C9",
        "ProcessID": 36430
      },
      {
        "Cycles": 0,
        "Agent": "Execution-CPU",
        "ProcessName": "Read",
        "TaskID": "370F3AE2C369CA49",
        "ParentEventID": [
          "18E4E66C184C4C2E"
        ],
        "Label": "unset",
        "Title": "X-Trace Task",
        "Host": "pinky19.mpi-sws.org",
        "Duration": "50964",
        "HRT": 26962598640942103,
        "Operation": "unset",
        "Timestamp": "1557746238581.099854",
        "TenantClass": 0,
        "Source": "Client.java:1062",
        "ThreadID": 41,
        "ThreadName": "",
        "EventID": "166FE8928C49E373",
        "ProcessID": 36430
      },
      {
        "Cycles": 0,
        "Agent": "Execution-CPU",
        "ProcessName": "Read",
        "TaskID": "370F3AE2C369CA49",
        "ParentEventID": [
          "166FE8928C49E373"
        ],
        "Label": "set",
        "Title": "X-Trace Task",
        "Host": "pinky19.mpi-sws.org",
        "HRT": 26962598640962034,
        "Operation": "set",
        "Timestamp": "1557746238581.119873",
        "TenantClass": 0,
        "Source": "Client.java:1104",
        "ThreadID": 1,
        "ThreadName": "",
        "EventID": "B7F3CD6CA63AF809",
        "ProcessID": 36430
      },
      {
        "Cycles": 0,
        "Agent": "Execution-CPU",
        "ProcessName": "Name",
        "TaskID": "370F3AE2C369CA49",
        "ParentEventID": [
          "18E4E66C184C4C2E"
        ],
        "Label": "set",
        "Title": "X-Trace Task",
        "Host": "pinky19.mpi-sws.org",
        "HRT": 26962598640999391,
        "Operation": "set",
        "Timestamp": "1557746238581.190430",
        "TenantClass": 0,
        "Source": "Server.java:1840",
        "ThreadID": 48,
        "ThreadName": "",
        "EventID": "293B844819A8BB6E",
        "BaggageBytes": "[[248 5] [240 0] [0 55 15 58 226 195 105 202 73] [240 1] [0 24 228 230 108 24 76 76 46] [240 3] [0 2]]",
        "ProcessID": 2171
      },
      {
        "Cycles": 0,
        "Agent": "Execution-CPU",
        "ProcessName": "Name",
        "TaskID": "370F3AE2C369CA49",
        "ParentEventID": [
          "8955EA0B088AD806"
        ],
        "Label": "unset",
        "Title": "X-Trace Task",
        "Host": "pinky19.mpi-sws.org",
        "Duration": "24679",
        "HRT": 26962598641049531,
        "Operation": "unset",
        "Timestamp": "1557746238581.240723",
        "TenantClass": 0,
        "Source": "Server.java:1828",
        "ThreadID": 48,
        "ThreadName": "",
        "EventID": "819ABBAEE6DAF7EA",
        "BaggageBytes": "[[248 5] [240 0] [0 55 15 58 226 195 105 202 73] [240 1] [0 137 85 234 11 8 138 216 6] [240 3] [0 2]]",
        "ProcessID": 2171
      },
      {
        "Cycles": 0,
        "Agent": "edu.brown.cs.systems.xtrace.logging.BaggageWrappers",
        "ProcessName": "Name",
        "TaskID": "370F3AE2C369CA49",
        "ParentEventID": [
          "293B844819A8BB6E"
        ],
        "Label": "Forking current baggage with Baggage.fork()",
        "Title": "X-Trace Task",
        "Host": "pinky19.mpi-sws.org",
        "HRT": 26962598641029482,
        "Operation": "fork",
        "Timestamp": "1557746238581.220703",
        "TenantClass": 0,
        "Source": "Server.java:550",
        "ThreadID": 48,
        "ThreadName": "",
        "EventID": "8955EA0B088AD806",
        "BaggageBytes": "[[248 5] [240 0] [0 55 15 58 226 195 105 202 73] [240 1] [0 41 59 132 72 25 168 187 110] [240 3] [0 2]]",
        "ProcessID": 2171
      },
      {
        "Cycles": 0,
        "Agent": "Execution-CPU",
        "ProcessName": "Name",
        "TaskID": "370F3AE2C369CA49",
        "ParentEventID": [
          "8955EA0B088AD806"
        ],
        "Label": "set",
        "Title": "X-Trace Task",
        "Host": "pinky19.mpi-sws.org",
        "HRT": 26962598641057348,
        "Operation": "set",
        "Timestamp": "1557746238581.248535",
        "TenantClass": 0,
        "Source": "Server.java:2071",
        "ThreadID": 58,
        "ThreadName": "",
        "EventID": "56B2B9E3799DA114",
        "BaggageBytes": "[[248 5] [240 0] [0 55 15 58 226 195 105 202 73] [240 1] [0 137 85 234 11 8 138 216 6] [240 3] [0 2]]",
        "ProcessID": 2171
      },
      {
        "Cycles": 0,
        "Agent": "org.apache.hadoop.ipc.Server",
        "ProcessName": "Name",
        "TaskID": "370F3AE2C369CA49",
        "ParentEventID": [
          "56B2B9E3799DA114"
        ],
        "Label": "getBlockLocations in org.apache.hadoop.hdfs.protocol.ClientProtocol",
        "Title": "X-Trace Task",
        "Host": "pinky19.mpi-sws.org",
        "HRT": 26962598641090820,
        "Timestamp": "1557746238581.281982",
        "TenantClass": 0,
        "Source": "ProtobufRpcEngine.java:601",
        "ThreadID": 58,
        "ThreadName": "",
        "EventID": "B4D736EC27183127",
        "BaggageBytes": "[[248 5] [240 0] [0 55 15 58 226 195 105 202 73] [240 1] [0 86 178 185 227 121 157 161 20] [240 3] [0 2]]",
        "ProcessID": 2171
      },
      {
        "Cycles": 0,
        "Agent": "org.apache.hadoop.hdfs.server.namenode.FSNamesystem.audit",
        "ProcessName": "Name",
        "TaskID": "370F3AE2C369CA49",
        "ParentEventID": [
          "B4D736EC27183127"
        ],
        "Label": "allowed=true\tugi=plascas (auth:SIMPLE)\tip=/139.19.171.63\tcmd=open\tsrc=/ds/WbDZ3gXL2tWgG6aB\tdst=null\tperm=null\tproto=rpc",
        "Title": "X-Trace Task",
        "Host": "pinky19.mpi-sws.org",
        "HRT": 26962598641137372,
        "Timestamp": "1557746238581.328369",
        "TenantClass": 0,
        "Source": "FSNamesystem.java:8313",
        "ThreadID": 58,
        "ThreadName": "",
        "EventID": "E4C29672F76C9F51",
        "BaggageBytes": "[[248 5] [240 0] [0 55 15 58 226 195 105 202 73] [240 1] [0 180 215 54 236 39 24 49 39] [240 3] [0 2]]",
        "ProcessID": 2171
      },
      {
        "Cycles": 0,
        "Agent": "edu.brown.cs.systems.xtrace.logging.BaggageWrappers",
        "ProcessName": "Name",
        "TaskID": "370F3AE2C369CA49",
        "ParentEventID": [
          "E4C29672F76C9F51"
        ],
        "Label": "Forking current baggage with Baggage.fork()",
        "Title": "X-Trace Task",
        "Host": "pinky19.mpi-sws.org",
        "HRT": 26962598641179915,
        "Operation": "fork",
        "Timestamp": "1557746238581.371094",
        "TenantClass": 0,
        "Source": "Server.java:2398",
        "ThreadID": 58,
        "ThreadName": "",
        "EventID": "B48EB6AF349AC275",
        "BaggageBytes": "[[248 5] [240 0] [0 55 15 58 226 195 105 202 73] [240 1] [0 228 194 150 114 247 108 159 81] [240 3] [0 2]]",
        "ProcessID": 2171
      },
      {
        "Cycles": 0,
        "Agent": "Execution-CPU",
        "ProcessName": "Read",
        "TaskID": "370F3AE2C369CA49",
        "ParentEventID": [
          "B48EB6AF349AC275"
        ],
        "Label": "set",
        "Title": "X-Trace Task",
        "Host": "pinky19.mpi-sws.org",
        "HRT": 26962598641355204,
        "Operation": "set",
        "Timestamp": "1557746238581.512939",
        "TenantClass": 0,
        "Source": "Client.java:302",
        "ThreadID": 37,
        "ThreadName": "",
        "EventID": "77B380CECB4A4BA1",
        "ProcessID": 36430
      },
      {
        "Cycles": 0,
        "Agent": "Execution-CPU",
        "ProcessName": "Read",
        "TaskID": "370F3AE2C369CA49",
        "ParentEventID": [
          "77B380CECB4A4BA1"
        ],
        "Label": "unset",
        "Title": "X-Trace Task",
        "Host": "pinky19.mpi-sws.org",
        "Duration": "5217",
        "HRT": 26962598641376607,
        "Operation": "unset",
        "Timestamp": "1557746238581.534424",
        "TenantClass": 0,
        "Source": "Client.java:1168",
        "ThreadID": 37,
        "ThreadName": "",
        "EventID": "0D2FABBD6D882F75",
        "ProcessID": 36430
      },
      {
        "Cycles": 0,
        "Agent": "Execution-Sleep",
        "ProcessName": "Read",
        "TaskID": "370F3AE2C369CA49",
        "ParentEventID": [
          "B7F3CD6CA63AF809"
        ],
        "Label": "waited",
        "Title": "X-Trace Task",
        "Host": "pinky19.mpi-sws.org",
        "Duration": "423481",
        "HRT": 26962598641413471,
        "Operation": "waited",
        "Timestamp": "1557746238581.571289",
        "TenantClass": 0,
        "Source": "Client.java:1537",
        "ThreadID": 1,
        "ThreadName": "",
        "EventID": "9C1F17CB1811B0B6",
        "ProcessID": 36430
      },
      {
        "Cycles": 0,
        "Agent": "Execution-CPU",
        "ProcessName": "Name",
        "TaskID": "370F3AE2C369CA49",
        "ParentEventID": [
          "B48EB6AF349AC275"
        ],
        "Label": "unset",
        "Title": "X-Trace Task",
        "Host": "pinky19.mpi-sws.org",
        "Duration": "203048",
        "HRT": 26962598641282772,
        "Operation": "unset",
        "Timestamp": "1557746238581.473877",
        "TenantClass": 0,
        "Source": "Server.java:1058",
        "ThreadID": 58,
        "ThreadName": "",
        "EventID": "30A5DC5F232FDCF3",
        "BaggageBytes": "[[248 5] [240 0] [0 55 15 58 226 195 105 202 73] [240 1] [0 180 142 182 175 52 154 194 117] [240 3] [0 2]]",
        "ProcessID": 2171
      },
      {
        "Cycles": 0,
        "Agent": "edu.brown.cs.systems.xtrace.logging.BaggageWrappers",
        "ProcessName": "Read",
        "TaskID": "370F3AE2C369CA49",
        "ParentEventID": [
          "0D2FABBD6D882F75",
          "9C1F17CB1811B0B6"
        ],
        "Label": "Merged current baggage with other baggage",
        "Title": "X-Trace Task",
        "Host": "pinky19.mpi-sws.org",
        "HRT": 26962598641428629,
        "Operation": "join",
        "Timestamp": "1557746238581.586426",
        "TenantClass": 0,
        "Source": "Client.java:1545",
        "ThreadID": 1,
        "ThreadName": "",
        "EventID": "7AFCCAA647BA04EC",
        "ProcessID": 36430
      },
      {
        "Cycles": 0,
        "Agent": "edu.brown.cs.systems.xtrace.logging.BaggageWrappers",
        "ProcessName": "Read",
        "TaskID": "370F3AE2C369CA49",
        "ParentEventID": [
          "FA1114B04CFFED80"
        ],
        "Label": "Forking current baggage with Baggage.fork()",
        "Title": "X-Trace Task",
        "Host": "pinky19.mpi-sws.org",
        "HRT": 26962598641515507,
        "Operation": "fork",
        "Timestamp": "1557746238581.673340",
        "TenantClass": 0,
        "Source": "DataTransferProtoUtil.java:94",
        "ThreadID": 1,
        "ThreadName": "",
        "EventID": "D0467EA7D632C1C8",
        "ProcessID": 36430
      },
      {
        "Cycles": 0,
        "Agent": "Execution-CPU",
        "ProcessName": "Data",
        "TaskID": "370F3AE2C369CA49",
        "ParentEventID": [
          "D0467EA7D632C1C8"
        ],
        "Label": "set",
        "Title": "X-Trace Task",
        "Host": "pinky26.mpi-sws.org",
        "HRT": 47512255371716531,
        "Operation": "set",
        "Timestamp": "1557746238582.054932",
        "TenantClass": 0,
        "Source": "Receiver.java:117",
        "ThreadID": 8227,
        "ThreadName": "",
        "EventID": "BDB775F98F4DC90A",
        "BaggageBytes": "[[248 5] [240 0] [0 55 15 58 226 195 105 202 73] [240 1] [0 208 70 126 167 214 50 193 200] [240 3] [0 2]]",
        "ProcessID": 17069
      },
      {
        "Cycles": 0,
        "Agent": "edu.brown.cs.systems.xtrace.logging.XTraceInit",
        "ProcessName": "Data",
        "TaskID": "370F3AE2C369CA49",
        "ParentEventID": [
          "BDB775F98F4DC90A"
        ],
        "Label": "Thread.setName: DataXceiver for client DFSClient_NONMAPREDUCE_778905418_1 at /139.19.171.63:36880 [Sending block BP-1633380353-139.19.171.63-1554193446451:blk_1073767374_26550]",
        "Title": "X-Trace Task",
        "Host": "pinky26.mpi-sws.org",
        "HRT": 47512255371808190,
        "Timestamp": "1557746238582.146484",
        "TenantClass": 0,
        "Source": "DataXceiver.java:168",
        "ThreadID": 8227,
        "ThreadName": "",
        "EventID": "BFF6AB84390EF6E6",
        "BaggageBytes": "[[248 5] [240 0] [0 55 15 58 226 195 105 202 73] [240 1] [0 189 183 117 249 143 77 201 10] [240 3] [0 2]]",
        "ProcessID": 17069
      },
      {
        "Cycles": 0,
        "Agent": "org.apache.hadoop.ipc.ProtobufRpcEngine",
        "ProcessName": "Read",
        "TaskID": "370F3AE2C369CA49",
        "ParentEventID": [
          "7AFCCAA647BA04EC"
        ],
        "Label": "org.apache.hadoop.hdfs.protocol.ClientProtocol.getBlockLocations completed",
        "Title": "X-Trace Task",
        "Host": "pinky19.mpi-sws.org",
        "HRT": 26962598641465963,
        "Timestamp": "1557746238581.623779",
        "TenantClass": 0,
        "Source": "ProtobufRpcEngine.java:275",
        "ThreadID": 1,
        "ThreadName": "",
        "EventID": "FA1114B04CFFED80",
        "ProcessID": 36430
      },
      {
        "Cycles": 0,
        "Agent": "edu.brown.cs.systems.xtrace.logging.BaggageWrappers",
        "ProcessName": "Data",
        "TaskID": "370F3AE2C369CA49",
        "ParentEventID": [
          "BFF6AB84390EF6E6"
        ],
        "Label": "Forking current baggage with Baggage.fork()",
        "Title": "X-Trace Task",
        "Host": "pinky26.mpi-sws.org",
        "HRT": 47512255371994248,
        "Operation": "fork",
        "Timestamp": "1557746238582.332520",
        "TenantClass": 0,
        "Source": "DataXceiver.java:1257",
        "ThreadID": 8227,
        "ThreadName": "",
        "EventID": "36AA8B93402F40FC",
        "BaggageBytes": "[[248 5] [240 0] [0 55 15 58 226 195 105 202 73] [240 1] [0 191 246 171 132 57 14 246 230] [240 3] [0 2]]",
        "ProcessID": 17069
      },
      {
        "Cycles": 0,
        "Agent": "Execution-Sleep",
        "ProcessName": "Read",
        "TaskID": "370F3AE2C369CA49",
        "ParentEventID": [
          "D0467EA7D632C1C8"
        ],
        "Label": "waited",
        "Title": "X-Trace Task",
        "Host": "pinky19.mpi-sws.org",
        "Duration": "662542",
        "HRT": 26962598642251233,
        "Operation": "waited",
        "Timestamp": "1557746238582.409180",
        "TenantClass": 0,
        "Source": "SocketIOWithTimeout.java:335",
        "ThreadID": 1,
        "ThreadName": "",
        "EventID": "4833B59F19042148",
        "ProcessID": 36430
      },
      {
        "Cycles": 0,
        "Agent": "edu.brown.cs.systems.xtrace.logging.BaggageWrappers",
        "ProcessName": "Data",
        "TaskID": "370F3AE2C369CA49",
        "ParentEventID": [
          "36AA8B93402F40FC"
        ],
        "Label": "Forking current baggage with Baggage.fork()",
        "Title": "X-Trace Task",
        "Host": "pinky26.mpi-sws.org",
        "HRT": 47512255372097201,
        "Operation": "fork",
        "Timestamp": "1557746238582.435547",
        "TenantClass": 0,
        "Source": "PacketHeader.java:95",
        "ThreadID": 8227,
        "ThreadName": "",
        "EventID": "9ABCB3225778B529",
        "BaggageBytes": "[[248 5] [240 0] [0 55 15 58 226 195 105 202 73] [240 1] [0 54 170 139 147 64 47 64 252] [240 3] [0 2]]",
        "ProcessID": 17069
      },
      {
        "Cycles": 0,
        "Agent": "Execution-Sleep",
        "ProcessName": "Data",
        "TaskID": "370F3AE2C369CA49",
        "ParentEventID": [
          "9ABCB3225778B529"
        ],
        "Label": "waited",
        "Title": "X-Trace Task",
        "Host": "pinky26.mpi-sws.org",
        "Duration": "4019",
        "HRT": 47512255372181182,
        "Operation": "waited",
        "Timestamp": "1557746238582.519531",
        "TenantClass": 0,
        "Source": "SocketIOWithTimeout.java:335",
        "ThreadID": 8227,
        "ThreadName": "",
        "EventID": "5BFD2DC4C107E21A",
        "BaggageBytes": "[[248 5] [240 0] [0 55 15 58 226 195 105 202 73] [240 1] [0 154 188 179 34 87 120 181 41] [240 3] [0 2]]",
        "ProcessID": 17069
      },
      {
        "Cycles": 0,
        "Agent": "edu.brown.cs.systems.xtrace.logging.BaggageWrappers",
        "ProcessName": "Data",
        "TaskID": "370F3AE2C369CA49",
        "ParentEventID": [
          "5BFD2DC4C107E21A"
        ],
        "Label": "Forking current baggage with Baggage.fork()",
        "Title": "X-Trace Task",
        "Host": "pinky26.mpi-sws.org",
        "HRT": 47512255372272821,
        "Operation": "fork",
        "Timestamp": "1557746238582.611084",
        "TenantClass": 0,
        "Source": "PacketHeader.java:95",
        "ThreadID": 8227,
        "ThreadName": "",
        "EventID": "8232F8023F1BC382",
        "BaggageBytes": "[[248 5] [240 0] [0 55 15 58 226 195 105 202 73] [240 1] [0 91 253 45 196 193 7 226 26] [240 3] [0 2]]",
        "ProcessID": 17069
      },
      {
        "Cycles": 0,
        "Agent": "Execution-Sleep",
        "ProcessName": "Read",
        "TaskID": "370F3AE2C369CA49",
        "ParentEventID": [
          "78B119D3249C8C09"
        ],
        "Label": "waited",
        "Title": "X-Trace Task",
        "Host": "pinky19.mpi-sws.org",
        "Duration": "162812",
        "HRT": 26962598642547143,
        "Operation": "waited",
        "Timestamp": "1557746238582.705078",
        "TenantClass": 0,
        "Source": "SocketIOWithTimeout.java:335",
        "ThreadID": 1,
        "ThreadName": "",
        "EventID": "24F0BC28CBBD5534",
        "ProcessID": 36430
      },
      {
        "Cycles": 0,
        "Agent": "edu.brown.cs.systems.xtrace.logging.BaggageWrappers",
        "ProcessName": "Read",
        "TaskID": "370F3AE2C369CA49",
        "ParentEventID": [
          "4833B59F19042148",
          "36AA8B93402F40FC"
        ],
        "Label": "Merged current baggage with other baggage",
        "Title": "X-Trace Task",
        "Host": "pinky19.mpi-sws.org",
        "HRT": 26962598642310587,
        "Operation": "join",
        "Timestamp": "1557746238582.468506",
        "TenantClass": 0,
        "Source": "RemoteBlockReader2.java:429",
        "ThreadID": 1,
        "ThreadName": "",
        "EventID": "78B119D3249C8C09",
        "ProcessID": 36430
      },
      {
        "Cycles": 0,
        "Agent": "edu.brown.cs.systems.xtrace.logging.BaggageWrappers",
        "ProcessName": "Read",
        "TaskID": "370F3AE2C369CA49",
        "ParentEventID": [
          "9ABCB3225778B529",
          "24F0BC28CBBD5534"
        ],
        "Label": "Merged current baggage with other baggage",
        "Title": "X-Trace Task",
        "Host": "pinky19.mpi-sws.org",
        "HRT": 26962598642598639,
        "Operation": "join",
        "Timestamp": "1557746238582.756592",
        "TenantClass": 0,
        "Source": "PacketHeader.java:168",
        "ThreadID": 1,
        "ThreadName": "",
        "EventID": "EB482F57FE432455",
        "ProcessID": 36430
      },
      {
        "Cycles": 0,
        "Agent": "edu.brown.cs.systems.xtrace.logging.BaggageWrappers",
        "ProcessName": "Read",
        "TaskID": "370F3AE2C369CA49",
        "ParentEventID": [
          "B20EED04EA3593ED"
        ],
        "Label": "Forking current baggage with Baggage.fork()",
        "Title": "X-Trace Task",
        "Host": "pinky19.mpi-sws.org",
        "HRT": 26962598642660173,
        "Operation": "fork",
        "Timestamp": "1557746238582.818115",
        "TenantClass": 0,
        "Source": "RemoteBlockReader2.java:361",
        "ThreadID": 1,
        "ThreadName": "",
        "EventID": "1894FC5D6B3D003F",
        "ProcessID": 36430
      },
      {
        "Cycles": 0,
        "Agent": "Execution-Sleep",
        "ProcessName": "Data",
        "TaskID": "370F3AE2C369CA49",
        "ParentEventID": [
          "8232F8023F1BC382"
        ],
        "Label": "waited",
        "Title": "X-Trace Task",
        "Host": "pinky26.mpi-sws.org",
        "Duration": "221580",
        "HRT": 47512255372568896,
        "Operation": "waited",
        "Timestamp": "1557746238582.907227",
        "TenantClass": 0,
        "Source": "SocketIOWithTimeout.java:335",
        "ThreadID": 8227,
        "ThreadName": "",
        "EventID": "7694CCACE703B720",
        "BaggageBytes": "[[248 5] [240 0] [0 55 15 58 226 195 105 202 73] [240 1] [0 130 50 248 2 63 27 195 130] [240 3] [0 2]]",
        "ProcessID": 17069
      },
      {
        "Cycles": 0,
        "Agent": "edu.brown.cs.systems.xtrace.logging.BaggageWrappers",
        "ProcessName": "Data",
        "TaskID": "370F3AE2C369CA49",
        "ParentEventID": [
          "7694CCACE703B720",
          "1894FC5D6B3D003F"
        ],
        "Label": "Merged current baggage with other baggage",
        "Title": "X-Trace Task",
        "Host": "pinky26.mpi-sws.org",
        "HRT": 47512255372615657,
        "Operation": "join",
        "Timestamp": "1557746238582.954102",
        "TenantClass": 0,
        "Source": "DataXceiver.java:574",
        "ThreadID": 8227,
        "ThreadName": "",
        "EventID": "EA5712FBF297632B",
        "BaggageBytes": "[[248 5] [240 0] [0 55 15 58 226 195 105 202 73] [240 1] [0 24 148 252 93 107 61 0 63] [0 118 148 204 172 231 3 183 32] [240 3] [0 2]]",
        "ProcessID": 17069
      },
      {
        "Cycles": 0,
        "Agent": "Execution-CPU",
        "ProcessName": "Data",
        "TaskID": "370F3AE2C369CA49",
        "ParentEventID": [
          "EA5712FBF297632B"
        ],
        "Label": "unset",
        "Title": "X-Trace Task",
        "Host": "pinky26.mpi-sws.org",
        "Duration": "870276",
        "HRT": 47512255372639393,
        "Operation": "unset",
        "Timestamp": "1557746238582.977783",
        "TenantClass": 0,
        "Source": "DataXceiver.java:261",
        "ThreadID": 8227,
        "ThreadName": "",
        "EventID": "348B1F2B42903DDA",
        "BaggageBytes": "[[248 5] [240 0] [0 55 15 58 226 195 105 202 73] [240 1] [0 234 87 18 251 242 151 99 43] [240 3] [0 2]]",
        "ProcessID": 17069
      },
      {
        "Cycles": 0,
        "Agent": "edu.brown.cs.systems.xtrace.logging.BaggageWrappers",
        "ProcessName": "Read",
        "TaskID": "370F3AE2C369CA49",
        "ParentEventID": [
          "EB482F57FE432455",
          "8232F8023F1BC382"
        ],
        "Label": "Merged current baggage with other baggage",
        "Title": "X-Trace Task",
        "Host": "pinky19.mpi-sws.org",
        "HRT": 26962598642651502,
        "Operation": "join",
        "Timestamp": "1557746238582.809326",
        "TenantClass": 0,
        "Source": "PacketHeader.java:168",
        "ThreadID": 1,
        "ThreadName": "",
        "EventID": "B20EED04EA3593ED",
        "ProcessID": 36430
      },
      {
        "Cycles": 0,
        "Agent": "edu.brown.cs.systems.retro.benchmarks.hdfs_client.Reader",
        "ProcessName": "Read",
        "TaskID": "370F3AE2C369CA49",
        "ParentEventID": [
          "0"
        ],
        "Label": "Reading file",
        "Title": "X-Trace Task",
        "Host": "pinky19.mpi-sws.org",
        "HRT": 26962598640810170,
        "Timestamp": "1557746238580.968018",
        "TenantClass": 0,
        "ThreadID": 1,
        "ThreadName": "",
        "EventID": "ADD48F16BDB12D43",
        "ProcessID": 36430,
        "Tag": [
          "reader_10kb",
          "Read Size: 10240"
        ]
      }
    ]
  }
]