[
  {
    "id": "54A5F6F007C514A6",
    "reports": [
      {
        "Cycles": 0,
        "Agent": "Execution-CPU",
        "ProcessName": "Read",
        "TaskID": "54A5F6F007C514A6",
        "ParentEventID": [
          "852F4664276939C4"
        ],
        "Label": "unset",
        "Title": "X-Trace Task",
        "Host": "pinky19.mpi-sws.org",
        "Duration": "41217715",
        "HRT": 26962472780111692,
        "Operation": "unset",
        "Timestamp": "1557746112720.398193",
        "TenantClass": 0,
        "Source": "Client.java:1027",
        "ThreadID": 1,
        "ThreadName": "",
        "EventID": "755BEE023F1E2972",
        "ProcessID": 36430
      },
      {
        "Cycles": 0,
        "Agent": "edu.brown.cs.systems.retro.benchmarks.hdfs_client.Reader",
        "ProcessName": "Read",
        "TaskID": "54A5F6F007C514A6",
        "ParentEventID": [
          "3D59EA4747DA6298"
        ],
        "Label": "Reading file",
        "Title": "X-Trace Task",
        "Host": "pinky19.mpi-sws.org",
        "HRT": 26962472779855874,
        "Timestamp": "1557746112720.142334",
        "TenantClass": 0,
        "ThreadID": 1,
        "ThreadName": "",
        "EventID": "C786BFAB30997715",
        "ProcessID": 36430
      },
      {
        "Cycles": 0,
        "Agent": "org.apache.hadoop.ipc.ProtobufRpcEngine",
        "ProcessName": "Read",
        "TaskID": "54A5F6F007C514A6",
        "ParentEventID": [
          "C786BFAB30997715"
        ],
        "Label": "Invoking org.apache.hadoop.hdfs.protocol.ClientProtocol.getBlockLocations",
        "Title": "X-Trace Task",
        "Host": "pinky19.mpi-sws.org",
        "HRT": 26962472780047122,
        "Timestamp": "1557746112720.333496",
        "TenantClass": 0,
        "Source": "ProtobufRpcEngine.java:228",
        "ThreadID": 1,
        "ThreadName": "",
        "EventID": "852F4664276939C4",
        "ProcessID": 36430
      },
      {
        "Cycles": 0,
        "Agent": "Execution-CPU",
        "ProcessName": "Read",
        "TaskID": "54A5F6F007C514A6",
        "ParentEventID": [
          "755BEE023F1E2972"
        ],
        "Label": "set",
        "Title": "X-Trace Task",
        "Host": "pinky19.mpi-sws.org",
        "HRT": 26962472780155074,
        "Operation": "set",
        "Timestamp": "1557746112720.441406",
        "TenantClass": 0,
        "Source": "Client.java:1032",
        "ThreadID": 41,
        "ThreadName": "",
        "EventID": "470E58DEDD78BFAD",
        "ProcessID": 36430
      },
      {
        "Cycles": 0,
        "Agent": "edu.brown.cs.systems.xtrace.logging.BaggageWrappers",
        "ProcessName": "Read",
        "TaskID": "54A5F6F007C514A6",
        "ParentEventID": [
          "470E58DEDD78BFAD"
        ],
        "Label": "Forking current baggage with Baggage.fork()",
        "Title": "X-Trace Task",
        "Host": "pinky19.mpi-sws.org",
        "HRT": 26962472780183258,
        "Operation": "fork",
        "Timestamp": "1557746112720.469727",
        "TenantClass": 0,
        "Source": "Client.java:1043",
        "ThreadID": 41,
        "ThreadName": "",
        "EventID": "87ED4A43E9FC4B04",
        "ProcessID": 36430
      },
      {
        "Cycles": 0,
        "Agent": "Execution-CPU",
        "ProcessName": "Read",
        "TaskID": "54A5F6F007C514A6",
        "ParentEventID": [
          "BA02F08C1A110E9D"
        ],
        "Label": "set",
        "Title": "X-Trace Task",
        "Host": "pinky19.mpi-sws.org",
        "HRT": 26962472780329798,
        "Operation": "set",
        "Timestamp": "1557746112720.616211",
        "TenantClass": 0,
        "Source": "Client.java:1104",
        "ThreadID": 1,
        "ThreadName": "",
        "EventID": "A77A78B9241AF9FF",
        "ProcessID": 36430
      },
      {
        "Cycles": 0,
        "Agent": "Execution-CPU",
        "ProcessName": "Name",
        "TaskID": "54A5F6F007C514A6",
        "ParentEventID": [
          "87ED4A43E9FC4B04"
        ],
        "Label": "set",
        "Title": "X-Trace Task",
        "Host": "pinky19.mpi-sws.org",
        "HRT": 26962472780357532,
        "Operation": "set",
        "Timestamp": "1557746112720.640625",
        "TenantClass": 0,
        "Source": "Server.java:1840",
        "ThreadID": 48,
        "ThreadName": "",
        "EventID": "0A97565CFF12E764",
        "BaggageBytes": "[[248 5] [240 0] [0 84 165 246 240 7 197 20 166] [240 1] [0 135 237 74 67 233 252 75 4] [240 3] [0 2]]",
        "ProcessID": 2171
      },
      {
        "Cycles": 0,
        "Agent": "edu.brown.cs.systems.xtrace.logging.BaggageWrappers",
        "ProcessName": "Name",
        "TaskID": "54A5F6F007C514A6",
        "ParentEventID": [
          "0A97565CFF12E764"
        ],
        "Label": "Forking current baggage with Baggage.fork()",
        "Title": "X-Trace Task",
        "Host": "pinky19.mpi-sws.org",
        "HRT": 26962472780387536,
        "Operation": "fork",
        "Timestamp": "1557746112720.670654",
        "TenantClass": 0,
        "Source": "Server.java:550",
        "ThreadID": 48,
        "ThreadName": "",
        "EventID": "6A9BFE92521738FA",
        "BaggageBytes": "[[248 5] [240 0] [0 84 165 246 240 7 197 20 166] [240 1] [0 10 151 86 92 255 18 231 100] [240 3] [0 2]]",
        "ProcessID": 2171
      },
      {
        "Cycles": 0,
        "Agent": "Execution-CPU",
        "ProcessName": "Name",
        "TaskID": "54A5F6F007C514A6",
        "ParentEventID": [
          "6A9BFE92521738FA"
        ],
        "Label": "unset",
        "Title": "X-Trace Task",
        "Host": "pinky19.mpi-sws.org",
        "Duration": "24069",
        "HRT": 26962472780407522,
        "Operation": "unset",
        "Timestamp": "1557746112720.690674",
        "TenantClass": 0,
        "Source": "Server.java:1828",
        "ThreadID": 48,
        "ThreadName": "",
        "EventID": "5C06B83E45CD7E53",
        "BaggageBytes": "[[248 5] [240 0] [0 84 165 246 240 7 197 20 166] [240 1] [0 106 155 254 146 82 23 56 250] [240 3] [0 2]]",
        "ProcessID": 2171
      },
      {
        "Cycles": 0,
        "Agent": "Execution-CPU",
        "ProcessName": "Read",
        "TaskID": "54A5F6F007C514A6",
        "ParentEventID": [
          "87ED4A43E9FC4B04"
        ],
        "Label": "unset",
        "Title": "X-Trace Task",
        "Host": "pinky19.mpi-sws.org",
        "Duration": "101462",
        "HRT": 26962472780288029,
        "Operation": "unset",
        "Timestamp": "1557746112720.574463",
        "TenantClass": 0,
        "Source": "Client.java:1062",
        "ThreadID": 41,
        "ThreadName": "",
        "EventID": "BA02F08C1A110E9D",
        "ProcessID": 36430
      },
      {
        "Cycles": 0,
        "Agent": "Execution-CPU",
        "ProcessName": "Name",
        "TaskID": "54A5F6F007C514A6",
        "ParentEventID": [
          "6A9BFE92521738FA"
        ],
        "Label": "set",
        "Title": "X-Trace Task",
        "Host": "pinky19.mpi-sws.org",
        "HRT": 26962472780417620,
        "Operation": "set",
        "Timestamp": "1557746112720.700684",
        "TenantClass": 0,
        "Source": "Server.java:2071",
        "ThreadID": 60,
        "ThreadName": "",
        "EventID": "92E6E1E7ADA6059B",
        "BaggageBytes": "[[248 5] [240 0] [0 84 165 246 240 7 197 20 166] [240 1] [0 106 155 254 146 82 23 56 250] [240 3] [0 2]]",
        "ProcessID": 2171
      },
      {
        "Cycles": 0,
        "Agent": "org.apache.hadoop.hdfs.server.namenode.FSNamesystem.audit",
        "ProcessName": "Name",
        "TaskID": "54A5F6F007C514A6",
        "ParentEventID": [
          "4AA30724BB694377"
        ],
        "Label": "allowed=true\tugi=plascas (auth:SIMPLE)\tip=/139.19.171.63\tcmd=open\tsrc=/ds/AiWSZPMeqlBE3ULI\tdst=null\tperm=null\tproto=rpc",
        "Title": "X-Trace Task",
        "Host": "pinky19.mpi-sws.org",
        "HRT": 26962472780513851,
        "Timestamp": "1557746112720.797119",
        "TenantClass": 0,
        "Source": "FSNamesystem.java:8313",
        "ThreadID": 60,
        "ThreadName": "",
        "EventID": "B58B19E83CBFC3D2",
        "BaggageBytes": "[[248 5] [240 0] [0 84 165 246 240 7 197 20 166] [240 1] [0 74 163 7 36 187 105 67 119] [240 3] [0 2]]",
        "ProcessID": 2171
      },
      {
        "Cycles": 0,
        "Agent": "org.apache.hadoop.ipc.Server",
        "ProcessName": "Name",
        "TaskID": "54A5F6F007C514A6",
        "ParentEventID": [
          "92E6E1E7ADA6059B"
        ],
        "Label": "getBlockLocations in org.apache.hadoop.hdfs.protocol.ClientProtocol",
        "Title": "X-Trace Task",
        "Host": "pinky19.mpi-sws.org",
        "HRT": 26962472780463439,
        "Timestamp": "1557746112720.746582",
        "TenantClass": 0,
        "Source": "ProtobufRpcEngine.java:601",
        "ThreadID": 60,
        "ThreadName": "",
        "EventID": "4AA30724BB694377",
        "BaggageBytes": "[[248 5] [240 0] [0 84 165 246 240 7 197 20 166] [240 1] [0 146 230 225 231 173 166 5 155] [240 3] [0 2]]",
        "ProcessID": 2171
      },
      {
        "Cycles": 0,
        "Agent": "edu.brown.cs.systems.xtrace.logging.BaggageWrappers",
        "ProcessName": "Name",
        "TaskID": "54A5F6F007C514A6",
        "ParentEventID": [
          "B58B19E83CBFC3D2"
        ],
        "Label": "Forking current baggage with Baggage.fork()",
        "Title": "X-Trace Task",
        "Host": "pinky19.mpi-sws.org",
        "HRT": 26962472780574322,
        "Operation": "fork",
        "Timestamp": "1557746112720.857422",
        "TenantClass": 0,
        "Source": "Server.java:2398",
        "ThreadID": 60,
        "ThreadName": "",
        "EventID": "764B447828E7BD2E",
        "BaggageBytes": "[[248 5] [240 0] [0 84 165 246 240 7 197 20 166] [240 1] [0 181 139 25 232 60 191 195 210] [240 3] [0 2]]",
        "ProcessID": 2171
      },
      {
        "Cycles": 0,
        "Agent": "Execution-CPU",
        "ProcessName": "Name",
        "TaskID": "54A5F6F007C514A6",
        "ParentEventID": [
          "764B447828E7BD2E"
        ],
        "Label": "unset",
        "Title": "X-Trace Task",
        "Host": "pinky19.mpi-sws.org",
        "Duration": "239274",
        "HRT": 26962472780690996,
        "Operation": "unset",
        "Timestamp": "1557746112720.974121",
        "TenantClass": 0,
        "Source": "Server.java:1058",
        "ThreadID": 60,
        "ThreadName": "",
        "EventID": "5CD39F70F25BD1D0",
        "BaggageBytes": "[[248 5] [240 0] [0 84 165 246 240 7 197 20 166] [240 1] [0 118 75 68 120 40 231 189 46] [240 3] [0 2]]",
        "ProcessID": 2171
      },
      {
        "Cycles": 0,
        "Agent": "Execution-CPU",
        "ProcessName": "Read",
        "TaskID": "54A5F6F007C514A6",
        "ParentEventID": [
          "764B447828E7BD2E"
        ],
        "Label": "set",
        "Title": "X-Trace Task",
        "Host": "pinky19.mpi-sws.org",
        "HRT": 26962472780741674,
        "Operation": "set",
        "Timestamp": "1557746112721.028076",
        "TenantClass": 0,
        "Source": "Client.java:302",
        "ThreadID": 37,
        "ThreadName": "",
        "EventID": "8FD1A85864350A43",
        "ProcessID": 36430
      },
      {
        "Cycles": 0,
        "Agent": "Execution-CPU",
        "ProcessName": "Read",
        "TaskID": "54A5F6F007C514A6",
        "ParentEventID": [
          "8FD1A85864350A43"
        ],
        "Label": "unset",
        "Title": "X-Trace Task",
        "Host": "pinky19.mpi-sws.org",
        "Duration": "15948",
        "HRT": 26962472780774007,
        "Operation": "unset",
        "Timestamp": "1557746112721.060547",
        "TenantClass": 0,
        "Source": "Client.java:1168",
        "ThreadID": 37,
        "ThreadName": "",
        "EventID": "EBBFBBAE4473EE06",
        "ProcessID": 36430
      },
      {
        "Cycles": 0,
        "Agent": "Execution-Sleep",
        "ProcessName": "Read",
        "TaskID": "54A5F6F007C514A6",
        "ParentEventID": [
          "A77A78B9241AF9FF"
        ],
        "Label": "waited",
        "Title": "X-Trace Task",
        "Host": "pinky19.mpi-sws.org",
        "Duration": "451932",
        "HRT": 26962472780809008,
        "Operation": "waited",
        "Timestamp": "1557746112721.095459",
        "TenantClass": 0,
        "Source": "Client.java:1537",
        "ThreadID": 1,
        "ThreadName": "",
        "EventID": "D70049797F9EE7D7",
        "ProcessID": 36430
      },
      {
        "Cycles": 0,
        "Agent": "edu.brown.cs.systems.xtrace.logging.BaggageWrappers",
        "ProcessName": "Read",
        "TaskID": "54A5F6F007C514A6",
        "ParentEventID": [
          "EBBFBBAE4473EE06",
          "D70049797F9EE7D7"
        ],
        "Label": "Merged current baggage with other baggage",
        "Title": "X-Trace Task",
        "Host": "pinky19.mpi-sws.org",
        "HRT": 26962472780831262,
        "Operation": "join",
        "Timestamp": "1557746112721.117676",
        "TenantClass": 0,
        "Source": "Client.java:1545",
        "ThreadID": 1,
        "ThreadName": "",
        "EventID": "48BC42D07B38B6F1",
        "ProcessID": 36430
      },
      {
        "Cycles": 0,
        "Agent": "org.apache.hadoop.ipc.ProtobufRpcEngine",
        "ProcessName": "Read",
        "TaskID": "54A5F6F007C514A6",
        "ParentEventID": [
          "48BC42D07B38B6F1"
        ],
        "Label": "org.apache.hadoop.hdfs.protocol.ClientProtocol.getBlockLocations completed",
        "Title": "X-Trace Task",
        "Host": "pinky19.mpi-sws.org",
        "HRT": 26962472780935515,
        "Timestamp": "1557746112721.221924",
        "TenantClass": 0,
        "Source": "ProtobufRpcEngine.java:275",
        "ThreadID": 1,
        "ThreadName": "",
        "EventID": "26C59CE646FA9481",
        "ProcessID": 36430
      },
      {
        "Cycles": 0,
        "Agent": "edu.brown.cs.systems.xtrace.logging.BaggageWrappers",
        "ProcessName": "Read",
        "TaskID": "54A5F6F007C514A6",
        "ParentEventID": [
          "26C59CE646FA9481"
        ],
        "Label": "Forking current baggage with Baggage.fork()",
        "Title": "X-Trace Task",
        "Host": "pinky19.mpi-sws.org",
        "HRT": 26962472781037163,
        "Operation": "fork",
        "Timestamp": "1557746112721.323486",
        "TenantClass": 0,
        "Source": "DataTransferProtoUtil.java:94",
        "ThreadID": 1,
        "ThreadName": "",
        "EventID": "0DBD9BBD5146A3CF",
        "ProcessID": 36430
      },
      {
        "Cycles": 0,
        "Agent": "Execution-CPU",
        "ProcessName": "Data",
        "TaskID": "54A5F6F007C514A6",
        "ParentEventID": [
          "0DBD9BBD5146A3CF"
        ],
        "Label": "set",
        "Title": "X-Trace Task",
        "Host": "pinky21.mpi-sws.org",
        "HRT": 10808782487660784,
        "Operation": "set",
        "Timestamp": "1557746112721.709961",
        "TenantClass": 0,
        "Source": "Receiver.java:117",
        "ThreadID": 14875,
        "ThreadName": "",
        "EventID": "8EBD61995CCE7132",
        "BaggageBytes": "[[248 5] [240 0] [0 84 165 246 240 7 197 20 166] [240 1] [0 13 189 155 189 81 70 163 207] [240 3] [0 2]]",
        "ProcessID": 20775
      },
      {
        "Cycles": 0,
        "Agent": "edu.brown.cs.systems.xtrace.logging.XTraceInit",
        "ProcessName": "Data",
        "TaskID": "54A5F6F007C514A6",
        "ParentEventID": [
          "8EBD61995CCE7132"
        ],
        "Label": "Thread.setName: DataXceiver for client DFSClient_NONMAPREDUCE_778905418_1 at /139.19.171.63:35320 [Sending block BP-1633380353-139.19.171.63-1554193446451:blk_1073768166_27342]",
        "Title": "X-Trace Task",
        "Host": "pinky21.mpi-sws.org",
        "HRT": 10808782487762707,
        "Timestamp": "1557746112721.812012",
        "TenantClass": 0,
        "Source": "DataXceiver.java:168",
        "ThreadID": 14875,
        "ThreadName": "",
        "EventID": "5296BD0493C9C8A7",
        "BaggageBytes": "[[248 5] [240 0] [0 84 165 246 240 7 197 20 166] [240 1] [0 142 189 97 153 92 206 113 50] [240 3] [0 2]]",
        "ProcessID": 20775
      },
      {
        "Cycles": 0,
        "Agent": "edu.brown.cs.systems.retro.benchmarks.hdfs_client.Reader",
        "ProcessName": "Read",
        "TaskID": "54A5F6F007C514A6",
        "ParentEventID": [
          "0"
        ],
        "Label": "Reading file",
        "Title": "X-Trace Task",
        "Host": "pinky19.mpi-sws.org",
        "HRT": 26962472779799033,
        "Timestamp": "1557746112720.085449",
        "TenantClass": 0,
        "ThreadID": 1,
        "ThreadName": "",
        "EventID": "3D59EA4747DA6298",
        "ProcessID": 36430,
        "Tag": [
          "reader_10kb",
          "Read Size: 10240"
        ]
      },
      {
        "Cycles": 0,
        "Agent": "edu.brown.cs.systems.xtrace.logging.BaggageWrappers",
        "ProcessName": "Data",
        "TaskID": "54A5F6F007C514A6",
        "ParentEventID": [
          "5296BD0493C9C8A7"
        ],
        "Label": "Forking current baggage with Baggage.fork()",
        "Title": "X-Trace Task",
        "Host": "pinky21.mpi-sws.org",
        "HRT": 10808782509941115,
        "Operation": "fork",
        "Timestamp": "1557746112743.990479",
        "TenantClass": 0,
        "Source": "DataXceiver.java:1257",
        "ThreadID": 14875,
        "ThreadName": "",
        "EventID": "2879ABEBC4A8293A",
        "BaggageBytes": "[[248 5] [240 0] [0 84 165 246 240 7 197 20 166] [240 1] [0 82 150 189 4 147 201 200 167] [240 3] [0 2]]",
        "ProcessID": 20775
      },
      {
        "Cycles": 0,
        "Agent": "edu.brown.cs.systems.xtrace.logging.BaggageWrappers",
        "ProcessName": "Data",
        "TaskID": "54A5F6F007C514A6",
        "ParentEventID": [
          "2879ABEBC4A8293A"
        ],
        "Label": "Forking current baggage with Baggage.fork()",
        "Title": "X-Trace Task",
        "Host": "pinky21.mpi-sws.org",
        "HRT": 10808782510015655,
        "Operation": "fork",
        "Timestamp": "1557746112744.064941",
        "TenantClass": 0,
        "Source": "PacketHeader.java:95",
        "ThreadID": 14875,
        "ThreadName": "",
        "EventID": "E341C7FA915DD5B3",
        "BaggageBytes": "[[248 5] [240 0] [0 84 165 246 240 7 197 20 166] [240 1] [0 40 121 171 235 196 168 41 58] [240 3] [0 2]]",
        "ProcessID": 20775
      },
      {
        "Cycles": 0,
        "Agent": "Execution-Sleep",
        "ProcessName": "Data",
        "TaskID": "54A5F6F007C514A6",
        "ParentEventID": [
          "E341C7FA915DD5B3"
        ],
        "Label": "waited",
        "Title": "X-Trace Task",
        "Host": "pinky21.mpi-sws.org",
        "Duration": "4852",
        "HRT": 10808782510086815,
        "Operation": "waited",
        "Timestamp": "1557746112744.135986",
        "TenantClass": 0,
        "Source": "SocketIOWithTimeout.java:335",
        "ThreadID": 14875,
        "ThreadName": "",
        "EventID": "91CEA3BC94FCD6DE",
        "BaggageBytes": "[[248 5] [240 0] [0 84 165 246 240 7 197 20 166] [240 1] [0 227 65 199 250 145 93 213 179] [240 3] [0 2]]",
        "ProcessID": 20775
      },
      {
        "Cycles": 0,
        "Agent": "Execution-Sleep",
        "ProcessName": "Read",
        "TaskID": "54A5F6F007C514A6",
        "ParentEventID": [
          "0DBD9BBD5146A3CF"
        ],
        "Label": "waited",
        "Title": "X-Trace Task",
        "Host": "pinky19.mpi-sws.org",
        "Duration": "22642771",
        "HRT": 26962472803783572,
        "Operation": "waited",
        "Timestamp": "1557746112744.070068",
        "TenantClass": 0,
        "Source": "SocketIOWithTimeout.java:335",
        "ThreadID": 1,
        "ThreadName": "",
        "EventID": "74A06008EAF59DFB",
        "ProcessID": 36430
      },
      {
        "Cycles": 0,
        "Agent": "edu.brown.cs.systems.xtrace.logging.BaggageWrappers",
        "ProcessName": "Read",
        "TaskID": "54A5F6F007C514A6",
        "ParentEventID": [
          "74A06008EAF59DFB",
          "2879ABEBC4A8293A"
        ],
        "Label": "Merged current baggage with other baggage",
        "Title": "X-Trace Task",
        "Host": "pinky19.mpi-sws.org",
        "HRT": 26962472803886603,
        "Operation": "join",
        "Timestamp": "1557746112744.173096",
        "TenantClass": 0,
        "Source": "RemoteBlockReader2.java:429",
        "ThreadID": 1,
        "ThreadName": "",
        "EventID": "B95917D7B243962E",
        "ProcessID": 36430
      },
      {
        "Cycles": 0,
        "Agent": "edu.brown.cs.systems.xtrace.logging.BaggageWrappers",
        "ProcessName": "Data",
        "TaskID": "54A5F6F007C514A6",
        "ParentEventID": [
          "91CEA3BC94FCD6DE"
        ],
        "Label": "Forking current baggage with Baggage.fork()",
        "Title": "X-Trace Task",
        "Host": "pinky21.mpi-sws.org",
        "HRT": 10808782519959785,
        "Operation": "fork",
        "Timestamp": "1557746112754.009033",
        "TenantClass": 0,
        "Source": "PacketHeader.java:95",
        "ThreadID": 14875,
        "ThreadName": "",
        "EventID": "8A60ED2ADBBB4965",
        "BaggageBytes": "[[248 5] [240 0] [0 84 165 246 240 7 197 20 166] [240 1] [0 145 206 163 188 148 252 214 222] [240 3] [0 2]]",
        "ProcessID": 20775
      },
      {
        "Cycles": 0,
        "Agent": "Execution-Sleep",
        "ProcessName": "Read",
        "TaskID": "54A5F6F007C514A6",
        "ParentEventID": [
          "B95917D7B243962E"
        ],
        "Label": "waited",
        "Title": "X-Trace Task",
        "Host": "pinky19.mpi-sws.org",
        "Duration": "9845068",
        "HRT": 26962472813823885,
        "Operation": "waited",
        "Timestamp": "1557746112754.110352",
        "TenantClass": 0,
        "Source": "SocketIOWithTimeout.java:335",
        "ThreadID": 1,
        "ThreadName": "",
        "EventID": "031C50B341D28174",
        "ProcessID": 36430
      },
      {
        "Cycles": 0,
        "Agent": "edu.brown.cs.systems.xtrace.logging.BaggageWrappers",
        "ProcessName": "Read",
        "TaskID": "54A5F6F007C514A6",
        "ParentEventID": [
          "031C50B341D28174",
          "E341C7FA915DD5B3"
        ],
        "Label": "Merged current baggage with other baggage",
        "Title": "X-Trace Task",
        "Host": "pinky19.mpi-sws.org",
        "HRT": 26962472813897496,
        "Operation": "join",
        "Timestamp": "1557746112754.183838",
        "TenantClass": 0,
        "Source": "PacketHeader.java:168",
        "ThreadID": 1,
        "ThreadName": "",
        "EventID": "A6353B5C369E4599",
        "ProcessID": 36430
      },
      {
        "Cycles": 0,
        "Agent": "edu.brown.cs.systems.xtrace.logging.BaggageWrappers",
        "ProcessName": "Read",
        "TaskID": "54A5F6F007C514A6",
        "ParentEventID": [
          "A6353B5C369E4599",
          "8A60ED2ADBBB4965"
        ],
        "Label": "Merged current baggage with other baggage",
        "Title": "X-Trace Task",
        "Host": "pinky19.mpi-sws.org",
        "HRT": 26962472813955129,
        "Operation": "join",
        "Timestamp": "1557746112754.241455",
        "TenantClass": 0,
        "Source": "PacketHeader.java:168",
        "ThreadID": 1,
        "ThreadName": "",
        "EventID": "D647845045A784B7",
        "ProcessID": 36430
      },
      {
        "Cycles": 0,
        "Agent": "edu.brown.cs.systems.xtrace.logging.BaggageWrappers",
        "ProcessName": "Read",
        "TaskID": "54A5F6F007C514A6",
        "ParentEventID": [
          "D647845045A784B7"
        ],
        "Label": "Forking current baggage with Baggage.fork()",
        "Title": "X-Trace Task",
        "Host": "pinky19.mpi-sws.org",
        "HRT": 26962472813967779,
        "Operation": "fork",
        "Timestamp": "1557746112754.254150",
        "TenantClass": 0,
        "Source": "RemoteBlockReader2.java:361",
        "ThreadID": 1,
        "ThreadName": "",
        "EventID": "A81289B31D50B762",
        "ProcessID": 36430
      },
      {
        "Cycles": 0,
        "Agent": "Execution-Sleep",
        "ProcessName": "Data",
        "TaskID": "54A5F6F007C514A6",
        "ParentEventID": [
          "8A60ED2ADBBB4965"
        ],
        "Label": "waited",
        "Title": "X-Trace Task",
        "Host": "pinky21.mpi-sws.org",
        "Duration": "275167",
        "HRT": 10808782520335192,
        "Operation": "waited",
        "Timestamp": "1557746112754.384521",
        "TenantClass": 0,
        "Source": "SocketIOWithTimeout.java:335",
        "ThreadID": 14875,
        "ThreadName": "",
        "EventID": "D53365ADEFAF7907",
        "BaggageBytes": "[[248 5] [240 0] [0 84 165 246 240 7 197 20 166] [240 1] [0 138 96 237 42 219 187 73 101] [240 3] [0 2]]",
        "ProcessID": 20775
      },
      {
        "Cycles": 0,
        "Agent": "edu.brown.cs.systems.xtrace.logging.BaggageWrappers",
        "ProcessName": "Data",
        "TaskID": "54A5F6F007C514A6",
        "ParentEventID": [
          "A81289B31D50B762",
          "D53365ADEFAF7907"
        ],
        "Label": "Merged current baggage with other baggage",
        "Title": "X-Trace Task",
        "Host": "pinky21.mpi-sws.org",
        "HRT": 10808782520387432,
        "Operation": "join",
        "Timestamp": "1557746112754.436768",
        "TenantClass": 0,
        "Source": "DataXceiver.java:574",
        "ThreadID": 14875,
        "ThreadName": "",
        "EventID": "A9D4A5D2D98355E2",
        "BaggageBytes": "[[248 5] [240 0] [0 84 165 246 240 7 197 20 166] [240 1] [0 168 18 137 179 29 80 183 98] [0 213 51 101 173 239 175 121 7] [240 3] [0 2]]",
        "ProcessID": 20775
      },
      {
        "Cycles": 0,
        "Agent": "Execution-CPU",
        "ProcessName": "Data",
        "TaskID": "54A5F6F007C514A6",
        "ParentEventID": [
          "A9D4A5D2D98355E2"
        ],
        "Label": "unset",
        "Title": "X-Trace Task",
        "Host": "pinky21.mpi-sws.org",
        "Duration": "32675480",
        "HRT": 10808782520407694,
        "Operation": "unset",
        "Timestamp": "1557746112754.457031",
        "TenantClass": 0,
        "Source": "DataXceiver.java:261",
        "ThreadID": 14875,
        "ThreadName": "",
        "EventID": "CD698041958084BB",
        "BaggageBytes": "[[248 5] [240 0] [0 84 165 246 240 7 197 20 166] [240 1] [0 169 212 165 210 217 131 85 226] [240 3] [0 2]]",
        "ProcessID": 20775
      }
    ]
  }
]