[
  {
    "id": "33702A1BF6E17E7A",
    "reports": [
      {
        "Cycles": 0,
        "Agent": "Execution-CPU",
        "ProcessName": "Read",
        "TaskID": "33702A1BF6E17E7A",
        "ParentEventID": [
          "EB54EA8058E98E90"
        ],
        "Label": "unset",
        "Title": "X-Trace Task",
        "Host": "pinky19.mpi-sws.org",
        "Duration": "24091718",
        "HRT": 26966802753005149,
        "Operation": "unset",
        "Timestamp": "1557750442693.153564",
        "TenantClass": 0,
        "Source": "Client.java:1027",
        "ThreadID": 1,
        "ThreadName": "",
        "EventID": "2F7CA5E5ED4471D2",
        "ProcessID": 2801
      },
      {
        "Cycles": 0,
        "Agent": "Execution-CPU",
        "ProcessName": "Read",
        "TaskID": "33702A1BF6E17E7A",
        "ParentEventID": [
          "2F7CA5E5ED4471D2"
        ],
        "Label": "set",
        "Title": "X-Trace Task",
        "Host": "pinky19.mpi-sws.org",
        "HRT": 26966802753047289,
        "Operation": "set",
        "Timestamp": "1557750442693.195801",
        "TenantClass": 0,
        "Source": "Client.java:1032",
        "ThreadID": 41,
        "ThreadName": "",
        "EventID": "A4196B2FF32B6874",
        "ProcessID": 2801
      },
      {
        "Cycles": 0,
        "Agent": "edu.brown.cs.systems.xtrace.logging.BaggageWrappers",
        "ProcessName": "Read",
        "TaskID": "33702A1BF6E17E7A",
        "ParentEventID": [
          "A4196B2FF32B6874"
        ],
        "Label": "Forking current baggage with Baggage.fork()",
        "Title": "X-Trace Task",
        "Host": "pinky19.mpi-sws.org",
        "HRT": 26966802753065821,
        "Operation": "fork",
        "Timestamp": "1557750442693.214355",
        "TenantClass": 0,
        "Source": "Client.java:1043",
        "ThreadID": 41,
        "ThreadName": "",
        "EventID": "1FB5C92229B1BEF7",
        "ProcessID": 2801
      },
      {
        "Cycles": 0,
        "Agent": "org.apache.hadoop.ipc.ProtobufRpcEngine",
        "ProcessName": "Read",
        "TaskID": "33702A1BF6E17E7A",
        "ParentEventID": [
          "B7B4F7B43238DEC1"
        ],
        "Label": "Invoking org.apache.hadoop.hdfs.protocol.ClientProtocol.getBlockLocations",
        "Title": "X-Trace Task",
        "Host": "pinky19.mpi-sws.org",
        "HRT": 26966802752990104,
        "Timestamp": "1557750442693.138428",
        "TenantClass": 0,
        "Source": "ProtobufRpcEngine.java:228",
        "ThreadID": 1,
        "ThreadName": "",
        "EventID": "EB54EA8058E98E90",
        "ProcessID": 2801
      },
      {
        "Cycles": 0,
        "Agent": "edu.brown.cs.systems.retro.benchmarks.hdfs_client.Reader",
        "ProcessName": "Read",
        "TaskID": "33702A1BF6E17E7A",
        "ParentEventID": [
          "0"
        ],
        "Label": "Reading file",
        "Title": "X-Trace Task",
        "Host": "pinky19.mpi-sws.org",
        "HRT": 26966802752950356,
        "Timestamp": "1557750442693.098877",
        "TenantClass": 0,
        "ThreadID": 1,
        "ThreadName": "",
        "EventID": "CFAB228AF00B2625",
        "ProcessID": 2801,
        "Tag": [
          "reader_100kb",
          "Read Size: 102400"
        ]
      },
      {
        "Cycles": 0,
        "Agent": "Execution-CPU",
        "ProcessName": "Read",
        "TaskID": "33702A1BF6E17E7A",
        "ParentEventID": [
          "1FB5C92229B1BEF7"
        ],
        "Label": "unset",
        "Title": "X-Trace Task",
        "Host": "pinky19.mpi-sws.org",
        "Duration": "65888",
        "HRT": 26966802753130988,
        "Operation": "unset",
        "Timestamp": "1557750442693.279297",
        "TenantClass": 0,
        "Source": "Client.java:1062",
        "ThreadID": 41,
        "ThreadName": "",
        "EventID": "BE7166B644799214",
        "ProcessID": 2801
      },
      {
        "Cycles": 0,
        "Agent": "Execution-CPU",
        "ProcessName": "Read",
        "TaskID": "33702A1BF6E17E7A",
        "ParentEventID": [
          "BE7166B644799214"
        ],
        "Label": "set",
        "Title": "X-Trace Task",
        "Host": "pinky19.mpi-sws.org",
        "HRT": 26966802753151608,
        "Operation": "set",
        "Timestamp": "1557750442693.300049",
        "TenantClass": 0,
        "Source": "Client.java:1104",
        "ThreadID": 1,
        "ThreadName": "",
        "EventID": "266A7E5428920BE1",
        "ProcessID": 2801
      },
      {
        "Cycles": 0,
        "Agent": "Execution-CPU",
        "ProcessName": "Name",
        "TaskID": "33702A1BF6E17E7A",
        "ParentEventID": [
          "1FB5C92229B1BEF7"
        ],
        "Label": "set",
        "Title": "X-Trace Task",
        "Host": "pinky19.mpi-sws.org",
        "HRT": 26966802753183298,
        "Operation": "set",
        "Timestamp": "1557750442693.347168",
        "TenantClass": 0,
        "Source": "Server.java:1840",
        "ThreadID": 48,
        "ThreadName": "",
        "EventID": "3A8D76374C9595A1",
        "BaggageBytes": "[[248 5] [240 0] [0 51 112 42 27 246 225 126 122] [240 1] [0 31 181 201 34 41 177 190 247] [240 3] [0 2]]",
        "ProcessID": 2171
      },
      {
        "Cycles": 0,
        "Agent": "edu.brown.cs.systems.xtrace.logging.BaggageWrappers",
        "ProcessName": "Name",
        "TaskID": "33702A1BF6E17E7A",
        "ParentEventID": [
          "3A8D76374C9595A1"
        ],
        "Label": "Forking current baggage with Baggage.fork()",
        "Title": "X-Trace Task",
        "Host": "pinky19.mpi-sws.org",
        "HRT": 26966802753212444,
        "Operation": "fork",
        "Timestamp": "1557750442693.376465",
        "TenantClass": 0,
        "Source": "Server.java:550",
        "ThreadID": 48,
        "ThreadName": "",
        "EventID": "D49AA89DAD1BC353",
        "BaggageBytes": "[[248 5] [240 0] [0 51 112 42 27 246 225 126 122] [240 1] [0 58 141 118 55 76 149 149 161] [240 3] [0 2]]",
        "ProcessID": 2171
      },
      {
        "Cycles": 0,
        "Agent": "Execution-CPU",
        "ProcessName": "Name",
        "TaskID": "33702A1BF6E17E7A",
        "ParentEventID": [
          "D49AA89DAD1BC353"
        ],
        "Label": "set",
        "Title": "X-Trace Task",
        "Host": "pinky19.mpi-sws.org",
        "HRT": 26966802753247000,
        "Operation": "set",
        "Timestamp": "1557750442693.410889",
        "TenantClass": 0,
        "Source": "Server.java:2071",
        "ThreadID": 57,
        "ThreadName": "",
        "EventID": "9097E275DEB1C9FC",
        "BaggageBytes": "[[248 5] [240 0] [0 51 112 42 27 246 225 126 122] [240 1] [0 212 154 168 157 173 27 195 83] [240 3] [0 2]]",
        "ProcessID": 2171
      },
      {
        "Cycles": 0,
        "Agent": "Execution-CPU",
        "ProcessName": "Name",
        "TaskID": "33702A1BF6E17E7A",
        "ParentEventID": [
          "D49AA89DAD1BC353"
        ],
        "Label": "unset",
        "Title": "X-Trace Task",
        "Host": "pinky19.mpi-sws.org",
        "Duration": "25976",
        "HRT": 26966802753234609,
        "Operation": "unset",
        "Timestamp": "1557750442693.398682",
        "TenantClass": 0,
        "Source": "Server.java:1828",
        "ThreadID": 48,
        "ThreadName": "",
        "EventID": "76FC56A3FC4D4CF8",
        "BaggageBytes": "[[248 5] [240 0] [0 51 112 42 27 246 225 126 122] [240 1] [0 212 154 168 157 173 27 195 83] [240 3] [0 2]]",
        "ProcessID": 2171
      },
      {
        "Cycles": 0,
        "Agent": "org.apache.hadoop.ipc.Server",
        "ProcessName": "Name",
        "TaskID": "33702A1BF6E17E7A",
        "ParentEventID": [
          "9097E275DEB1C9FC"
        ],
        "Label": "getBlockLocations in org.apache.hadoop.hdfs.protocol.ClientProtocol",
        "Title": "X-Trace Task",
        "Host": "pinky19.mpi-sws.org",
        "HRT": 26966802753283604,
        "Timestamp": "1557750442693.447510",
        "TenantClass": 0,
        "Source": "ProtobufRpcEngine.java:601",
        "ThreadID": 57,
        "ThreadName": "",
        "EventID": "2E88478480D9BF51",
        "BaggageBytes": "[[248 5] [240 0] [0 51 112 42 27 246 225 126 122] [240 1] [0 144 151 226 117 222 177 201 252] [240 3] [0 2]]",
        "ProcessID": 2171
      },
      {
        "Cycles": 0,
        "Agent": "org.apache.hadoop.hdfs.server.namenode.FSNamesystem.audit",
        "ProcessName": "Name",
        "TaskID": "33702A1BF6E17E7A",
        "ParentEventID": [
          "2E88478480D9BF51"
        ],
        "Label": "allowed=true\tugi=plascas (auth:SIMPLE)\tip=/139.19.171.63\tcmd=open\tsrc=/ds/imlSntjJH3pL56Jb\tdst=null\tperm=null\tproto=rpc",
        "Title": "X-Trace Task",
        "Host": "pinky19.mpi-sws.org",
        "HRT": 26966802753347333,
        "Timestamp": "1557750442693.511230",
        "TenantClass": 0,
        "Source": "FSNamesystem.java:8313",
        "ThreadID": 57,
        "ThreadName": "",
        "EventID": "44BA794A9BE1D42E",
        "BaggageBytes": "[[248 5] [240 0] [0 51 112 42 27 246 225 126 122] [240 1] [0 46 136 71 132 128 217 191 81] [240 3] [0 2]]",
        "ProcessID": 2171
      },
      {
        "Cycles": 0,
        "Agent": "edu.brown.cs.systems.xtrace.logging.BaggageWrappers",
        "ProcessName": "Name",
        "TaskID": "33702A1BF6E17E7A",
        "ParentEventID": [
          "44BA794A9BE1D42E"
        ],
        "Label": "Forking current baggage with Baggage.fork()",
        "Title": "X-Trace Task",
        "Host": "pinky19.mpi-sws.org",
        "HRT": 26966802753390120,
        "Operation": "fork",
        "Timestamp": "1557750442693.554199",
        "TenantClass": 0,
        "Source": "Server.java:2398",
        "ThreadID": 57,
        "ThreadName": "",
        "EventID": "79200F6D997EEBB0",
        "BaggageBytes": "[[248 5] [240 0] [0 51 112 42 27 246 225 126 122] [240 1] [0 68 186 121 74 155 225 212 46] [240 3] [0 2]]",
        "ProcessID": 2171
      },
      {
        "Cycles": 0,
        "Agent": "Execution-CPU",
        "ProcessName": "Name",
        "TaskID": "33702A1BF6E17E7A",
        "ParentEventID": [
          "79200F6D997EEBB0"
        ],
        "Label": "unset",
        "Title": "X-Trace Task",
        "Host": "pinky19.mpi-sws.org",
        "Duration": "225191",
        "HRT": 26966802753494806,
        "Operation": "unset",
        "Timestamp": "1557750442693.658691",
        "TenantClass": 0,
        "Source": "Server.java:1058",
        "ThreadID": 57,
        "ThreadName": "",
        "EventID": "F2ED255EDA011271",
        "BaggageBytes": "[[248 5] [240 0] [0 51 112 42 27 246 225 126 122] [240 1] [0 121 32 15 109 153 126 235 176] [240 3] [0 2]]",
        "ProcessID": 2171
      },
      {
        "Cycles": 0,
        "Agent": "Execution-CPU",
        "ProcessName": "Read",
        "TaskID": "33702A1BF6E17E7A",
        "ParentEventID": [
          "79200F6D997EEBB0"
        ],
        "Label": "set",
        "Title": "X-Trace Task",
        "Host": "pinky19.mpi-sws.org",
        "HRT": 26966802753538946,
        "Operation": "set",
        "Timestamp": "1557750442693.687256",
        "TenantClass": 0,
        "Source": "Client.java:302",
        "ThreadID": 40,
        "ThreadName": "",
        "EventID": "EA0D74A1B78E0A8B",
        "ProcessID": 2801
      },
      {
        "Cycles": 0,
        "Agent": "Execution-Sleep",
        "ProcessName": "Read",
        "TaskID": "33702A1BF6E17E7A",
        "ParentEventID": [
          "266A7E5428920BE1"
        ],
        "Label": "waited",
        "Title": "X-Trace Task",
        "Host": "pinky19.mpi-sws.org",
        "Duration": "436911",
        "HRT": 26966802753598685,
        "Operation": "waited",
        "Timestamp": "1557750442693.747070",
        "TenantClass": 0,
        "Source": "Client.java:1537",
        "ThreadID": 1,
        "ThreadName": "",
        "EventID": "959D3B1DAA8D9E23",
        "ProcessID": 2801
      },
      {
        "Cycles": 0,
        "Agent": "Execution-CPU",
        "ProcessName": "Read",
        "TaskID": "33702A1BF6E17E7A",
        "ParentEventID": [
          "EA0D74A1B78E0A8B"
        ],
        "Label": "unset",
        "Title": "X-Trace Task",
        "Host": "pinky19.mpi-sws.org",
        "Duration": "4678",
        "HRT": 26966802753558300,
        "Operation": "unset",
        "Timestamp": "1557750442693.706787",
        "TenantClass": 0,
        "Source": "Client.java:1168",
        "ThreadID": 40,
        "ThreadName": "",
        "EventID": "BB3A0E67DCBD93DC",
        "ProcessID": 2801
      },
      {
        "Cycles": 0,
        "Agent": "org.apache.hadoop.ipc.ProtobufRpcEngine",
        "ProcessName": "Read",
        "TaskID": "33702A1BF6E17E7A",
        "ParentEventID": [
          "91CAC60FFDD67E43"
        ],
        "Label": "org.apache.hadoop.hdfs.protocol.ClientProtocol.getBlockLocations completed",
        "Title": "X-Trace Task",
        "Host": "pinky19.mpi-sws.org",
        "HRT": 26966802753657911,
        "Timestamp": "1557750442693.806396",
        "TenantClass": 0,
        "Source": "ProtobufRpcEngine.java:275",
        "ThreadID": 1,
        "ThreadName": "",
        "EventID": "7B6E9651545F83E7",
        "ProcessID": 2801
      },
      {
        "Cycles": 0,
        "Agent": "edu.brown.cs.systems.xtrace.logging.BaggageWrappers",
        "ProcessName": "Read",
        "TaskID": "33702A1BF6E17E7A",
        "ParentEventID": [
          "959D3B1DAA8D9E23",
          "BB3A0E67DCBD93DC"
        ],
        "Label": "Merged current baggage with other baggage",
        "Title": "X-Trace Task",
        "Host": "pinky19.mpi-sws.org",
        "HRT": 26966802753619549,
        "Operation": "join",
        "Timestamp": "1557750442693.768066",
        "TenantClass": 0,
        "Source": "Client.java:1545",
        "ThreadID": 1,
        "ThreadName": "",
        "EventID": "91CAC60FFDD67E43",
        "ProcessID": 2801
      },
      {
        "Cycles": 0,
        "Agent": "Execution-Sleep",
        "ProcessName": "Read",
        "TaskID": "33702A1BF6E17E7A",
        "ParentEventID": [
          "7B6E9651545F83E7"
        ],
        "Label": "waited",
        "Title": "X-Trace Task",
        "Host": "pinky19.mpi-sws.org",
        "Duration": "81420",
        "HRT": 26966802753819320,
        "Operation": "waited",
        "Timestamp": "1557750442693.967773",
        "TenantClass": 0,
        "Source": "SocketIOWithTimeout.java:335",
        "ThreadID": 1,
        "ThreadName": "",
        "EventID": "941B05C3ACE04835",
        "ProcessID": 2801
      },
      {
        "Cycles": 0,
        "Agent": "edu.brown.cs.systems.xtrace.logging.BaggageWrappers",
        "ProcessName": "Read",
        "TaskID": "33702A1BF6E17E7A",
        "ParentEventID": [
          "941B05C3ACE04835"
        ],
        "Label": "Forking current baggage with Baggage.fork()",
        "Title": "X-Trace Task",
        "Host": "pinky19.mpi-sws.org",
        "HRT": 26966802753871050,
        "Operation": "fork",
        "Timestamp": "1557750442694.019531",
        "TenantClass": 0,
        "Source": "DataTransferProtoUtil.java:94",
        "ThreadID": 1,
        "ThreadName": "",
        "EventID": "48CD52076468C076",
        "ProcessID": 2801
      },
      {
        "Cycles": 0,
        "Agent": "edu.brown.cs.systems.retro.benchmarks.hdfs_client.Reader",
        "ProcessName": "Read",
        "TaskID": "33702A1BF6E17E7A",
        "ParentEventID": [
          "CFAB228AF00B2625"
        ],
        "Label": "Reading file",
        "Title": "X-Trace Task",
        "Host": "pinky19.mpi-sws.org",
        "HRT": 26966802752966937,
        "Timestamp": "1557750442693.115234",
        "TenantClass": 0,
        "ThreadID": 1,
        "ThreadName": "",
        "EventID": "B7B4F7B43238DEC1",
        "ProcessID": 2801
      },
      {
        "Cycles": 0,
        "Agent": "Execution-CPU",
        "ProcessName": "Data",
        "TaskID": "33702A1BF6E17E7A",
        "ParentEventID": [
          "48CD52076468C076"
        ],
        "Label": "set",
        "Title": "X-Trace Task",
        "Host": "pinky22.mpi-sws.org",
        "HRT": 47516775019600254,
        "Operation": "set",
        "Timestamp": "1557750442705.360107",
        "TenantClass": 0,
        "Source": "Receiver.java:117",
        "ThreadID": 16333,
        "ThreadName": "",
        "EventID": "60252176F3E29DB1",
        "BaggageBytes": "[[248 5] [240 0] [0 51 112 42 27 246 225 126 122] [240 1] [0 72 205 82 7 100 104 192 118] [240 3] [0 2]]",
        "ProcessID": 28841
      },
      {
        "Cycles": 0,
        "Agent": "edu.brown.cs.systems.xtrace.logging.XTraceInit",
        "ProcessName": "Data",
        "TaskID": "33702A1BF6E17E7A",
        "ParentEventID": [
          "60252176F3E29DB1"
        ],
        "Label": "Thread.setName: DataXceiver for client DFSClient_NONMAPREDUCE_310321604_1 at /139.19.171.63:36918 [Sending block BP-1633380353-139.19.171.63-1554193446451:blk_1073770454_29630]",
        "Title": "X-Trace Task",
        "Host": "pinky22.mpi-sws.org",
        "HRT": 47516775019726218,
        "Timestamp": "1557750442705.486084",
        "TenantClass": 0,
        "Source": "DataXceiver.java:168",
        "ThreadID": 16333,
        "ThreadName": "",
        "EventID": "8E91D0A97FC46A64",
        "BaggageBytes": "[[248 5] [240 0] [0 51 112 42 27 246 225 126 122] [240 1] [0 96 37 33 118 243 226 157 177] [240 3] [0 2]]",
        "ProcessID": 28841
      },
      {
        "Cycles": 0,
        "Agent": "edu.brown.cs.systems.xtrace.logging.BaggageWrappers",
        "ProcessName": "Data",
        "TaskID": "33702A1BF6E17E7A",
        "ParentEventID": [
          "8E91D0A97FC46A64"
        ],
        "Label": "Forking current baggage with Baggage.fork()",
        "Title": "X-Trace Task",
        "Host": "pinky22.mpi-sws.org",
        "HRT": 47516775019965775,
        "Operation": "fork",
        "Timestamp": "1557750442705.725586",
        "TenantClass": 0,
        "Source": "DataXceiver.java:1257",
        "ThreadID": 16333,
        "ThreadName": "",
        "EventID": "AC2A4263BEB3BFAC",
        "BaggageBytes": "[[248 5] [240 0] [0 51 112 42 27 246 225 126 122] [240 1] [0 142 145 208 169 127 196 106 100] [240 3] [0 2]]",
        "ProcessID": 28841
      },
      {
        "Cycles": 0,
        "Agent": "edu.brown.cs.systems.xtrace.logging.BaggageWrappers",
        "ProcessName": "Data",
        "TaskID": "33702A1BF6E17E7A",
        "ParentEventID": [
          "AC2A4263BEB3BFAC"
        ],
        "Label": "Forking current baggage with Baggage.fork()",
        "Title": "X-Trace Task",
        "Host": "pinky22.mpi-sws.org",
        "HRT": 47516775020120730,
        "Operation": "fork",
        "Timestamp": "1557750442705.880615",
        "TenantClass": 0,
        "Source": "PacketHeader.java:95",
        "ThreadID": 16333,
        "ThreadName": "",
        "EventID": "30C20B7D2917E817",
        "BaggageBytes": "[[248 5] [240 0] [0 51 112 42 27 246 225 126 122] [240 1] [0 172 42 66 99 190 179 191 172] [240 3] [0 2]]",
        "ProcessID": 28841
      },
      {
        "Cycles": 0,
        "Agent": "Execution-Sleep",
        "ProcessName": "Read",
        "TaskID": "33702A1BF6E17E7A",
        "ParentEventID": [
          "48CD52076468C076"
        ],
        "Label": "waited",
        "Title": "X-Trace Task",
        "Host": "pinky19.mpi-sws.org",
        "Duration": "11858409",
        "HRT": 26966802765825408,
        "Operation": "waited",
        "Timestamp": "1557750442705.973877",
        "TenantClass": 0,
        "Source": "SocketIOWithTimeout.java:335",
        "ThreadID": 1,
        "ThreadName": "",
        "EventID": "3384CE0A69779588",
        "ProcessID": 2801
      },
      {
        "Cycles": 0,
        "Agent": "edu.brown.cs.systems.xtrace.logging.BaggageWrappers",
        "ProcessName": "Read",
        "TaskID": "33702A1BF6E17E7A",
        "ParentEventID": [
          "AC2A4263BEB3BFAC",
          "3384CE0A69779588"
        ],
        "Label": "Merged current baggage with other baggage",
        "Title": "X-Trace Task",
        "Host": "pinky19.mpi-sws.org",
        "HRT": 26966802765933551,
        "Operation": "join",
        "Timestamp": "1557750442706.082031",
        "TenantClass": 0,
        "Source": "RemoteBlockReader2.java:429",
        "ThreadID": 1,
        "ThreadName": "",
        "EventID": "65725990B01A621A",
        "ProcessID": 2801
      },
      {
        "Cycles": 0,
        "Agent": "Execution-Sleep",
        "ProcessName": "Data",
        "TaskID": "33702A1BF6E17E7A",
        "ParentEventID": [
          "30C20B7D2917E817"
        ],
        "Label": "waited",
        "Title": "X-Trace Task",
        "Host": "pinky22.mpi-sws.org",
        "Duration": "14969",
        "HRT": 47516775020255767,
        "Operation": "waited",
        "Timestamp": "1557750442706.015625",
        "TenantClass": 0,
        "Source": "SocketIOWithTimeout.java:335",
        "ThreadID": 16333,
        "ThreadName": "",
        "EventID": "34DB7DA611732D11",
        "BaggageBytes": "[[248 5] [240 0] [0 51 112 42 27 246 225 126 122] [240 1] [0 48 194 11 125 41 23 232 23] [240 3] [0 2]]",
        "ProcessID": 28841
      },
      {
        "Cycles": 0,
        "Agent": "edu.brown.cs.systems.xtrace.logging.BaggageWrappers",
        "ProcessName": "Data",
        "TaskID": "33702A1BF6E17E7A",
        "ParentEventID": [
          "34DB7DA611732D11"
        ],
        "Label": "Forking current baggage with Baggage.fork()",
        "Title": "X-Trace Task",
        "Host": "pinky22.mpi-sws.org",
        "HRT": 47516775020411764,
        "Operation": "fork",
        "Timestamp": "1557750442706.171631",
        "TenantClass": 0,
        "Source": "PacketHeader.java:95",
        "ThreadID": 16333,
        "ThreadName": "",
        "EventID": "BE6E7B8F8D3AABD7",
        "BaggageBytes": "[[248 5] [240 0] [0 51 112 42 27 246 225 126 122] [240 1] [0 52 219 125 166 17 115 45 17] [240 3] [0 2]]",
        "ProcessID": 28841
      },
      {
        "Cycles": 0,
        "Agent": "Execution-Sleep",
        "ProcessName": "Read",
        "TaskID": "33702A1BF6E17E7A",
        "ParentEventID": [
          "65725990B01A621A"
        ],
        "Label": "waited",
        "Title": "X-Trace Task",
        "Host": "pinky19.mpi-sws.org",
        "Duration": "360030",
        "HRT": 26966802766372444,
        "Operation": "waited",
        "Timestamp": "1557750442706.520752",
        "TenantClass": 0,
        "Source": "SocketIOWithTimeout.java:335",
        "ThreadID": 1,
        "ThreadName": "",
        "EventID": "D2B74BF767019CFD",
        "ProcessID": 2801
      },
      {
        "Cycles": 0,
        "Agent": "Execution-Sleep",
        "ProcessName": "Read",
        "TaskID": "33702A1BF6E17E7A",
        "ParentEventID": [
          "D2B74BF767019CFD"
        ],
        "Label": "waited",
        "Title": "X-Trace Task",
        "Host": "pinky19.mpi-sws.org",
        "Duration": "216580",
        "HRT": 26966802766666810,
        "Operation": "waited",
        "Timestamp": "1557750442706.815186",
        "TenantClass": 0,
        "Source": "SocketIOWithTimeout.java:335",
        "ThreadID": 1,
        "ThreadName": "",
        "EventID": "ABDB81E9211EEA18",
        "ProcessID": 2801
      },
      {
        "Cycles": 0,
        "Agent": "Execution-Sleep",
        "ProcessName": "Read",
        "TaskID": "33702A1BF6E17E7A",
        "ParentEventID": [
          "ABDB81E9211EEA18"
        ],
        "Label": "waited",
        "Title": "X-Trace Task",
        "Host": "pinky19.mpi-sws.org",
        "Duration": "132660",
        "HRT": 26966802766863209,
        "Operation": "waited",
        "Timestamp": "1557750442707.011719",
        "TenantClass": 0,
        "Source": "SocketIOWithTimeout.java:335",
        "ThreadID": 1,
        "ThreadName": "",
        "EventID": "ED1E29F492E9A3B5",
        "ProcessID": 2801
      },
      {
        "Cycles": 0,
        "Agent": "edu.brown.cs.systems.xtrace.logging.BaggageWrappers",
        "ProcessName": "Read",
        "TaskID": "33702A1BF6E17E7A",
        "ParentEventID": [
          "ED1E29F492E9A3B5",
          "30C20B7D2917E817"
        ],
        "Label": "Merged current baggage with other baggage",
        "Title": "X-Trace Task",
        "Host": "pinky19.mpi-sws.org",
        "HRT": 26966802766928191,
        "Operation": "join",
        "Timestamp": "1557750442707.076660",
        "TenantClass": 0,
        "Source": "PacketHeader.java:168",
        "ThreadID": 1,
        "ThreadName": "",
        "EventID": "B553521986E47749",
        "ProcessID": 2801
      },
      {
        "Cycles": 0,
        "Agent": "edu.brown.cs.systems.xtrace.logging.BaggageWrappers",
        "ProcessName": "Read",
        "TaskID": "33702A1BF6E17E7A",
        "ParentEventID": [
          "B553521986E47749",
          "BE6E7B8F8D3AABD7"
        ],
        "Label": "Merged current baggage with other baggage",
        "Title": "X-Trace Task",
        "Host": "pinky19.mpi-sws.org",
        "HRT": 26966802767022583,
        "Operation": "join",
        "Timestamp": "1557750442707.170898",
        "TenantClass": 0,
        "Source": "PacketHeader.java:168",
        "ThreadID": 1,
        "ThreadName": "",
        "EventID": "0966A8C4F3763BE4",
        "ProcessID": 2801
      },
      {
        "Cycles": 0,
        "Agent": "edu.brown.cs.systems.xtrace.logging.BaggageWrappers",
        "ProcessName": "Read",
        "TaskID": "33702A1BF6E17E7A",
        "ParentEventID": [
          "0966A8C4F3763BE4"
        ],
        "Label": "Forking current baggage with Baggage.fork()",
        "Title": "X-Trace Task",
        "Host": "pinky19.mpi-sws.org",
        "HRT": 26966802767031401,
        "Operation": "fork",
        "Timestamp": "1557750442707.179932",
        "TenantClass": 0,
        "Source": "RemoteBlockReader2.java:361",
        "ThreadID": 1,
        "ThreadName": "",
        "EventID": "B7026DDDE40685E9",
        "ProcessID": 2801
      },
      {
        "Cycles": 0,
        "Agent": "edu.brown.cs.systems.xtrace.logging.BaggageWrappers",
        "ProcessName": "Read",
        "TaskID": "33702A1BF6E17E7A",
        "ParentEventID": [
          "B7026DDDE40685E9"
        ],
        "Label": "Forking current baggage with Baggage.fork()",
        "Title": "X-Trace Task",
        "Host": "pinky19.mpi-sws.org",
        "HRT": 26966802767084954,
        "Operation": "fork",
        "Timestamp": "1557750442707.233398",
        "TenantClass": 0,
        "Source": "DataTransferProtoUtil.java:94",
        "ThreadID": 1,
        "ThreadName": "",
        "EventID": "614EC4C689273AC3",
        "ProcessID": 2801
      },
      {
        "Cycles": 0,
        "Agent": "Execution-Sleep",
        "ProcessName": "Data",
        "TaskID": "33702A1BF6E17E7A",
        "ParentEventID": [
          "BE6E7B8F8D3AABD7"
        ],
        "Label": "waited",
        "Title": "X-Trace Task",
        "Host": "pinky22.mpi-sws.org",
        "Duration": "903658",
        "HRT": 47516775021484305,
        "Operation": "waited",
        "Timestamp": "1557750442707.244141",
        "TenantClass": 0,
        "Source": "SocketIOWithTimeout.java:335",
        "ThreadID": 16333,
        "ThreadName": "",
        "EventID": "9C9ADFC98E59D91E",
        "BaggageBytes": "[[248 5] [240 0] [0 51 112 42 27 246 225 126 122] [240 1] [0 190 110 123 143 141 58 171 215] [240 3] [0 2]]",
        "ProcessID": 28841
      },
      {
        "Cycles": 0,
        "Agent": "edu.brown.cs.systems.xtrace.logging.BaggageWrappers",
        "ProcessName": "Data",
        "TaskID": "33702A1BF6E17E7A",
        "ParentEventID": [
          "B7026DDDE40685E9",
          "9C9ADFC98E59D91E"
        ],
        "Label": "Merged current baggage with other baggage",
        "Title": "X-Trace Task",
        "Host": "pinky22.mpi-sws.org",
        "HRT": 47516775021691081,
        "Operation": "join",
        "Timestamp": "1557750442707.450928",
        "TenantClass": 0,
        "Source": "DataXceiver.java:574",
        "ThreadID": 16333,
        "ThreadName": "",
        "EventID": "2F154B7AB5D46596",
        "BaggageBytes": "[[248 5] [240 0] [0 51 112 42 27 246 225 126 122] [240 1] [0 156 154 223 201 142 89 217 30] [0 183 2 109 221 228 6 133 233] [240 3] [0 2]]",
        "ProcessID": 28841
      },
      {
        "Cycles": 0,
        "Agent": "Execution-CPU",
        "ProcessName": "Data",
        "TaskID": "33702A1BF6E17E7A",
        "ParentEventID": [
          "2F154B7AB5D46596"
        ],
        "Label": "unset",
        "Title": "X-Trace Task",
        "Host": "pinky22.mpi-sws.org",
        "Duration": "2083485",
        "HRT": 47516775021764862,
        "Operation": "unset",
        "Timestamp": "1557750442707.524658",
        "TenantClass": 0,
        "Source": "DataXceiver.java:261",
        "ThreadID": 16333,
        "ThreadName": "",
        "EventID": "4D775A6CB485D87B",
        "BaggageBytes": "[[248 5] [240 0] [0 51 112 42 27 246 225 126 122] [240 1] [0 47 21 75 122 181 212 101 150] [240 3] [0 2]]",
        "ProcessID": 28841
      },
      {
        "Cycles": 0,
        "Agent": "Execution-CPU",
        "ProcessName": "Data",
        "TaskID": "33702A1BF6E17E7A",
        "ParentEventID": [
          "614EC4C689273AC3"
        ],
        "Label": "set",
        "Title": "X-Trace Task",
        "Host": "pinky22.mpi-sws.org",
        "HRT": 47516775021827644,
        "Operation": "set",
        "Timestamp": "1557750442707.587402",
        "TenantClass": 0,
        "Source": "Receiver.java:117",
        "ThreadID": 16333,
        "ThreadName": "",
        "EventID": "74293C012B0DAAC3",
        "BaggageBytes": "[[248 5] [240 0] [0 51 112 42 27 246 225 126 122] [240 1] [0 97 78 196 198 137 39 58 195] [240 3] [0 2]]",
        "ProcessID": 28841
      },
      {
        "Cycles": 0,
        "Agent": "edu.brown.cs.systems.xtrace.logging.XTraceInit",
        "ProcessName": "Data",
        "TaskID": "33702A1BF6E17E7A",
        "ParentEventID": [
          "74293C012B0DAAC3"
        ],
        "Label": "Thread.setName: DataXceiver for client DFSClient_NONMAPREDUCE_310321604_1 at /139.19.171.63:36918 [Sending block BP-1633380353-139.19.171.63-1554193446451:blk_1073770454_29630]",
        "Title": "X-Trace Task",
        "Host": "pinky22.mpi-sws.org",
        "HRT": 47516775021891059,
        "Timestamp": "1557750442707.650879",
        "TenantClass": 0,
        "Source": "DataXceiver.java:168",
        "ThreadID": 16333,
        "ThreadName": "",
        "EventID": "C9871D020EE244B1",
        "BaggageBytes": "[[248 5] [240 0] [0 51 112 42 27 246 225 126 122] [240 1] [0 116 41 60 1 43 13 170 195] [240 3] [0 2]]",
        "ProcessID": 28841
      },
      {
        "Cycles": 0,
        "Agent": "edu.brown.cs.systems.xtrace.logging.BaggageWrappers",
        "ProcessName": "Data",
        "TaskID": "33702A1BF6E17E7A",
        "ParentEventID": [
          "C9871D020EE244B1"
        ],
        "Label": "Forking current baggage with Baggage.fork()",
        "Title": "X-Trace Task",
        "Host": "pinky22.mpi-sws.org",
        "HRT": 47516775022070171,
        "Operation": "fork",
        "Timestamp": "1557750442707.830078",
        "TenantClass": 0,
        "Source": "DataXceiver.java:1257",
        "ThreadID": 16333,
        "ThreadName": "",
        "EventID": "0F17B4741B0EC8DC",
        "BaggageBytes": "[[248 5] [240 0] [0 51 112 42 27 246 225 126 122] [240 1] [0 201 135 29 2 14 226 68 177] [240 3] [0 2]]",
        "ProcessID": 28841
      },
      {
        "Cycles": 0,
        "Agent": "Execution-Sleep",
        "ProcessName": "Read",
        "TaskID": "33702A1BF6E17E7A",
        "ParentEventID": [
          "614EC4C689273AC3"
        ],
        "Label": "waited",
        "Title": "X-Trace Task",
        "Host": "pinky19.mpi-sws.org",
        "Duration": "755138",
        "HRT": 26966802767902295,
        "Operation": "waited",
        "Timestamp": "1557750442708.050781",
        "TenantClass": 0,
        "Source": "SocketIOWithTimeout.java:335",
        "ThreadID": 1,
        "ThreadName": "",
        "EventID": "36DA868854F358AE",
        "ProcessID": 2801
      },
      {
        "Cycles": 0,
        "Agent": "edu.brown.cs.systems.xtrace.logging.BaggageWrappers",
        "ProcessName": "Read",
        "TaskID": "33702A1BF6E17E7A",
        "ParentEventID": [
          "36DA868854F358AE",
          "0F17B4741B0EC8DC"
        ],
        "Label": "Merged current baggage with other baggage",
        "Title": "X-Trace Task",
        "Host": "pinky19.mpi-sws.org",
        "HRT": 26966802767952604,
        "Operation": "join",
        "Timestamp": "1557750442708.101074",
        "TenantClass": 0,
        "Source": "RemoteBlockReader2.java:429",
        "ThreadID": 1,
        "ThreadName": "",
        "EventID": "E8EAEB78D62899CB",
        "ProcessID": 2801
      },
      {
        "Cycles": 0,
        "Agent": "edu.brown.cs.systems.xtrace.logging.BaggageWrappers",
        "ProcessName": "Data",
        "TaskID": "33702A1BF6E17E7A",
        "ParentEventID": [
          "0F17B4741B0EC8DC"
        ],
        "Label": "Forking current baggage with Baggage.fork()",
        "Title": "X-Trace Task",
        "Host": "pinky22.mpi-sws.org",
        "HRT": 47516775022200359,
        "Operation": "fork",
        "Timestamp": "1557750442707.960205",
        "TenantClass": 0,
        "Source": "PacketHeader.java:95",
        "ThreadID": 16333,
        "ThreadName": "",
        "EventID": "E58835D262E562DD",
        "BaggageBytes": "[[248 5] [240 0] [0 51 112 42 27 246 225 126 122] [240 1] [0 15 23 180 116 27 14 200 220] [240 3] [0 2]]",
        "ProcessID": 28841
      },
      {
        "Cycles": 0,
        "Agent": "Execution-Sleep",
        "ProcessName": "Read",
        "TaskID": "33702A1BF6E17E7A",
        "ParentEventID": [
          "E8EAEB78D62899CB"
        ],
        "Label": "waited",
        "Title": "X-Trace Task",
        "Host": "pinky19.mpi-sws.org",
        "Duration": "28869",
        "HRT": 26966802768026242,
        "Operation": "waited",
        "Timestamp": "1557750442708.174561",
        "TenantClass": 0,
        "Source": "SocketIOWithTimeout.java:335",
        "ThreadID": 1,
        "ThreadName": "",
        "EventID": "A1C4F6241E565F1C",
        "ProcessID": 2801
      },
      {
        "Cycles": 0,
        "Agent": "Execution-Sleep",
        "ProcessName": "Data",
        "TaskID": "33702A1BF6E17E7A",
        "ParentEventID": [
          "E58835D262E562DD"
        ],
        "Label": "waited",
        "Title": "X-Trace Task",
        "Host": "pinky22.mpi-sws.org",
        "Duration": "8846",
        "HRT": 47516775022318491,
        "Operation": "waited",
        "Timestamp": "1557750442708.078369",
        "TenantClass": 0,
        "Source": "SocketIOWithTimeout.java:335",
        "ThreadID": 16333,
        "ThreadName": "",
        "EventID": "94F4F5570700AD47",
        "BaggageBytes": "[[248 5] [240 0] [0 51 112 42 27 246 225 126 122] [240 1] [0 229 136 53 210 98 229 98 221] [240 3] [0 2]]",
        "ProcessID": 28841
      },
      {
        "Cycles": 0,
        "Agent": "edu.brown.cs.systems.xtrace.logging.BaggageWrappers",
        "ProcessName": "Data",
        "TaskID": "33702A1BF6E17E7A",
        "ParentEventID": [
          "94F4F5570700AD47"
        ],
        "Label": "Forking current baggage with Baggage.fork()",
        "Title": "X-Trace Task",
        "Host": "pinky22.mpi-sws.org",
        "HRT": 47516775022458803,
        "Operation": "fork",
        "Timestamp": "1557750442708.218750",
        "TenantClass": 0,
        "Source": "PacketHeader.java:95",
        "ThreadID": 16333,
        "ThreadName": "",
        "EventID": "D1FBBF43AE7E01A0",
        "BaggageBytes": "[[248 5] [240 0] [0 51 112 42 27 246 225 126 122] [240 1] [0 148 244 245 87 7 0 173 71] [240 3] [0 2]]",
        "ProcessID": 28841
      },
      {
        "Cycles": 0,
        "Agent": "Execution-Sleep",
        "ProcessName": "Read",
        "TaskID": "33702A1BF6E17E7A",
        "ParentEventID": [
          "A1C4F6241E565F1C"
        ],
        "Label": "waited",
        "Title": "X-Trace Task",
        "Host": "pinky19.mpi-sws.org",
        "Duration": "298873",
        "HRT": 26966802768386765,
        "Operation": "waited",
        "Timestamp": "1557750442708.535156",
        "TenantClass": 0,
        "Source": "SocketIOWithTimeout.java:335",
        "ThreadID": 1,
        "ThreadName": "",
        "EventID": "3753053D5F75B71F",
        "ProcessID": 2801
      },
      {
        "Cycles": 0,
        "Agent": "Execution-Sleep",
        "ProcessName": "Data",
        "TaskID": "33702A1BF6E17E7A",
        "ParentEventID": [
          "D1FBBF43AE7E01A0"
        ],
        "Label": "waited",
        "Title": "X-Trace Task",
        "Host": "pinky22.mpi-sws.org",
        "Duration": "181581",
        "HRT": 47516775022729049,
        "Operation": "waited",
        "Timestamp": "1557750442708.489014",
        "TenantClass": 0,
        "Source": "SocketIOWithTimeout.java:335",
        "ThreadID": 16333,
        "ThreadName": "",
        "EventID": "43E65143FA93F662",
        "BaggageBytes": "[[248 5] [240 0] [0 51 112 42 27 246 225 126 122] [240 1] [0 209 251 191 67 174 126 1 160] [240 3] [0 2]]",
        "ProcessID": 28841
      },
      {
        "Cycles": 0,
        "Agent": "Execution-Sleep",
        "ProcessName": "Read",
        "TaskID": "33702A1BF6E17E7A",
        "ParentEventID": [
          "3753053D5F75B71F"
        ],
        "Label": "waited",
        "Title": "X-Trace Task",
        "Host": "pinky19.mpi-sws.org",
        "Duration": "145154",
        "HRT": 26966802768595508,
        "Operation": "waited",
        "Timestamp": "1557750442708.743896",
        "TenantClass": 0,
        "Source": "SocketIOWithTimeout.java:335",
        "ThreadID": 1,
        "ThreadName": "",
        "EventID": "F67D68DBC0922D17",
        "ProcessID": 2801
      },
      {
        "Cycles": 0,
        "Agent": "edu.brown.cs.systems.xtrace.logging.BaggageWrappers",
        "ProcessName": "Data",
        "TaskID": "33702A1BF6E17E7A",
        "ParentEventID": [
          "43E65143FA93F662"
        ],
        "Label": "Forking current baggage with Baggage.fork()",
        "Title": "X-Trace Task",
        "Host": "pinky22.mpi-sws.org",
        "HRT": 47516775022860207,
        "Operation": "fork",
        "Timestamp": "1557750442708.620117",
        "TenantClass": 0,
        "Source": "PacketHeader.java:95",
        "ThreadID": 16333,
        "ThreadName": "",
        "EventID": "2F701D5DACA44259",
        "BaggageBytes": "[[248 5] [240 0] [0 51 112 42 27 246 225 126 122] [240 1] [0 67 230 81 67 250 147 246 98] [240 3] [0 2]]",
        "ProcessID": 28841
      },
      {
        "Cycles": 0,
        "Agent": "Execution-Sleep",
        "ProcessName": "Read",
        "TaskID": "33702A1BF6E17E7A",
        "ParentEventID": [
          "F67D68DBC0922D17"
        ],
        "Label": "waited",
        "Title": "X-Trace Task",
        "Host": "pinky19.mpi-sws.org",
        "Duration": "212548",
        "HRT": 26966802768866224,
        "Operation": "waited",
        "Timestamp": "1557750442709.014648",
        "TenantClass": 0,
        "Source": "SocketIOWithTimeout.java:335",
        "ThreadID": 1,
        "ThreadName": "",
        "EventID": "FA6FD75E550BA949",
        "ProcessID": 2801
      },
      {
        "Cycles": 0,
        "Agent": "Execution-Sleep",
        "ProcessName": "Data",
        "TaskID": "33702A1BF6E17E7A",
        "ParentEventID": [
          "2F701D5DACA44259"
        ],
        "Label": "waited",
        "Title": "X-Trace Task",
        "Host": "pinky22.mpi-sws.org",
        "Duration": "7151",
        "HRT": 47516775022945730,
        "Operation": "waited",
        "Timestamp": "1557750442708.705566",
        "TenantClass": 0,
        "Source": "SocketIOWithTimeout.java:335",
        "ThreadID": 16333,
        "ThreadName": "",
        "EventID": "1D7C900F96BF81D8",
        "BaggageBytes": "[[248 5] [240 0] [0 51 112 42 27 246 225 126 122] [240 1] [0 47 112 29 93 172 164 66 89] [240 3] [0 2]]",
        "ProcessID": 28841
      },
      {
        "Cycles": 0,
        "Agent": "edu.brown.cs.systems.xtrace.logging.BaggageWrappers",
        "ProcessName": "Read",
        "TaskID": "33702A1BF6E17E7A",
        "ParentEventID": [
          "E58835D262E562DD",
          "FA6FD75E550BA949"
        ],
        "Label": "Merged current baggage with other baggage",
        "Title": "X-Trace Task",
        "Host": "pinky19.mpi-sws.org",
        "HRT": 26966802768908662,
        "Operation": "join",
        "Timestamp": "1557750442709.057129",
        "TenantClass": 0,
        "Source": "PacketHeader.java:168",
        "ThreadID": 1,
        "ThreadName": "",
        "EventID": "DC23389BDF29D7B9",
        "ProcessID": 2801
      },
      {
        "Cycles": 0,
        "Agent": "edu.brown.cs.systems.xtrace.logging.BaggageWrappers",
        "ProcessName": "Data",
        "TaskID": "33702A1BF6E17E7A",
        "ParentEventID": [
          "1D7C900F96BF81D8"
        ],
        "Label": "Forking current baggage with Baggage.fork()",
        "Title": "X-Trace Task",
        "Host": "pinky22.mpi-sws.org",
        "HRT": 47516775023041838,
        "Operation": "fork",
        "Timestamp": "1557750442708.801758",
        "TenantClass": 0,
        "Source": "PacketHeader.java:95",
        "ThreadID": 16333,
        "ThreadName": "",
        "EventID": "E2F30F8B1E914196",
        "BaggageBytes": "[[248 5] [240 0] [0 51 112 42 27 246 225 126 122] [240 1] [0 29 124 144 15 150 191 129 216] [240 3] [0 2]]",
        "ProcessID": 28841
      },
      {
        "Cycles": 0,
        "Agent": "Execution-Sleep",
        "ProcessName": "Data",
        "TaskID": "33702A1BF6E17E7A",
        "ParentEventID": [
          "E2F30F8B1E914196"
        ],
        "Label": "waited",
        "Title": "X-Trace Task",
        "Host": "pinky22.mpi-sws.org",
        "Duration": "120195",
        "HRT": 47516775023246682,
        "Operation": "waited",
        "Timestamp": "1557750442709.006592",
        "TenantClass": 0,
        "Source": "SocketIOWithTimeout.java:335",
        "ThreadID": 16333,
        "ThreadName": "",
        "EventID": "F7AEE02C01A90C36",
        "BaggageBytes": "[[248 5] [240 0] [0 51 112 42 27 246 225 126 122] [240 1] [0 226 243 15 139 30 145 65 150] [240 3] [0 2]]",
        "ProcessID": 28841
      },
      {
        "Cycles": 0,
        "Agent": "Execution-CPU",
        "ProcessName": "Data",
        "TaskID": "33702A1BF6E17E7A",
        "ParentEventID": [
          "F7AEE02C01A90C36"
        ],
        "Label": "unset",
        "Title": "X-Trace Task",
        "Host": "pinky22.mpi-sws.org",
        "Duration": "1822138",
        "HRT": 47516775023691163,
        "Operation": "unset",
        "Timestamp": "1557750442709.450928",
        "TenantClass": 0,
        "Source": "DataXceiver.java:261",
        "ThreadID": 16333,
        "ThreadName": "",
        "EventID": "AFEC9A9E2FE452C7",
        "BaggageBytes": "[[248 5] [240 0] [0 51 112 42 27 246 225 126 122] [240 1] [0 247 174 224 44 1 169 12 54] [240 3] [0 2]]",
        "ProcessID": 28841
      }
    ]
  }
]