[
  {
    "id": "6542BD9A4DAE653C",
    "reports": [
      {
        "Cycles": 0,
        "Agent": "org.apache.hadoop.ipc.ProtobufRpcEngine",
        "ProcessName": "Read",
        "TaskID": "6542BD9A4DAE653C",
        "ParentEventID": [
          "B955AF8457C80EBE"
        ],
        "Label": "Invoking org.apache.hadoop.hdfs.protocol.ClientProtocol.getBlockLocations",
        "Title": "X-Trace Task",
        "Host": "pinky19.mpi-sws.org",
        "HRT": 25491785133280283,
        "Timestamp": "1556275425073.605957",
        "TenantClass": 0,
        "Source": "ProtobufRpcEngine.java:228",
        "ThreadID": 1,
        "ThreadName": "",
        "EventID": "ED83BBBEBBBD70D7",
        "ProcessID": 21035
      },
      {
        "Cycles": 0,
        "Agent": "Execution-CPU",
        "ProcessName": "Read",
        "TaskID": "6542BD9A4DAE653C",
        "ParentEventID": [
          "5E84173F14CBD8D7"
        ],
        "Label": "set",
        "Title": "X-Trace Task",
        "Host": "pinky19.mpi-sws.org",
        "HRT": 25491785133357826,
        "Operation": "set",
        "Timestamp": "1556275425073.683350",
        "TenantClass": 0,
        "Source": "Client.java:1032",
        "ThreadID": 41,
        "ThreadName": "",
        "EventID": "49BB957DF59DA3E9",
        "ProcessID": 21035
      },
      {
        "Cycles": 0,
        "Agent": "edu.brown.cs.systems.xtrace.logging.BaggageWrappers",
        "ProcessName": "Read",
        "TaskID": "6542BD9A4DAE653C",
        "ParentEventID": [
          "49BB957DF59DA3E9"
        ],
        "Label": "Forking current baggage with Baggage.fork()",
        "Title": "X-Trace Task",
        "Host": "pinky19.mpi-sws.org",
        "HRT": 25491785133378460,
        "Operation": "fork",
        "Timestamp": "1556275425073.704102",
        "TenantClass": 0,
        "Source": "Client.java:1043",
        "ThreadID": 41,
        "ThreadName": "",
        "EventID": "7E191D0CAB036A75",
        "ProcessID": 21035
      },
      {
        "Cycles": 0,
        "Agent": "Execution-CPU",
        "ProcessName": "Read",
        "TaskID": "6542BD9A4DAE653C",
        "ParentEventID": [
          "ED83BBBEBBBD70D7"
        ],
        "Label": "unset",
        "Title": "X-Trace Task",
        "Host": "pinky19.mpi-sws.org",
        "Duration": "22531187",
        "HRT": 25491785133306673,
        "Operation": "unset",
        "Timestamp": "1556275425073.632324",
        "TenantClass": 0,
        "Source": "Client.java:1027",
        "ThreadID": 1,
        "ThreadName": "",
        "EventID": "5E84173F14CBD8D7",
        "ProcessID": 21035
      },
      {
        "Cycles": 0,
        "Agent": "edu.brown.cs.systems.retro.benchmarks.hdfs_client.Reader",
        "ProcessName": "Read",
        "TaskID": "6542BD9A4DAE653C",
        "ParentEventID": [
          "EDD6AD375108F96D"
        ],
        "Label": "Reading file",
        "Title": "X-Trace Task",
        "Host": "pinky19.mpi-sws.org",
        "HRT": 25491785133228934,
        "Timestamp": "1556275425073.554443",
        "TenantClass": 0,
        "ThreadID": 1,
        "ThreadName": "",
        "EventID": "B955AF8457C80EBE",
        "ProcessID": 21035
      },
      {
        "Cycles": 0,
        "Agent": "Execution-CPU",
        "ProcessName": "Read",
        "TaskID": "6542BD9A4DAE653C",
        "ParentEventID": [
          "7E191D0CAB036A75"
        ],
        "Label": "unset",
        "Title": "X-Trace Task",
        "Host": "pinky19.mpi-sws.org",
        "Duration": "72068",
        "HRT": 25491785133449940,
        "Operation": "unset",
        "Timestamp": "1556275425073.775635",
        "TenantClass": 0,
        "Source": "Client.java:1062",
        "ThreadID": 41,
        "ThreadName": "",
        "EventID": "B061DD663FD3D9AD",
        "ProcessID": 21035
      },
      {
        "Cycles": 0,
        "Agent": "Execution-CPU",
        "ProcessName": "Read",
        "TaskID": "6542BD9A4DAE653C",
        "ParentEventID": [
          "B061DD663FD3D9AD"
        ],
        "Label": "set",
        "Title": "X-Trace Task",
        "Host": "pinky19.mpi-sws.org",
        "HRT": 25491785133473077,
        "Operation": "set",
        "Timestamp": "1556275425073.798584",
        "TenantClass": 0,
        "Source": "Client.java:1104",
        "ThreadID": 1,
        "ThreadName": "",
        "EventID": "E74987BE9047BA98",
        "ProcessID": 21035
      },
      {
        "Cycles": 0,
        "Agent": "Execution-CPU",
        "ProcessName": "Name",
        "TaskID": "6542BD9A4DAE653C",
        "ParentEventID": [
          "7E191D0CAB036A75"
        ],
        "Label": "set",
        "Title": "X-Trace Task",
        "Host": "pinky19.mpi-sws.org",
        "HRT": 25491785133505695,
        "Operation": "set",
        "Timestamp": "1556275425073.841553",
        "TenantClass": 0,
        "Source": "Server.java:1840",
        "ThreadID": 48,
        "ThreadName": "",
        "EventID": "F3F46D2B33CF9E95",
        "BaggageBytes": "[[248 5] [240 0] [0 101 66 189 154 77 174 101 60] [240 1] [0 126 25 29 12 171 3 106 117] [240 3] [0 2]]",
        "ProcessID": 2171
      },
      {
        "Cycles": 0,
        "Agent": "Execution-CPU",
        "ProcessName": "Name",
        "TaskID": "6542BD9A4DAE653C",
        "ParentEventID": [
          "3832C287B31CACE1"
        ],
        "Label": "unset",
        "Title": "X-Trace Task",
        "Host": "pinky19.mpi-sws.org",
        "Duration": "26075",
        "HRT": 25491785133563049,
        "Operation": "unset",
        "Timestamp": "1556275425073.898926",
        "TenantClass": 0,
        "Source": "Server.java:1828",
        "ThreadID": 48,
        "ThreadName": "",
        "EventID": "CF6BA1D267F874B4",
        "BaggageBytes": "[[248 5] [240 0] [0 101 66 189 154 77 174 101 60] [240 1] [0 56 50 194 135 179 28 172 225] [240 3] [0 2]]",
        "ProcessID": 2171
      },
      {
        "Cycles": 0,
        "Agent": "edu.brown.cs.systems.xtrace.logging.BaggageWrappers",
        "ProcessName": "Name",
        "TaskID": "6542BD9A4DAE653C",
        "ParentEventID": [
          "F3F46D2B33CF9E95"
        ],
        "Label": "Forking current baggage with Baggage.fork()",
        "Title": "X-Trace Task",
        "Host": "pinky19.mpi-sws.org",
        "HRT": 25491785133540885,
        "Operation": "fork",
        "Timestamp": "1556275425073.876709",
        "TenantClass": 0,
        "Source": "Server.java:550",
        "ThreadID": 48,
        "ThreadName": "",
        "EventID": "3832C287B31CACE1",
        "BaggageBytes": "[[248 5] [240 0] [0 101 66 189 154 77 174 101 60] [240 1] [0 243 244 109 43 51 207 158 149] [240 3] [0 2]]",
        "ProcessID": 2171
      },
      {
        "Cycles": 0,
        "Agent": "Execution-CPU",
        "ProcessName": "Name",
        "TaskID": "6542BD9A4DAE653C",
        "ParentEventID": [
          "3832C287B31CACE1"
        ],
        "Label": "set",
        "Title": "X-Trace Task",
        "Host": "pinky19.mpi-sws.org",
        "HRT": 25491785133574792,
        "Operation": "set",
        "Timestamp": "1556275425073.910645",
        "TenantClass": 0,
        "Source": "Server.java:2071",
        "ThreadID": 59,
        "ThreadName": "",
        "EventID": "08881F10234EE475",
        "BaggageBytes": "[[248 5] [240 0] [0 101 66 189 154 77 174 101 60] [240 1] [0 56 50 194 135 179 28 172 225] [240 3] [0 2]]",
        "ProcessID": 2171
      },
      {
        "Cycles": 0,
        "Agent": "org.apache.hadoop.ipc.Server",
        "ProcessName": "Name",
        "TaskID": "6542BD9A4DAE653C",
        "ParentEventID": [
          "08881F10234EE475"
        ],
        "Label": "getBlockLocations in org.apache.hadoop.hdfs.protocol.ClientProtocol",
        "Title": "X-Trace Task",
        "Host": "pinky19.mpi-sws.org",
        "HRT": 25491785133610729,
        "Timestamp": "1556275425073.946777",
        "TenantClass": 0,
        "Source": "ProtobufRpcEngine.java:601",
        "ThreadID": 59,
        "ThreadName": "",
        "EventID": "6ABE1CFA3A488261",
        "BaggageBytes": "[[248 5] [240 0] [0 101 66 189 154 77 174 101 60] [240 1] [0 8 136 31 16 35 78 228 117] [240 3] [0 2]]",
        "ProcessID": 2171
      },
      {
        "Cycles": 0,
        "Agent": "edu.brown.cs.systems.xtrace.logging.BaggageWrappers",
        "ProcessName": "Name",
        "TaskID": "6542BD9A4DAE653C",
        "ParentEventID": [
          "E784CA61B1B5EB48"
        ],
        "Label": "Forking current baggage with Baggage.fork()",
        "Title": "X-Trace Task",
        "Host": "pinky19.mpi-sws.org",
        "HRT": 25491785133724893,
        "Operation": "fork",
        "Timestamp": "1556275425074.060791",
        "TenantClass": 0,
        "Source": "Server.java:2398",
        "ThreadID": 59,
        "ThreadName": "",
        "EventID": "423DE9E075E63BC6",
        "BaggageBytes": "[[248 5] [240 0] [0 101 66 189 154 77 174 101 60] [240 1] [0 231 132 202 97 177 181 235 72] [240 3] [0 2]]",
        "ProcessID": 2171
      },
      {
        "Cycles": 0,
        "Agent": "org.apache.hadoop.hdfs.server.namenode.FSNamesystem.audit",
        "ProcessName": "Name",
        "TaskID": "6542BD9A4DAE653C",
        "ParentEventID": [
          "6ABE1CFA3A488261"
        ],
        "Label": "allowed=true\tugi=plascas (auth:SIMPLE)\tip=/139.19.171.63\tcmd=open\tsrc=/ds/HLNX6HnHkZSG3Zo9\tdst=null\tperm=null\tproto=rpc",
        "Title": "X-Trace Task",
        "Host": "pinky19.mpi-sws.org",
        "HRT": 25491785133659964,
        "Timestamp": "1556275425073.995850",
        "TenantClass": 0,
        "Source": "FSNamesystem.java:8313",
        "ThreadID": 59,
        "ThreadName": "",
        "EventID": "E784CA61B1B5EB48",
        "BaggageBytes": "[[248 5] [240 0] [0 101 66 189 154 77 174 101 60] [240 1] [0 106 190 28 250 58 72 130 97] [240 3] [0 2]]",
        "ProcessID": 2171
      },
      {
        "Cycles": 0,
        "Agent": "Execution-CPU",
        "ProcessName": "Name",
        "TaskID": "6542BD9A4DAE653C",
        "ParentEventID": [
          "423DE9E075E63BC6"
        ],
        "Label": "unset",
        "Title": "X-Trace Task",
        "Host": "pinky19.mpi-sws.org",
        "Duration": "232252",
        "HRT": 25491785133829744,
        "Operation": "unset",
        "Timestamp": "1556275425074.165771",
        "TenantClass": 0,
        "Source": "Server.java:1058",
        "ThreadID": 59,
        "ThreadName": "",
        "EventID": "614D3EC5AA6088C9",
        "BaggageBytes": "[[248 5] [240 0] [0 101 66 189 154 77 174 101 60] [240 1] [0 66 61 233 224 117 230 59 198] [240 3] [0 2]]",
        "ProcessID": 2171
      },
      {
        "Cycles": 0,
        "Agent": "Execution-CPU",
        "ProcessName": "Read",
        "TaskID": "6542BD9A4DAE653C",
        "ParentEventID": [
          "423DE9E075E63BC6"
        ],
        "Label": "set",
        "Title": "X-Trace Task",
        "Host": "pinky19.mpi-sws.org",
        "HRT": 25491785133873004,
        "Operation": "set",
        "Timestamp": "1556275425074.198486",
        "TenantClass": 0,
        "Source": "Client.java:302",
        "ThreadID": 37,
        "ThreadName": "",
        "EventID": "76B5CD423DEADCBE",
        "ProcessID": 21035
      },
      {
        "Cycles": 0,
        "Agent": "Execution-CPU",
        "ProcessName": "Read",
        "TaskID": "6542BD9A4DAE653C",
        "ParentEventID": [
          "76B5CD423DEADCBE"
        ],
        "Label": "unset",
        "Title": "X-Trace Task",
        "Host": "pinky19.mpi-sws.org",
        "Duration": "9808",
        "HRT": 25491785133897861,
        "Operation": "unset",
        "Timestamp": "1556275425074.223389",
        "TenantClass": 0,
        "Source": "Client.java:1168",
        "ThreadID": 37,
        "ThreadName": "",
        "EventID": "3FD76F5939637824",
        "ProcessID": 21035
      },
      {
        "Cycles": 0,
        "Agent": "edu.brown.cs.systems.xtrace.logging.BaggageWrappers",
        "ProcessName": "Read",
        "TaskID": "6542BD9A4DAE653C",
        "ParentEventID": [
          "3FD76F5939637824",
          "3EF0E2F6BCB8D93F"
        ],
        "Label": "Merged current baggage with other baggage",
        "Title": "X-Trace Task",
        "Host": "pinky19.mpi-sws.org",
        "HRT": 25491785133950706,
        "Operation": "join",
        "Timestamp": "1556275425074.276367",
        "TenantClass": 0,
        "Source": "Client.java:1545",
        "ThreadID": 1,
        "ThreadName": "",
        "EventID": "EE6BF5F5A8939AF9",
        "ProcessID": 21035
      },
      {
        "Cycles": 0,
        "Agent": "org.apache.hadoop.ipc.ProtobufRpcEngine",
        "ProcessName": "Read",
        "TaskID": "6542BD9A4DAE653C",
        "ParentEventID": [
          "EE6BF5F5A8939AF9"
        ],
        "Label": "org.apache.hadoop.hdfs.protocol.ClientProtocol.getBlockLocations completed",
        "Title": "X-Trace Task",
        "Host": "pinky19.mpi-sws.org",
        "HRT": 25491785134024636,
        "Timestamp": "1556275425074.350342",
        "TenantClass": 0,
        "Source": "ProtobufRpcEngine.java:275",
        "ThreadID": 1,
        "ThreadName": "",
        "EventID": "3DCC9E0CA245A60D",
        "ProcessID": 21035
      },
      {
        "Cycles": 0,
        "Agent": "Execution-Sleep",
        "ProcessName": "Read",
        "TaskID": "6542BD9A4DAE653C",
        "ParentEventID": [
          "E74987BE9047BA98"
        ],
        "Label": "waited",
        "Title": "X-Trace Task",
        "Host": "pinky19.mpi-sws.org",
        "Duration": "440694",
        "HRT": 25491785133925477,
        "Operation": "waited",
        "Timestamp": "1556275425074.250977",
        "TenantClass": 0,
        "Source": "Client.java:1537",
        "ThreadID": 1,
        "ThreadName": "",
        "EventID": "3EF0E2F6BCB8D93F",
        "ProcessID": 21035
      },
      {
        "Cycles": 0,
        "Agent": "edu.brown.cs.systems.xtrace.logging.BaggageWrappers",
        "ProcessName": "Read",
        "TaskID": "6542BD9A4DAE653C",
        "ParentEventID": [
          "3DCC9E0CA245A60D"
        ],
        "Label": "Forking current baggage with Baggage.fork()",
        "Title": "X-Trace Task",
        "Host": "pinky19.mpi-sws.org",
        "HRT": 25491785134114315,
        "Operation": "fork",
        "Timestamp": "1556275425074.439941",
        "TenantClass": 0,
        "Source": "DataTransferProtoUtil.java:94",
        "ThreadID": 1,
        "ThreadName": "",
        "EventID": "B9592AE8D5577240",
        "ProcessID": 21035
      },
      {
        "Cycles": 0,
        "Agent": "edu.brown.cs.systems.xtrace.logging.XTraceInit",
        "ProcessName": "Data",
        "TaskID": "6542BD9A4DAE653C",
        "ParentEventID": [
          "93AF8C1B28AD8D83"
        ],
        "Label": "Thread.setName: DataXceiver for client DFSClient_NONMAPREDUCE_1377588049_1 at /139.19.171.63:56492 [Sending block BP-1633380353-139.19.171.63-1554193446451:blk_1073760187_19363]",
        "Title": "X-Trace Task",
        "Host": "pinky21.mpi-sws.org",
        "HRT": 9338094841419409,
        "Timestamp": "1556275425074.713135",
        "TenantClass": 0,
        "Source": "DataXceiver.java:168",
        "ThreadID": 5977,
        "ThreadName": "",
        "EventID": "0EE9CE311662CF9D",
        "BaggageBytes": "[[248 5] [240 0] [0 101 66 189 154 77 174 101 60] [240 1] [0 147 175 140 27 40 173 141 131] [240 3] [0 2]]",
        "ProcessID": 20775
      },
      {
        "Cycles": 0,
        "Agent": "edu.brown.cs.systems.xtrace.logging.BaggageWrappers",
        "ProcessName": "Data",
        "TaskID": "6542BD9A4DAE653C",
        "ParentEventID": [
          "0EE9CE311662CF9D"
        ],
        "Label": "Forking current baggage with Baggage.fork()",
        "Title": "X-Trace Task",
        "Host": "pinky21.mpi-sws.org",
        "HRT": 9338094841625207,
        "Operation": "fork",
        "Timestamp": "1556275425074.918945",
        "TenantClass": 0,
        "Source": "DataXceiver.java:1257",
        "ThreadID": 5977,
        "ThreadName": "",
        "EventID": "113E77F36339A836",
        "BaggageBytes": "[[248 5] [240 0] [0 101 66 189 154 77 174 101 60] [240 1] [0 14 233 206 49 22 98 207 157] [240 3] [0 2]]",
        "ProcessID": 20775
      },
      {
        "Cycles": 0,
        "Agent": "Execution-Sleep",
        "ProcessName": "Read",
        "TaskID": "6542BD9A4DAE653C",
        "ParentEventID": [
          "B9592AE8D5577240"
        ],
        "Label": "waited",
        "Title": "X-Trace Task",
        "Host": "pinky19.mpi-sws.org",
        "Duration": "572393",
        "HRT": 25491785134780893,
        "Operation": "waited",
        "Timestamp": "1556275425075.106445",
        "TenantClass": 0,
        "Source": "SocketIOWithTimeout.java:335",
        "ThreadID": 1,
        "ThreadName": "",
        "EventID": "6868116D122FED38",
        "ProcessID": 21035
      },
      {
        "Cycles": 0,
        "Agent": "Execution-CPU",
        "ProcessName": "Data",
        "TaskID": "6542BD9A4DAE653C",
        "ParentEventID": [
          "B9592AE8D5577240"
        ],
        "Label": "set",
        "Title": "X-Trace Task",
        "Host": "pinky21.mpi-sws.org",
        "HRT": 9338094841349161,
        "Operation": "set",
        "Timestamp": "1556275425074.643066",
        "TenantClass": 0,
        "Source": "Receiver.java:117",
        "ThreadID": 5977,
        "ThreadName": "",
        "EventID": "93AF8C1B28AD8D83",
        "BaggageBytes": "[[248 5] [240 0] [0 101 66 189 154 77 174 101 60] [240 1] [0 185 89 42 232 213 87 114 64] [240 3] [0 2]]",
        "ProcessID": 20775
      },
      {
        "Cycles": 0,
        "Agent": "edu.brown.cs.systems.xtrace.logging.BaggageWrappers",
        "ProcessName": "Data",
        "TaskID": "6542BD9A4DAE653C",
        "ParentEventID": [
          "113E77F36339A836"
        ],
        "Label": "Forking current baggage with Baggage.fork()",
        "Title": "X-Trace Task",
        "Host": "pinky21.mpi-sws.org",
        "HRT": 9338094841778770,
        "Operation": "fork",
        "Timestamp": "1556275425075.072510",
        "TenantClass": 0,
        "Source": "PacketHeader.java:95",
        "ThreadID": 5977,
        "ThreadName": "",
        "EventID": "3133A6DBED4070C3",
        "BaggageBytes": "[[248 5] [240 0] [0 101 66 189 154 77 174 101 60] [240 1] [0 17 62 119 243 99 57 168 54] [240 3] [0 2]]",
        "ProcessID": 20775
      },
      {
        "Cycles": 0,
        "Agent": "Execution-Sleep",
        "ProcessName": "Data",
        "TaskID": "6542BD9A4DAE653C",
        "ParentEventID": [
          "3133A6DBED4070C3"
        ],
        "Label": "waited",
        "Title": "X-Trace Task",
        "Host": "pinky21.mpi-sws.org",
        "Duration": "10358",
        "HRT": 9338094841908042,
        "Operation": "waited",
        "Timestamp": "1556275425075.201904",
        "TenantClass": 0,
        "Source": "SocketIOWithTimeout.java:335",
        "ThreadID": 5977,
        "ThreadName": "",
        "EventID": "E7B5FD92614A5392",
        "BaggageBytes": "[[248 5] [240 0] [0 101 66 189 154 77 174 101 60] [240 1] [0 49 51 166 219 237 64 112 195] [240 3] [0 2]]",
        "ProcessID": 20775
      },
      {
        "Cycles": 0,
        "Agent": "edu.brown.cs.systems.xtrace.logging.BaggageWrappers",
        "ProcessName": "Read",
        "TaskID": "6542BD9A4DAE653C",
        "ParentEventID": [
          "6868116D122FED38",
          "113E77F36339A836"
        ],
        "Label": "Merged current baggage with other baggage",
        "Title": "X-Trace Task",
        "Host": "pinky19.mpi-sws.org",
        "HRT": 25491785134922078,
        "Operation": "join",
        "Timestamp": "1556275425075.247559",
        "TenantClass": 0,
        "Source": "RemoteBlockReader2.java:429",
        "ThreadID": 1,
        "ThreadName": "",
        "EventID": "0AF47C254902C407",
        "ProcessID": 21035
      },
      {
        "Cycles": 0,
        "Agent": "Execution-Sleep",
        "ProcessName": "Read",
        "TaskID": "6542BD9A4DAE653C",
        "ParentEventID": [
          "0AF47C254902C407"
        ],
        "Label": "waited",
        "Title": "X-Trace Task",
        "Host": "pinky19.mpi-sws.org",
        "Duration": "35263",
        "HRT": 25491785135085887,
        "Operation": "waited",
        "Timestamp": "1556275425075.411377",
        "TenantClass": 0,
        "Source": "SocketIOWithTimeout.java:335",
        "ThreadID": 1,
        "ThreadName": "",
        "EventID": "DB4E4D6C4257E7AE",
        "ProcessID": 21035
      },
      {
        "Cycles": 0,
        "Agent": "edu.brown.cs.systems.xtrace.logging.BaggageWrappers",
        "ProcessName": "Data",
        "TaskID": "6542BD9A4DAE653C",
        "ParentEventID": [
          "E7B5FD92614A5392"
        ],
        "Label": "Forking current baggage with Baggage.fork()",
        "Title": "X-Trace Task",
        "Host": "pinky21.mpi-sws.org",
        "HRT": 9338094842075000,
        "Operation": "fork",
        "Timestamp": "1556275425075.368896",
        "TenantClass": 0,
        "Source": "PacketHeader.java:95",
        "ThreadID": 5977,
        "ThreadName": "",
        "EventID": "AF51D4C134B62B21",
        "BaggageBytes": "[[248 5] [240 0] [0 101 66 189 154 77 174 101 60] [240 1] [0 231 181 253 146 97 74 83 146] [240 3] [0 2]]",
        "ProcessID": 20775
      },
      {
        "Cycles": 0,
        "Agent": "edu.brown.cs.systems.xtrace.logging.BaggageWrappers",
        "ProcessName": "Read",
        "TaskID": "6542BD9A4DAE653C",
        "ParentEventID": [
          "3133A6DBED4070C3",
          "DB4E4D6C4257E7AE"
        ],
        "Label": "Merged current baggage with other baggage",
        "Title": "X-Trace Task",
        "Host": "pinky19.mpi-sws.org",
        "HRT": 25491785135171163,
        "Operation": "join",
        "Timestamp": "1556275425075.496826",
        "TenantClass": 0,
        "Source": "PacketHeader.java:168",
        "ThreadID": 1,
        "ThreadName": "",
        "EventID": "04DC59DDF799D210",
        "ProcessID": 21035
      },
      {
        "Cycles": 0,
        "Agent": "edu.brown.cs.systems.xtrace.logging.BaggageWrappers",
        "ProcessName": "Read",
        "TaskID": "6542BD9A4DAE653C",
        "ParentEventID": [
          "27EAE606E4CDA039"
        ],
        "Label": "Forking current baggage with Baggage.fork()",
        "Title": "X-Trace Task",
        "Host": "pinky19.mpi-sws.org",
        "HRT": 25491785135265971,
        "Operation": "fork",
        "Timestamp": "1556275425075.591553",
        "TenantClass": 0,
        "Source": "RemoteBlockReader2.java:361",
        "ThreadID": 1,
        "ThreadName": "",
        "EventID": "FB81F06EACA857E6",
        "ProcessID": 21035
      },
      {
        "Cycles": 0,
        "Agent": "edu.brown.cs.systems.xtrace.logging.BaggageWrappers",
        "ProcessName": "Read",
        "TaskID": "6542BD9A4DAE653C",
        "ParentEventID": [
          "04DC59DDF799D210",
          "AF51D4C134B62B21"
        ],
        "Label": "Merged current baggage with other baggage",
        "Title": "X-Trace Task",
        "Host": "pinky19.mpi-sws.org",
        "HRT": 25491785135246735,
        "Operation": "join",
        "Timestamp": "1556275425075.572266",
        "TenantClass": 0,
        "Source": "PacketHeader.java:168",
        "ThreadID": 1,
        "ThreadName": "",
        "EventID": "27EAE606E4CDA039",
        "ProcessID": 21035
      },
      {
        "Cycles": 0,
        "Agent": "Execution-Sleep",
        "ProcessName": "Data",
        "TaskID": "6542BD9A4DAE653C",
        "ParentEventID": [
          "AF51D4C134B62B21"
        ],
        "Label": "waited",
        "Title": "X-Trace Task",
        "Host": "pinky21.mpi-sws.org",
        "Duration": "92634",
        "HRT": 9338094842364852,
        "Operation": "waited",
        "Timestamp": "1556275425075.658691",
        "TenantClass": 0,
        "Source": "SocketIOWithTimeout.java:335",
        "ThreadID": 5977,
        "ThreadName": "",
        "EventID": "905CF37768955FA5",
        "BaggageBytes": "[[248 5] [240 0] [0 101 66 189 154 77 174 101 60] [240 1] [0 175 81 212 193 52 182 43 33] [240 3] [0 2]]",
        "ProcessID": 20775
      },
      {
        "Cycles": 0,
        "Agent": "Execution-CPU",
        "ProcessName": "Data",
        "TaskID": "6542BD9A4DAE653C",
        "ParentEventID": [
          "73F2BBC40E8043FE"
        ],
        "Label": "unset",
        "Title": "X-Trace Task",
        "Host": "pinky21.mpi-sws.org",
        "Duration": "1167232",
        "HRT": 9338094842564636,
        "Operation": "unset",
        "Timestamp": "1556275425075.858398",
        "TenantClass": 0,
        "Source": "DataXceiver.java:261",
        "ThreadID": 5977,
        "ThreadName": "",
        "EventID": "59ACB9A6FCED7B69",
        "BaggageBytes": "[[248 5] [240 0] [0 101 66 189 154 77 174 101 60] [240 1] [0 115 242 187 196 14 128 67 254] [240 3] [0 2]]",
        "ProcessID": 20775
      },
      {
        "Cycles": 0,
        "Agent": "edu.brown.cs.systems.xtrace.logging.BaggageWrappers",
        "ProcessName": "Data",
        "TaskID": "6542BD9A4DAE653C",
        "ParentEventID": [
          "FB81F06EACA857E6",
          "905CF37768955FA5"
        ],
        "Label": "Merged current baggage with other baggage",
        "Title": "X-Trace Task",
        "Host": "pinky21.mpi-sws.org",
        "HRT": 9338094842514139,
        "Operation": "join",
        "Timestamp": "1556275425075.807861",
        "TenantClass": 0,
        "Source": "DataXceiver.java:574",
        "ThreadID": 5977,
        "ThreadName": "",
        "EventID": "73F2BBC40E8043FE",
        "BaggageBytes": "[[248 5] [240 0] [0 101 66 189 154 77 174 101 60] [240 1] [0 144 92 243 119 104 149 95 165] [0 251 129 240 110 172 168 87 230] [240 3] [0 2]]",
        "ProcessID": 20775
      },
      {
        "Cycles": 0,
        "Agent": "edu.brown.cs.systems.retro.benchmarks.hdfs_client.Reader",
        "ProcessName": "Read",
        "TaskID": "6542BD9A4DAE653C",
        "ParentEventID": [
          "0"
        ],
        "Label": "Reading file",
        "Title": "X-Trace Task",
        "Host": "pinky19.mpi-sws.org",
        "HRT": 25491785133210371,
        "Timestamp": "1556275425073.535889",
        "TenantClass": 0,
        "ThreadID": 1,
        "ThreadName": "",
        "EventID": "EDD6AD375108F96D",
        "ProcessID": 21035,
        "Tag": [
          "reader_1kb",
          "Read Size: 1024"
        ]
      }
    ]
  }
]