[
  {
    "id": "94A1FC50E6880FA3",
    "reports": [
      {
        "Cycles": 0,
        "Agent": "org.apache.hadoop.ipc.ProtobufRpcEngine",
        "ProcessName": "Read",
        "TaskID": "94A1FC50E6880FA3",
        "ParentEventID": [
          "4DF9422064176EE6"
        ],
        "Label": "Invoking org.apache.hadoop.hdfs.protocol.ClientProtocol.getBlockLocations",
        "Title": "X-Trace Task",
        "Host": "pinky19.mpi-sws.org",
        "HRT": 26962646301430165,
        "Timestamp": "1557746286241.712158",
        "TenantClass": 0,
        "Source": "ProtobufRpcEngine.java:228",
        "ThreadID": 1,
        "ThreadName": "",
        "EventID": "D26F9D73B033D3D6",
        "ProcessID": 36430
      },
      {
        "Cycles": 0,
        "Agent": "edu.brown.cs.systems.retro.benchmarks.hdfs_client.Reader",
        "ProcessName": "Read",
        "TaskID": "94A1FC50E6880FA3",
        "ParentEventID": [
          "A745C830C0B228FE"
        ],
        "Label": "Reading file",
        "Title": "X-Trace Task",
        "Host": "pinky19.mpi-sws.org",
        "HRT": 26962646301405135,
        "Timestamp": "1557746286241.687256",
        "TenantClass": 0,
        "ThreadID": 1,
        "ThreadName": "",
        "EventID": "4DF9422064176EE6",
        "ProcessID": 36430
      },
      {
        "Cycles": 0,
        "Agent": "Execution-CPU",
        "ProcessName": "Read",
        "TaskID": "94A1FC50E6880FA3",
        "ParentEventID": [
          "A5AEFACFD2F590DE"
        ],
        "Label": "set",
        "Title": "X-Trace Task",
        "Host": "pinky19.mpi-sws.org",
        "HRT": 26962646301492946,
        "Operation": "set",
        "Timestamp": "1557746286241.775146",
        "TenantClass": 0,
        "Source": "Client.java:1032",
        "ThreadID": 41,
        "ThreadName": "",
        "EventID": "EBCD4D07F3DD0F80",
        "ProcessID": 36430
      },
      {
        "Cycles": 0,
        "Agent": "Execution-CPU",
        "ProcessName": "Read",
        "TaskID": "94A1FC50E6880FA3",
        "ParentEventID": [
          "D26F9D73B033D3D6"
        ],
        "Label": "unset",
        "Title": "X-Trace Task",
        "Host": "pinky19.mpi-sws.org",
        "Duration": "21771050",
        "HRT": 26962646301446065,
        "Operation": "unset",
        "Timestamp": "1557746286241.728271",
        "TenantClass": 0,
        "Source": "Client.java:1027",
        "ThreadID": 1,
        "ThreadName": "",
        "EventID": "A5AEFACFD2F590DE",
        "ProcessID": 36430
      },
      {
        "Cycles": 0,
        "Agent": "Execution-CPU",
        "ProcessName": "Read",
        "TaskID": "94A1FC50E6880FA3",
        "ParentEventID": [
          "696723F1FC52A780"
        ],
        "Label": "unset",
        "Title": "X-Trace Task",
        "Host": "pinky19.mpi-sws.org",
        "Duration": "74105",
        "HRT": 26962646301586158,
        "Operation": "unset",
        "Timestamp": "1557746286241.868164",
        "TenantClass": 0,
        "Source": "Client.java:1062",
        "ThreadID": 41,
        "ThreadName": "",
        "EventID": "A631076AC0B7613B",
        "ProcessID": 36430
      },
      {
        "Cycles": 0,
        "Agent": "edu.brown.cs.systems.xtrace.logging.BaggageWrappers",
        "ProcessName": "Read",
        "TaskID": "94A1FC50E6880FA3",
        "ParentEventID": [
          "EBCD4D07F3DD0F80"
        ],
        "Label": "Forking current baggage with Baggage.fork()",
        "Title": "X-Trace Task",
        "Host": "pinky19.mpi-sws.org",
        "HRT": 26962646301511807,
        "Operation": "fork",
        "Timestamp": "1557746286241.793945",
        "TenantClass": 0,
        "Source": "Client.java:1043",
        "ThreadID": 41,
        "ThreadName": "",
        "EventID": "696723F1FC52A780",
        "ProcessID": 36430
      },
      {
        "Cycles": 0,
        "Agent": "Execution-CPU",
        "ProcessName": "Name",
        "TaskID": "94A1FC50E6880FA3",
        "ParentEventID": [
          "696723F1FC52A780"
        ],
        "Label": "set",
        "Title": "X-Trace Task",
        "Host": "pinky19.mpi-sws.org",
        "HRT": 26962646301637838,
        "Operation": "set",
        "Timestamp": "1557746286241.952637",
        "TenantClass": 0,
        "Source": "Server.java:1840",
        "ThreadID": 48,
        "ThreadName": "",
        "EventID": "79BF3078D79ED482",
        "BaggageBytes": "[[248 5] [240 0] [0 148 161 252 80 230 136 15 163] [240 1] [0 105 103 35 241 252 82 167 128] [240 3] [0 2]]",
        "ProcessID": 2171
      },
      {
        "Cycles": 0,
        "Agent": "Execution-CPU",
        "ProcessName": "Read",
        "TaskID": "94A1FC50E6880FA3",
        "ParentEventID": [
          "A631076AC0B7613B"
        ],
        "Label": "set",
        "Title": "X-Trace Task",
        "Host": "pinky19.mpi-sws.org",
        "HRT": 26962646301611767,
        "Operation": "set",
        "Timestamp": "1557746286241.893799",
        "TenantClass": 0,
        "Source": "Client.java:1104",
        "ThreadID": 1,
        "ThreadName": "",
        "EventID": "38F00A1CCEB8417D",
        "ProcessID": 36430
      },
      {
        "Cycles": 0,
        "Agent": "Execution-CPU",
        "ProcessName": "Name",
        "TaskID": "94A1FC50E6880FA3",
        "ParentEventID": [
          "10165E38D829A091"
        ],
        "Label": "unset",
        "Title": "X-Trace Task",
        "Host": "pinky19.mpi-sws.org",
        "Duration": "25344",
        "HRT": 26962646301689408,
        "Operation": "unset",
        "Timestamp": "1557746286242.004395",
        "TenantClass": 0,
        "Source": "Server.java:1828",
        "ThreadID": 48,
        "ThreadName": "",
        "EventID": "62632A6221D3C5B7",
        "BaggageBytes": "[[248 5] [240 0] [0 148 161 252 80 230 136 15 163] [240 1] [0 16 22 94 56 216 41 160 145] [240 3] [0 2]]",
        "ProcessID": 2171
      },
      {
        "Cycles": 0,
        "Agent": "edu.brown.cs.systems.xtrace.logging.BaggageWrappers",
        "ProcessName": "Name",
        "TaskID": "94A1FC50E6880FA3",
        "ParentEventID": [
          "79BF3078D79ED482"
        ],
        "Label": "Forking current baggage with Baggage.fork()",
        "Title": "X-Trace Task",
        "Host": "pinky19.mpi-sws.org",
        "HRT": 26962646301667667,
        "Operation": "fork",
        "Timestamp": "1557746286241.982666",
        "TenantClass": 0,
        "Source": "Server.java:550",
        "ThreadID": 48,
        "ThreadName": "",
        "EventID": "10165E38D829A091",
        "BaggageBytes": "[[248 5] [240 0] [0 148 161 252 80 230 136 15 163] [240 1] [0 121 191 48 120 215 158 212 130] [240 3] [0 2]]",
        "ProcessID": 2171
      },
      {
        "Cycles": 0,
        "Agent": "Execution-CPU",
        "ProcessName": "Name",
        "TaskID": "94A1FC50E6880FA3",
        "ParentEventID": [
          "10165E38D829A091"
        ],
        "Label": "set",
        "Title": "X-Trace Task",
        "Host": "pinky19.mpi-sws.org",
        "HRT": 26962646301698350,
        "Operation": "set",
        "Timestamp": "1557746286242.013184",
        "TenantClass": 0,
        "Source": "Server.java:2071",
        "ThreadID": 59,
        "ThreadName": "",
        "EventID": "6AC9295A40F0B2CD",
        "BaggageBytes": "[[248 5] [240 0] [0 148 161 252 80 230 136 15 163] [240 1] [0 16 22 94 56 216 41 160 145] [240 3] [0 2]]",
        "ProcessID": 2171
      },
      {
        "Cycles": 0,
        "Agent": "org.apache.hadoop.hdfs.server.namenode.FSNamesystem.audit",
        "ProcessName": "Name",
        "TaskID": "94A1FC50E6880FA3",
        "ParentEventID": [
          "96091A019D3F95DD"
        ],
        "Label": "allowed=true\tugi=plascas (auth:SIMPLE)\tip=/139.19.171.63\tcmd=open\tsrc=/ds/hWtu0pUNLkR3tXq5\tdst=null\tperm=null\tproto=rpc",
        "Title": "X-Trace Task",
        "Host": "pinky19.mpi-sws.org",
        "HRT": 26962646301773956,
        "Timestamp": "1557746286242.088867",
        "TenantClass": 0,
        "Source": "FSNamesystem.java:8313",
        "ThreadID": 59,
        "ThreadName": "",
        "EventID": "BE247B0B356C5F56",
        "BaggageBytes": "[[248 5] [240 0] [0 148 161 252 80 230 136 15 163] [240 1] [0 150 9 26 1 157 63 149 221] [240 3] [0 2]]",
        "ProcessID": 2171
      },
      {
        "Cycles": 0,
        "Agent": "edu.brown.cs.systems.xtrace.logging.BaggageWrappers",
        "ProcessName": "Name",
        "TaskID": "94A1FC50E6880FA3",
        "ParentEventID": [
          "BE247B0B356C5F56"
        ],
        "Label": "Forking current baggage with Baggage.fork()",
        "Title": "X-Trace Task",
        "Host": "pinky19.mpi-sws.org",
        "HRT": 26962646301828767,
        "Operation": "fork",
        "Timestamp": "1557746286242.143799",
        "TenantClass": 0,
        "Source": "Server.java:2398",
        "ThreadID": 59,
        "ThreadName": "",
        "EventID": "8FE723561F862612",
        "BaggageBytes": "[[248 5] [240 0] [0 148 161 252 80 230 136 15 163] [240 1] [0 190 36 123 11 53 108 95 86] [240 3] [0 2]]",
        "ProcessID": 2171
      },
      {
        "Cycles": 0,
        "Agent": "org.apache.hadoop.ipc.Server",
        "ProcessName": "Name",
        "TaskID": "94A1FC50E6880FA3",
        "ParentEventID": [
          "6AC9295A40F0B2CD"
        ],
        "Label": "getBlockLocations in org.apache.hadoop.hdfs.protocol.ClientProtocol",
        "Title": "X-Trace Task",
        "Host": "pinky19.mpi-sws.org",
        "HRT": 26962646301726884,
        "Timestamp": "1557746286242.041748",
        "TenantClass": 0,
        "Source": "ProtobufRpcEngine.java:601",
        "ThreadID": 59,
        "ThreadName": "",
        "EventID": "96091A019D3F95DD",
        "BaggageBytes": "[[248 5] [240 0] [0 148 161 252 80 230 136 15 163] [240 1] [0 106 201 41 90 64 240 178 205] [240 3] [0 2]]",
        "ProcessID": 2171
      },
      {
        "Cycles": 0,
        "Agent": "Execution-CPU",
        "ProcessName": "Name",
        "TaskID": "94A1FC50E6880FA3",
        "ParentEventID": [
          "8FE723561F862612"
        ],
        "Label": "unset",
        "Title": "X-Trace Task",
        "Host": "pinky19.mpi-sws.org",
        "Duration": "232859",
        "HRT": 26962646301950012,
        "Operation": "unset",
        "Timestamp": "1557746286242.264893",
        "TenantClass": 0,
        "Source": "Server.java:1058",
        "ThreadID": 59,
        "ThreadName": "",
        "EventID": "3C4673047BC294C4",
        "BaggageBytes": "[[248 5] [240 0] [0 148 161 252 80 230 136 15 163] [240 1] [0 143 231 35 86 31 134 38 18] [240 3] [0 2]]",
        "ProcessID": 2171
      },
      {
        "Cycles": 0,
        "Agent": "Execution-CPU",
        "ProcessName": "Read",
        "TaskID": "94A1FC50E6880FA3",
        "ParentEventID": [
          "E1D59AC33EAAB1F9"
        ],
        "Label": "unset",
        "Title": "X-Trace Task",
        "Host": "pinky19.mpi-sws.org",
        "Duration": "6580",
        "HRT": 26962646302043077,
        "Operation": "unset",
        "Timestamp": "1557746286242.325195",
        "TenantClass": 0,
        "Source": "Client.java:1168",
        "ThreadID": 37,
        "ThreadName": "",
        "EventID": "21E12C010F23F1C4",
        "ProcessID": 36430
      },
      {
        "Cycles": 0,
        "Agent": "Execution-CPU",
        "ProcessName": "Read",
        "TaskID": "94A1FC50E6880FA3",
        "ParentEventID": [
          "8FE723561F862612"
        ],
        "Label": "set",
        "Title": "X-Trace Task",
        "Host": "pinky19.mpi-sws.org",
        "HRT": 26962646302020348,
        "Operation": "set",
        "Timestamp": "1557746286242.302490",
        "TenantClass": 0,
        "Source": "Client.java:302",
        "ThreadID": 37,
        "ThreadName": "",
        "EventID": "E1D59AC33EAAB1F9",
        "ProcessID": 36430
      },
      {
        "Cycles": 0,
        "Agent": "Execution-Sleep",
        "ProcessName": "Read",
        "TaskID": "94A1FC50E6880FA3",
        "ParentEventID": [
          "38F00A1CCEB8417D"
        ],
        "Label": "waited",
        "Title": "X-Trace Task",
        "Host": "pinky19.mpi-sws.org",
        "Duration": "439562",
        "HRT": 26962646302059814,
        "Operation": "waited",
        "Timestamp": "1557746286242.341797",
        "TenantClass": 0,
        "Source": "Client.java:1537",
        "ThreadID": 1,
        "ThreadName": "",
        "EventID": "ECE85E0DD8772B89",
        "ProcessID": 36430
      },
      {
        "Cycles": 0,
        "Agent": "edu.brown.cs.systems.xtrace.logging.BaggageWrappers",
        "ProcessName": "Read",
        "TaskID": "94A1FC50E6880FA3",
        "ParentEventID": [
          "21E12C010F23F1C4",
          "ECE85E0DD8772B89"
        ],
        "Label": "Merged current baggage with other baggage",
        "Title": "X-Trace Task",
        "Host": "pinky19.mpi-sws.org",
        "HRT": 26962646302071693,
        "Operation": "join",
        "Timestamp": "1557746286242.353760",
        "TenantClass": 0,
        "Source": "Client.java:1545",
        "ThreadID": 1,
        "ThreadName": "",
        "EventID": "3EDCBABB26A66B4B",
        "ProcessID": 36430
      },
      {
        "Cycles": 0,
        "Agent": "org.apache.hadoop.ipc.ProtobufRpcEngine",
        "ProcessName": "Read",
        "TaskID": "94A1FC50E6880FA3",
        "ParentEventID": [
          "3EDCBABB26A66B4B"
        ],
        "Label": "org.apache.hadoop.hdfs.protocol.ClientProtocol.getBlockLocations completed",
        "Title": "X-Trace Task",
        "Host": "pinky19.mpi-sws.org",
        "HRT": 26962646302108007,
        "Timestamp": "1557746286242.390137",
        "TenantClass": 0,
        "Source": "ProtobufRpcEngine.java:275",
        "ThreadID": 1,
        "ThreadName": "",
        "EventID": "93EA1B9D028D43F7",
        "ProcessID": 36430
      },
      {
        "Cycles": 0,
        "Agent": "Execution-CPU",
        "ProcessName": "Data",
        "TaskID": "94A1FC50E6880FA3",
        "ParentEventID": [
          "B3F84B68B6F2150F"
        ],
        "Label": "set",
        "Title": "X-Trace Task",
        "Host": "pinky22.mpi-sws.org",
        "HRT": 47512618557000146,
        "Operation": "set",
        "Timestamp": "1557746286242.743896",
        "TenantClass": 0,
        "Source": "Receiver.java:117",
        "ThreadID": 15142,
        "ThreadName": "",
        "EventID": "0963D575D9534C4F",
        "BaggageBytes": "[[248 5] [240 0] [0 148 161 252 80 230 136 15 163] [240 1] [0 179 248 75 104 182 242 21 15] [240 3] [0 2]]",
        "ProcessID": 28841
      },
      {
        "Cycles": 0,
        "Agent": "edu.brown.cs.systems.xtrace.logging.XTraceInit",
        "ProcessName": "Data",
        "TaskID": "94A1FC50E6880FA3",
        "ParentEventID": [
          "0963D575D9534C4F"
        ],
        "Label": "Thread.setName: DataXceiver for client DFSClient_NONMAPREDUCE_778905418_1 at /139.19.171.63:45362 [Sending block BP-1633380353-139.19.171.63-1554193446451:blk_1073770430_29606]",
        "Title": "X-Trace Task",
        "Host": "pinky22.mpi-sws.org",
        "HRT": 47512618557096876,
        "Timestamp": "1557746286242.840576",
        "TenantClass": 0,
        "Source": "DataXceiver.java:168",
        "ThreadID": 15142,
        "ThreadName": "",
        "EventID": "A402694534638331",
        "BaggageBytes": "[[248 5] [240 0] [0 148 161 252 80 230 136 15 163] [240 1] [0 9 99 213 117 217 83 76 79] [240 3] [0 2]]",
        "ProcessID": 28841
      },
      {
        "Cycles": 0,
        "Agent": "edu.brown.cs.systems.xtrace.logging.BaggageWrappers",
        "ProcessName": "Read",
        "TaskID": "94A1FC50E6880FA3",
        "ParentEventID": [
          "93EA1B9D028D43F7"
        ],
        "Label": "Forking current baggage with Baggage.fork()",
        "Title": "X-Trace Task",
        "Host": "pinky19.mpi-sws.org",
        "HRT": 26962646302177092,
        "Operation": "fork",
        "Timestamp": "1557746286242.459229",
        "TenantClass": 0,
        "Source": "DataTransferProtoUtil.java:94",
        "ThreadID": 1,
        "ThreadName": "",
        "EventID": "B3F84B68B6F2150F",
        "ProcessID": 36430
      },
      {
        "Cycles": 0,
        "Agent": "edu.brown.cs.systems.xtrace.logging.BaggageWrappers",
        "ProcessName": "Data",
        "TaskID": "94A1FC50E6880FA3",
        "ParentEventID": [
          "A402694534638331"
        ],
        "Label": "Forking current baggage with Baggage.fork()",
        "Title": "X-Trace Task",
        "Host": "pinky22.mpi-sws.org",
        "HRT": 47512618557309223,
        "Operation": "fork",
        "Timestamp": "1557746286243.052979",
        "TenantClass": 0,
        "Source": "DataXceiver.java:1257",
        "ThreadID": 15142,
        "ThreadName": "",
        "EventID": "F4E207E01757BB56",
        "BaggageBytes": "[[248 5] [240 0] [0 148 161 252 80 230 136 15 163] [240 1] [0 164 2 105 69 52 99 131 49] [240 3] [0 2]]",
        "ProcessID": 28841
      },
      {
        "Cycles": 0,
        "Agent": "edu.brown.cs.systems.xtrace.logging.BaggageWrappers",
        "ProcessName": "Data",
        "TaskID": "94A1FC50E6880FA3",
        "ParentEventID": [
          "F4E207E01757BB56"
        ],
        "Label": "Forking current baggage with Baggage.fork()",
        "Title": "X-Trace Task",
        "Host": "pinky22.mpi-sws.org",
        "HRT": 47512618557467207,
        "Operation": "fork",
        "Timestamp": "1557746286243.210938",
        "TenantClass": 0,
        "Source": "PacketHeader.java:95",
        "ThreadID": 15142,
        "ThreadName": "",
        "EventID": "B4205180683FEA19",
        "BaggageBytes": "[[248 5] [240 0] [0 148 161 252 80 230 136 15 163] [240 1] [0 244 226 7 224 23 87 187 86] [240 3] [0 2]]",
        "ProcessID": 28841
      },
      {
        "Cycles": 0,
        "Agent": "Execution-Sleep",
        "ProcessName": "Read",
        "TaskID": "94A1FC50E6880FA3",
        "ParentEventID": [
          "B3F84B68B6F2150F"
        ],
        "Label": "waited",
        "Title": "X-Trace Task",
        "Host": "pinky19.mpi-sws.org",
        "Duration": "663229",
        "HRT": 26962646302926149,
        "Operation": "waited",
        "Timestamp": "1557746286243.208252",
        "TenantClass": 0,
        "Source": "SocketIOWithTimeout.java:335",
        "ThreadID": 1,
        "ThreadName": "",
        "EventID": "670FAEC20CD09B32",
        "ProcessID": 36430
      },
      {
        "Cycles": 0,
        "Agent": "edu.brown.cs.systems.xtrace.logging.BaggageWrappers",
        "ProcessName": "Read",
        "TaskID": "94A1FC50E6880FA3",
        "ParentEventID": [
          "F4E207E01757BB56",
          "670FAEC20CD09B32"
        ],
        "Label": "Merged current baggage with other baggage",
        "Title": "X-Trace Task",
        "Host": "pinky19.mpi-sws.org",
        "HRT": 26962646302997218,
        "Operation": "join",
        "Timestamp": "1557746286243.279297",
        "TenantClass": 0,
        "Source": "RemoteBlockReader2.java:429",
        "ThreadID": 1,
        "ThreadName": "",
        "EventID": "9D068E00AD705A59",
        "ProcessID": 36430
      },
      {
        "Cycles": 0,
        "Agent": "edu.brown.cs.systems.xtrace.logging.BaggageWrappers",
        "ProcessName": "Data",
        "TaskID": "94A1FC50E6880FA3",
        "ParentEventID": [
          "D706B3820F6CDF10"
        ],
        "Label": "Forking current baggage with Baggage.fork()",
        "Title": "X-Trace Task",
        "Host": "pinky22.mpi-sws.org",
        "HRT": 47512618557778621,
        "Operation": "fork",
        "Timestamp": "1557746286243.522217",
        "TenantClass": 0,
        "Source": "PacketHeader.java:95",
        "ThreadID": 15142,
        "ThreadName": "",
        "EventID": "7F66840B3A8ED776",
        "BaggageBytes": "[[248 5] [240 0] [0 148 161 252 80 230 136 15 163] [240 1] [0 215 6 179 130 15 108 223 16] [240 3] [0 2]]",
        "ProcessID": 28841
      },
      {
        "Cycles": 0,
        "Agent": "Execution-Sleep",
        "ProcessName": "Data",
        "TaskID": "94A1FC50E6880FA3",
        "ParentEventID": [
          "B4205180683FEA19"
        ],
        "Label": "waited",
        "Title": "X-Trace Task",
        "Host": "pinky22.mpi-sws.org",
        "Duration": "9504",
        "HRT": 47512618557614291,
        "Operation": "waited",
        "Timestamp": "1557746286243.357910",
        "TenantClass": 0,
        "Source": "SocketIOWithTimeout.java:335",
        "ThreadID": 15142,
        "ThreadName": "",
        "EventID": "D706B3820F6CDF10",
        "BaggageBytes": "[[248 5] [240 0] [0 148 161 252 80 230 136 15 163] [240 1] [0 180 32 81 128 104 63 234 25] [240 3] [0 2]]",
        "ProcessID": 28841
      },
      {
        "Cycles": 0,
        "Agent": "Execution-Sleep",
        "ProcessName": "Read",
        "TaskID": "94A1FC50E6880FA3",
        "ParentEventID": [
          "9D068E00AD705A59"
        ],
        "Label": "waited",
        "Title": "X-Trace Task",
        "Host": "pinky19.mpi-sws.org",
        "Duration": "230889",
        "HRT": 26962646303322532,
        "Operation": "waited",
        "Timestamp": "1557746286243.604736",
        "TenantClass": 0,
        "Source": "SocketIOWithTimeout.java:335",
        "ThreadID": 1,
        "ThreadName": "",
        "EventID": "F72248C7B4F88EEF",
        "ProcessID": 36430
      },
      {
        "Cycles": 0,
        "Agent": "edu.brown.cs.systems.xtrace.logging.BaggageWrappers",
        "ProcessName": "Read",
        "TaskID": "94A1FC50E6880FA3",
        "ParentEventID": [
          "33C51D5DD8253B42",
          "7F66840B3A8ED776"
        ],
        "Label": "Merged current baggage with other baggage",
        "Title": "X-Trace Task",
        "Host": "pinky19.mpi-sws.org",
        "HRT": 26962646303485480,
        "Operation": "join",
        "Timestamp": "1557746286243.767578",
        "TenantClass": 0,
        "Source": "PacketHeader.java:168",
        "ThreadID": 1,
        "ThreadName": "",
        "EventID": "5FEA91231D0BA8CE",
        "ProcessID": 36430
      },
      {
        "Cycles": 0,
        "Agent": "edu.brown.cs.systems.xtrace.logging.BaggageWrappers",
        "ProcessName": "Read",
        "TaskID": "94A1FC50E6880FA3",
        "ParentEventID": [
          "5FEA91231D0BA8CE"
        ],
        "Label": "Forking current baggage with Baggage.fork()",
        "Title": "X-Trace Task",
        "Host": "pinky19.mpi-sws.org",
        "HRT": 26962646303495437,
        "Operation": "fork",
        "Timestamp": "1557746286243.777588",
        "TenantClass": 0,
        "Source": "RemoteBlockReader2.java:361",
        "ThreadID": 1,
        "ThreadName": "",
        "EventID": "688EBC9B6E1CE178",
        "ProcessID": 36430
      },
      {
        "Cycles": 0,
        "Agent": "Execution-Sleep",
        "ProcessName": "Data",
        "TaskID": "94A1FC50E6880FA3",
        "ParentEventID": [
          "7F66840B3A8ED776"
        ],
        "Label": "waited",
        "Title": "X-Trace Task",
        "Host": "pinky22.mpi-sws.org",
        "Duration": "130609",
        "HRT": 47512618558136135,
        "Operation": "waited",
        "Timestamp": "1557746286243.879883",
        "TenantClass": 0,
        "Source": "SocketIOWithTimeout.java:335",
        "ThreadID": 15142,
        "ThreadName": "",
        "EventID": "19F105472ACDF04E",
        "BaggageBytes": "[[248 5] [240 0] [0 148 161 252 80 230 136 15 163] [240 1] [0 127 102 132 11 58 142 215 118] [240 3] [0 2]]",
        "ProcessID": 28841
      },
      {
        "Cycles": 0,
        "Agent": "edu.brown.cs.systems.xtrace.logging.BaggageWrappers",
        "ProcessName": "Read",
        "TaskID": "94A1FC50E6880FA3",
        "ParentEventID": [
          "B4205180683FEA19",
          "F72248C7B4F88EEF"
        ],
        "Label": "Merged current baggage with other baggage",
        "Title": "X-Trace Task",
        "Host": "pinky19.mpi-sws.org",
        "HRT": 26962646303391412,
        "Operation": "join",
        "Timestamp": "1557746286243.673584",
        "TenantClass": 0,
        "Source": "PacketHeader.java:168",
        "ThreadID": 1,
        "ThreadName": "",
        "EventID": "33C51D5DD8253B42",
        "ProcessID": 36430
      },
      {
        "Cycles": 0,
        "Agent": "edu.brown.cs.systems.xtrace.logging.BaggageWrappers",
        "ProcessName": "Data",
        "TaskID": "94A1FC50E6880FA3",
        "ParentEventID": [
          "688EBC9B6E1CE178",
          "19F105472ACDF04E"
        ],
        "Label": "Merged current baggage with other baggage",
        "Title": "X-Trace Task",
        "Host": "pinky22.mpi-sws.org",
        "HRT": 47512618558259993,
        "Operation": "join",
        "Timestamp": "1557746286244.003662",
        "TenantClass": 0,
        "Source": "DataXceiver.java:574",
        "ThreadID": 15142,
        "ThreadName": "",
        "EventID": "634D0D2030F25609",
        "BaggageBytes": "[[248 5] [240 0] [0 148 161 252 80 230 136 15 163] [240 1] [0 25 241 5 71 42 205 240 78] [0 104 142 188 155 110 28 225 120] [240 3] [0 2]]",
        "ProcessID": 28841
      },
      {
        "Cycles": 0,
        "Agent": "Execution-CPU",
        "ProcessName": "Data",
        "TaskID": "94A1FC50E6880FA3",
        "ParentEventID": [
          "634D0D2030F25609"
        ],
        "Label": "unset",
        "Title": "X-Trace Task",
        "Host": "pinky22.mpi-sws.org",
        "Duration": "1230113",
        "HRT": 47512618558298762,
        "Operation": "unset",
        "Timestamp": "1557746286244.042480",
        "TenantClass": 0,
        "Source": "DataXceiver.java:261",
        "ThreadID": 15142,
        "ThreadName": "",
        "EventID": "3AC1DC8EC14861BD",
        "BaggageBytes": "[[248 5] [240 0] [0 148 161 252 80 230 136 15 163] [240 1] [0 99 77 13 32 48 242 86 9] [240 3] [0 2]]",
        "ProcessID": 28841
      },
      {
        "Cycles": 0,
        "Agent": "edu.brown.cs.systems.retro.benchmarks.hdfs_client.Reader",
        "ProcessName": "Read",
        "TaskID": "94A1FC50E6880FA3",
        "ParentEventID": [
          "0"
        ],
        "Label": "Reading file",
        "Title": "X-Trace Task",
        "Host": "pinky19.mpi-sws.org",
        "HRT": 26962646301389977,
        "Timestamp": "1557746286241.672119",
        "TenantClass": 0,
        "ThreadID": 1,
        "ThreadName": "",
        "EventID": "A745C830C0B228FE",
        "ProcessID": 36430,
        "Tag": [
          "reader_10kb",
          "Read Size: 10240"
        ]
      }
    ]
  }
]