[
  {
    "id": "192DC4BD89235888",
    "reports": [
      {
        "Cycles": 0,
        "Agent": "edu.brown.cs.systems.retro.benchmarks.hdfs_client.Reader",
        "ProcessName": "Read",
        "TaskID": "192DC4BD89235888",
        "ParentEventID": [
          "081711179985FC72"
        ],
        "Label": "Reading file",
        "Title": "X-Trace Task",
        "Host": "pinky19.mpi-sws.org",
        "HRT": 26966686528836572,
        "Timestamp": "1557750326468.887207",
        "TenantClass": 0,
        "ThreadID": 1,
        "ThreadName": "",
        "EventID": "F4AE6D298DA16C04",
        "ProcessID": 2801
      },
      {
        "Cycles": 0,
        "Agent": "org.apache.hadoop.ipc.ProtobufRpcEngine",
        "ProcessName": "Read",
        "TaskID": "192DC4BD89235888",
        "ParentEventID": [
          "F4AE6D298DA16C04"
        ],
        "Label": "Invoking org.apache.hadoop.hdfs.protocol.ClientProtocol.getBlockLocations",
        "Title": "X-Trace Task",
        "Host": "pinky19.mpi-sws.org",
        "HRT": 26966686528863069,
        "Timestamp": "1557750326468.913574",
        "TenantClass": 0,
        "Source": "ProtobufRpcEngine.java:228",
        "ThreadID": 1,
        "ThreadName": "",
        "EventID": "5CDBEEF92084CA83",
        "ProcessID": 2801
      },
      {
        "Cycles": 0,
        "Agent": "Execution-CPU",
        "ProcessName": "Read",
        "TaskID": "192DC4BD89235888",
        "ParentEventID": [
          "0FE5E5C534A47528"
        ],
        "Label": "set",
        "Title": "X-Trace Task",
        "Host": "pinky19.mpi-sws.org",
        "HRT": 26966686528912042,
        "Operation": "set",
        "Timestamp": "1557750326468.962646",
        "TenantClass": 0,
        "Source": "Client.java:1032",
        "ThreadID": 41,
        "ThreadName": "",
        "EventID": "CB75A47BB960985E",
        "ProcessID": 2801
      },
      {
        "Cycles": 0,
        "Agent": "Execution-CPU",
        "ProcessName": "Read",
        "TaskID": "192DC4BD89235888",
        "ParentEventID": [
          "5CDBEEF92084CA83"
        ],
        "Label": "unset",
        "Title": "X-Trace Task",
        "Host": "pinky19.mpi-sws.org",
        "Duration": "24117373",
        "HRT": 26966686528887368,
        "Operation": "unset",
        "Timestamp": "1557750326468.937988",
        "TenantClass": 0,
        "Source": "Client.java:1027",
        "ThreadID": 1,
        "ThreadName": "",
        "EventID": "0FE5E5C534A47528",
        "ProcessID": 2801
      },
      {
        "Cycles": 0,
        "Agent": "Execution-CPU",
        "ProcessName": "Read",
        "TaskID": "192DC4BD89235888",
        "ParentEventID": [
          "161377860278C913"
        ],
        "Label": "unset",
        "Title": "X-Trace Task",
        "Host": "pinky19.mpi-sws.org",
        "Duration": "72626",
        "HRT": 26966686529000056,
        "Operation": "unset",
        "Timestamp": "1557750326469.050537",
        "TenantClass": 0,
        "Source": "Client.java:1062",
        "ThreadID": 41,
        "ThreadName": "",
        "EventID": "8694357B67BF1CAA",
        "ProcessID": 2801
      },
      {
        "Cycles": 0,
        "Agent": "edu.brown.cs.systems.xtrace.logging.BaggageWrappers",
        "ProcessName": "Read",
        "TaskID": "192DC4BD89235888",
        "ParentEventID": [
          "CB75A47BB960985E"
        ],
        "Label": "Forking current baggage with Baggage.fork()",
        "Title": "X-Trace Task",
        "Host": "pinky19.mpi-sws.org",
        "HRT": 26966686528928177,
        "Operation": "fork",
        "Timestamp": "1557750326468.978760",
        "TenantClass": 0,
        "Source": "Client.java:1043",
        "ThreadID": 41,
        "ThreadName": "",
        "EventID": "161377860278C913",
        "ProcessID": 2801
      },
      {
        "Cycles": 0,
        "Agent": "Execution-CPU",
        "ProcessName": "Name",
        "TaskID": "192DC4BD89235888",
        "ParentEventID": [
          "161377860278C913"
        ],
        "Label": "set",
        "Title": "X-Trace Task",
        "Host": "pinky19.mpi-sws.org",
        "HRT": 26966686529057433,
        "Operation": "set",
        "Timestamp": "1557750326469.121582",
        "TenantClass": 0,
        "Source": "Server.java:1840",
        "ThreadID": 48,
        "ThreadName": "",
        "EventID": "4F4E4555E72BF9C3",
        "BaggageBytes": "[[248 5] [240 0] [0 25 45 196 189 137 35 88 136] [240 1] [0 22 19 119 134 2 120 201 19] [240 3] [0 2]]",
        "ProcessID": 2171
      },
      {
        "Cycles": 0,
        "Agent": "Execution-CPU",
        "ProcessName": "Read",
        "TaskID": "192DC4BD89235888",
        "ParentEventID": [
          "8694357B67BF1CAA"
        ],
        "Label": "set",
        "Title": "X-Trace Task",
        "Host": "pinky19.mpi-sws.org",
        "HRT": 26966686529026905,
        "Operation": "set",
        "Timestamp": "1557750326469.077393",
        "TenantClass": 0,
        "Source": "Client.java:1104",
        "ThreadID": 1,
        "ThreadName": "",
        "EventID": "B90CC6B5E0A85148",
        "ProcessID": 2801
      },
      {
        "Cycles": 0,
        "Agent": "Execution-CPU",
        "ProcessName": "Name",
        "TaskID": "192DC4BD89235888",
        "ParentEventID": [
          "C776D19AE0D7516D"
        ],
        "Label": "unset",
        "Title": "X-Trace Task",
        "Host": "pinky19.mpi-sws.org",
        "Duration": "24162",
        "HRT": 26966686529106456,
        "Operation": "unset",
        "Timestamp": "1557750326469.170654",
        "TenantClass": 0,
        "Source": "Server.java:1828",
        "ThreadID": 48,
        "ThreadName": "",
        "EventID": "D3FE361401AE33AE",
        "BaggageBytes": "[[248 5] [240 0] [0 25 45 196 189 137 35 88 136] [240 1] [0 199 118 209 154 224 215 81 109] [240 3] [0 2]]",
        "ProcessID": 2171
      },
      {
        "Cycles": 0,
        "Agent": "Execution-CPU",
        "ProcessName": "Name",
        "TaskID": "192DC4BD89235888",
        "ParentEventID": [
          "C776D19AE0D7516D"
        ],
        "Label": "set",
        "Title": "X-Trace Task",
        "Host": "pinky19.mpi-sws.org",
        "HRT": 26966686529115543,
        "Operation": "set",
        "Timestamp": "1557750326469.179688",
        "TenantClass": 0,
        "Source": "Server.java:2071",
        "ThreadID": 60,
        "ThreadName": "",
        "EventID": "2308C2F91DE3116F",
        "BaggageBytes": "[[248 5] [240 0] [0 25 45 196 189 137 35 88 136] [240 1] [0 199 118 209 154 224 215 81 109] [240 3] [0 2]]",
        "ProcessID": 2171
      },
      {
        "Cycles": 0,
        "Agent": "edu.brown.cs.systems.xtrace.logging.BaggageWrappers",
        "ProcessName": "Name",
        "TaskID": "192DC4BD89235888",
        "ParentEventID": [
          "4F4E4555E72BF9C3"
        ],
        "Label": "Forking current baggage with Baggage.fork()",
        "Title": "X-Trace Task",
        "Host": "pinky19.mpi-sws.org",
        "HRT": 26966686529085845,
        "Operation": "fork",
        "Timestamp": "1557750326469.149902",
        "TenantClass": 0,
        "Source": "Server.java:550",
        "ThreadID": 48,
        "ThreadName": "",
        "EventID": "C776D19AE0D7516D",
        "BaggageBytes": "[[248 5] [240 0] [0 25 45 196 189 137 35 88 136] [240 1] [0 79 78 69 85 231 43 249 195] [240 3] [0 2]]",
        "ProcessID": 2171
      },
      {
        "Cycles": 0,
        "Agent": "org.apache.hadoop.ipc.Server",
        "ProcessName": "Name",
        "TaskID": "192DC4BD89235888",
        "ParentEventID": [
          "2308C2F91DE3116F"
        ],
        "Label": "getBlockLocations in org.apache.hadoop.hdfs.protocol.ClientProtocol",
        "Title": "X-Trace Task",
        "Host": "pinky19.mpi-sws.org",
        "HRT": 26966686529143466,
        "Timestamp": "1557750326469.207520",
        "TenantClass": 0,
        "Source": "ProtobufRpcEngine.java:601",
        "ThreadID": 60,
        "ThreadName": "",
        "EventID": "3E79858ACAD481FF",
        "BaggageBytes": "[[248 5] [240 0] [0 25 45 196 189 137 35 88 136] [240 1] [0 35 8 194 249 29 227 17 111] [240 3] [0 2]]",
        "ProcessID": 2171
      },
      {
        "Cycles": 0,
        "Agent": "edu.brown.cs.systems.xtrace.logging.BaggageWrappers",
        "ProcessName": "Name",
        "TaskID": "192DC4BD89235888",
        "ParentEventID": [
          "1D8AE0E082785D3B"
        ],
        "Label": "Forking current baggage with Baggage.fork()",
        "Title": "X-Trace Task",
        "Host": "pinky19.mpi-sws.org",
        "HRT": 26966686529230521,
        "Operation": "fork",
        "Timestamp": "1557750326469.294678",
        "TenantClass": 0,
        "Source": "Server.java:2398",
        "ThreadID": 60,
        "ThreadName": "",
        "EventID": "1CB95753AA7AFCD9",
        "BaggageBytes": "[[248 5] [240 0] [0 25 45 196 189 137 35 88 136] [240 1] [0 29 138 224 224 130 120 93 59] [240 3] [0 2]]",
        "ProcessID": 2171
      },
      {
        "Cycles": 0,
        "Agent": "org.apache.hadoop.hdfs.server.namenode.FSNamesystem.audit",
        "ProcessName": "Name",
        "TaskID": "192DC4BD89235888",
        "ParentEventID": [
          "3E79858ACAD481FF"
        ],
        "Label": "allowed=true\tugi=plascas (auth:SIMPLE)\tip=/139.19.171.63\tcmd=open\tsrc=/ds/eiYP1Ofrz8bb9Dbh\tdst=null\tperm=null\tproto=rpc",
        "Title": "X-Trace Task",
        "Host": "pinky19.mpi-sws.org",
        "HRT": 26966686529187950,
        "Timestamp": "1557750326469.252197",
        "TenantClass": 0,
        "Source": "FSNamesystem.java:8313",
        "ThreadID": 60,
        "ThreadName": "",
        "EventID": "1D8AE0E082785D3B",
        "BaggageBytes": "[[248 5] [240 0] [0 25 45 196 189 137 35 88 136] [240 1] [0 62 121 133 138 202 212 129 255] [240 3] [0 2]]",
        "ProcessID": 2171
      },
      {
        "Cycles": 0,
        "Agent": "Execution-CPU",
        "ProcessName": "Name",
        "TaskID": "192DC4BD89235888",
        "ParentEventID": [
          "1CB95753AA7AFCD9"
        ],
        "Label": "unset",
        "Title": "X-Trace Task",
        "Host": "pinky19.mpi-sws.org",
        "Duration": "198887",
        "HRT": 26966686529331144,
        "Operation": "unset",
        "Timestamp": "1557750326469.395264",
        "TenantClass": 0,
        "Source": "Server.java:1058",
        "ThreadID": 60,
        "ThreadName": "",
        "EventID": "F0AA3CA3BBA9FDE3",
        "BaggageBytes": "[[248 5] [240 0] [0 25 45 196 189 137 35 88 136] [240 1] [0 28 185 87 83 170 122 252 217] [240 3] [0 2]]",
        "ProcessID": 2171
      },
      {
        "Cycles": 0,
        "Agent": "Execution-CPU",
        "ProcessName": "Read",
        "TaskID": "192DC4BD89235888",
        "ParentEventID": [
          "D0BC65E0BA0BA19E"
        ],
        "Label": "unset",
        "Title": "X-Trace Task",
        "Host": "pinky19.mpi-sws.org",
        "Duration": "8397",
        "HRT": 26966686529410281,
        "Operation": "unset",
        "Timestamp": "1557750326469.460938",
        "TenantClass": 0,
        "Source": "Client.java:1168",
        "ThreadID": 40,
        "ThreadName": "",
        "EventID": "82C2CBF5D3022A59",
        "ProcessID": 2801
      },
      {
        "Cycles": 0,
        "Agent": "Execution-Sleep",
        "ProcessName": "Read",
        "TaskID": "192DC4BD89235888",
        "ParentEventID": [
          "B90CC6B5E0A85148"
        ],
        "Label": "waited",
        "Title": "X-Trace Task",
        "Host": "pinky19.mpi-sws.org",
        "Duration": "413040",
        "HRT": 26966686529454124,
        "Operation": "waited",
        "Timestamp": "1557750326469.504639",
        "TenantClass": 0,
        "Source": "Client.java:1537",
        "ThreadID": 1,
        "ThreadName": "",
        "EventID": "4F0C0448694A24D7",
        "ProcessID": 2801
      },
      {
        "Cycles": 0,
        "Agent": "edu.brown.cs.systems.xtrace.logging.BaggageWrappers",
        "ProcessName": "Read",
        "TaskID": "192DC4BD89235888",
        "ParentEventID": [
          "82C2CBF5D3022A59",
          "4F0C0448694A24D7"
        ],
        "Label": "Merged current baggage with other baggage",
        "Title": "X-Trace Task",
        "Host": "pinky19.mpi-sws.org",
        "HRT": 26966686529476242,
        "Operation": "join",
        "Timestamp": "1557750326469.526855",
        "TenantClass": 0,
        "Source": "Client.java:1545",
        "ThreadID": 1,
        "ThreadName": "",
        "EventID": "C02ED985C3F0F9E1",
        "ProcessID": 2801
      },
      {
        "Cycles": 0,
        "Agent": "Execution-CPU",
        "ProcessName": "Read",
        "TaskID": "192DC4BD89235888",
        "ParentEventID": [
          "1CB95753AA7AFCD9"
        ],
        "Label": "set",
        "Title": "X-Trace Task",
        "Host": "pinky19.mpi-sws.org",
        "HRT": 26966686529386917,
        "Operation": "set",
        "Timestamp": "1557750326469.437500",
        "TenantClass": 0,
        "Source": "Client.java:302",
        "ThreadID": 40,
        "ThreadName": "",
        "EventID": "D0BC65E0BA0BA19E",
        "ProcessID": 2801
      },
      {
        "Cycles": 0,
        "Agent": "org.apache.hadoop.ipc.ProtobufRpcEngine",
        "ProcessName": "Read",
        "TaskID": "192DC4BD89235888",
        "ParentEventID": [
          "C02ED985C3F0F9E1"
        ],
        "Label": "org.apache.hadoop.hdfs.protocol.ClientProtocol.getBlockLocations completed",
        "Title": "X-Trace Task",
        "Host": "pinky19.mpi-sws.org",
        "HRT": 26966686529516715,
        "Timestamp": "1557750326469.567383",
        "TenantClass": 0,
        "Source": "ProtobufRpcEngine.java:275",
        "ThreadID": 1,
        "ThreadName": "",
        "EventID": "7025BAE3535C206C",
        "ProcessID": 2801
      },
      {
        "Cycles": 0,
        "Agent": "Execution-Sleep",
        "ProcessName": "Read",
        "TaskID": "192DC4BD89235888",
        "ParentEventID": [
          "7025BAE3535C206C"
        ],
        "Label": "waited",
        "Title": "X-Trace Task",
        "Host": "pinky19.mpi-sws.org",
        "Duration": "143452",
        "HRT": 26966686529746269,
        "Operation": "waited",
        "Timestamp": "1557750326469.796875",
        "TenantClass": 0,
        "Source": "SocketIOWithTimeout.java:335",
        "ThreadID": 1,
        "ThreadName": "",
        "EventID": "93B430C3520C2FB6",
        "ProcessID": 2801
      },
      {
        "Cycles": 0,
        "Agent": "edu.brown.cs.systems.xtrace.logging.BaggageWrappers",
        "ProcessName": "Read",
        "TaskID": "192DC4BD89235888",
        "ParentEventID": [
          "93B430C3520C2FB6"
        ],
        "Label": "Forking current baggage with Baggage.fork()",
        "Title": "X-Trace Task",
        "Host": "pinky19.mpi-sws.org",
        "HRT": 26966686529786771,
        "Operation": "fork",
        "Timestamp": "1557750326469.837402",
        "TenantClass": 0,
        "Source": "DataTransferProtoUtil.java:94",
        "ThreadID": 1,
        "ThreadName": "",
        "EventID": "A78E8A9D7BA0513F",
        "ProcessID": 2801
      },
      {
        "Cycles": 0,
        "Agent": "edu.brown.cs.systems.xtrace.logging.XTraceInit",
        "ProcessName": "Data",
        "TaskID": "192DC4BD89235888",
        "ParentEventID": [
          "1412E5D25FB08254"
        ],
        "Label": "Thread.setName: DataXceiver for client DFSClient_NONMAPREDUCE_310321604_1 at /139.19.171.63:46218 [Sending block BP-1633380353-139.19.171.63-1554193446451:blk_1073769566_28742]",
        "Title": "X-Trace Task",
        "Host": "pinky21.mpi-sws.org",
        "HRT": 10812996236514337,
        "Timestamp": "1557750326470.390137",
        "TenantClass": 0,
        "Source": "DataXceiver.java:168",
        "ThreadID": 15510,
        "ThreadName": "",
        "EventID": "9A62C887953B3DFC",
        "BaggageBytes": "[[248 5] [240 0] [0 25 45 196 189 137 35 88 136] [240 1] [0 20 18 229 210 95 176 130 84] [240 3] [0 2]]",
        "ProcessID": 20775
      },
      {
        "Cycles": 0,
        "Agent": "edu.brown.cs.systems.xtrace.logging.BaggageWrappers",
        "ProcessName": "Data",
        "TaskID": "192DC4BD89235888",
        "ParentEventID": [
          "9A62C887953B3DFC"
        ],
        "Label": "Forking current baggage with Baggage.fork()",
        "Title": "X-Trace Task",
        "Host": "pinky21.mpi-sws.org",
        "HRT": 10812996236728311,
        "Operation": "fork",
        "Timestamp": "1557750326470.604004",
        "TenantClass": 0,
        "Source": "DataXceiver.java:1257",
        "ThreadID": 15510,
        "ThreadName": "",
        "EventID": "880739214946E5BF",
        "BaggageBytes": "[[248 5] [240 0] [0 25 45 196 189 137 35 88 136] [240 1] [0 154 98 200 135 149 59 61 252] [240 3] [0 2]]",
        "ProcessID": 20775
      },
      {
        "Cycles": 0,
        "Agent": "Execution-CPU",
        "ProcessName": "Data",
        "TaskID": "192DC4BD89235888",
        "ParentEventID": [
          "A78E8A9D7BA0513F"
        ],
        "Label": "set",
        "Title": "X-Trace Task",
        "Host": "pinky21.mpi-sws.org",
        "HRT": 10812996236401537,
        "Operation": "set",
        "Timestamp": "1557750326470.277344",
        "TenantClass": 0,
        "Source": "Receiver.java:117",
        "ThreadID": 15510,
        "ThreadName": "",
        "EventID": "1412E5D25FB08254",
        "BaggageBytes": "[[248 5] [240 0] [0 25 45 196 189 137 35 88 136] [240 1] [0 167 142 138 157 123 160 81 63] [240 3] [0 2]]",
        "ProcessID": 20775
      },
      {
        "Cycles": 0,
        "Agent": "Execution-Sleep",
        "ProcessName": "Read",
        "TaskID": "192DC4BD89235888",
        "ParentEventID": [
          "A78E8A9D7BA0513F"
        ],
        "Label": "waited",
        "Title": "X-Trace Task",
        "Host": "pinky19.mpi-sws.org",
        "Duration": "914115",
        "HRT": 26966686530790893,
        "Operation": "waited",
        "Timestamp": "1557750326470.841553",
        "TenantClass": 0,
        "Source": "SocketIOWithTimeout.java:335",
        "ThreadID": 1,
        "ThreadName": "",
        "EventID": "72C6EBF0BEDFA65F",
        "ProcessID": 2801
      },
      {
        "Cycles": 0,
        "Agent": "edu.brown.cs.systems.xtrace.logging.BaggageWrappers",
        "ProcessName": "Data",
        "TaskID": "192DC4BD89235888",
        "ParentEventID": [
          "880739214946E5BF"
        ],
        "Label": "Forking current baggage with Baggage.fork()",
        "Title": "X-Trace Task",
        "Host": "pinky21.mpi-sws.org",
        "HRT": 10812996236896819,
        "Operation": "fork",
        "Timestamp": "1557750326470.772461",
        "TenantClass": 0,
        "Source": "PacketHeader.java:95",
        "ThreadID": 15510,
        "ThreadName": "",
        "EventID": "249D224217608315",
        "BaggageBytes": "[[248 5] [240 0] [0 25 45 196 189 137 35 88 136] [240 1] [0 136 7 57 33 73 70 229 191] [240 3] [0 2]]",
        "ProcessID": 20775
      },
      {
        "Cycles": 0,
        "Agent": "edu.brown.cs.systems.xtrace.logging.BaggageWrappers",
        "ProcessName": "Read",
        "TaskID": "192DC4BD89235888",
        "ParentEventID": [
          "880739214946E5BF",
          "72C6EBF0BEDFA65F"
        ],
        "Label": "Merged current baggage with other baggage",
        "Title": "X-Trace Task",
        "Host": "pinky19.mpi-sws.org",
        "HRT": 26966686530859795,
        "Operation": "join",
        "Timestamp": "1557750326470.910400",
        "TenantClass": 0,
        "Source": "RemoteBlockReader2.java:429",
        "ThreadID": 1,
        "ThreadName": "",
        "EventID": "F5C5548182980E95",
        "ProcessID": 2801
      },
      {
        "Cycles": 0,
        "Agent": "Execution-Sleep",
        "ProcessName": "Data",
        "TaskID": "192DC4BD89235888",
        "ParentEventID": [
          "249D224217608315"
        ],
        "Label": "waited",
        "Title": "X-Trace Task",
        "Host": "pinky21.mpi-sws.org",
        "Duration": "14313",
        "HRT": 10812996237055186,
        "Operation": "waited",
        "Timestamp": "1557750326470.930908",
        "TenantClass": 0,
        "Source": "SocketIOWithTimeout.java:335",
        "ThreadID": 15510,
        "ThreadName": "",
        "EventID": "473D5164C21DFDCA",
        "BaggageBytes": "[[248 5] [240 0] [0 25 45 196 189 137 35 88 136] [240 1] [0 36 157 34 66 23 96 131 21] [240 3] [0 2]]",
        "ProcessID": 20775
      },
      {
        "Cycles": 0,
        "Agent": "edu.brown.cs.systems.xtrace.logging.BaggageWrappers",
        "ProcessName": "Data",
        "TaskID": "192DC4BD89235888",
        "ParentEventID": [
          "473D5164C21DFDCA"
        ],
        "Label": "Forking current baggage with Baggage.fork()",
        "Title": "X-Trace Task",
        "Host": "pinky21.mpi-sws.org",
        "HRT": 10812996237235843,
        "Operation": "fork",
        "Timestamp": "1557750326471.111572",
        "TenantClass": 0,
        "Source": "PacketHeader.java:95",
        "ThreadID": 15510,
        "ThreadName": "",
        "EventID": "58F0864FF6256BA5",
        "BaggageBytes": "[[248 5] [240 0] [0 25 45 196 189 137 35 88 136] [240 1] [0 71 61 81 100 194 29 253 202] [240 3] [0 2]]",
        "ProcessID": 20775
      },
      {
        "Cycles": 0,
        "Agent": "Execution-Sleep",
        "ProcessName": "Read",
        "TaskID": "192DC4BD89235888",
        "ParentEventID": [
          "B871403A5EA856C3"
        ],
        "Label": "waited",
        "Title": "X-Trace Task",
        "Host": "pinky19.mpi-sws.org",
        "Duration": "338896",
        "HRT": 26966686531345705,
        "Operation": "waited",
        "Timestamp": "1557750326471.396240",
        "TenantClass": 0,
        "Source": "SocketIOWithTimeout.java:335",
        "ThreadID": 1,
        "ThreadName": "",
        "EventID": "C6FF155DCCD206E9",
        "ProcessID": 2801
      },
      {
        "Cycles": 0,
        "Agent": "Execution-Sleep",
        "ProcessName": "Read",
        "TaskID": "192DC4BD89235888",
        "ParentEventID": [
          "F5C5548182980E95"
        ],
        "Label": "waited",
        "Title": "X-Trace Task",
        "Host": "pinky19.mpi-sws.org",
        "Duration": "41704",
        "HRT": 26966686530953627,
        "Operation": "waited",
        "Timestamp": "1557750326471.004150",
        "TenantClass": 0,
        "Source": "SocketIOWithTimeout.java:335",
        "ThreadID": 1,
        "ThreadName": "",
        "EventID": "B871403A5EA856C3",
        "ProcessID": 2801
      },
      {
        "Cycles": 0,
        "Agent": "Execution-Sleep",
        "ProcessName": "Read",
        "TaskID": "192DC4BD89235888",
        "ParentEventID": [
          "C6FF155DCCD206E9"
        ],
        "Label": "waited",
        "Title": "X-Trace Task",
        "Host": "pinky19.mpi-sws.org",
        "Duration": "242865",
        "HRT": 26966686531637456,
        "Operation": "waited",
        "Timestamp": "1557750326471.687988",
        "TenantClass": 0,
        "Source": "SocketIOWithTimeout.java:335",
        "ThreadID": 1,
        "ThreadName": "",
        "EventID": "085C5BF6997C1323",
        "ProcessID": 2801
      },
      {
        "Cycles": 0,
        "Agent": "Execution-Sleep",
        "ProcessName": "Read",
        "TaskID": "192DC4BD89235888",
        "ParentEventID": [
          "13F8B7A3350375FC"
        ],
        "Label": "waited",
        "Title": "X-Trace Task",
        "Host": "pinky19.mpi-sws.org",
        "Duration": "14095",
        "HRT": 26966686531896723,
        "Operation": "waited",
        "Timestamp": "1557750326471.947266",
        "TenantClass": 0,
        "Source": "SocketIOWithTimeout.java:335",
        "ThreadID": 1,
        "ThreadName": "",
        "EventID": "FC92652D4B3D7D4A",
        "ProcessID": 2801
      },
      {
        "Cycles": 0,
        "Agent": "Execution-Sleep",
        "ProcessName": "Read",
        "TaskID": "192DC4BD89235888",
        "ParentEventID": [
          "085C5BF6997C1323"
        ],
        "Label": "waited",
        "Title": "X-Trace Task",
        "Host": "pinky19.mpi-sws.org",
        "Duration": "146003",
        "HRT": 26966686531840817,
        "Operation": "waited",
        "Timestamp": "1557750326471.891357",
        "TenantClass": 0,
        "Source": "SocketIOWithTimeout.java:335",
        "ThreadID": 1,
        "ThreadName": "",
        "EventID": "13F8B7A3350375FC",
        "ProcessID": 2801
      },
      {
        "Cycles": 0,
        "Agent": "edu.brown.cs.systems.xtrace.logging.BaggageWrappers",
        "ProcessName": "Read",
        "TaskID": "192DC4BD89235888",
        "ParentEventID": [
          "FC92652D4B3D7D4A",
          "249D224217608315"
        ],
        "Label": "Merged current baggage with other baggage",
        "Title": "X-Trace Task",
        "Host": "pinky19.mpi-sws.org",
        "HRT": 26966686531933183,
        "Operation": "join",
        "Timestamp": "1557750326471.983887",
        "TenantClass": 0,
        "Source": "PacketHeader.java:168",
        "ThreadID": 1,
        "ThreadName": "",
        "EventID": "7BF99F8ED2362830",
        "ProcessID": 2801
      },
      {
        "Cycles": 0,
        "Agent": "edu.brown.cs.systems.xtrace.logging.BaggageWrappers",
        "ProcessName": "Read",
        "TaskID": "192DC4BD89235888",
        "ParentEventID": [
          "7BF99F8ED2362830",
          "58F0864FF6256BA5"
        ],
        "Label": "Merged current baggage with other baggage",
        "Title": "X-Trace Task",
        "Host": "pinky19.mpi-sws.org",
        "HRT": 26966686532028190,
        "Operation": "join",
        "Timestamp": "1557750326472.078857",
        "TenantClass": 0,
        "Source": "PacketHeader.java:168",
        "ThreadID": 1,
        "ThreadName": "",
        "EventID": "C7835C59281CAC02",
        "ProcessID": 2801
      },
      {
        "Cycles": 0,
        "Agent": "edu.brown.cs.systems.xtrace.logging.BaggageWrappers",
        "ProcessName": "Read",
        "TaskID": "192DC4BD89235888",
        "ParentEventID": [
          "C7835C59281CAC02"
        ],
        "Label": "Forking current baggage with Baggage.fork()",
        "Title": "X-Trace Task",
        "Host": "pinky19.mpi-sws.org",
        "HRT": 26966686532036691,
        "Operation": "fork",
        "Timestamp": "1557750326472.087158",
        "TenantClass": 0,
        "Source": "RemoteBlockReader2.java:361",
        "ThreadID": 1,
        "ThreadName": "",
        "EventID": "C330558DD282DF16",
        "ProcessID": 2801
      },
      {
        "Cycles": 0,
        "Agent": "Execution-Sleep",
        "ProcessName": "Data",
        "TaskID": "192DC4BD89235888",
        "ParentEventID": [
          "58F0864FF6256BA5"
        ],
        "Label": "waited",
        "Title": "X-Trace Task",
        "Host": "pinky21.mpi-sws.org",
        "Duration": "824182",
        "HRT": 10812996238242906,
        "Operation": "waited",
        "Timestamp": "1557750326472.118652",
        "TenantClass": 0,
        "Source": "SocketIOWithTimeout.java:335",
        "ThreadID": 15510,
        "ThreadName": "",
        "EventID": "05505D60F544EAB5",
        "BaggageBytes": "[[248 5] [240 0] [0 25 45 196 189 137 35 88 136] [240 1] [0 88 240 134 79 246 37 107 165] [240 3] [0 2]]",
        "ProcessID": 20775
      },
      {
        "Cycles": 0,
        "Agent": "edu.brown.cs.systems.xtrace.logging.BaggageWrappers",
        "ProcessName": "Read",
        "TaskID": "192DC4BD89235888",
        "ParentEventID": [
          "C330558DD282DF16"
        ],
        "Label": "Forking current baggage with Baggage.fork()",
        "Title": "X-Trace Task",
        "Host": "pinky19.mpi-sws.org",
        "HRT": 26966686532091341,
        "Operation": "fork",
        "Timestamp": "1557750326472.141846",
        "TenantClass": 0,
        "Source": "DataTransferProtoUtil.java:94",
        "ThreadID": 1,
        "ThreadName": "",
        "EventID": "DC2EE76F827833CA",
        "ProcessID": 2801
      },
      {
        "Cycles": 0,
        "Agent": "edu.brown.cs.systems.xtrace.logging.BaggageWrappers",
        "ProcessName": "Data",
        "TaskID": "192DC4BD89235888",
        "ParentEventID": [
          "05505D60F544EAB5",
          "C330558DD282DF16"
        ],
        "Label": "Merged current baggage with other baggage",
        "Title": "X-Trace Task",
        "Host": "pinky21.mpi-sws.org",
        "HRT": 10812996238485010,
        "Operation": "join",
        "Timestamp": "1557750326472.360840",
        "TenantClass": 0,
        "Source": "DataXceiver.java:574",
        "ThreadID": 15510,
        "ThreadName": "",
        "EventID": "EFFA4D328C1E4837",
        "BaggageBytes": "[[248 5] [240 0] [0 25 45 196 189 137 35 88 136] [240 1] [0 195 48 85 141 210 130 223 22] [0 5 80 93 96 245 68 234 181] [240 3] [0 2]]",
        "ProcessID": 20775
      },
      {
        "Cycles": 0,
        "Agent": "Execution-CPU",
        "ProcessName": "Data",
        "TaskID": "192DC4BD89235888",
        "ParentEventID": [
          "EFFA4D328C1E4837"
        ],
        "Label": "unset",
        "Title": "X-Trace Task",
        "Host": "pinky21.mpi-sws.org",
        "Duration": "2086080",
        "HRT": 10812996238569124,
        "Operation": "unset",
        "Timestamp": "1557750326472.444824",
        "TenantClass": 0,
        "Source": "DataXceiver.java:261",
        "ThreadID": 15510,
        "ThreadName": "",
        "EventID": "3FCE3768B1CF8C42",
        "BaggageBytes": "[[248 5] [240 0] [0 25 45 196 189 137 35 88 136] [240 1] [0 239 250 77 50 140 30 72 55] [240 3] [0 2]]",
        "ProcessID": 20775
      },
      {
        "Cycles": 0,
        "Agent": "edu.brown.cs.systems.xtrace.logging.XTraceInit",
        "ProcessName": "Data",
        "TaskID": "192DC4BD89235888",
        "ParentEventID": [
          "004BC5AC3DA4E29B"
        ],
        "Label": "Thread.setName: DataXceiver for client DFSClient_NONMAPREDUCE_310321604_1 at /139.19.171.63:46218 [Sending block BP-1633380353-139.19.171.63-1554193446451:blk_1073769566_28742]",
        "Title": "X-Trace Task",
        "Host": "pinky21.mpi-sws.org",
        "HRT": 10812996238797001,
        "Timestamp": "1557750326472.672852",
        "TenantClass": 0,
        "Source": "DataXceiver.java:168",
        "ThreadID": 15510,
        "ThreadName": "",
        "EventID": "BE6B4713C7A55353",
        "BaggageBytes": "[[248 5] [240 0] [0 25 45 196 189 137 35 88 136] [240 1] [0 0 75 197 172 61 164 226 155] [240 3] [0 2]]",
        "ProcessID": 20775
      },
      {
        "Cycles": 0,
        "Agent": "Execution-CPU",
        "ProcessName": "Data",
        "TaskID": "192DC4BD89235888",
        "ParentEventID": [
          "DC2EE76F827833CA"
        ],
        "Label": "set",
        "Title": "X-Trace Task",
        "Host": "pinky21.mpi-sws.org",
        "HRT": 10812996238646424,
        "Operation": "set",
        "Timestamp": "1557750326472.522217",
        "TenantClass": 0,
        "Source": "Receiver.java:117",
        "ThreadID": 15510,
        "ThreadName": "",
        "EventID": "004BC5AC3DA4E29B",
        "BaggageBytes": "[[248 5] [240 0] [0 25 45 196 189 137 35 88 136] [240 1] [0 220 46 231 111 130 120 51 202] [240 3] [0 2]]",
        "ProcessID": 20775
      },
      {
        "Cycles": 0,
        "Agent": "edu.brown.cs.systems.xtrace.logging.BaggageWrappers",
        "ProcessName": "Data",
        "TaskID": "192DC4BD89235888",
        "ParentEventID": [
          "BE6B4713C7A55353"
        ],
        "Label": "Forking current baggage with Baggage.fork()",
        "Title": "X-Trace Task",
        "Host": "pinky21.mpi-sws.org",
        "HRT": 10812996239061425,
        "Operation": "fork",
        "Timestamp": "1557750326472.937256",
        "TenantClass": 0,
        "Source": "DataXceiver.java:1257",
        "ThreadID": 15510,
        "ThreadName": "",
        "EventID": "CE02CF938B5CE22D",
        "BaggageBytes": "[[248 5] [240 0] [0 25 45 196 189 137 35 88 136] [240 1] [0 190 107 71 19 199 165 83 83] [240 3] [0 2]]",
        "ProcessID": 20775
      },
      {
        "Cycles": 0,
        "Agent": "Execution-Sleep",
        "ProcessName": "Read",
        "TaskID": "192DC4BD89235888",
        "ParentEventID": [
          "DC2EE76F827833CA"
        ],
        "Label": "waited",
        "Title": "X-Trace Task",
        "Host": "pinky19.mpi-sws.org",
        "Duration": "957429",
        "HRT": 26966686533110630,
        "Operation": "waited",
        "Timestamp": "1557750326473.161133",
        "TenantClass": 0,
        "Source": "SocketIOWithTimeout.java:335",
        "ThreadID": 1,
        "ThreadName": "",
        "EventID": "5F44F2DC4234EB45",
        "ProcessID": 2801
      },
      {
        "Cycles": 0,
        "Agent": "edu.brown.cs.systems.xtrace.logging.BaggageWrappers",
        "ProcessName": "Read",
        "TaskID": "192DC4BD89235888",
        "ParentEventID": [
          "CE02CF938B5CE22D",
          "5F44F2DC4234EB45"
        ],
        "Label": "Merged current baggage with other baggage",
        "Title": "X-Trace Task",
        "Host": "pinky19.mpi-sws.org",
        "HRT": 26966686533160182,
        "Operation": "join",
        "Timestamp": "1557750326473.210693",
        "TenantClass": 0,
        "Source": "RemoteBlockReader2.java:429",
        "ThreadID": 1,
        "ThreadName": "",
        "EventID": "5BF149201BF986C5",
        "ProcessID": 2801
      },
      {
        "Cycles": 0,
        "Agent": "Execution-Sleep",
        "ProcessName": "Read",
        "TaskID": "192DC4BD89235888",
        "ParentEventID": [
          "5BF149201BF986C5"
        ],
        "Label": "waited",
        "Title": "X-Trace Task",
        "Host": "pinky19.mpi-sws.org",
        "Duration": "89964",
        "HRT": 26966686533287733,
        "Operation": "waited",
        "Timestamp": "1557750326473.338379",
        "TenantClass": 0,
        "Source": "SocketIOWithTimeout.java:335",
        "ThreadID": 1,
        "ThreadName": "",
        "EventID": "0B93346E77AD0F6D",
        "ProcessID": 2801
      },
      {
        "Cycles": 0,
        "Agent": "edu.brown.cs.systems.xtrace.logging.BaggageWrappers",
        "ProcessName": "Data",
        "TaskID": "192DC4BD89235888",
        "ParentEventID": [
          "CE02CF938B5CE22D"
        ],
        "Label": "Forking current baggage with Baggage.fork()",
        "Title": "X-Trace Task",
        "Host": "pinky21.mpi-sws.org",
        "HRT": 10812996239244129,
        "Operation": "fork",
        "Timestamp": "1557750326473.119873",
        "TenantClass": 0,
        "Source": "PacketHeader.java:95",
        "ThreadID": 15510,
        "ThreadName": "",
        "EventID": "CE264A2F353909D2",
        "BaggageBytes": "[[248 5] [240 0] [0 25 45 196 189 137 35 88 136] [240 1] [0 206 2 207 147 139 92 226 45] [240 3] [0 2]]",
        "ProcessID": 20775
      },
      {
        "Cycles": 0,
        "Agent": "Execution-Sleep",
        "ProcessName": "Data",
        "TaskID": "192DC4BD89235888",
        "ParentEventID": [
          "CE264A2F353909D2"
        ],
        "Label": "waited",
        "Title": "X-Trace Task",
        "Host": "pinky21.mpi-sws.org",
        "Duration": "11867",
        "HRT": 10812996239398996,
        "Operation": "waited",
        "Timestamp": "1557750326473.274658",
        "TenantClass": 0,
        "Source": "SocketIOWithTimeout.java:335",
        "ThreadID": 15510,
        "ThreadName": "",
        "EventID": "5DD0CFED45E3B05C",
        "BaggageBytes": "[[248 5] [240 0] [0 25 45 196 189 137 35 88 136] [240 1] [0 206 38 74 47 53 57 9 210] [240 3] [0 2]]",
        "ProcessID": 20775
      },
      {
        "Cycles": 0,
        "Agent": "edu.brown.cs.systems.xtrace.logging.BaggageWrappers",
        "ProcessName": "Data",
        "TaskID": "192DC4BD89235888",
        "ParentEventID": [
          "5DD0CFED45E3B05C"
        ],
        "Label": "Forking current baggage with Baggage.fork()",
        "Title": "X-Trace Task",
        "Host": "pinky21.mpi-sws.org",
        "HRT": 10812996239578557,
        "Operation": "fork",
        "Timestamp": "1557750326473.454346",
        "TenantClass": 0,
        "Source": "PacketHeader.java:95",
        "ThreadID": 15510,
        "ThreadName": "",
        "EventID": "6C2B38F3BB1AB4D0",
        "BaggageBytes": "[[248 5] [240 0] [0 25 45 196 189 137 35 88 136] [240 1] [0 93 208 207 237 69 227 176 92] [240 3] [0 2]]",
        "ProcessID": 20775
      },
      {
        "Cycles": 0,
        "Agent": "Execution-Sleep",
        "ProcessName": "Read",
        "TaskID": "192DC4BD89235888",
        "ParentEventID": [
          "0B93346E77AD0F6D"
        ],
        "Label": "waited",
        "Title": "X-Trace Task",
        "Host": "pinky19.mpi-sws.org",
        "Duration": "323663",
        "HRT": 26966686533693908,
        "Operation": "waited",
        "Timestamp": "1557750326473.744385",
        "TenantClass": 0,
        "Source": "SocketIOWithTimeout.java:335",
        "ThreadID": 1,
        "ThreadName": "",
        "EventID": "8C92085C7A02DFF4",
        "ProcessID": 2801
      },
      {
        "Cycles": 0,
        "Agent": "Execution-Sleep",
        "ProcessName": "Read",
        "TaskID": "192DC4BD89235888",
        "ParentEventID": [
          "8C92085C7A02DFF4"
        ],
        "Label": "waited",
        "Title": "X-Trace Task",
        "Host": "pinky19.mpi-sws.org",
        "Duration": "161658",
        "HRT": 26966686533906576,
        "Operation": "waited",
        "Timestamp": "1557750326473.957275",
        "TenantClass": 0,
        "Source": "SocketIOWithTimeout.java:335",
        "ThreadID": 1,
        "ThreadName": "",
        "EventID": "69385811C32700AB",
        "ProcessID": 2801
      },
      {
        "Cycles": 0,
        "Agent": "Execution-Sleep",
        "ProcessName": "Data",
        "TaskID": "192DC4BD89235888",
        "ParentEventID": [
          "6C2B38F3BB1AB4D0"
        ],
        "Label": "waited",
        "Title": "X-Trace Task",
        "Host": "pinky21.mpi-sws.org",
        "Duration": "145304",
        "HRT": 10812996239885491,
        "Operation": "waited",
        "Timestamp": "1557750326473.761230",
        "TenantClass": 0,
        "Source": "SocketIOWithTimeout.java:335",
        "ThreadID": 15510,
        "ThreadName": "",
        "EventID": "0C745232E4FBA16A",
        "BaggageBytes": "[[248 5] [240 0] [0 25 45 196 189 137 35 88 136] [240 1] [0 108 43 56 243 187 26 180 208] [240 3] [0 2]]",
        "ProcessID": 20775
      },
      {
        "Cycles": 0,
        "Agent": "Execution-Sleep",
        "ProcessName": "Read",
        "TaskID": "192DC4BD89235888",
        "ParentEventID": [
          "69385811C32700AB"
        ],
        "Label": "waited",
        "Title": "X-Trace Task",
        "Host": "pinky19.mpi-sws.org",
        "Duration": "157504",
        "HRT": 26966686534112554,
        "Operation": "waited",
        "Timestamp": "1557750326474.163086",
        "TenantClass": 0,
        "Source": "SocketIOWithTimeout.java:335",
        "ThreadID": 1,
        "ThreadName": "",
        "EventID": "46170C16E4342DA7",
        "ProcessID": 2801
      },
      {
        "Cycles": 0,
        "Agent": "edu.brown.cs.systems.xtrace.logging.BaggageWrappers",
        "ProcessName": "Read",
        "TaskID": "192DC4BD89235888",
        "ParentEventID": [
          "46170C16E4342DA7",
          "CE264A2F353909D2"
        ],
        "Label": "Merged current baggage with other baggage",
        "Title": "X-Trace Task",
        "Host": "pinky19.mpi-sws.org",
        "HRT": 26966686534150150,
        "Operation": "join",
        "Timestamp": "1557750326474.200684",
        "TenantClass": 0,
        "Source": "PacketHeader.java:168",
        "ThreadID": 1,
        "ThreadName": "",
        "EventID": "833F27D47FE6181E",
        "ProcessID": 2801
      },
      {
        "Cycles": 0,
        "Agent": "edu.brown.cs.systems.retro.benchmarks.hdfs_client.Reader",
        "ProcessName": "Read",
        "TaskID": "192DC4BD89235888",
        "ParentEventID": [
          "0"
        ],
        "Label": "Reading file",
        "Title": "X-Trace Task",
        "Host": "pinky19.mpi-sws.org",
        "HRT": 26966686528819820,
        "Timestamp": "1557750326468.870361",
        "TenantClass": 0,
        "ThreadID": 1,
        "ThreadName": "",
        "EventID": "081711179985FC72",
        "ProcessID": 2801,
        "Tag": [
          "reader_100kb",
          "Read Size: 102400"
        ]
      },
      {
        "Cycles": 0,
        "Agent": "Execution-CPU",
        "ProcessName": "Data",
        "TaskID": "192DC4BD89235888",
        "ParentEventID": [
          "0C745232E4FBA16A"
        ],
        "Label": "unset",
        "Title": "X-Trace Task",
        "Host": "pinky21.mpi-sws.org",
        "Duration": "26491878",
        "HRT": 10812996265262010,
        "Operation": "unset",
        "Timestamp": "1557750326499.137695",
        "TenantClass": 0,
        "Source": "DataXceiver.java:261",
        "ThreadID": 15510,
        "ThreadName": "",
        "EventID": "B683B97B65C2F4F0",
        "BaggageBytes": "[[248 5] [240 0] [0 25 45 196 189 137 35 88 136] [240 1] [0 12 116 82 50 228 251 161 106] [240 3] [0 2]]",
        "ProcessID": 20775
      }
    ]
  }
]