[
  {
    "id": "BE9D4A351DAFB8E4",
    "reports": [
      {
        "Cycles": 0,
        "Agent": "edu.brown.cs.systems.retro.benchmarks.hdfs_client.Reader",
        "ProcessName": "Read",
        "TaskID": "BE9D4A351DAFB8E4",
        "ParentEventID": [
          "0"
        ],
        "Label": "Reading file",
        "Title": "X-Trace Task",
        "Host": "pinky19.mpi-sws.org",
        "HRT": 26966541504593385,
        "Timestamp": "1557750181444.955078",
        "TenantClass": 0,
        "ThreadID": 1,
        "ThreadName": "",
        "EventID": "2143DD76E07E115E",
        "ProcessID": 2801,
        "Tag": [
          "reader_100kb",
          "Read Size: 102400"
        ]
      },
      {
        "Cycles": 0,
        "Agent": "org.apache.hadoop.ipc.ProtobufRpcEngine",
        "ProcessName": "Read",
        "TaskID": "BE9D4A351DAFB8E4",
        "ParentEventID": [
          "D61059B5D2F0B82D"
        ],
        "Label": "Invoking org.apache.hadoop.hdfs.protocol.ClientProtocol.getBlockLocations",
        "Title": "X-Trace Task",
        "Host": "pinky19.mpi-sws.org",
        "HRT": 26966541504685597,
        "Timestamp": "1557750181445.047363",
        "TenantClass": 0,
        "Source": "ProtobufRpcEngine.java:228",
        "ThreadID": 1,
        "ThreadName": "",
        "EventID": "0A064F701C0462CF",
        "ProcessID": 2801
      },
      {
        "Cycles": 0,
        "Agent": "edu.brown.cs.systems.retro.benchmarks.hdfs_client.Reader",
        "ProcessName": "Read",
        "TaskID": "BE9D4A351DAFB8E4",
        "ParentEventID": [
          "2143DD76E07E115E"
        ],
        "Label": "Reading file",
        "Title": "X-Trace Task",
        "Host": "pinky19.mpi-sws.org",
        "HRT": 26966541504614733,
        "Timestamp": "1557750181444.976562",
        "TenantClass": 0,
        "ThreadID": 1,
        "ThreadName": "",
        "EventID": "D61059B5D2F0B82D",
        "ProcessID": 2801
      },
      {
        "Cycles": 0,
        "Agent": "Execution-CPU",
        "ProcessName": "Read",
        "TaskID": "BE9D4A351DAFB8E4",
        "ParentEventID": [
          "0A064F701C0462CF"
        ],
        "Label": "unset",
        "Title": "X-Trace Task",
        "Host": "pinky19.mpi-sws.org",
        "Duration": "26187526",
        "HRT": 26966541504732903,
        "Operation": "unset",
        "Timestamp": "1557750181445.094727",
        "TenantClass": 0,
        "Source": "Client.java:1027",
        "ThreadID": 1,
        "ThreadName": "",
        "EventID": "3AB75B551A841AE0",
        "ProcessID": 2801
      },
      {
        "Cycles": 0,
        "Agent": "edu.brown.cs.systems.xtrace.logging.BaggageWrappers",
        "ProcessName": "Read",
        "TaskID": "BE9D4A351DAFB8E4",
        "ParentEventID": [
          "84EF9A797E9419B5"
        ],
        "Label": "Forking current baggage with Baggage.fork()",
        "Title": "X-Trace Task",
        "Host": "pinky19.mpi-sws.org",
        "HRT": 26966541504793083,
        "Operation": "fork",
        "Timestamp": "1557750181445.154785",
        "TenantClass": 0,
        "Source": "Client.java:1043",
        "ThreadID": 41,
        "ThreadName": "",
        "EventID": "FFF723AFE885DFD2",
        "ProcessID": 2801
      },
      {
        "Cycles": 0,
        "Agent": "Execution-CPU",
        "ProcessName": "Read",
        "TaskID": "BE9D4A351DAFB8E4",
        "ParentEventID": [
          "3AB75B551A841AE0"
        ],
        "Label": "set",
        "Title": "X-Trace Task",
        "Host": "pinky19.mpi-sws.org",
        "HRT": 26966541504772678,
        "Operation": "set",
        "Timestamp": "1557750181445.134521",
        "TenantClass": 0,
        "Source": "Client.java:1032",
        "ThreadID": 41,
        "ThreadName": "",
        "EventID": "84EF9A797E9419B5",
        "ProcessID": 2801
      },
      {
        "Cycles": 0,
        "Agent": "Execution-CPU",
        "ProcessName": "Read",
        "TaskID": "BE9D4A351DAFB8E4",
        "ParentEventID": [
          "FFF723AFE885DFD2"
        ],
        "Label": "unset",
        "Title": "X-Trace Task",
        "Host": "pinky19.mpi-sws.org",
        "Duration": "117536",
        "HRT": 26966541504907604,
        "Operation": "unset",
        "Timestamp": "1557750181445.269531",
        "TenantClass": 0,
        "Source": "Client.java:1062",
        "ThreadID": 41,
        "ThreadName": "",
        "EventID": "7A868C05E5EC7C05",
        "ProcessID": 2801
      },
      {
        "Cycles": 0,
        "Agent": "Execution-CPU",
        "ProcessName": "Read",
        "TaskID": "BE9D4A351DAFB8E4",
        "ParentEventID": [
          "7A868C05E5EC7C05"
        ],
        "Label": "set",
        "Title": "X-Trace Task",
        "Host": "pinky19.mpi-sws.org",
        "HRT": 26966541504945421,
        "Operation": "set",
        "Timestamp": "1557750181445.307129",
        "TenantClass": 0,
        "Source": "Client.java:1104",
        "ThreadID": 1,
        "ThreadName": "",
        "EventID": "05F9F27EFAC0CF35",
        "ProcessID": 2801
      },
      {
        "Cycles": 0,
        "Agent": "Execution-CPU",
        "ProcessName": "Name",
        "TaskID": "BE9D4A351DAFB8E4",
        "ParentEventID": [
          "0F8E667B8845B7A5"
        ],
        "Label": "unset",
        "Title": "X-Trace Task",
        "Host": "pinky19.mpi-sws.org",
        "Duration": "40911",
        "HRT": 26966541505032756,
        "Operation": "unset",
        "Timestamp": "1557750181445.408691",
        "TenantClass": 0,
        "Source": "Server.java:1828",
        "ThreadID": 48,
        "ThreadName": "",
        "EventID": "B1F7597E0C4F27A9",
        "BaggageBytes": "[[248 5] [240 0] [0 190 157 74 53 29 175 184 228] [240 1] [0 15 142 102 123 136 69 183 165] [240 3] [0 2]]",
        "ProcessID": 2171
      },
      {
        "Cycles": 0,
        "Agent": "edu.brown.cs.systems.xtrace.logging.BaggageWrappers",
        "ProcessName": "Name",
        "TaskID": "BE9D4A351DAFB8E4",
        "ParentEventID": [
          "B966E25DFF43FD45"
        ],
        "Label": "Forking current baggage with Baggage.fork()",
        "Title": "X-Trace Task",
        "Host": "pinky19.mpi-sws.org",
        "HRT": 26966541505000229,
        "Operation": "fork",
        "Timestamp": "1557750181445.376221",
        "TenantClass": 0,
        "Source": "Server.java:550",
        "ThreadID": 48,
        "ThreadName": "",
        "EventID": "0F8E667B8845B7A5",
        "BaggageBytes": "[[248 5] [240 0] [0 190 157 74 53 29 175 184 228] [240 1] [0 185 102 226 93 255 67 253 69] [240 3] [0 2]]",
        "ProcessID": 2171
      },
      {
        "Cycles": 0,
        "Agent": "Execution-CPU",
        "ProcessName": "Name",
        "TaskID": "BE9D4A351DAFB8E4",
        "ParentEventID": [
          "0F8E667B8845B7A5"
        ],
        "Label": "set",
        "Title": "X-Trace Task",
        "Host": "pinky19.mpi-sws.org",
        "HRT": 26966541505044760,
        "Operation": "set",
        "Timestamp": "1557750181445.420654",
        "TenantClass": 0,
        "Source": "Server.java:2071",
        "ThreadID": 56,
        "ThreadName": "",
        "EventID": "27B2092BC331221A",
        "BaggageBytes": "[[248 5] [240 0] [0 190 157 74 53 29 175 184 228] [240 1] [0 15 142 102 123 136 69 183 165] [240 3] [0 2]]",
        "ProcessID": 2171
      },
      {
        "Cycles": 0,
        "Agent": "org.apache.hadoop.hdfs.server.namenode.FSNamesystem.audit",
        "ProcessName": "Name",
        "TaskID": "BE9D4A351DAFB8E4",
        "ParentEventID": [
          "7867138B313EF42D"
        ],
        "Label": "allowed=true\tugi=plascas (auth:SIMPLE)\tip=/139.19.171.63\tcmd=open\tsrc=/ds/HzqutUsRKtLT5dlt\tdst=null\tperm=null\tproto=rpc",
        "Title": "X-Trace Task",
        "Host": "pinky19.mpi-sws.org",
        "HRT": 26966541505151386,
        "Timestamp": "1557750181445.527344",
        "TenantClass": 0,
        "Source": "FSNamesystem.java:8313",
        "ThreadID": 56,
        "ThreadName": "",
        "EventID": "43CBF6A36C570EB7",
        "BaggageBytes": "[[248 5] [240 0] [0 190 157 74 53 29 175 184 228] [240 1] [0 120 103 19 139 49 62 244 45] [240 3] [0 2]]",
        "ProcessID": 2171
      },
      {
        "Cycles": 0,
        "Agent": "Execution-CPU",
        "ProcessName": "Name",
        "TaskID": "BE9D4A351DAFB8E4",
        "ParentEventID": [
          "FFF723AFE885DFD2"
        ],
        "Label": "set",
        "Title": "X-Trace Task",
        "Host": "pinky19.mpi-sws.org",
        "HRT": 26966541504959791,
        "Operation": "set",
        "Timestamp": "1557750181445.335693",
        "TenantClass": 0,
        "Source": "Server.java:1840",
        "ThreadID": 48,
        "ThreadName": "",
        "EventID": "B966E25DFF43FD45",
        "BaggageBytes": "[[248 5] [240 0] [0 190 157 74 53 29 175 184 228] [240 1] [0 255 247 35 175 232 133 223 210] [240 3] [0 2]]",
        "ProcessID": 2171
      },
      {
        "Cycles": 0,
        "Agent": "edu.brown.cs.systems.xtrace.logging.BaggageWrappers",
        "ProcessName": "Name",
        "TaskID": "BE9D4A351DAFB8E4",
        "ParentEventID": [
          "43CBF6A36C570EB7"
        ],
        "Label": "Forking current baggage with Baggage.fork()",
        "Title": "X-Trace Task",
        "Host": "pinky19.mpi-sws.org",
        "HRT": 26966541505217692,
        "Operation": "fork",
        "Timestamp": "1557750181445.593506",
        "TenantClass": 0,
        "Source": "Server.java:2398",
        "ThreadID": 56,
        "ThreadName": "",
        "EventID": "FB2B9724800D288D",
        "BaggageBytes": "[[248 5] [240 0] [0 190 157 74 53 29 175 184 228] [240 1] [0 67 203 246 163 108 87 14 183] [240 3] [0 2]]",
        "ProcessID": 2171
      },
      {
        "Cycles": 0,
        "Agent": "Execution-CPU",
        "ProcessName": "Read",
        "TaskID": "BE9D4A351DAFB8E4",
        "ParentEventID": [
          "FB2B9724800D288D"
        ],
        "Label": "set",
        "Title": "X-Trace Task",
        "Host": "pinky19.mpi-sws.org",
        "HRT": 26966541505412891,
        "Operation": "set",
        "Timestamp": "1557750181445.774658",
        "TenantClass": 0,
        "Source": "Client.java:302",
        "ThreadID": 40,
        "ThreadName": "",
        "EventID": "F6D20F71A1D33518",
        "ProcessID": 2801
      },
      {
        "Cycles": 0,
        "Agent": "Execution-CPU",
        "ProcessName": "Name",
        "TaskID": "BE9D4A351DAFB8E4",
        "ParentEventID": [
          "FB2B9724800D288D"
        ],
        "Label": "unset",
        "Title": "X-Trace Task",
        "Host": "pinky19.mpi-sws.org",
        "Duration": "274258",
        "HRT": 26966541505344061,
        "Operation": "unset",
        "Timestamp": "1557750181445.719971",
        "TenantClass": 0,
        "Source": "Server.java:1058",
        "ThreadID": 56,
        "ThreadName": "",
        "EventID": "482426AADD1657AE",
        "BaggageBytes": "[[248 5] [240 0] [0 190 157 74 53 29 175 184 228] [240 1] [0 251 43 151 36 128 13 40 141] [240 3] [0 2]]",
        "ProcessID": 2171
      },
      {
        "Cycles": 0,
        "Agent": "Execution-CPU",
        "ProcessName": "Read",
        "TaskID": "BE9D4A351DAFB8E4",
        "ParentEventID": [
          "F6D20F71A1D33518"
        ],
        "Label": "unset",
        "Title": "X-Trace Task",
        "Host": "pinky19.mpi-sws.org",
        "Duration": "17158",
        "HRT": 26966541505445769,
        "Operation": "unset",
        "Timestamp": "1557750181445.807617",
        "TenantClass": 0,
        "Source": "Client.java:1168",
        "ThreadID": 40,
        "ThreadName": "",
        "EventID": "41B95E40E1CD2774",
        "ProcessID": 2801
      },
      {
        "Cycles": 0,
        "Agent": "edu.brown.cs.systems.xtrace.logging.BaggageWrappers",
        "ProcessName": "Read",
        "TaskID": "BE9D4A351DAFB8E4",
        "ParentEventID": [
          "41B95E40E1CD2774",
          "C61F3C4343E9809E"
        ],
        "Label": "Merged current baggage with other baggage",
        "Title": "X-Trace Task",
        "Host": "pinky19.mpi-sws.org",
        "HRT": 26966541505491160,
        "Operation": "join",
        "Timestamp": "1557750181445.853027",
        "TenantClass": 0,
        "Source": "Client.java:1545",
        "ThreadID": 1,
        "ThreadName": "",
        "EventID": "F048D6173EACC343",
        "ProcessID": 2801
      },
      {
        "Cycles": 0,
        "Agent": "org.apache.hadoop.ipc.Server",
        "ProcessName": "Name",
        "TaskID": "BE9D4A351DAFB8E4",
        "ParentEventID": [
          "27B2092BC331221A"
        ],
        "Label": "getBlockLocations in org.apache.hadoop.hdfs.protocol.ClientProtocol",
        "Title": "X-Trace Task",
        "Host": "pinky19.mpi-sws.org",
        "HRT": 26966541505085808,
        "Timestamp": "1557750181445.461670",
        "TenantClass": 0,
        "Source": "ProtobufRpcEngine.java:601",
        "ThreadID": 56,
        "ThreadName": "",
        "EventID": "7867138B313EF42D",
        "BaggageBytes": "[[248 5] [240 0] [0 190 157 74 53 29 175 184 228] [240 1] [0 39 178 9 43 195 49 34 26] [240 3] [0 2]]",
        "ProcessID": 2171
      },
      {
        "Cycles": 0,
        "Agent": "org.apache.hadoop.ipc.ProtobufRpcEngine",
        "ProcessName": "Read",
        "TaskID": "BE9D4A351DAFB8E4",
        "ParentEventID": [
          "F048D6173EACC343"
        ],
        "Label": "org.apache.hadoop.hdfs.protocol.ClientProtocol.getBlockLocations completed",
        "Title": "X-Trace Task",
        "Host": "pinky19.mpi-sws.org",
        "HRT": 26966541505554887,
        "Timestamp": "1557750181445.916748",
        "TenantClass": 0,
        "Source": "ProtobufRpcEngine.java:275",
        "ThreadID": 1,
        "ThreadName": "",
        "EventID": "6D2384B255B490D1",
        "ProcessID": 2801
      },
      {
        "Cycles": 0,
        "Agent": "edu.brown.cs.systems.xtrace.logging.BaggageWrappers",
        "ProcessName": "Read",
        "TaskID": "BE9D4A351DAFB8E4",
        "ParentEventID": [
          "F42BDDEDA3BB0CF1"
        ],
        "Label": "Forking current baggage with Baggage.fork()",
        "Title": "X-Trace Task",
        "Host": "pinky19.mpi-sws.org",
        "HRT": 26966541505922911,
        "Operation": "fork",
        "Timestamp": "1557750181446.284668",
        "TenantClass": 0,
        "Source": "DataTransferProtoUtil.java:94",
        "ThreadID": 1,
        "ThreadName": "",
        "EventID": "AD34C8694A09A3ED",
        "ProcessID": 2801
      },
      {
        "Cycles": 0,
        "Agent": "Execution-Sleep",
        "ProcessName": "Read",
        "TaskID": "BE9D4A351DAFB8E4",
        "ParentEventID": [
          "05F9F27EFAC0CF35"
        ],
        "Label": "waited",
        "Title": "X-Trace Task",
        "Host": "pinky19.mpi-sws.org",
        "Duration": "501700",
        "HRT": 26966541505467702,
        "Operation": "waited",
        "Timestamp": "1557750181445.829590",
        "TenantClass": 0,
        "Source": "Client.java:1537",
        "ThreadID": 1,
        "ThreadName": "",
        "EventID": "C61F3C4343E9809E",
        "ProcessID": 2801
      },
      {
        "Cycles": 0,
        "Agent": "Execution-CPU",
        "ProcessName": "Data",
        "TaskID": "BE9D4A351DAFB8E4",
        "ParentEventID": [
          "AD34C8694A09A3ED"
        ],
        "Label": "set",
        "Title": "X-Trace Task",
        "Host": "pinky22.mpi-sws.org",
        "HRT": 47516513760517119,
        "Operation": "set",
        "Timestamp": "1557750181446.543213",
        "TenantClass": 0,
        "Source": "Receiver.java:117",
        "ThreadID": 15179,
        "ThreadName": "",
        "EventID": "E4E471D813C5E1B5",
        "BaggageBytes": "[[248 5] [240 0] [0 190 157 74 53 29 175 184 228] [240 1] [0 173 52 200 105 74 9 163 237] [240 3] [0 2]]",
        "ProcessID": 28841
      },
      {
        "Cycles": 0,
        "Agent": "edu.brown.cs.systems.xtrace.logging.BaggageWrappers",
        "ProcessName": "Data",
        "TaskID": "BE9D4A351DAFB8E4",
        "ParentEventID": [
          "59CFDD8AAB991615"
        ],
        "Label": "Forking current baggage with Baggage.fork()",
        "Title": "X-Trace Task",
        "Host": "pinky22.mpi-sws.org",
        "HRT": 47516513760736422,
        "Operation": "fork",
        "Timestamp": "1557750181446.762695",
        "TenantClass": 0,
        "Source": "DataXceiver.java:1257",
        "ThreadID": 15179,
        "ThreadName": "",
        "EventID": "ADB9BD90326B10AF",
        "BaggageBytes": "[[248 5] [240 0] [0 190 157 74 53 29 175 184 228] [240 1] [0 89 207 221 138 171 153 22 21] [240 3] [0 2]]",
        "ProcessID": 28841
      },
      {
        "Cycles": 0,
        "Agent": "edu.brown.cs.systems.xtrace.logging.XTraceInit",
        "ProcessName": "Data",
        "TaskID": "BE9D4A351DAFB8E4",
        "ParentEventID": [
          "E4E471D813C5E1B5"
        ],
        "Label": "Thread.setName: DataXceiver for client DFSClient_NONMAPREDUCE_310321604_1 at /139.19.171.63:45898 [Sending block BP-1633380353-139.19.171.63-1554193446451:blk_1073761715_20891]",
        "Title": "X-Trace Task",
        "Host": "pinky22.mpi-sws.org",
        "HRT": 47516513760589073,
        "Timestamp": "1557750181446.615234",
        "TenantClass": 0,
        "Source": "DataXceiver.java:168",
        "ThreadID": 15179,
        "ThreadName": "",
        "EventID": "59CFDD8AAB991615",
        "BaggageBytes": "[[248 5] [240 0] [0 190 157 74 53 29 175 184 228] [240 1] [0 228 228 113 216 19 197 225 181] [240 3] [0 2]]",
        "ProcessID": 28841
      },
      {
        "Cycles": 0,
        "Agent": "edu.brown.cs.systems.xtrace.logging.BaggageWrappers",
        "ProcessName": "Data",
        "TaskID": "BE9D4A351DAFB8E4",
        "ParentEventID": [
          "ADB9BD90326B10AF"
        ],
        "Label": "Forking current baggage with Baggage.fork()",
        "Title": "X-Trace Task",
        "Host": "pinky22.mpi-sws.org",
        "HRT": 47516513760839167,
        "Operation": "fork",
        "Timestamp": "1557750181446.865234",
        "TenantClass": 0,
        "Source": "PacketHeader.java:95",
        "ThreadID": 15179,
        "ThreadName": "",
        "EventID": "210CAF0C6C2EC683",
        "BaggageBytes": "[[248 5] [240 0] [0 190 157 74 53 29 175 184 228] [240 1] [0 173 185 189 144 50 107 16 175] [240 3] [0 2]]",
        "ProcessID": 28841
      },
      {
        "Cycles": 0,
        "Agent": "edu.brown.cs.systems.xtrace.logging.BaggageWrappers",
        "ProcessName": "Read",
        "TaskID": "BE9D4A351DAFB8E4",
        "ParentEventID": [
          "1A9168E46E585300",
          "ADB9BD90326B10AF"
        ],
        "Label": "Merged current baggage with other baggage",
        "Title": "X-Trace Task",
        "Host": "pinky19.mpi-sws.org",
        "HRT": 26966541506659521,
        "Operation": "join",
        "Timestamp": "1557750181447.021240",
        "TenantClass": 0,
        "Source": "RemoteBlockReader2.java:429",
        "ThreadID": 1,
        "ThreadName": "",
        "EventID": "70A94F8E3D217CDE",
        "ProcessID": 2801
      },
      {
        "Cycles": 0,
        "Agent": "Execution-Sleep",
        "ProcessName": "Read",
        "TaskID": "BE9D4A351DAFB8E4",
        "ParentEventID": [
          "6D2384B255B490D1"
        ],
        "Label": "waited",
        "Title": "X-Trace Task",
        "Host": "pinky19.mpi-sws.org",
        "Duration": "127858",
        "HRT": 26966541505845631,
        "Operation": "waited",
        "Timestamp": "1557750181446.207520",
        "TenantClass": 0,
        "Source": "SocketIOWithTimeout.java:335",
        "ThreadID": 1,
        "ThreadName": "",
        "EventID": "F42BDDEDA3BB0CF1",
        "ProcessID": 2801
      },
      {
        "Cycles": 0,
        "Agent": "Execution-Sleep",
        "ProcessName": "Data",
        "TaskID": "BE9D4A351DAFB8E4",
        "ParentEventID": [
          "210CAF0C6C2EC683"
        ],
        "Label": "waited",
        "Title": "X-Trace Task",
        "Host": "pinky22.mpi-sws.org",
        "Duration": "8962",
        "HRT": 47516513760934580,
        "Operation": "waited",
        "Timestamp": "1557750181446.960693",
        "TenantClass": 0,
        "Source": "SocketIOWithTimeout.java:335",
        "ThreadID": 15179,
        "ThreadName": "",
        "EventID": "7F320775881B6A48",
        "BaggageBytes": "[[248 5] [240 0] [0 190 157 74 53 29 175 184 228] [240 1] [0 33 12 175 12 108 46 198 131] [240 3] [0 2]]",
        "ProcessID": 28841
      },
      {
        "Cycles": 0,
        "Agent": "Execution-Sleep",
        "ProcessName": "Read",
        "TaskID": "BE9D4A351DAFB8E4",
        "ParentEventID": [
          "70A94F8E3D217CDE"
        ],
        "Label": "waited",
        "Title": "X-Trace Task",
        "Host": "pinky19.mpi-sws.org",
        "Duration": "221090",
        "HRT": 26966541506989814,
        "Operation": "waited",
        "Timestamp": "1557750181447.351562",
        "TenantClass": 0,
        "Source": "SocketIOWithTimeout.java:335",
        "ThreadID": 1,
        "ThreadName": "",
        "EventID": "BFFFF5E4251D51F7",
        "ProcessID": 2801
      },
      {
        "Cycles": 0,
        "Agent": "Execution-Sleep",
        "ProcessName": "Read",
        "TaskID": "BE9D4A351DAFB8E4",
        "ParentEventID": [
          "AD34C8694A09A3ED"
        ],
        "Label": "waited",
        "Title": "X-Trace Task",
        "Host": "pinky19.mpi-sws.org",
        "Duration": "513328",
        "HRT": 26966541506557285,
        "Operation": "waited",
        "Timestamp": "1557750181446.919189",
        "TenantClass": 0,
        "Source": "SocketIOWithTimeout.java:335",
        "ThreadID": 1,
        "ThreadName": "",
        "EventID": "1A9168E46E585300",
        "ProcessID": 2801
      },
      {
        "Cycles": 0,
        "Agent": "Execution-Sleep",
        "ProcessName": "Read",
        "TaskID": "BE9D4A351DAFB8E4",
        "ParentEventID": [
          "BFFFF5E4251D51F7"
        ],
        "Label": "waited",
        "Title": "X-Trace Task",
        "Host": "pinky19.mpi-sws.org",
        "Duration": "224677",
        "HRT": 26966541507271462,
        "Operation": "waited",
        "Timestamp": "1557750181447.633301",
        "TenantClass": 0,
        "Source": "SocketIOWithTimeout.java:335",
        "ThreadID": 1,
        "ThreadName": "",
        "EventID": "1C0DF2005A9E333B",
        "ProcessID": 2801
      },
      {
        "Cycles": 0,
        "Agent": "edu.brown.cs.systems.xtrace.logging.BaggageWrappers",
        "ProcessName": "Read",
        "TaskID": "BE9D4A351DAFB8E4",
        "ParentEventID": [
          "210CAF0C6C2EC683",
          "C694529215DD0775"
        ],
        "Label": "Merged current baggage with other baggage",
        "Title": "X-Trace Task",
        "Host": "pinky19.mpi-sws.org",
        "HRT": 26966541507556072,
        "Operation": "join",
        "Timestamp": "1557750181447.917969",
        "TenantClass": 0,
        "Source": "PacketHeader.java:168",
        "ThreadID": 1,
        "ThreadName": "",
        "EventID": "6700EEDEF6098E73",
        "ProcessID": 2801
      },
      {
        "Cycles": 0,
        "Agent": "Execution-Sleep",
        "ProcessName": "Read",
        "TaskID": "BE9D4A351DAFB8E4",
        "ParentEventID": [
          "1C0DF2005A9E333B"
        ],
        "Label": "waited",
        "Title": "X-Trace Task",
        "Host": "pinky19.mpi-sws.org",
        "Duration": "137473",
        "HRT": 26966541507476259,
        "Operation": "waited",
        "Timestamp": "1557750181447.838135",
        "TenantClass": 0,
        "Source": "SocketIOWithTimeout.java:335",
        "ThreadID": 1,
        "ThreadName": "",
        "EventID": "C694529215DD0775",
        "ProcessID": 2801
      },
      {
        "Cycles": 0,
        "Agent": "edu.brown.cs.systems.xtrace.logging.BaggageWrappers",
        "ProcessName": "Read",
        "TaskID": "BE9D4A351DAFB8E4",
        "ParentEventID": [
          "BC4568C309261B2A",
          "6700EEDEF6098E73"
        ],
        "Label": "Merged current baggage with other baggage",
        "Title": "X-Trace Task",
        "Host": "pinky19.mpi-sws.org",
        "HRT": 26966541507668902,
        "Operation": "join",
        "Timestamp": "1557750181448.030762",
        "TenantClass": 0,
        "Source": "PacketHeader.java:168",
        "ThreadID": 1,
        "ThreadName": "",
        "EventID": "B5AF286E14882289",
        "ProcessID": 2801
      },
      {
        "Cycles": 0,
        "Agent": "edu.brown.cs.systems.xtrace.logging.BaggageWrappers",
        "ProcessName": "Read",
        "TaskID": "BE9D4A351DAFB8E4",
        "ParentEventID": [
          "5F643851E8016045"
        ],
        "Label": "Forking current baggage with Baggage.fork()",
        "Title": "X-Trace Task",
        "Host": "pinky19.mpi-sws.org",
        "HRT": 26966541507793015,
        "Operation": "fork",
        "Timestamp": "1557750181448.154785",
        "TenantClass": 0,
        "Source": "DataTransferProtoUtil.java:94",
        "ThreadID": 1,
        "ThreadName": "",
        "EventID": "3A0BB832E966A541",
        "ProcessID": 2801
      },
      {
        "Cycles": 0,
        "Agent": "edu.brown.cs.systems.xtrace.logging.BaggageWrappers",
        "ProcessName": "Data",
        "TaskID": "BE9D4A351DAFB8E4",
        "ParentEventID": [
          "7F320775881B6A48"
        ],
        "Label": "Forking current baggage with Baggage.fork()",
        "Title": "X-Trace Task",
        "Host": "pinky22.mpi-sws.org",
        "HRT": 47516513761044318,
        "Operation": "fork",
        "Timestamp": "1557750181447.070557",
        "TenantClass": 0,
        "Source": "PacketHeader.java:95",
        "ThreadID": 15179,
        "ThreadName": "",
        "EventID": "BC4568C309261B2A",
        "BaggageBytes": "[[248 5] [240 0] [0 190 157 74 53 29 175 184 228] [240 1] [0 127 50 7 117 136 27 106 72] [240 3] [0 2]]",
        "ProcessID": 28841
      },
      {
        "Cycles": 0,
        "Agent": "Execution-Sleep",
        "ProcessName": "Data",
        "TaskID": "BE9D4A351DAFB8E4",
        "ParentEventID": [
          "BC4568C309261B2A"
        ],
        "Label": "waited",
        "Title": "X-Trace Task",
        "Host": "pinky22.mpi-sws.org",
        "Duration": "935064",
        "HRT": 47516513762095817,
        "Operation": "waited",
        "Timestamp": "1557750181448.122070",
        "TenantClass": 0,
        "Source": "SocketIOWithTimeout.java:335",
        "ThreadID": 15179,
        "ThreadName": "",
        "EventID": "98C245F57F4A12DA",
        "BaggageBytes": "[[248 5] [240 0] [0 190 157 74 53 29 175 184 228] [240 1] [0 188 69 104 195 9 38 27 42] [240 3] [0 2]]",
        "ProcessID": 28841
      },
      {
        "Cycles": 0,
        "Agent": "Execution-CPU",
        "ProcessName": "Data",
        "TaskID": "BE9D4A351DAFB8E4",
        "ParentEventID": [
          "D478C96FD75C0C2D"
        ],
        "Label": "unset",
        "Title": "X-Trace Task",
        "Host": "pinky22.mpi-sws.org",
        "Duration": "1817037",
        "HRT": 47516513762385875,
        "Operation": "unset",
        "Timestamp": "1557750181448.412109",
        "TenantClass": 0,
        "Source": "DataXceiver.java:261",
        "ThreadID": 15179,
        "ThreadName": "",
        "EventID": "EEFBB0C2D60DB0DE",
        "BaggageBytes": "[[248 5] [240 0] [0 190 157 74 53 29 175 184 228] [240 1] [0 212 120 201 111 215 92 12 45] [240 3] [0 2]]",
        "ProcessID": 28841
      },
      {
        "Cycles": 0,
        "Agent": "edu.brown.cs.systems.xtrace.logging.BaggageWrappers",
        "ProcessName": "Read",
        "TaskID": "BE9D4A351DAFB8E4",
        "ParentEventID": [
          "B5AF286E14882289"
        ],
        "Label": "Forking current baggage with Baggage.fork()",
        "Title": "X-Trace Task",
        "Host": "pinky19.mpi-sws.org",
        "HRT": 26966541507683463,
        "Operation": "fork",
        "Timestamp": "1557750181448.045166",
        "TenantClass": 0,
        "Source": "RemoteBlockReader2.java:361",
        "ThreadID": 1,
        "ThreadName": "",
        "EventID": "5F643851E8016045",
        "ProcessID": 2801
      },
      {
        "Cycles": 0,
        "Agent": "Execution-CPU",
        "ProcessName": "Data",
        "TaskID": "BE9D4A351DAFB8E4",
        "ParentEventID": [
          "3A0BB832E966A541"
        ],
        "Label": "set",
        "Title": "X-Trace Task",
        "Host": "pinky22.mpi-sws.org",
        "HRT": 47516513762460528,
        "Operation": "set",
        "Timestamp": "1557750181448.486572",
        "TenantClass": 0,
        "Source": "Receiver.java:117",
        "ThreadID": 15179,
        "ThreadName": "",
        "EventID": "26A13DC738CB142F",
        "BaggageBytes": "[[248 5] [240 0] [0 190 157 74 53 29 175 184 228] [240 1] [0 58 11 184 50 233 102 165 65] [240 3] [0 2]]",
        "ProcessID": 28841
      },
      {
        "Cycles": 0,
        "Agent": "edu.brown.cs.systems.xtrace.logging.BaggageWrappers",
        "ProcessName": "Data",
        "TaskID": "BE9D4A351DAFB8E4",
        "ParentEventID": [
          "760D63423B68697E"
        ],
        "Label": "Forking current baggage with Baggage.fork()",
        "Title": "X-Trace Task",
        "Host": "pinky22.mpi-sws.org",
        "HRT": 47516513762774426,
        "Operation": "fork",
        "Timestamp": "1557750181448.800537",
        "TenantClass": 0,
        "Source": "DataXceiver.java:1257",
        "ThreadID": 15179,
        "ThreadName": "",
        "EventID": "58B86372B66F9106",
        "BaggageBytes": "[[248 5] [240 0] [0 190 157 74 53 29 175 184 228] [240 1] [0 118 13 99 66 59 104 105 126] [240 3] [0 2]]",
        "ProcessID": 28841
      },
      {
        "Cycles": 0,
        "Agent": "edu.brown.cs.systems.xtrace.logging.BaggageWrappers",
        "ProcessName": "Data",
        "TaskID": "BE9D4A351DAFB8E4",
        "ParentEventID": [
          "98C245F57F4A12DA",
          "5F643851E8016045"
        ],
        "Label": "Merged current baggage with other baggage",
        "Title": "X-Trace Task",
        "Host": "pinky22.mpi-sws.org",
        "HRT": 47516513762305178,
        "Operation": "join",
        "Timestamp": "1557750181448.331299",
        "TenantClass": 0,
        "Source": "DataXceiver.java:574",
        "ThreadID": 15179,
        "ThreadName": "",
        "EventID": "D478C96FD75C0C2D",
        "BaggageBytes": "[[248 5] [240 0] [0 190 157 74 53 29 175 184 228] [240 1] [0 152 194 69 245 127 74 18 218] [0 95 100 56 81 232 1 96 69] [240 3] [0 2]]",
        "ProcessID": 28841
      },
      {
        "Cycles": 0,
        "Agent": "Execution-Sleep",
        "ProcessName": "Read",
        "TaskID": "BE9D4A351DAFB8E4",
        "ParentEventID": [
          "3A0BB832E966A541"
        ],
        "Label": "waited",
        "Title": "X-Trace Task",
        "Host": "pinky19.mpi-sws.org",
        "Duration": "732111",
        "HRT": 26966541508626804,
        "Operation": "waited",
        "Timestamp": "1557750181448.988525",
        "TenantClass": 0,
        "Source": "SocketIOWithTimeout.java:335",
        "ThreadID": 1,
        "ThreadName": "",
        "EventID": "6B823782ABAA9275",
        "ProcessID": 2801
      },
      {
        "Cycles": 0,
        "Agent": "edu.brown.cs.systems.xtrace.logging.BaggageWrappers",
        "ProcessName": "Data",
        "TaskID": "BE9D4A351DAFB8E4",
        "ParentEventID": [
          "58B86372B66F9106"
        ],
        "Label": "Forking current baggage with Baggage.fork()",
        "Title": "X-Trace Task",
        "Host": "pinky22.mpi-sws.org",
        "HRT": 47516513762931239,
        "Operation": "fork",
        "Timestamp": "1557750181448.957520",
        "TenantClass": 0,
        "Source": "PacketHeader.java:95",
        "ThreadID": 15179,
        "ThreadName": "",
        "EventID": "94D34128AD3A9268",
        "BaggageBytes": "[[248 5] [240 0] [0 190 157 74 53 29 175 184 228] [240 1] [0 88 184 99 114 182 111 145 6] [240 3] [0 2]]",
        "ProcessID": 28841
      },
      {
        "Cycles": 0,
        "Agent": "edu.brown.cs.systems.xtrace.logging.XTraceInit",
        "ProcessName": "Data",
        "TaskID": "BE9D4A351DAFB8E4",
        "ParentEventID": [
          "26A13DC738CB142F"
        ],
        "Label": "Thread.setName: DataXceiver for client DFSClient_NONMAPREDUCE_310321604_1 at /139.19.171.63:45898 [Sending block BP-1633380353-139.19.171.63-1554193446451:blk_1073761715_20891]",
        "Title": "X-Trace Task",
        "Host": "pinky22.mpi-sws.org",
        "HRT": 47516513762552815,
        "Timestamp": "1557750181448.578857",
        "TenantClass": 0,
        "Source": "DataXceiver.java:168",
        "ThreadID": 15179,
        "ThreadName": "",
        "EventID": "760D63423B68697E",
        "BaggageBytes": "[[248 5] [240 0] [0 190 157 74 53 29 175 184 228] [240 1] [0 38 161 61 199 56 203 20 47] [240 3] [0 2]]",
        "ProcessID": 28841
      },
      {
        "Cycles": 0,
        "Agent": "Execution-Sleep",
        "ProcessName": "Data",
        "TaskID": "BE9D4A351DAFB8E4",
        "ParentEventID": [
          "94D34128AD3A9268"
        ],
        "Label": "waited",
        "Title": "X-Trace Task",
        "Host": "pinky22.mpi-sws.org",
        "Duration": "9110",
        "HRT": 47516513763066243,
        "Operation": "waited",
        "Timestamp": "1557750181449.092285",
        "TenantClass": 0,
        "Source": "SocketIOWithTimeout.java:335",
        "ThreadID": 15179,
        "ThreadName": "",
        "EventID": "CD41385CC344FBAE",
        "BaggageBytes": "[[248 5] [240 0] [0 190 157 74 53 29 175 184 228] [240 1] [0 148 211 65 40 173 58 146 104] [240 3] [0 2]]",
        "ProcessID": 28841
      },
      {
        "Cycles": 0,
        "Agent": "edu.brown.cs.systems.xtrace.logging.BaggageWrappers",
        "ProcessName": "Data",
        "TaskID": "BE9D4A351DAFB8E4",
        "ParentEventID": [
          "CD41385CC344FBAE"
        ],
        "Label": "Forking current baggage with Baggage.fork()",
        "Title": "X-Trace Task",
        "Host": "pinky22.mpi-sws.org",
        "HRT": 47516513763246464,
        "Operation": "fork",
        "Timestamp": "1557750181449.272705",
        "TenantClass": 0,
        "Source": "PacketHeader.java:95",
        "ThreadID": 15179,
        "ThreadName": "",
        "EventID": "D7DC0162E1CE2CE4",
        "BaggageBytes": "[[248 5] [240 0] [0 190 157 74 53 29 175 184 228] [240 1] [0 205 65 56 92 195 68 251 174] [240 3] [0 2]]",
        "ProcessID": 28841
      },
      {
        "Cycles": 0,
        "Agent": "edu.brown.cs.systems.xtrace.logging.BaggageWrappers",
        "ProcessName": "Read",
        "TaskID": "BE9D4A351DAFB8E4",
        "ParentEventID": [
          "6B823782ABAA9275",
          "58B86372B66F9106"
        ],
        "Label": "Merged current baggage with other baggage",
        "Title": "X-Trace Task",
        "Host": "pinky19.mpi-sws.org",
        "HRT": 26966541508701616,
        "Operation": "join",
        "Timestamp": "1557750181449.063477",
        "TenantClass": 0,
        "Source": "RemoteBlockReader2.java:429",
        "ThreadID": 1,
        "ThreadName": "",
        "EventID": "C7FC677F97518B80",
        "ProcessID": 2801
      },
      {
        "Cycles": 0,
        "Agent": "Execution-Sleep",
        "ProcessName": "Read",
        "TaskID": "BE9D4A351DAFB8E4",
        "ParentEventID": [
          "9FEC4CEE0C5ADBBC"
        ],
        "Label": "waited",
        "Title": "X-Trace Task",
        "Host": "pinky19.mpi-sws.org",
        "Duration": "155782",
        "HRT": 26966541509399009,
        "Operation": "waited",
        "Timestamp": "1557750181449.760742",
        "TenantClass": 0,
        "Source": "SocketIOWithTimeout.java:335",
        "ThreadID": 1,
        "ThreadName": "",
        "EventID": "6E3004B9A2DF8B14",
        "ProcessID": 2801
      },
      {
        "Cycles": 0,
        "Agent": "Execution-Sleep",
        "ProcessName": "Read",
        "TaskID": "BE9D4A351DAFB8E4",
        "ParentEventID": [
          "6E3004B9A2DF8B14"
        ],
        "Label": "waited",
        "Title": "X-Trace Task",
        "Host": "pinky19.mpi-sws.org",
        "Duration": "103013",
        "HRT": 26966541509555223,
        "Operation": "waited",
        "Timestamp": "1557750181449.916992",
        "TenantClass": 0,
        "Source": "SocketIOWithTimeout.java:335",
        "ThreadID": 1,
        "ThreadName": "",
        "EventID": "AC8A90DB2DF44FFF",
        "ProcessID": 2801
      },
      {
        "Cycles": 0,
        "Agent": "Execution-Sleep",
        "ProcessName": "Read",
        "TaskID": "BE9D4A351DAFB8E4",
        "ParentEventID": [
          "C7FC677F97518B80"
        ],
        "Label": "waited",
        "Title": "X-Trace Task",
        "Host": "pinky19.mpi-sws.org",
        "Duration": "370762",
        "HRT": 26966541509189889,
        "Operation": "waited",
        "Timestamp": "1557750181449.551758",
        "TenantClass": 0,
        "Source": "SocketIOWithTimeout.java:335",
        "ThreadID": 1,
        "ThreadName": "",
        "EventID": "9FEC4CEE0C5ADBBC",
        "ProcessID": 2801
      },
      {
        "Cycles": 0,
        "Agent": "edu.brown.cs.systems.xtrace.logging.BaggageWrappers",
        "ProcessName": "Read",
        "TaskID": "BE9D4A351DAFB8E4",
        "ParentEventID": [
          "AC8A90DB2DF44FFF",
          "94D34128AD3A9268"
        ],
        "Label": "Merged current baggage with other baggage",
        "Title": "X-Trace Task",
        "Host": "pinky19.mpi-sws.org",
        "HRT": 26966541509607764,
        "Operation": "join",
        "Timestamp": "1557750181449.969482",
        "TenantClass": 0,
        "Source": "PacketHeader.java:168",
        "ThreadID": 1,
        "ThreadName": "",
        "EventID": "B02CE52EB7154107",
        "ProcessID": 2801
      },
      {
        "Cycles": 0,
        "Agent": "Execution-Sleep",
        "ProcessName": "Data",
        "TaskID": "BE9D4A351DAFB8E4",
        "ParentEventID": [
          "EE0A833680367E28"
        ],
        "Label": "waited",
        "Title": "X-Trace Task",
        "Host": "pinky22.mpi-sws.org",
        "Duration": "7867",
        "HRT": 47516513763824162,
        "Operation": "waited",
        "Timestamp": "1557750181449.850342",
        "TenantClass": 0,
        "Source": "SocketIOWithTimeout.java:335",
        "ThreadID": 15179,
        "ThreadName": "",
        "EventID": "2C66FA0FB9AA18A2",
        "BaggageBytes": "[[248 5] [240 0] [0 190 157 74 53 29 175 184 228] [240 1] [0 238 10 131 54 128 54 126 40] [240 3] [0 2]]",
        "ProcessID": 28841
      },
      {
        "Cycles": 0,
        "Agent": "Execution-Sleep",
        "ProcessName": "Data",
        "TaskID": "BE9D4A351DAFB8E4",
        "ParentEventID": [
          "D7DC0162E1CE2CE4"
        ],
        "Label": "waited",
        "Title": "X-Trace Task",
        "Host": "pinky22.mpi-sws.org",
        "Duration": "193617",
        "HRT": 47516513763540848,
        "Operation": "waited",
        "Timestamp": "1557750181449.566895",
        "TenantClass": 0,
        "Source": "SocketIOWithTimeout.java:335",
        "ThreadID": 15179,
        "ThreadName": "",
        "EventID": "B2AF7A2CB0CA2B7F",
        "BaggageBytes": "[[248 5] [240 0] [0 190 157 74 53 29 175 184 228] [240 1] [0 215 220 1 98 225 206 44 228] [240 3] [0 2]]",
        "ProcessID": 28841
      },
      {
        "Cycles": 0,
        "Agent": "edu.brown.cs.systems.xtrace.logging.BaggageWrappers",
        "ProcessName": "Data",
        "TaskID": "BE9D4A351DAFB8E4",
        "ParentEventID": [
          "2C66FA0FB9AA18A2"
        ],
        "Label": "Forking current baggage with Baggage.fork()",
        "Title": "X-Trace Task",
        "Host": "pinky22.mpi-sws.org",
        "HRT": 47516513763981679,
        "Operation": "fork",
        "Timestamp": "1557750181450.007812",
        "TenantClass": 0,
        "Source": "PacketHeader.java:95",
        "ThreadID": 15179,
        "ThreadName": "",
        "EventID": "AC14D1A792A058EA",
        "BaggageBytes": "[[248 5] [240 0] [0 190 157 74 53 29 175 184 228] [240 1] [0 44 102 250 15 185 170 24 162] [240 3] [0 2]]",
        "ProcessID": 28841
      },
      {
        "Cycles": 0,
        "Agent": "edu.brown.cs.systems.xtrace.logging.BaggageWrappers",
        "ProcessName": "Data",
        "TaskID": "BE9D4A351DAFB8E4",
        "ParentEventID": [
          "B2AF7A2CB0CA2B7F"
        ],
        "Label": "Forking current baggage with Baggage.fork()",
        "Title": "X-Trace Task",
        "Host": "pinky22.mpi-sws.org",
        "HRT": 47516513763689315,
        "Operation": "fork",
        "Timestamp": "1557750181449.715576",
        "TenantClass": 0,
        "Source": "PacketHeader.java:95",
        "ThreadID": 15179,
        "ThreadName": "",
        "EventID": "EE0A833680367E28",
        "BaggageBytes": "[[248 5] [240 0] [0 190 157 74 53 29 175 184 228] [240 1] [0 178 175 122 44 176 202 43 127] [240 3] [0 2]]",
        "ProcessID": 28841
      },
      {
        "Cycles": 0,
        "Agent": "Execution-CPU",
        "ProcessName": "Data",
        "TaskID": "BE9D4A351DAFB8E4",
        "ParentEventID": [
          "AC14D1A792A058EA"
        ],
        "Label": "unset",
        "Title": "X-Trace Task",
        "Host": "pinky22.mpi-sws.org",
        "Duration": "1822008",
        "HRT": 47516513764350250,
        "Operation": "unset",
        "Timestamp": "1557750181450.376465",
        "TenantClass": 0,
        "Source": "DataXceiver.java:261",
        "ThreadID": 15179,
        "ThreadName": "",
        "EventID": "4D75E8BBAF09D1C1",
        "BaggageBytes": "[[248 5] [240 0] [0 190 157 74 53 29 175 184 228] [240 1] [0 172 20 209 167 146 160 88 234] [240 3] [0 2]]",
        "ProcessID": 28841
      }
    ]
  }
]