[
  {
    "id": "48F0B0536157CEB9",
    "reports": [
      {
        "Cycles": 0,
        "Agent": "edu.brown.cs.systems.retro.benchmarks.hdfs_client.ReaderRandomSize",
        "ProcessName": "Read",
        "TaskID": "48F0B0536157CEB9",
        "ParentEventID": [
          "8DBE31FA1EE00CE2"
        ],
        "Label": "Reading file",
        "Title": "X-Trace Task",
        "Host": "pinky19.mpi-sws.org",
        "HRT": 27726525160735669,
        "Timestamp": "1558510165098.972900",
        "TenantClass": 0,
        "ThreadID": 1,
        "ThreadName": "",
        "EventID": "A20CADD2AAA4D6E2",
        "ProcessID": 40748
      },
      {
        "Cycles": 0,
        "Agent": "edu.brown.cs.systems.retro.benchmarks.hdfs_client.ReaderRandomSize",
        "ProcessName": "Read",
        "TaskID": "48F0B0536157CEB9",
        "ParentEventID": [
          "0"
        ],
        "Label": "Reading file",
        "Title": "X-Trace Task",
        "Host": "pinky19.mpi-sws.org",
        "HRT": 27726525160717864,
        "Timestamp": "1558510165098.955078",
        "TenantClass": 0,
        "ThreadID": 1,
        "ThreadName": "",
        "EventID": "8DBE31FA1EE00CE2",
        "ProcessID": 40748,
        "Tag": [
          "/home/plascas/tracing-data/traceID-files/reader_small",
          "Read Size: 65536"
        ]
      },
      {
        "Cycles": 0,
        "Agent": "org.apache.hadoop.ipc.ProtobufRpcEngine",
        "ProcessName": "Read",
        "TaskID": "48F0B0536157CEB9",
        "ParentEventID": [
          "A20CADD2AAA4D6E2"
        ],
        "Label": "Invoking org.apache.hadoop.hdfs.protocol.ClientProtocol.getBlockLocations",
        "Title": "X-Trace Task",
        "Host": "pinky19.mpi-sws.org",
        "HRT": 27726525160775673,
        "Timestamp": "1558510165099.012939",
        "TenantClass": 0,
        "Source": "ProtobufRpcEngine.java:228",
        "ThreadID": 1,
        "ThreadName": "",
        "EventID": "0CC98FA45B817DE1",
        "ProcessID": 40748
      },
      {
        "Cycles": 0,
        "Agent": "Execution-CPU",
        "ProcessName": "Read",
        "TaskID": "48F0B0536157CEB9",
        "ParentEventID": [
          "0CC98FA45B817DE1"
        ],
        "Label": "unset",
        "Title": "X-Trace Task",
        "Host": "pinky19.mpi-sws.org",
        "Duration": "22181113",
        "HRT": 27726525160802719,
        "Operation": "unset",
        "Timestamp": "1558510165099.040039",
        "TenantClass": 0,
        "Source": "Client.java:1027",
        "ThreadID": 1,
        "ThreadName": "",
        "EventID": "0CA6BA576EAE18F8",
        "ProcessID": 40748
      },
      {
        "Cycles": 0,
        "Agent": "Execution-CPU",
        "ProcessName": "Read",
        "TaskID": "48F0B0536157CEB9",
        "ParentEventID": [
          "0CA6BA576EAE18F8"
        ],
        "Label": "set",
        "Title": "X-Trace Task",
        "Host": "pinky19.mpi-sws.org",
        "HRT": 27726525160828636,
        "Operation": "set",
        "Timestamp": "1558510165099.065918",
        "TenantClass": 0,
        "Source": "Client.java:1032",
        "ThreadID": 41,
        "ThreadName": "",
        "EventID": "6CE3D6C518DEB6C4",
        "ProcessID": 40748
      },
      {
        "Cycles": 0,
        "Agent": "Execution-CPU",
        "ProcessName": "Read",
        "TaskID": "48F0B0536157CEB9",
        "ParentEventID": [
          "F90F84A507EAB078"
        ],
        "Label": "unset",
        "Title": "X-Trace Task",
        "Host": "pinky19.mpi-sws.org",
        "Duration": "79534",
        "HRT": 27726525160926778,
        "Operation": "unset",
        "Timestamp": "1558510165099.164062",
        "TenantClass": 0,
        "Source": "Client.java:1062",
        "ThreadID": 41,
        "ThreadName": "",
        "EventID": "76A9E8532D7847E6",
        "ProcessID": 40748
      },
      {
        "Cycles": 0,
        "Agent": "Execution-CPU",
        "ProcessName": "Read",
        "TaskID": "48F0B0536157CEB9",
        "ParentEventID": [
          "76A9E8532D7847E6"
        ],
        "Label": "set",
        "Title": "X-Trace Task",
        "Host": "pinky19.mpi-sws.org",
        "HRT": 27726525160951475,
        "Operation": "set",
        "Timestamp": "1558510165099.188721",
        "TenantClass": 0,
        "Source": "Client.java:1104",
        "ThreadID": 1,
        "ThreadName": "",
        "EventID": "1836744CAA38E952",
        "ProcessID": 40748
      },
      {
        "Cycles": 0,
        "Agent": "Execution-CPU",
        "ProcessName": "Name",
        "TaskID": "48F0B0536157CEB9",
        "ParentEventID": [
          "F90F84A507EAB078"
        ],
        "Label": "set",
        "Title": "X-Trace Task",
        "Host": "pinky19.mpi-sws.org",
        "HRT": 27726525161003003,
        "Operation": "set",
        "Timestamp": "1558510165099.531006",
        "TenantClass": 0,
        "Source": "Server.java:1840",
        "ThreadID": 48,
        "ThreadName": "",
        "EventID": "686C2E50B986D7F2",
        "BaggageBytes": "[[248 5] [240 0] [0 72 240 176 83 97 87 206 185] [240 1] [0 249 15 132 165 7 234 176 120] [240 3] [0 2]]",
        "ProcessID": 2171
      },
      {
        "Cycles": 0,
        "Agent": "edu.brown.cs.systems.xtrace.logging.BaggageWrappers",
        "ProcessName": "Read",
        "TaskID": "48F0B0536157CEB9",
        "ParentEventID": [
          "6CE3D6C518DEB6C4"
        ],
        "Label": "Forking current baggage with Baggage.fork()",
        "Title": "X-Trace Task",
        "Host": "pinky19.mpi-sws.org",
        "HRT": 27726525160848411,
        "Operation": "fork",
        "Timestamp": "1558510165099.085693",
        "TenantClass": 0,
        "Source": "Client.java:1043",
        "ThreadID": 41,
        "ThreadName": "",
        "EventID": "F90F84A507EAB078",
        "ProcessID": 40748
      },
      {
        "Cycles": 0,
        "Agent": "edu.brown.cs.systems.xtrace.logging.BaggageWrappers",
        "ProcessName": "Name",
        "TaskID": "48F0B0536157CEB9",
        "ParentEventID": [
          "686C2E50B986D7F2"
        ],
        "Label": "Forking current baggage with Baggage.fork()",
        "Title": "X-Trace Task",
        "Host": "pinky19.mpi-sws.org",
        "HRT": 27726525161033640,
        "Operation": "fork",
        "Timestamp": "1558510165099.561523",
        "TenantClass": 0,
        "Source": "Server.java:550",
        "ThreadID": 48,
        "ThreadName": "",
        "EventID": "77F64FF31ACB6D1F",
        "BaggageBytes": "[[248 5] [240 0] [0 72 240 176 83 97 87 206 185] [240 1] [0 104 108 46 80 185 134 215 242] [240 3] [0 2]]",
        "ProcessID": 2171
      },
      {
        "Cycles": 0,
        "Agent": "Execution-CPU",
        "ProcessName": "Name",
        "TaskID": "48F0B0536157CEB9",
        "ParentEventID": [
          "77F64FF31ACB6D1F"
        ],
        "Label": "set",
        "Title": "X-Trace Task",
        "Host": "pinky19.mpi-sws.org",
        "HRT": 27726525161068095,
        "Operation": "set",
        "Timestamp": "1558510165099.596191",
        "TenantClass": 0,
        "Source": "Server.java:2071",
        "ThreadID": 63,
        "ThreadName": "",
        "EventID": "E92B60F43097860D",
        "BaggageBytes": "[[248 5] [240 0] [0 72 240 176 83 97 87 206 185] [240 1] [0 119 246 79 243 26 203 109 31] [240 3] [0 2]]",
        "ProcessID": 2171
      },
      {
        "Cycles": 0,
        "Agent": "org.apache.hadoop.hdfs.server.namenode.FSNamesystem.audit",
        "ProcessName": "Name",
        "TaskID": "48F0B0536157CEB9",
        "ParentEventID": [
          "B2BC22385E3AB404"
        ],
        "Label": "allowed=true\tugi=plascas (auth:SIMPLE)\tip=/139.19.171.63\tcmd=open\tsrc=/ds/Cy2IjvkVdQjGHkpH\tdst=null\tperm=null\tproto=rpc",
        "Title": "X-Trace Task",
        "Host": "pinky19.mpi-sws.org",
        "HRT": 27726525161158904,
        "Timestamp": "1558510165099.687012",
        "TenantClass": 0,
        "Source": "FSNamesystem.java:8313",
        "ThreadID": 63,
        "ThreadName": "",
        "EventID": "D9CDF560904E63D1",
        "BaggageBytes": "[[248 5] [240 0] [0 72 240 176 83 97 87 206 185] [240 1] [0 178 188 34 56 94 58 180 4] [240 3] [0 2]]",
        "ProcessID": 2171
      },
      {
        "Cycles": 0,
        "Agent": "edu.brown.cs.systems.xtrace.logging.BaggageWrappers",
        "ProcessName": "Name",
        "TaskID": "48F0B0536157CEB9",
        "ParentEventID": [
          "D9CDF560904E63D1"
        ],
        "Label": "Forking current baggage with Baggage.fork()",
        "Title": "X-Trace Task",
        "Host": "pinky19.mpi-sws.org",
        "HRT": 27726525161202279,
        "Operation": "fork",
        "Timestamp": "1558510165099.730225",
        "TenantClass": 0,
        "Source": "Server.java:2398",
        "ThreadID": 63,
        "ThreadName": "",
        "EventID": "8FF6C09EFBFB5616",
        "BaggageBytes": "[[248 5] [240 0] [0 72 240 176 83 97 87 206 185] [240 1] [0 217 205 245 96 144 78 99 209] [240 3] [0 2]]",
        "ProcessID": 2171
      },
      {
        "Cycles": 0,
        "Agent": "Execution-CPU",
        "ProcessName": "Name",
        "TaskID": "48F0B0536157CEB9",
        "ParentEventID": [
          "77F64FF31ACB6D1F"
        ],
        "Label": "unset",
        "Title": "X-Trace Task",
        "Host": "pinky19.mpi-sws.org",
        "Duration": "26006",
        "HRT": 27726525161055693,
        "Operation": "unset",
        "Timestamp": "1558510165099.583740",
        "TenantClass": 0,
        "Source": "Server.java:1828",
        "ThreadID": 48,
        "ThreadName": "",
        "EventID": "D4330573417E9F2C",
        "BaggageBytes": "[[248 5] [240 0] [0 72 240 176 83 97 87 206 185] [240 1] [0 119 246 79 243 26 203 109 31] [240 3] [0 2]]",
        "ProcessID": 2171
      },
      {
        "Cycles": 0,
        "Agent": "Execution-CPU",
        "ProcessName": "Name",
        "TaskID": "48F0B0536157CEB9",
        "ParentEventID": [
          "8FF6C09EFBFB5616"
        ],
        "Label": "unset",
        "Title": "X-Trace Task",
        "Host": "pinky19.mpi-sws.org",
        "Duration": "213519",
        "HRT": 27726525161311511,
        "Operation": "unset",
        "Timestamp": "1558510165099.839600",
        "TenantClass": 0,
        "Source": "Server.java:1058",
        "ThreadID": 63,
        "ThreadName": "",
        "EventID": "0A2729650EF99D7D",
        "BaggageBytes": "[[248 5] [240 0] [0 72 240 176 83 97 87 206 185] [240 1] [0 143 246 192 158 251 251 86 22] [240 3] [0 2]]",
        "ProcessID": 2171
      },
      {
        "Cycles": 0,
        "Agent": "Execution-CPU",
        "ProcessName": "Read",
        "TaskID": "48F0B0536157CEB9",
        "ParentEventID": [
          "90A26B8BA8BE4B0C"
        ],
        "Label": "unset",
        "Title": "X-Trace Task",
        "Host": "pinky19.mpi-sws.org",
        "Duration": "12361",
        "HRT": 27726525161388651,
        "Operation": "unset",
        "Timestamp": "1558510165099.625977",
        "TenantClass": 0,
        "Source": "Client.java:1168",
        "ThreadID": 40,
        "ThreadName": "",
        "EventID": "C104022FC78C8824",
        "ProcessID": 40748
      },
      {
        "Cycles": 0,
        "Agent": "Execution-CPU",
        "ProcessName": "Read",
        "TaskID": "48F0B0536157CEB9",
        "ParentEventID": [
          "8FF6C09EFBFB5616"
        ],
        "Label": "set",
        "Title": "X-Trace Task",
        "Host": "pinky19.mpi-sws.org",
        "HRT": 27726525161358332,
        "Operation": "set",
        "Timestamp": "1558510165099.595459",
        "TenantClass": 0,
        "Source": "Client.java:302",
        "ThreadID": 40,
        "ThreadName": "",
        "EventID": "90A26B8BA8BE4B0C",
        "ProcessID": 40748
      },
      {
        "Cycles": 0,
        "Agent": "Execution-Sleep",
        "ProcessName": "Read",
        "TaskID": "48F0B0536157CEB9",
        "ParentEventID": [
          "1836744CAA38E952"
        ],
        "Label": "waited",
        "Title": "X-Trace Task",
        "Host": "pinky19.mpi-sws.org",
        "Duration": "449988",
        "HRT": 27726525161413245,
        "Operation": "waited",
        "Timestamp": "1558510165099.650391",
        "TenantClass": 0,
        "Source": "Client.java:1537",
        "ThreadID": 1,
        "ThreadName": "",
        "EventID": "DA41441590DE08B9",
        "ProcessID": 40748
      },
      {
        "Cycles": 0,
        "Agent": "org.apache.hadoop.ipc.ProtobufRpcEngine",
        "ProcessName": "Read",
        "TaskID": "48F0B0536157CEB9",
        "ParentEventID": [
          "C4E29546013CE1AB"
        ],
        "Label": "org.apache.hadoop.hdfs.protocol.ClientProtocol.getBlockLocations completed",
        "Title": "X-Trace Task",
        "Host": "pinky19.mpi-sws.org",
        "HRT": 27726525161473862,
        "Timestamp": "1558510165099.711182",
        "TenantClass": 0,
        "Source": "ProtobufRpcEngine.java:275",
        "ThreadID": 1,
        "ThreadName": "",
        "EventID": "4A29C66744341EBF",
        "ProcessID": 40748
      },
      {
        "Cycles": 0,
        "Agent": "edu.brown.cs.systems.xtrace.logging.BaggageWrappers",
        "ProcessName": "Read",
        "TaskID": "48F0B0536157CEB9",
        "ParentEventID": [
          "4A29C66744341EBF"
        ],
        "Label": "Forking current baggage with Baggage.fork()",
        "Title": "X-Trace Task",
        "Host": "pinky19.mpi-sws.org",
        "HRT": 27726525161594979,
        "Operation": "fork",
        "Timestamp": "1558510165099.832275",
        "TenantClass": 0,
        "Source": "DataTransferProtoUtil.java:94",
        "ThreadID": 1,
        "ThreadName": "",
        "EventID": "6471E79B1CD87575",
        "ProcessID": 40748
      },
      {
        "Cycles": 0,
        "Agent": "org.apache.hadoop.ipc.Server",
        "ProcessName": "Name",
        "TaskID": "48F0B0536157CEB9",
        "ParentEventID": [
          "E92B60F43097860D"
        ],
        "Label": "getBlockLocations in org.apache.hadoop.hdfs.protocol.ClientProtocol",
        "Title": "X-Trace Task",
        "Host": "pinky19.mpi-sws.org",
        "HRT": 27726525161110871,
        "Timestamp": "1558510165099.638916",
        "TenantClass": 0,
        "Source": "ProtobufRpcEngine.java:601",
        "ThreadID": 63,
        "ThreadName": "",
        "EventID": "B2BC22385E3AB404",
        "BaggageBytes": "[[248 5] [240 0] [0 72 240 176 83 97 87 206 185] [240 1] [0 233 43 96 244 48 151 134 13] [240 3] [0 2]]",
        "ProcessID": 2171
      },
      {
        "Cycles": 0,
        "Agent": "Execution-CPU",
        "ProcessName": "Data",
        "TaskID": "48F0B0536157CEB9",
        "ParentEventID": [
          "6471E79B1CD87575"
        ],
        "Label": "set",
        "Title": "X-Trace Task",
        "Host": "pinky25.mpi-sws.org",
        "HRT": 48275630402711703,
        "Operation": "set",
        "Timestamp": "1558510165100.134521",
        "TenantClass": 0,
        "Source": "Receiver.java:117",
        "ThreadID": 17661,
        "ThreadName": "",
        "EventID": "33CA6278D795624C",
        "BaggageBytes": "[[248 5] [240 0] [0 72 240 176 83 97 87 206 185] [240 1] [0 100 113 231 155 28 216 117 117] [240 3] [0 2]]",
        "ProcessID": 28198
      },
      {
        "Cycles": 0,
        "Agent": "edu.brown.cs.systems.xtrace.logging.BaggageWrappers",
        "ProcessName": "Data",
        "TaskID": "48F0B0536157CEB9",
        "ParentEventID": [
          "4C68DF0C75AEAF17"
        ],
        "Label": "Forking current baggage with Baggage.fork()",
        "Title": "X-Trace Task",
        "Host": "pinky25.mpi-sws.org",
        "HRT": 48275630402896390,
        "Operation": "fork",
        "Timestamp": "1558510165100.319336",
        "TenantClass": 0,
        "Source": "DataXceiver.java:1257",
        "ThreadID": 17661,
        "ThreadName": "",
        "EventID": "2DEE4B2A8720D9F9",
        "BaggageBytes": "[[248 5] [240 0] [0 72 240 176 83 97 87 206 185] [240 1] [0 76 104 223 12 117 174 175 23] [240 3] [0 2]]",
        "ProcessID": 28198
      },
      {
        "Cycles": 0,
        "Agent": "edu.brown.cs.systems.xtrace.logging.BaggageWrappers",
        "ProcessName": "Read",
        "TaskID": "48F0B0536157CEB9",
        "ParentEventID": [
          "DA41441590DE08B9",
          "C104022FC78C8824"
        ],
        "Label": "Merged current baggage with other baggage",
        "Title": "X-Trace Task",
        "Host": "pinky19.mpi-sws.org",
        "HRT": 27726525161431566,
        "Operation": "join",
        "Timestamp": "1558510165099.668701",
        "TenantClass": 0,
        "Source": "Client.java:1545",
        "ThreadID": 1,
        "ThreadName": "",
        "EventID": "C4E29546013CE1AB",
        "ProcessID": 40748
      },
      {
        "Cycles": 0,
        "Agent": "edu.brown.cs.systems.xtrace.logging.BaggageWrappers",
        "ProcessName": "Data",
        "TaskID": "48F0B0536157CEB9",
        "ParentEventID": [
          "2DEE4B2A8720D9F9"
        ],
        "Label": "Forking current baggage with Baggage.fork()",
        "Title": "X-Trace Task",
        "Host": "pinky25.mpi-sws.org",
        "HRT": 48275630402971300,
        "Operation": "fork",
        "Timestamp": "1558510165100.394287",
        "TenantClass": 0,
        "Source": "PacketHeader.java:95",
        "ThreadID": 17661,
        "ThreadName": "",
        "EventID": "80CF49A240F3E54D",
        "BaggageBytes": "[[248 5] [240 0] [0 72 240 176 83 97 87 206 185] [240 1] [0 45 238 75 42 135 32 217 249] [240 3] [0 2]]",
        "ProcessID": 28198
      },
      {
        "Cycles": 0,
        "Agent": "Execution-Sleep",
        "ProcessName": "Data",
        "TaskID": "48F0B0536157CEB9",
        "ParentEventID": [
          "80CF49A240F3E54D"
        ],
        "Label": "waited",
        "Title": "X-Trace Task",
        "Host": "pinky25.mpi-sws.org",
        "Duration": "4375",
        "HRT": 48275630403037981,
        "Operation": "waited",
        "Timestamp": "1558510165100.460938",
        "TenantClass": 0,
        "Source": "SocketIOWithTimeout.java:335",
        "ThreadID": 17661,
        "ThreadName": "",
        "EventID": "1F701CE097351493",
        "BaggageBytes": "[[248 5] [240 0] [0 72 240 176 83 97 87 206 185] [240 1] [0 128 207 73 162 64 243 229 77] [240 3] [0 2]]",
        "ProcessID": 28198
      },
      {
        "Cycles": 0,
        "Agent": "Execution-Sleep",
        "ProcessName": "Read",
        "TaskID": "48F0B0536157CEB9",
        "ParentEventID": [
          "6471E79B1CD87575"
        ],
        "Label": "waited",
        "Title": "X-Trace Task",
        "Host": "pinky19.mpi-sws.org",
        "Duration": "411892",
        "HRT": 27726525162116648,
        "Operation": "waited",
        "Timestamp": "1558510165100.354004",
        "TenantClass": 0,
        "Source": "SocketIOWithTimeout.java:335",
        "ThreadID": 1,
        "ThreadName": "",
        "EventID": "BF354E65BBA1FC19",
        "ProcessID": 40748
      },
      {
        "Cycles": 0,
        "Agent": "edu.brown.cs.systems.xtrace.logging.BaggageWrappers",
        "ProcessName": "Read",
        "TaskID": "48F0B0536157CEB9",
        "ParentEventID": [
          "BF354E65BBA1FC19",
          "2DEE4B2A8720D9F9"
        ],
        "Label": "Merged current baggage with other baggage",
        "Title": "X-Trace Task",
        "Host": "pinky19.mpi-sws.org",
        "HRT": 27726525162253759,
        "Operation": "join",
        "Timestamp": "1558510165100.490967",
        "TenantClass": 0,
        "Source": "RemoteBlockReader2.java:429",
        "ThreadID": 1,
        "ThreadName": "",
        "EventID": "5A9D37990F8AFFDB",
        "ProcessID": 40748
      },
      {
        "Cycles": 0,
        "Agent": "Execution-Sleep",
        "ProcessName": "Read",
        "TaskID": "48F0B0536157CEB9",
        "ParentEventID": [
          "5A9D37990F8AFFDB"
        ],
        "Label": "waited",
        "Title": "X-Trace Task",
        "Host": "pinky19.mpi-sws.org",
        "Duration": "158351",
        "HRT": 27726525162519201,
        "Operation": "waited",
        "Timestamp": "1558510165100.756348",
        "TenantClass": 0,
        "Source": "SocketIOWithTimeout.java:335",
        "ThreadID": 1,
        "ThreadName": "",
        "EventID": "B3FA1C527F9EC5F8",
        "ProcessID": 40748
      },
      {
        "Cycles": 0,
        "Agent": "edu.brown.cs.systems.xtrace.logging.XTraceInit",
        "ProcessName": "Data",
        "TaskID": "48F0B0536157CEB9",
        "ParentEventID": [
          "33CA6278D795624C"
        ],
        "Label": "Thread.setName: DataXceiver for client DFSClient_NONMAPREDUCE_1816546669_1 at /139.19.171.63:32870 [Sending block BP-1633380353-139.19.171.63-1554193446451:blk_1073768134_27310]",
        "Title": "X-Trace Task",
        "Host": "pinky25.mpi-sws.org",
        "HRT": 48275630402785093,
        "Timestamp": "1558510165100.208008",
        "TenantClass": 0,
        "Source": "DataXceiver.java:168",
        "ThreadID": 17661,
        "ThreadName": "",
        "EventID": "4C68DF0C75AEAF17",
        "BaggageBytes": "[[248 5] [240 0] [0 72 240 176 83 97 87 206 185] [240 1] [0 51 202 98 120 215 149 98 76] [240 3] [0 2]]",
        "ProcessID": 28198
      },
      {
        "Cycles": 0,
        "Agent": "Execution-Sleep",
        "ProcessName": "Read",
        "TaskID": "48F0B0536157CEB9",
        "ParentEventID": [
          "B3FA1C527F9EC5F8"
        ],
        "Label": "waited",
        "Title": "X-Trace Task",
        "Host": "pinky19.mpi-sws.org",
        "Duration": "211887",
        "HRT": 27726525162786396,
        "Operation": "waited",
        "Timestamp": "1558510165101.023682",
        "TenantClass": 0,
        "Source": "SocketIOWithTimeout.java:335",
        "ThreadID": 1,
        "ThreadName": "",
        "EventID": "E90CC98D227E372E",
        "ProcessID": 40748
      },
      {
        "Cycles": 0,
        "Agent": "Execution-Sleep",
        "ProcessName": "Read",
        "TaskID": "48F0B0536157CEB9",
        "ParentEventID": [
          "29E89BE2DEC8FA1B"
        ],
        "Label": "waited",
        "Title": "X-Trace Task",
        "Host": "pinky19.mpi-sws.org",
        "Duration": "66888",
        "HRT": 27726525163107541,
        "Operation": "waited",
        "Timestamp": "1558510165101.344727",
        "TenantClass": 0,
        "Source": "SocketIOWithTimeout.java:335",
        "ThreadID": 1,
        "ThreadName": "",
        "EventID": "696F7D62F46CA830",
        "ProcessID": 40748
      },
      {
        "Cycles": 0,
        "Agent": "edu.brown.cs.systems.xtrace.logging.BaggageWrappers",
        "ProcessName": "Data",
        "TaskID": "48F0B0536157CEB9",
        "ParentEventID": [
          "1F701CE097351493"
        ],
        "Label": "Forking current baggage with Baggage.fork()",
        "Title": "X-Trace Task",
        "Host": "pinky25.mpi-sws.org",
        "HRT": 48275630403143585,
        "Operation": "fork",
        "Timestamp": "1558510165100.566406",
        "TenantClass": 0,
        "Source": "PacketHeader.java:95",
        "ThreadID": 17661,
        "ThreadName": "",
        "EventID": "DE2F440648AC3C3F",
        "BaggageBytes": "[[248 5] [240 0] [0 72 240 176 83 97 87 206 185] [240 1] [0 31 112 28 224 151 53 20 147] [240 3] [0 2]]",
        "ProcessID": 28198
      },
      {
        "Cycles": 0,
        "Agent": "edu.brown.cs.systems.xtrace.logging.BaggageWrappers",
        "ProcessName": "Read",
        "TaskID": "48F0B0536157CEB9",
        "ParentEventID": [
          "696F7D62F46CA830",
          "80CF49A240F3E54D"
        ],
        "Label": "Merged current baggage with other baggage",
        "Title": "X-Trace Task",
        "Host": "pinky19.mpi-sws.org",
        "HRT": 27726525163158090,
        "Operation": "join",
        "Timestamp": "1558510165101.395264",
        "TenantClass": 0,
        "Source": "PacketHeader.java:168",
        "ThreadID": 1,
        "ThreadName": "",
        "EventID": "19D379AD8B3F6263",
        "ProcessID": 40748
      },
      {
        "Cycles": 0,
        "Agent": "Execution-Sleep",
        "ProcessName": "Read",
        "TaskID": "48F0B0536157CEB9",
        "ParentEventID": [
          "E90CC98D227E372E"
        ],
        "Label": "waited",
        "Title": "X-Trace Task",
        "Host": "pinky19.mpi-sws.org",
        "Duration": "145354",
        "HRT": 27726525162988879,
        "Operation": "waited",
        "Timestamp": "1558510165101.226074",
        "TenantClass": 0,
        "Source": "SocketIOWithTimeout.java:335",
        "ThreadID": 1,
        "ThreadName": "",
        "EventID": "29E89BE2DEC8FA1B",
        "ProcessID": 40748
      },
      {
        "Cycles": 0,
        "Agent": "edu.brown.cs.systems.xtrace.logging.BaggageWrappers",
        "ProcessName": "Read",
        "TaskID": "48F0B0536157CEB9",
        "ParentEventID": [
          "DE2F440648AC3C3F",
          "19D379AD8B3F6263"
        ],
        "Label": "Merged current baggage with other baggage",
        "Title": "X-Trace Task",
        "Host": "pinky19.mpi-sws.org",
        "HRT": 27726525163286790,
        "Operation": "join",
        "Timestamp": "1558510165101.523926",
        "TenantClass": 0,
        "Source": "PacketHeader.java:168",
        "ThreadID": 1,
        "ThreadName": "",
        "EventID": "1BA17CB3E42165C6",
        "ProcessID": 40748
      },
      {
        "Cycles": 0,
        "Agent": "Execution-Sleep",
        "ProcessName": "Data",
        "TaskID": "48F0B0536157CEB9",
        "ParentEventID": [
          "DE2F440648AC3C3F"
        ],
        "Label": "waited",
        "Title": "X-Trace Task",
        "Host": "pinky25.mpi-sws.org",
        "Duration": "1001137",
        "HRT": 48275630404246677,
        "Operation": "waited",
        "Timestamp": "1558510165101.669678",
        "TenantClass": 0,
        "Source": "SocketIOWithTimeout.java:335",
        "ThreadID": 17661,
        "ThreadName": "",
        "EventID": "989E8CF2D763C900",
        "BaggageBytes": "[[248 5] [240 0] [0 72 240 176 83 97 87 206 185] [240 1] [0 222 47 68 6 72 172 60 63] [240 3] [0 2]]",
        "ProcessID": 28198
      },
      {
        "Cycles": 0,
        "Agent": "Execution-CPU",
        "ProcessName": "Data",
        "TaskID": "48F0B0536157CEB9",
        "ParentEventID": [
          "03BC2DC94BA844B0"
        ],
        "Label": "unset",
        "Title": "X-Trace Task",
        "Host": "pinky25.mpi-sws.org",
        "Duration": "1584957",
        "HRT": 48275630404328956,
        "Operation": "unset",
        "Timestamp": "1558510165101.751953",
        "TenantClass": 0,
        "Source": "DataXceiver.java:261",
        "ThreadID": 17661,
        "ThreadName": "",
        "EventID": "E8D9026F14D37C8D",
        "BaggageBytes": "[[248 5] [240 0] [0 72 240 176 83 97 87 206 185] [240 1] [0 3 188 45 201 75 168 68 176] [240 3] [0 2]]",
        "ProcessID": 28198
      },
      {
        "Cycles": 0,
        "Agent": "edu.brown.cs.systems.xtrace.logging.BaggageWrappers",
        "ProcessName": "Data",
        "TaskID": "48F0B0536157CEB9",
        "ParentEventID": [
          "989E8CF2D763C900",
          "96192ACCB95D2DA6"
        ],
        "Label": "Merged current baggage with other baggage",
        "Title": "X-Trace Task",
        "Host": "pinky25.mpi-sws.org",
        "HRT": 48275630404307790,
        "Operation": "join",
        "Timestamp": "1558510165101.730713",
        "TenantClass": 0,
        "Source": "DataXceiver.java:574",
        "ThreadID": 17661,
        "ThreadName": "",
        "EventID": "03BC2DC94BA844B0",
        "BaggageBytes": "[[248 5] [240 0] [0 72 240 176 83 97 87 206 185] [240 1] [0 150 25 42 204 185 93 45 166] [0 152 158 140 242 215 99 201 0] [240 3] [0 2]]",
        "ProcessID": 28198
      },
      {
        "Cycles": 0,
        "Agent": "edu.brown.cs.systems.xtrace.logging.BaggageWrappers",
        "ProcessName": "Read",
        "TaskID": "48F0B0536157CEB9",
        "ParentEventID": [
          "1BA17CB3E42165C6"
        ],
        "Label": "Forking current baggage with Baggage.fork()",
        "Title": "X-Trace Task",
        "Host": "pinky19.mpi-sws.org",
        "HRT": 27726525163302782,
        "Operation": "fork",
        "Timestamp": "1558510165101.540039",
        "TenantClass": 0,
        "Source": "RemoteBlockReader2.java:361",
        "ThreadID": 1,
        "ThreadName": "",
        "EventID": "96192ACCB95D2DA6",
        "ProcessID": 40748
      }
    ]
  }
]