[
  {
    "id": "A0B8E678543BAEE0",
    "reports": [
      {
        "Cycles": 0,
        "Agent": "Execution-CPU",
        "ProcessName": "Read",
        "TaskID": "A0B8E678543BAEE0",
        "ParentEventID": [
          "173378471A3BF4F4"
        ],
        "Label": "unset",
        "Title": "X-Trace Task",
        "Host": "pinky19.mpi-sws.org",
        "Duration": "22871810",
        "HRT": 25491768106165870,
        "Operation": "unset",
        "Timestamp": "1556275408046.430420",
        "TenantClass": 0,
        "Source": "Client.java:1027",
        "ThreadID": 1,
        "ThreadName": "",
        "EventID": "84A1A4956E1ADFD9",
        "ProcessID": 21035
      },
      {
        "Cycles": 0,
        "Agent": "org.apache.hadoop.ipc.ProtobufRpcEngine",
        "ProcessName": "Read",
        "TaskID": "A0B8E678543BAEE0",
        "ParentEventID": [
          "8E2BA899CCFAF7DA"
        ],
        "Label": "Invoking org.apache.hadoop.hdfs.protocol.ClientProtocol.getBlockLocations",
        "Title": "X-Trace Task",
        "Host": "pinky19.mpi-sws.org",
        "HRT": 25491768106084539,
        "Timestamp": "1556275408046.348877",
        "TenantClass": 0,
        "Source": "ProtobufRpcEngine.java:228",
        "ThreadID": 1,
        "ThreadName": "",
        "EventID": "173378471A3BF4F4",
        "ProcessID": 21035
      },
      {
        "Cycles": 0,
        "Agent": "edu.brown.cs.systems.retro.benchmarks.hdfs_client.Reader",
        "ProcessName": "Read",
        "TaskID": "A0B8E678543BAEE0",
        "ParentEventID": [
          "9BECB3281FA80CE5"
        ],
        "Label": "Reading file",
        "Title": "X-Trace Task",
        "Host": "pinky19.mpi-sws.org",
        "HRT": 25491768105890100,
        "Timestamp": "1556275408046.154541",
        "TenantClass": 0,
        "ThreadID": 1,
        "ThreadName": "",
        "EventID": "8E2BA899CCFAF7DA",
        "ProcessID": 21035
      },
      {
        "Cycles": 0,
        "Agent": "Execution-CPU",
        "ProcessName": "Read",
        "TaskID": "A0B8E678543BAEE0",
        "ParentEventID": [
          "84A1A4956E1ADFD9"
        ],
        "Label": "set",
        "Title": "X-Trace Task",
        "Host": "pinky19.mpi-sws.org",
        "HRT": 25491768106217426,
        "Operation": "set",
        "Timestamp": "1556275408046.481934",
        "TenantClass": 0,
        "Source": "Client.java:1032",
        "ThreadID": 41,
        "ThreadName": "",
        "EventID": "EFCB09402716FF0F",
        "ProcessID": 21035
      },
      {
        "Cycles": 0,
        "Agent": "edu.brown.cs.systems.xtrace.logging.BaggageWrappers",
        "ProcessName": "Read",
        "TaskID": "A0B8E678543BAEE0",
        "ParentEventID": [
          "EFCB09402716FF0F"
        ],
        "Label": "Forking current baggage with Baggage.fork()",
        "Title": "X-Trace Task",
        "Host": "pinky19.mpi-sws.org",
        "HRT": 25491768106244435,
        "Operation": "fork",
        "Timestamp": "1556275408046.508789",
        "TenantClass": 0,
        "Source": "Client.java:1043",
        "ThreadID": 41,
        "ThreadName": "",
        "EventID": "24131893FCBEA7FC",
        "ProcessID": 21035
      },
      {
        "Cycles": 0,
        "Agent": "Execution-CPU",
        "ProcessName": "Read",
        "TaskID": "A0B8E678543BAEE0",
        "ParentEventID": [
          "DE1419145E7D9909"
        ],
        "Label": "set",
        "Title": "X-Trace Task",
        "Host": "pinky19.mpi-sws.org",
        "HRT": 25491768106378750,
        "Operation": "set",
        "Timestamp": "1556275408046.643311",
        "TenantClass": 0,
        "Source": "Client.java:1104",
        "ThreadID": 1,
        "ThreadName": "",
        "EventID": "40E4FB7813F127A2",
        "ProcessID": 21035
      },
      {
        "Cycles": 0,
        "Agent": "Execution-CPU",
        "ProcessName": "Name",
        "TaskID": "A0B8E678543BAEE0",
        "ParentEventID": [
          "24131893FCBEA7FC"
        ],
        "Label": "set",
        "Title": "X-Trace Task",
        "Host": "pinky19.mpi-sws.org",
        "HRT": 25491768106445501,
        "Operation": "set",
        "Timestamp": "1556275408046.880615",
        "TenantClass": 0,
        "Source": "Server.java:1840",
        "ThreadID": 48,
        "ThreadName": "",
        "EventID": "6599ACA99249C16D",
        "BaggageBytes": "[[248 5] [240 0] [0 160 184 230 120 84 59 174 224] [240 1] [0 36 19 24 147 252 190 167 252] [240 3] [0 2]]",
        "ProcessID": 2171
      },
      {
        "Cycles": 0,
        "Agent": "Execution-CPU",
        "ProcessName": "Read",
        "TaskID": "A0B8E678543BAEE0",
        "ParentEventID": [
          "24131893FCBEA7FC"
        ],
        "Label": "unset",
        "Title": "X-Trace Task",
        "Host": "pinky19.mpi-sws.org",
        "Duration": "111827",
        "HRT": 25491768106353418,
        "Operation": "unset",
        "Timestamp": "1556275408046.617920",
        "TenantClass": 0,
        "Source": "Client.java:1062",
        "ThreadID": 41,
        "ThreadName": "",
        "EventID": "DE1419145E7D9909",
        "ProcessID": 21035
      },
      {
        "Cycles": 0,
        "Agent": "Execution-CPU",
        "ProcessName": "Name",
        "TaskID": "A0B8E678543BAEE0",
        "ParentEventID": [
          "39ACE993D46A7090"
        ],
        "Label": "unset",
        "Title": "X-Trace Task",
        "Host": "pinky19.mpi-sws.org",
        "Duration": "38654",
        "HRT": 25491768106528920,
        "Operation": "unset",
        "Timestamp": "1556275408046.964111",
        "TenantClass": 0,
        "Source": "Server.java:1828",
        "ThreadID": 48,
        "ThreadName": "",
        "EventID": "E8A4849780D6CFFB",
        "BaggageBytes": "[[248 5] [240 0] [0 160 184 230 120 84 59 174 224] [240 1] [0 57 172 233 147 212 106 112 144] [240 3] [0 2]]",
        "ProcessID": 2171
      },
      {
        "Cycles": 0,
        "Agent": "Execution-CPU",
        "ProcessName": "Name",
        "TaskID": "A0B8E678543BAEE0",
        "ParentEventID": [
          "39ACE993D46A7090"
        ],
        "Label": "set",
        "Title": "X-Trace Task",
        "Host": "pinky19.mpi-sws.org",
        "HRT": 25491768106539067,
        "Operation": "set",
        "Timestamp": "1556275408046.974365",
        "TenantClass": 0,
        "Source": "Server.java:2071",
        "ThreadID": 60,
        "ThreadName": "",
        "EventID": "444B855E4974A2DA",
        "BaggageBytes": "[[248 5] [240 0] [0 160 184 230 120 84 59 174 224] [240 1] [0 57 172 233 147 212 106 112 144] [240 3] [0 2]]",
        "ProcessID": 2171
      },
      {
        "Cycles": 0,
        "Agent": "org.apache.hadoop.ipc.Server",
        "ProcessName": "Name",
        "TaskID": "A0B8E678543BAEE0",
        "ParentEventID": [
          "444B855E4974A2DA"
        ],
        "Label": "getBlockLocations in org.apache.hadoop.hdfs.protocol.ClientProtocol",
        "Title": "X-Trace Task",
        "Host": "pinky19.mpi-sws.org",
        "HRT": 25491768106593597,
        "Timestamp": "1556275408047.028809",
        "TenantClass": 0,
        "Source": "ProtobufRpcEngine.java:601",
        "ThreadID": 60,
        "ThreadName": "",
        "EventID": "40990ADCCB84569A",
        "BaggageBytes": "[[248 5] [240 0] [0 160 184 230 120 84 59 174 224] [240 1] [0 68 75 133 94 73 116 162 218] [240 3] [0 2]]",
        "ProcessID": 2171
      },
      {
        "Cycles": 0,
        "Agent": "edu.brown.cs.systems.xtrace.logging.BaggageWrappers",
        "ProcessName": "Name",
        "TaskID": "A0B8E678543BAEE0",
        "ParentEventID": [
          "6599ACA99249C16D"
        ],
        "Label": "Forking current baggage with Baggage.fork()",
        "Title": "X-Trace Task",
        "Host": "pinky19.mpi-sws.org",
        "HRT": 25491768106499429,
        "Operation": "fork",
        "Timestamp": "1556275408046.934570",
        "TenantClass": 0,
        "Source": "Server.java:550",
        "ThreadID": 48,
        "ThreadName": "",
        "EventID": "39ACE993D46A7090",
        "BaggageBytes": "[[248 5] [240 0] [0 160 184 230 120 84 59 174 224] [240 1] [0 101 153 172 169 146 73 193 109] [240 3] [0 2]]",
        "ProcessID": 2171
      },
      {
        "Cycles": 0,
        "Agent": "org.apache.hadoop.hdfs.server.namenode.FSNamesystem.audit",
        "ProcessName": "Name",
        "TaskID": "A0B8E678543BAEE0",
        "ParentEventID": [
          "40990ADCCB84569A"
        ],
        "Label": "allowed=true\tugi=plascas (auth:SIMPLE)\tip=/139.19.171.63\tcmd=open\tsrc=/ds/brWrvBdngok8mHBS\tdst=null\tperm=null\tproto=rpc",
        "Title": "X-Trace Task",
        "Host": "pinky19.mpi-sws.org",
        "HRT": 25491768106664373,
        "Timestamp": "1556275408047.099609",
        "TenantClass": 0,
        "Source": "FSNamesystem.java:8313",
        "ThreadID": 60,
        "ThreadName": "",
        "EventID": "CBB0601DA47C3584",
        "BaggageBytes": "[[248 5] [240 0] [0 160 184 230 120 84 59 174 224] [240 1] [0 64 153 10 220 203 132 86 154] [240 3] [0 2]]",
        "ProcessID": 2171
      },
      {
        "Cycles": 0,
        "Agent": "Execution-CPU",
        "ProcessName": "Name",
        "TaskID": "A0B8E678543BAEE0",
        "ParentEventID": [
          "08351A51B9B656DF"
        ],
        "Label": "unset",
        "Title": "X-Trace Task",
        "Host": "pinky19.mpi-sws.org",
        "Duration": "285744",
        "HRT": 25491768106853955,
        "Operation": "unset",
        "Timestamp": "1556275408047.289307",
        "TenantClass": 0,
        "Source": "Server.java:1058",
        "ThreadID": 60,
        "ThreadName": "",
        "EventID": "96D4331786D5294A",
        "BaggageBytes": "[[248 5] [240 0] [0 160 184 230 120 84 59 174 224] [240 1] [0 8 53 26 81 185 182 86 223] [240 3] [0 2]]",
        "ProcessID": 2171
      },
      {
        "Cycles": 0,
        "Agent": "Execution-CPU",
        "ProcessName": "Read",
        "TaskID": "A0B8E678543BAEE0",
        "ParentEventID": [
          "08351A51B9B656DF"
        ],
        "Label": "set",
        "Title": "X-Trace Task",
        "Host": "pinky19.mpi-sws.org",
        "HRT": 25491768106941341,
        "Operation": "set",
        "Timestamp": "1556275408047.205811",
        "TenantClass": 0,
        "Source": "Client.java:302",
        "ThreadID": 37,
        "ThreadName": "",
        "EventID": "5AD6273271474929",
        "ProcessID": 21035
      },
      {
        "Cycles": 0,
        "Agent": "Execution-CPU",
        "ProcessName": "Read",
        "TaskID": "A0B8E678543BAEE0",
        "ParentEventID": [
          "5AD6273271474929"
        ],
        "Label": "unset",
        "Title": "X-Trace Task",
        "Host": "pinky19.mpi-sws.org",
        "Duration": "28840",
        "HRT": 25491768106985580,
        "Operation": "unset",
        "Timestamp": "1556275408047.250000",
        "TenantClass": 0,
        "Source": "Client.java:1168",
        "ThreadID": 37,
        "ThreadName": "",
        "EventID": "CBFA6BD86D7EA91C",
        "ProcessID": 21035
      },
      {
        "Cycles": 0,
        "Agent": "edu.brown.cs.systems.xtrace.logging.BaggageWrappers",
        "ProcessName": "Name",
        "TaskID": "A0B8E678543BAEE0",
        "ParentEventID": [
          "CBB0601DA47C3584"
        ],
        "Label": "Forking current baggage with Baggage.fork()",
        "Title": "X-Trace Task",
        "Host": "pinky19.mpi-sws.org",
        "HRT": 25491768106731163,
        "Operation": "fork",
        "Timestamp": "1556275408047.166504",
        "TenantClass": 0,
        "Source": "Server.java:2398",
        "ThreadID": 60,
        "ThreadName": "",
        "EventID": "08351A51B9B656DF",
        "BaggageBytes": "[[248 5] [240 0] [0 160 184 230 120 84 59 174 224] [240 1] [0 203 176 96 29 164 124 53 132] [240 3] [0 2]]",
        "ProcessID": 2171
      },
      {
        "Cycles": 0,
        "Agent": "Execution-Sleep",
        "ProcessName": "Read",
        "TaskID": "A0B8E678543BAEE0",
        "ParentEventID": [
          "40E4FB7813F127A2"
        ],
        "Label": "waited",
        "Title": "X-Trace Task",
        "Host": "pinky19.mpi-sws.org",
        "Duration": "615504",
        "HRT": 25491768107008316,
        "Operation": "waited",
        "Timestamp": "1556275408047.272705",
        "TenantClass": 0,
        "Source": "Client.java:1537",
        "ThreadID": 1,
        "ThreadName": "",
        "EventID": "EE3C301D60593BF9",
        "ProcessID": 21035
      },
      {
        "Cycles": 0,
        "Agent": "edu.brown.cs.systems.xtrace.logging.BaggageWrappers",
        "ProcessName": "Read",
        "TaskID": "A0B8E678543BAEE0",
        "ParentEventID": [
          "EE3C301D60593BF9",
          "CBFA6BD86D7EA91C"
        ],
        "Label": "Merged current baggage with other baggage",
        "Title": "X-Trace Task",
        "Host": "pinky19.mpi-sws.org",
        "HRT": 25491768107031545,
        "Operation": "join",
        "Timestamp": "1556275408047.295898",
        "TenantClass": 0,
        "Source": "Client.java:1545",
        "ThreadID": 1,
        "ThreadName": "",
        "EventID": "A4BF8B492C435DA3",
        "ProcessID": 21035
      },
      {
        "Cycles": 0,
        "Agent": "org.apache.hadoop.ipc.ProtobufRpcEngine",
        "ProcessName": "Read",
        "TaskID": "A0B8E678543BAEE0",
        "ParentEventID": [
          "A4BF8B492C435DA3"
        ],
        "Label": "org.apache.hadoop.hdfs.protocol.ClientProtocol.getBlockLocations completed",
        "Title": "X-Trace Task",
        "Host": "pinky19.mpi-sws.org",
        "HRT": 25491768107128436,
        "Timestamp": "1556275408047.392822",
        "TenantClass": 0,
        "Source": "ProtobufRpcEngine.java:275",
        "ThreadID": 1,
        "ThreadName": "",
        "EventID": "CC59444C12DB5B5D",
        "ProcessID": 21035
      },
      {
        "Cycles": 0,
        "Agent": "Execution-CPU",
        "ProcessName": "Data",
        "TaskID": "A0B8E678543BAEE0",
        "ParentEventID": [
          "DEF049DE42589C8C"
        ],
        "Label": "set",
        "Title": "X-Trace Task",
        "Host": "pinky20.mpi-sws.org",
        "HRT": 5094972467256590,
        "Operation": "set",
        "Timestamp": "1556275408048.204834",
        "TenantClass": 0,
        "Source": "Receiver.java:117",
        "ThreadID": 5400,
        "ThreadName": "",
        "EventID": "B4CE6C4D97438B9C",
        "BaggageBytes": "[[248 5] [240 0] [0 160 184 230 120 84 59 174 224] [240 1] [0 222 240 73 222 66 88 156 140] [240 3] [0 2]]",
        "ProcessID": 13111
      },
      {
        "Cycles": 0,
        "Agent": "edu.brown.cs.systems.xtrace.logging.BaggageWrappers",
        "ProcessName": "Read",
        "TaskID": "A0B8E678543BAEE0",
        "ParentEventID": [
          "CC59444C12DB5B5D"
        ],
        "Label": "Forking current baggage with Baggage.fork()",
        "Title": "X-Trace Task",
        "Host": "pinky19.mpi-sws.org",
        "HRT": 25491768107319745,
        "Operation": "fork",
        "Timestamp": "1556275408047.584229",
        "TenantClass": 0,
        "Source": "DataTransferProtoUtil.java:94",
        "ThreadID": 1,
        "ThreadName": "",
        "EventID": "DEF049DE42589C8C",
        "ProcessID": 21035
      },
      {
        "Cycles": 0,
        "Agent": "edu.brown.cs.systems.xtrace.logging.XTraceInit",
        "ProcessName": "Data",
        "TaskID": "A0B8E678543BAEE0",
        "ParentEventID": [
          "B4CE6C4D97438B9C"
        ],
        "Label": "Thread.setName: DataXceiver for client DFSClient_NONMAPREDUCE_1377588049_1 at /139.19.171.63:32854 [Sending block BP-1633380353-139.19.171.63-1554193446451:blk_1073767070_26246]",
        "Title": "X-Trace Task",
        "Host": "pinky20.mpi-sws.org",
        "HRT": 5094972467362243,
        "Timestamp": "1556275408048.310303",
        "TenantClass": 0,
        "Source": "DataXceiver.java:168",
        "ThreadID": 5400,
        "ThreadName": "",
        "EventID": "76521BD8B799E391",
        "BaggageBytes": "[[248 5] [240 0] [0 160 184 230 120 84 59 174 224] [240 1] [0 180 206 108 77 151 67 139 156] [240 3] [0 2]]",
        "ProcessID": 13111
      },
      {
        "Cycles": 0,
        "Agent": "Execution-Sleep",
        "ProcessName": "Read",
        "TaskID": "A0B8E678543BAEE0",
        "ParentEventID": [
          "DEF049DE42589C8C"
        ],
        "Label": "waited",
        "Title": "X-Trace Task",
        "Host": "pinky19.mpi-sws.org",
        "Duration": "709514",
        "HRT": 25491768108195015,
        "Operation": "waited",
        "Timestamp": "1556275408048.459473",
        "TenantClass": 0,
        "Source": "SocketIOWithTimeout.java:335",
        "ThreadID": 1,
        "ThreadName": "",
        "EventID": "5925295046BF42E6",
        "ProcessID": 21035
      },
      {
        "Cycles": 0,
        "Agent": "edu.brown.cs.systems.xtrace.logging.BaggageWrappers",
        "ProcessName": "Data",
        "TaskID": "A0B8E678543BAEE0",
        "ParentEventID": [
          "76521BD8B799E391"
        ],
        "Label": "Forking current baggage with Baggage.fork()",
        "Title": "X-Trace Task",
        "Host": "pinky20.mpi-sws.org",
        "HRT": 5094972467610310,
        "Operation": "fork",
        "Timestamp": "1556275408048.558350",
        "TenantClass": 0,
        "Source": "DataXceiver.java:1257",
        "ThreadID": 5400,
        "ThreadName": "",
        "EventID": "8958C105C8433822",
        "BaggageBytes": "[[248 5] [240 0] [0 160 184 230 120 84 59 174 224] [240 1] [0 118 82 27 216 183 153 227 145] [240 3] [0 2]]",
        "ProcessID": 13111
      },
      {
        "Cycles": 0,
        "Agent": "edu.brown.cs.systems.xtrace.logging.BaggageWrappers",
        "ProcessName": "Data",
        "TaskID": "A0B8E678543BAEE0",
        "ParentEventID": [
          "8958C105C8433822"
        ],
        "Label": "Forking current baggage with Baggage.fork()",
        "Title": "X-Trace Task",
        "Host": "pinky20.mpi-sws.org",
        "HRT": 5094972467792651,
        "Operation": "fork",
        "Timestamp": "1556275408048.740723",
        "TenantClass": 0,
        "Source": "PacketHeader.java:95",
        "ThreadID": 5400,
        "ThreadName": "",
        "EventID": "8AF42625EA06BE7F",
        "BaggageBytes": "[[248 5] [240 0] [0 160 184 230 120 84 59 174 224] [240 1] [0 137 88 193 5 200 67 56 34] [240 3] [0 2]]",
        "ProcessID": 13111
      },
      {
        "Cycles": 0,
        "Agent": "edu.brown.cs.systems.xtrace.logging.BaggageWrappers",
        "ProcessName": "Read",
        "TaskID": "A0B8E678543BAEE0",
        "ParentEventID": [
          "8958C105C8433822",
          "5925295046BF42E6"
        ],
        "Label": "Merged current baggage with other baggage",
        "Title": "X-Trace Task",
        "Host": "pinky19.mpi-sws.org",
        "HRT": 25491768108306351,
        "Operation": "join",
        "Timestamp": "1556275408048.570801",
        "TenantClass": 0,
        "Source": "RemoteBlockReader2.java:429",
        "ThreadID": 1,
        "ThreadName": "",
        "EventID": "8101E5F20D7A61BA",
        "ProcessID": 21035
      },
      {
        "Cycles": 0,
        "Agent": "Execution-Sleep",
        "ProcessName": "Data",
        "TaskID": "A0B8E678543BAEE0",
        "ParentEventID": [
          "8AF42625EA06BE7F"
        ],
        "Label": "waited",
        "Title": "X-Trace Task",
        "Host": "pinky20.mpi-sws.org",
        "Duration": "30280",
        "HRT": 5094972467968138,
        "Operation": "waited",
        "Timestamp": "1556275408048.916260",
        "TenantClass": 0,
        "Source": "SocketIOWithTimeout.java:335",
        "ThreadID": 5400,
        "ThreadName": "",
        "EventID": "7EC573190C1C4F39",
        "BaggageBytes": "[[248 5] [240 0] [0 160 184 230 120 84 59 174 224] [240 1] [0 138 244 38 37 234 6 190 127] [240 3] [0 2]]",
        "ProcessID": 13111
      },
      {
        "Cycles": 0,
        "Agent": "Execution-Sleep",
        "ProcessName": "Read",
        "TaskID": "A0B8E678543BAEE0",
        "ParentEventID": [
          "8101E5F20D7A61BA"
        ],
        "Label": "waited",
        "Title": "X-Trace Task",
        "Host": "pinky19.mpi-sws.org",
        "Duration": "137464",
        "HRT": 25491768108576751,
        "Operation": "waited",
        "Timestamp": "1556275408048.841309",
        "TenantClass": 0,
        "Source": "SocketIOWithTimeout.java:335",
        "ThreadID": 1,
        "ThreadName": "",
        "EventID": "1A3F693BA8D1A568",
        "ProcessID": 21035
      },
      {
        "Cycles": 0,
        "Agent": "edu.brown.cs.systems.xtrace.logging.BaggageWrappers",
        "ProcessName": "Data",
        "TaskID": "A0B8E678543BAEE0",
        "ParentEventID": [
          "7EC573190C1C4F39"
        ],
        "Label": "Forking current baggage with Baggage.fork()",
        "Title": "X-Trace Task",
        "Host": "pinky20.mpi-sws.org",
        "HRT": 5094972468148768,
        "Operation": "fork",
        "Timestamp": "1556275408049.096924",
        "TenantClass": 0,
        "Source": "PacketHeader.java:95",
        "ThreadID": 5400,
        "ThreadName": "",
        "EventID": "92EC1E823D5C2E6C",
        "BaggageBytes": "[[248 5] [240 0] [0 160 184 230 120 84 59 174 224] [240 1] [0 126 197 115 25 12 28 79 57] [240 3] [0 2]]",
        "ProcessID": 13111
      },
      {
        "Cycles": 0,
        "Agent": "edu.brown.cs.systems.xtrace.logging.BaggageWrappers",
        "ProcessName": "Read",
        "TaskID": "A0B8E678543BAEE0",
        "ParentEventID": [
          "1A3F693BA8D1A568",
          "8AF42625EA06BE7F"
        ],
        "Label": "Merged current baggage with other baggage",
        "Title": "X-Trace Task",
        "Host": "pinky19.mpi-sws.org",
        "HRT": 25491768108640666,
        "Operation": "join",
        "Timestamp": "1556275408048.905029",
        "TenantClass": 0,
        "Source": "PacketHeader.java:168",
        "ThreadID": 1,
        "ThreadName": "",
        "EventID": "613E24240BA1BF53",
        "ProcessID": 21035
      },
      {
        "Cycles": 0,
        "Agent": "edu.brown.cs.systems.xtrace.logging.BaggageWrappers",
        "ProcessName": "Read",
        "TaskID": "A0B8E678543BAEE0",
        "ParentEventID": [
          "48C974402403F7C9",
          "92EC1E823D5C2E6C"
        ],
        "Label": "Merged current baggage with other baggage",
        "Title": "X-Trace Task",
        "Host": "pinky19.mpi-sws.org",
        "HRT": 25491768108759372,
        "Operation": "join",
        "Timestamp": "1556275408049.023926",
        "TenantClass": 0,
        "Source": "PacketHeader.java:168",
        "ThreadID": 1,
        "ThreadName": "",
        "EventID": "6B0B83A2606836B5",
        "ProcessID": 21035
      },
      {
        "Cycles": 0,
        "Agent": "edu.brown.cs.systems.xtrace.logging.BaggageWrappers",
        "ProcessName": "Read",
        "TaskID": "A0B8E678543BAEE0",
        "ParentEventID": [
          "6B0B83A2606836B5"
        ],
        "Label": "Forking current baggage with Baggage.fork()",
        "Title": "X-Trace Task",
        "Host": "pinky19.mpi-sws.org",
        "HRT": 25491768108781505,
        "Operation": "fork",
        "Timestamp": "1556275408049.045898",
        "TenantClass": 0,
        "Source": "RemoteBlockReader2.java:361",
        "ThreadID": 1,
        "ThreadName": "",
        "EventID": "778EB8976425751C",
        "ProcessID": 21035
      },
      {
        "Cycles": 0,
        "Agent": "Execution-Sleep",
        "ProcessName": "Data",
        "TaskID": "A0B8E678543BAEE0",
        "ParentEventID": [
          "92EC1E823D5C2E6C"
        ],
        "Label": "waited",
        "Title": "X-Trace Task",
        "Host": "pinky20.mpi-sws.org",
        "Duration": "98660",
        "HRT": 5094972468484325,
        "Operation": "waited",
        "Timestamp": "1556275408049.432373",
        "TenantClass": 0,
        "Source": "SocketIOWithTimeout.java:335",
        "ThreadID": 5400,
        "ThreadName": "",
        "EventID": "354F338296558162",
        "BaggageBytes": "[[248 5] [240 0] [0 160 184 230 120 84 59 174 224] [240 1] [0 146 236 30 130 61 92 46 108] [240 3] [0 2]]",
        "ProcessID": 13111
      },
      {
        "Cycles": 0,
        "Agent": "Execution-Sleep",
        "ProcessName": "Read",
        "TaskID": "A0B8E678543BAEE0",
        "ParentEventID": [
          "613E24240BA1BF53"
        ],
        "Label": "waited",
        "Title": "X-Trace Task",
        "Host": "pinky19.mpi-sws.org",
        "Duration": "4619",
        "HRT": 25491768108704741,
        "Operation": "waited",
        "Timestamp": "1556275408048.969238",
        "TenantClass": 0,
        "Source": "SocketIOWithTimeout.java:335",
        "ThreadID": 1,
        "ThreadName": "",
        "EventID": "48C974402403F7C9",
        "ProcessID": 21035
      },
      {
        "Cycles": 0,
        "Agent": "edu.brown.cs.systems.xtrace.logging.BaggageWrappers",
        "ProcessName": "Data",
        "TaskID": "A0B8E678543BAEE0",
        "ParentEventID": [
          "778EB8976425751C",
          "354F338296558162"
        ],
        "Label": "Merged current baggage with other baggage",
        "Title": "X-Trace Task",
        "Host": "pinky20.mpi-sws.org",
        "HRT": 5094972468619738,
        "Operation": "join",
        "Timestamp": "1556275408049.567871",
        "TenantClass": 0,
        "Source": "DataXceiver.java:574",
        "ThreadID": 5400,
        "ThreadName": "",
        "EventID": "CF9FF70C72A921C7",
        "BaggageBytes": "[[248 5] [240 0] [0 160 184 230 120 84 59 174 224] [240 1] [0 53 79 51 130 150 85 129 98] [0 119 142 184 151 100 37 117 28] [240 3] [0 2]]",
        "ProcessID": 13111
      },
      {
        "Cycles": 0,
        "Agent": "Execution-CPU",
        "ProcessName": "Data",
        "TaskID": "A0B8E678543BAEE0",
        "ParentEventID": [
          "CF9FF70C72A921C7"
        ],
        "Label": "unset",
        "Title": "X-Trace Task",
        "Host": "pinky20.mpi-sws.org",
        "Duration": "1350946",
        "HRT": 5094972468685525,
        "Operation": "unset",
        "Timestamp": "1556275408049.633789",
        "TenantClass": 0,
        "Source": "DataXceiver.java:261",
        "ThreadID": 5400,
        "ThreadName": "",
        "EventID": "3381104011F651B8",
        "BaggageBytes": "[[248 5] [240 0] [0 160 184 230 120 84 59 174 224] [240 1] [0 207 159 247 12 114 169 33 199] [240 3] [0 2]]",
        "ProcessID": 13111
      },
      {
        "Cycles": 0,
        "Agent": "edu.brown.cs.systems.retro.benchmarks.hdfs_client.Reader",
        "ProcessName": "Read",
        "TaskID": "A0B8E678543BAEE0",
        "ParentEventID": [
          "0"
        ],
        "Label": "Reading file",
        "Title": "X-Trace Task",
        "Host": "pinky19.mpi-sws.org",
        "HRT": 25491768105848418,
        "Timestamp": "1556275408046.112793",
        "TenantClass": 0,
        "ThreadID": 1,
        "ThreadName": "",
        "EventID": "9BECB3281FA80CE5",
        "ProcessID": 21035,
        "Tag": [
          "reader_1kb",
          "Read Size: 1024"
        ]
      }
    ]
  }
]