[
  {
    "id": "B20A85C2F324C47E",
    "reports": [
      {
        "Cycles": 0,
        "Agent": "Execution-CPU",
        "ProcessName": "Read",
        "TaskID": "B20A85C2F324C47E",
        "ParentEventID": [
          "45882FA3C71F90CE"
        ],
        "Label": "unset",
        "Title": "X-Trace Task",
        "Host": "pinky19.mpi-sws.org",
        "Duration": "22330586",
        "HRT": 25491770894718612,
        "Operation": "unset",
        "Timestamp": "1556275410834.779541",
        "TenantClass": 0,
        "Source": "Client.java:1027",
        "ThreadID": 1,
        "ThreadName": "",
        "EventID": "29048EFE649866EF",
        "ProcessID": 21035
      },
      {
        "Cycles": 0,
        "Agent": "edu.brown.cs.systems.retro.benchmarks.hdfs_client.Reader",
        "ProcessName": "Read",
        "TaskID": "B20A85C2F324C47E",
        "ParentEventID": [
          "2F4D63BDCC12A325"
        ],
        "Label": "Reading file",
        "Title": "X-Trace Task",
        "Host": "pinky19.mpi-sws.org",
        "HRT": 25491770894655361,
        "Timestamp": "1556275410834.716309",
        "TenantClass": 0,
        "ThreadID": 1,
        "ThreadName": "",
        "EventID": "7D08CC960519BCE2",
        "ProcessID": 21035
      },
      {
        "Cycles": 0,
        "Agent": "org.apache.hadoop.ipc.ProtobufRpcEngine",
        "ProcessName": "Read",
        "TaskID": "B20A85C2F324C47E",
        "ParentEventID": [
          "7D08CC960519BCE2"
        ],
        "Label": "Invoking org.apache.hadoop.hdfs.protocol.ClientProtocol.getBlockLocations",
        "Title": "X-Trace Task",
        "Host": "pinky19.mpi-sws.org",
        "HRT": 25491770894693631,
        "Timestamp": "1556275410834.754395",
        "TenantClass": 0,
        "Source": "ProtobufRpcEngine.java:228",
        "ThreadID": 1,
        "ThreadName": "",
        "EventID": "45882FA3C71F90CE",
        "ProcessID": 21035
      },
      {
        "Cycles": 0,
        "Agent": "edu.brown.cs.systems.xtrace.logging.BaggageWrappers",
        "ProcessName": "Read",
        "TaskID": "B20A85C2F324C47E",
        "ParentEventID": [
          "C455133A16B5AF68"
        ],
        "Label": "Forking current baggage with Baggage.fork()",
        "Title": "X-Trace Task",
        "Host": "pinky19.mpi-sws.org",
        "HRT": 25491770894761955,
        "Operation": "fork",
        "Timestamp": "1556275410834.822754",
        "TenantClass": 0,
        "Source": "Client.java:1043",
        "ThreadID": 41,
        "ThreadName": "",
        "EventID": "E23D361AA20EF8DF",
        "ProcessID": 21035
      },
      {
        "Cycles": 0,
        "Agent": "Execution-CPU",
        "ProcessName": "Read",
        "TaskID": "B20A85C2F324C47E",
        "ParentEventID": [
          "29048EFE649866EF"
        ],
        "Label": "set",
        "Title": "X-Trace Task",
        "Host": "pinky19.mpi-sws.org",
        "HRT": 25491770894743900,
        "Operation": "set",
        "Timestamp": "1556275410834.804688",
        "TenantClass": 0,
        "Source": "Client.java:1032",
        "ThreadID": 41,
        "ThreadName": "",
        "EventID": "C455133A16B5AF68",
        "ProcessID": 21035
      },
      {
        "Cycles": 0,
        "Agent": "Execution-CPU",
        "ProcessName": "Read",
        "TaskID": "B20A85C2F324C47E",
        "ParentEventID": [
          "E23D361AA20EF8DF"
        ],
        "Label": "unset",
        "Title": "X-Trace Task",
        "Host": "pinky19.mpi-sws.org",
        "Duration": "83456",
        "HRT": 25491770894844133,
        "Operation": "unset",
        "Timestamp": "1556275410834.905029",
        "TenantClass": 0,
        "Source": "Client.java:1062",
        "ThreadID": 41,
        "ThreadName": "",
        "EventID": "BAA2ECC7AE5AFDA3",
        "ProcessID": 21035
      },
      {
        "Cycles": 0,
        "Agent": "Execution-CPU",
        "ProcessName": "Read",
        "TaskID": "B20A85C2F324C47E",
        "ParentEventID": [
          "BAA2ECC7AE5AFDA3"
        ],
        "Label": "set",
        "Title": "X-Trace Task",
        "Host": "pinky19.mpi-sws.org",
        "HRT": 25491770894865773,
        "Operation": "set",
        "Timestamp": "1556275410834.926514",
        "TenantClass": 0,
        "Source": "Client.java:1104",
        "ThreadID": 1,
        "ThreadName": "",
        "EventID": "C0484E879B856653",
        "ProcessID": 21035
      },
      {
        "Cycles": 0,
        "Agent": "Execution-CPU",
        "ProcessName": "Name",
        "TaskID": "B20A85C2F324C47E",
        "ParentEventID": [
          "E23D361AA20EF8DF"
        ],
        "Label": "set",
        "Title": "X-Trace Task",
        "Host": "pinky19.mpi-sws.org",
        "HRT": 25491770894914579,
        "Operation": "set",
        "Timestamp": "1556275410834.987793",
        "TenantClass": 0,
        "Source": "Server.java:1840",
        "ThreadID": 48,
        "ThreadName": "",
        "EventID": "1496A3121C069054",
        "BaggageBytes": "[[248 5] [240 0] [0 178 10 133 194 243 36 196 126] [240 1] [0 226 61 54 26 162 14 248 223] [240 3] [0 2]]",
        "ProcessID": 2171
      },
      {
        "Cycles": 0,
        "Agent": "Execution-CPU",
        "ProcessName": "Name",
        "TaskID": "B20A85C2F324C47E",
        "ParentEventID": [
          "CADE9CF93BEA7BF1"
        ],
        "Label": "unset",
        "Title": "X-Trace Task",
        "Host": "pinky19.mpi-sws.org",
        "Duration": "29290",
        "HRT": 25491770894976760,
        "Operation": "unset",
        "Timestamp": "1556275410835.050049",
        "TenantClass": 0,
        "Source": "Server.java:1828",
        "ThreadID": 48,
        "ThreadName": "",
        "EventID": "3348F080A90C851B",
        "BaggageBytes": "[[248 5] [240 0] [0 178 10 133 194 243 36 196 126] [240 1] [0 202 222 156 249 59 234 123 241] [240 3] [0 2]]",
        "ProcessID": 2171
      },
      {
        "Cycles": 0,
        "Agent": "edu.brown.cs.systems.xtrace.logging.BaggageWrappers",
        "ProcessName": "Name",
        "TaskID": "B20A85C2F324C47E",
        "ParentEventID": [
          "1496A3121C069054"
        ],
        "Label": "Forking current baggage with Baggage.fork()",
        "Title": "X-Trace Task",
        "Host": "pinky19.mpi-sws.org",
        "HRT": 25491770894952210,
        "Operation": "fork",
        "Timestamp": "1556275410835.025391",
        "TenantClass": 0,
        "Source": "Server.java:550",
        "ThreadID": 48,
        "ThreadName": "",
        "EventID": "CADE9CF93BEA7BF1",
        "BaggageBytes": "[[248 5] [240 0] [0 178 10 133 194 243 36 196 126] [240 1] [0 20 150 163 18 28 6 144 84] [240 3] [0 2]]",
        "ProcessID": 2171
      },
      {
        "Cycles": 0,
        "Agent": "Execution-CPU",
        "ProcessName": "Name",
        "TaskID": "B20A85C2F324C47E",
        "ParentEventID": [
          "CADE9CF93BEA7BF1"
        ],
        "Label": "set",
        "Title": "X-Trace Task",
        "Host": "pinky19.mpi-sws.org",
        "HRT": 25491770894991276,
        "Operation": "set",
        "Timestamp": "1556275410835.064453",
        "TenantClass": 0,
        "Source": "Server.java:2071",
        "ThreadID": 57,
        "ThreadName": "",
        "EventID": "52FA942506C1FA74",
        "BaggageBytes": "[[248 5] [240 0] [0 178 10 133 194 243 36 196 126] [240 1] [0 202 222 156 249 59 234 123 241] [240 3] [0 2]]",
        "ProcessID": 2171
      },
      {
        "Cycles": 0,
        "Agent": "org.apache.hadoop.hdfs.server.namenode.FSNamesystem.audit",
        "ProcessName": "Name",
        "TaskID": "B20A85C2F324C47E",
        "ParentEventID": [
          "3A15E282DC621CB4"
        ],
        "Label": "allowed=true\tugi=plascas (auth:SIMPLE)\tip=/139.19.171.63\tcmd=open\tsrc=/ds/sX0dmNwo8RwmXFFT\tdst=null\tperm=null\tproto=rpc",
        "Title": "X-Trace Task",
        "Host": "pinky19.mpi-sws.org",
        "HRT": 25491770895104997,
        "Timestamp": "1556275410835.178223",
        "TenantClass": 0,
        "Source": "FSNamesystem.java:8313",
        "ThreadID": 57,
        "ThreadName": "",
        "EventID": "C8E222D75384E6A4",
        "BaggageBytes": "[[248 5] [240 0] [0 178 10 133 194 243 36 196 126] [240 1] [0 58 21 226 130 220 98 28 180] [240 3] [0 2]]",
        "ProcessID": 2171
      },
      {
        "Cycles": 0,
        "Agent": "edu.brown.cs.systems.xtrace.logging.BaggageWrappers",
        "ProcessName": "Name",
        "TaskID": "B20A85C2F324C47E",
        "ParentEventID": [
          "C8E222D75384E6A4"
        ],
        "Label": "Forking current baggage with Baggage.fork()",
        "Title": "X-Trace Task",
        "Host": "pinky19.mpi-sws.org",
        "HRT": 25491770895159395,
        "Operation": "fork",
        "Timestamp": "1556275410835.232666",
        "TenantClass": 0,
        "Source": "Server.java:2398",
        "ThreadID": 57,
        "ThreadName": "",
        "EventID": "7ED34D83BE5EAE4B",
        "BaggageBytes": "[[248 5] [240 0] [0 178 10 133 194 243 36 196 126] [240 1] [0 200 226 34 215 83 132 230 164] [240 3] [0 2]]",
        "ProcessID": 2171
      },
      {
        "Cycles": 0,
        "Agent": "org.apache.hadoop.ipc.Server",
        "ProcessName": "Name",
        "TaskID": "B20A85C2F324C47E",
        "ParentEventID": [
          "52FA942506C1FA74"
        ],
        "Label": "getBlockLocations in org.apache.hadoop.hdfs.protocol.ClientProtocol",
        "Title": "X-Trace Task",
        "Host": "pinky19.mpi-sws.org",
        "HRT": 25491770895044386,
        "Timestamp": "1556275410835.117676",
        "TenantClass": 0,
        "Source": "ProtobufRpcEngine.java:601",
        "ThreadID": 57,
        "ThreadName": "",
        "EventID": "3A15E282DC621CB4",
        "BaggageBytes": "[[248 5] [240 0] [0 178 10 133 194 243 36 196 126] [240 1] [0 82 250 148 37 6 193 250 116] [240 3] [0 2]]",
        "ProcessID": 2171
      },
      {
        "Cycles": 0,
        "Agent": "Execution-CPU",
        "ProcessName": "Name",
        "TaskID": "B20A85C2F324C47E",
        "ParentEventID": [
          "7ED34D83BE5EAE4B"
        ],
        "Label": "unset",
        "Title": "X-Trace Task",
        "Host": "pinky19.mpi-sws.org",
        "Duration": "266045",
        "HRT": 25491770895287606,
        "Operation": "unset",
        "Timestamp": "1556275410835.360840",
        "TenantClass": 0,
        "Source": "Server.java:1058",
        "ThreadID": 57,
        "ThreadName": "",
        "EventID": "93431D9CAD4D422C",
        "BaggageBytes": "[[248 5] [240 0] [0 178 10 133 194 243 36 196 126] [240 1] [0 126 211 77 131 190 94 174 75] [240 3] [0 2]]",
        "ProcessID": 2171
      },
      {
        "Cycles": 0,
        "Agent": "Execution-CPU",
        "ProcessName": "Read",
        "TaskID": "B20A85C2F324C47E",
        "ParentEventID": [
          "C6B0030EF6C2320E"
        ],
        "Label": "unset",
        "Title": "X-Trace Task",
        "Host": "pinky19.mpi-sws.org",
        "Duration": "11470",
        "HRT": 25491770895366884,
        "Operation": "unset",
        "Timestamp": "1556275410835.427734",
        "TenantClass": 0,
        "Source": "Client.java:1168",
        "ThreadID": 37,
        "ThreadName": "",
        "EventID": "0DB9DBE2B0018786",
        "ProcessID": 21035
      },
      {
        "Cycles": 0,
        "Agent": "Execution-CPU",
        "ProcessName": "Read",
        "TaskID": "B20A85C2F324C47E",
        "ParentEventID": [
          "7ED34D83BE5EAE4B"
        ],
        "Label": "set",
        "Title": "X-Trace Task",
        "Host": "pinky19.mpi-sws.org",
        "HRT": 25491770895336805,
        "Operation": "set",
        "Timestamp": "1556275410835.397705",
        "TenantClass": 0,
        "Source": "Client.java:302",
        "ThreadID": 37,
        "ThreadName": "",
        "EventID": "C6B0030EF6C2320E",
        "ProcessID": 21035
      },
      {
        "Cycles": 0,
        "Agent": "Execution-Sleep",
        "ProcessName": "Read",
        "TaskID": "B20A85C2F324C47E",
        "ParentEventID": [
          "C0484E879B856653"
        ],
        "Label": "waited",
        "Title": "X-Trace Task",
        "Host": "pinky19.mpi-sws.org",
        "Duration": "513885",
        "HRT": 25491770895389259,
        "Operation": "waited",
        "Timestamp": "1556275410835.450195",
        "TenantClass": 0,
        "Source": "Client.java:1537",
        "ThreadID": 1,
        "ThreadName": "",
        "EventID": "2ED76E690EE6D761",
        "ProcessID": 21035
      },
      {
        "Cycles": 0,
        "Agent": "edu.brown.cs.systems.xtrace.logging.BaggageWrappers",
        "ProcessName": "Read",
        "TaskID": "B20A85C2F324C47E",
        "ParentEventID": [
          "0DB9DBE2B0018786",
          "2ED76E690EE6D761"
        ],
        "Label": "Merged current baggage with other baggage",
        "Title": "X-Trace Task",
        "Host": "pinky19.mpi-sws.org",
        "HRT": 25491770895405890,
        "Operation": "join",
        "Timestamp": "1556275410835.466797",
        "TenantClass": 0,
        "Source": "Client.java:1545",
        "ThreadID": 1,
        "ThreadName": "",
        "EventID": "37FFE08D3CA9FFC5",
        "ProcessID": 21035
      },
      {
        "Cycles": 0,
        "Agent": "org.apache.hadoop.ipc.ProtobufRpcEngine",
        "ProcessName": "Read",
        "TaskID": "B20A85C2F324C47E",
        "ParentEventID": [
          "37FFE08D3CA9FFC5"
        ],
        "Label": "org.apache.hadoop.hdfs.protocol.ClientProtocol.getBlockLocations completed",
        "Title": "X-Trace Task",
        "Host": "pinky19.mpi-sws.org",
        "HRT": 25491770895446189,
        "Timestamp": "1556275410835.507080",
        "TenantClass": 0,
        "Source": "ProtobufRpcEngine.java:275",
        "ThreadID": 1,
        "ThreadName": "",
        "EventID": "8F69702D77DE5A16",
        "ProcessID": 21035
      },
      {
        "Cycles": 0,
        "Agent": "edu.brown.cs.systems.xtrace.logging.BaggageWrappers",
        "ProcessName": "Read",
        "TaskID": "B20A85C2F324C47E",
        "ParentEventID": [
          "8F69702D77DE5A16"
        ],
        "Label": "Forking current baggage with Baggage.fork()",
        "Title": "X-Trace Task",
        "Host": "pinky19.mpi-sws.org",
        "HRT": 25491770895519455,
        "Operation": "fork",
        "Timestamp": "1556275410835.580322",
        "TenantClass": 0,
        "Source": "DataTransferProtoUtil.java:94",
        "ThreadID": 1,
        "ThreadName": "",
        "EventID": "A6081DAE678C971E",
        "ProcessID": 21035
      },
      {
        "Cycles": 0,
        "Agent": "edu.brown.cs.systems.xtrace.logging.XTraceInit",
        "ProcessName": "Data",
        "TaskID": "B20A85C2F324C47E",
        "ParentEventID": [
          "D1124F223284EA3C"
        ],
        "Label": "Thread.setName: DataXceiver for client DFSClient_NONMAPREDUCE_1377588049_1 at /139.19.171.63:36074 [Sending block BP-1633380353-139.19.171.63-1554193446451:blk_1073755339_14515]",
        "Title": "X-Trace Task",
        "Host": "pinky19.mpi-sws.org",
        "HRT": 25491770895706536,
        "Timestamp": "1556275410835.757324",
        "TenantClass": 0,
        "Source": "DataXceiver.java:168",
        "ThreadID": 9602,
        "ThreadName": "",
        "EventID": "C8824043566CF73E",
        "BaggageBytes": "[[248 5] [240 0] [0 178 10 133 194 243 36 196 126] [240 1] [0 209 18 79 34 50 132 234 60] [240 3] [0 2]]",
        "ProcessID": 2319
      },
      {
        "Cycles": 0,
        "Agent": "Execution-CPU",
        "ProcessName": "Data",
        "TaskID": "B20A85C2F324C47E",
        "ParentEventID": [
          "A6081DAE678C971E"
        ],
        "Label": "set",
        "Title": "X-Trace Task",
        "Host": "pinky19.mpi-sws.org",
        "HRT": 25491770895666137,
        "Operation": "set",
        "Timestamp": "1556275410835.717041",
        "TenantClass": 0,
        "Source": "Receiver.java:117",
        "ThreadID": 9602,
        "ThreadName": "",
        "EventID": "D1124F223284EA3C",
        "BaggageBytes": "[[248 5] [240 0] [0 178 10 133 194 243 36 196 126] [240 1] [0 166 8 29 174 103 140 151 30] [240 3] [0 2]]",
        "ProcessID": 2319
      },
      {
        "Cycles": 0,
        "Agent": "edu.brown.cs.systems.xtrace.logging.BaggageWrappers",
        "ProcessName": "Data",
        "TaskID": "B20A85C2F324C47E",
        "ParentEventID": [
          "C8824043566CF73E"
        ],
        "Label": "Forking current baggage with Baggage.fork()",
        "Title": "X-Trace Task",
        "Host": "pinky19.mpi-sws.org",
        "HRT": 25491770895786187,
        "Operation": "fork",
        "Timestamp": "1556275410835.837158",
        "TenantClass": 0,
        "Source": "DataXceiver.java:1257",
        "ThreadID": 9602,
        "ThreadName": "",
        "EventID": "2C3AAC38EA3EBD2B",
        "BaggageBytes": "[[248 5] [240 0] [0 178 10 133 194 243 36 196 126] [240 1] [0 200 130 64 67 86 108 247 62] [240 3] [0 2]]",
        "ProcessID": 2319
      },
      {
        "Cycles": 0,
        "Agent": "edu.brown.cs.systems.xtrace.logging.BaggageWrappers",
        "ProcessName": "Data",
        "TaskID": "B20A85C2F324C47E",
        "ParentEventID": [
          "2C3AAC38EA3EBD2B"
        ],
        "Label": "Forking current baggage with Baggage.fork()",
        "Title": "X-Trace Task",
        "Host": "pinky19.mpi-sws.org",
        "HRT": 25491770895849662,
        "Operation": "fork",
        "Timestamp": "1556275410835.900635",
        "TenantClass": 0,
        "Source": "PacketHeader.java:95",
        "ThreadID": 9602,
        "ThreadName": "",
        "EventID": "1772D91BDB921349",
        "BaggageBytes": "[[248 5] [240 0] [0 178 10 133 194 243 36 196 126] [240 1] [0 44 58 172 56 234 62 189 43] [240 3] [0 2]]",
        "ProcessID": 2319
      },
      {
        "Cycles": 0,
        "Agent": "Execution-Sleep",
        "ProcessName": "Read",
        "TaskID": "B20A85C2F324C47E",
        "ParentEventID": [
          "A6081DAE678C971E"
        ],
        "Label": "waited",
        "Title": "X-Trace Task",
        "Host": "pinky19.mpi-sws.org",
        "Duration": "215883",
        "HRT": 25491770895847897,
        "Operation": "waited",
        "Timestamp": "1556275410835.908691",
        "TenantClass": 0,
        "Source": "SocketIOWithTimeout.java:335",
        "ThreadID": 1,
        "ThreadName": "",
        "EventID": "2FA75C583333DB3D",
        "ProcessID": 21035
      },
      {
        "Cycles": 0,
        "Agent": "edu.brown.cs.systems.xtrace.logging.BaggageWrappers",
        "ProcessName": "Read",
        "TaskID": "B20A85C2F324C47E",
        "ParentEventID": [
          "2C3AAC38EA3EBD2B",
          "2FA75C583333DB3D"
        ],
        "Label": "Merged current baggage with other baggage",
        "Title": "X-Trace Task",
        "Host": "pinky19.mpi-sws.org",
        "HRT": 25491770895924469,
        "Operation": "join",
        "Timestamp": "1556275410835.985352",
        "TenantClass": 0,
        "Source": "RemoteBlockReader2.java:429",
        "ThreadID": 1,
        "ThreadName": "",
        "EventID": "58334F7B4903FB57",
        "ProcessID": 21035
      },
      {
        "Cycles": 0,
        "Agent": "Execution-Sleep",
        "ProcessName": "Data",
        "TaskID": "B20A85C2F324C47E",
        "ParentEventID": [
          "1772D91BDB921349"
        ],
        "Label": "waited",
        "Title": "X-Trace Task",
        "Host": "pinky19.mpi-sws.org",
        "Duration": "4137",
        "HRT": 25491770895909931,
        "Operation": "waited",
        "Timestamp": "1556275410835.960693",
        "TenantClass": 0,
        "Source": "SocketIOWithTimeout.java:335",
        "ThreadID": 9602,
        "ThreadName": "",
        "EventID": "7BF9E8FDB354B370",
        "BaggageBytes": "[[248 5] [240 0] [0 178 10 133 194 243 36 196 126] [240 1] [0 23 114 217 27 219 146 19 73] [240 3] [0 2]]",
        "ProcessID": 2319
      },
      {
        "Cycles": 0,
        "Agent": "edu.brown.cs.systems.xtrace.logging.BaggageWrappers",
        "ProcessName": "Data",
        "TaskID": "B20A85C2F324C47E",
        "ParentEventID": [
          "7BF9E8FDB354B370"
        ],
        "Label": "Forking current baggage with Baggage.fork()",
        "Title": "X-Trace Task",
        "Host": "pinky19.mpi-sws.org",
        "HRT": 25491770895972200,
        "Operation": "fork",
        "Timestamp": "1556275410836.022949",
        "TenantClass": 0,
        "Source": "PacketHeader.java:95",
        "ThreadID": 9602,
        "ThreadName": "",
        "EventID": "007D5DB165777CC5",
        "BaggageBytes": "[[248 5] [240 0] [0 178 10 133 194 243 36 196 126] [240 1] [0 123 249 232 253 179 84 179 112] [240 3] [0 2]]",
        "ProcessID": 2319
      },
      {
        "Cycles": 0,
        "Agent": "edu.brown.cs.systems.xtrace.logging.BaggageWrappers",
        "ProcessName": "Read",
        "TaskID": "B20A85C2F324C47E",
        "ParentEventID": [
          "007D5DB165777CC5",
          "8661F968A2ADDC90"
        ],
        "Label": "Merged current baggage with other baggage",
        "Title": "X-Trace Task",
        "Host": "pinky19.mpi-sws.org",
        "HRT": 25491770896064244,
        "Operation": "join",
        "Timestamp": "1556275410836.125000",
        "TenantClass": 0,
        "Source": "PacketHeader.java:168",
        "ThreadID": 1,
        "ThreadName": "",
        "EventID": "C28969BB04041C21",
        "ProcessID": 21035
      },
      {
        "Cycles": 0,
        "Agent": "edu.brown.cs.systems.xtrace.logging.BaggageWrappers",
        "ProcessName": "Read",
        "TaskID": "B20A85C2F324C47E",
        "ParentEventID": [
          "58334F7B4903FB57",
          "1772D91BDB921349"
        ],
        "Label": "Merged current baggage with other baggage",
        "Title": "X-Trace Task",
        "Host": "pinky19.mpi-sws.org",
        "HRT": 25491770896006911,
        "Operation": "join",
        "Timestamp": "1556275410836.067871",
        "TenantClass": 0,
        "Source": "PacketHeader.java:168",
        "ThreadID": 1,
        "ThreadName": "",
        "EventID": "8661F968A2ADDC90",
        "ProcessID": 21035
      },
      {
        "Cycles": 0,
        "Agent": "edu.brown.cs.systems.xtrace.logging.BaggageWrappers",
        "ProcessName": "Read",
        "TaskID": "B20A85C2F324C47E",
        "ParentEventID": [
          "C28969BB04041C21"
        ],
        "Label": "Forking current baggage with Baggage.fork()",
        "Title": "X-Trace Task",
        "Host": "pinky19.mpi-sws.org",
        "HRT": 25491770896074453,
        "Operation": "fork",
        "Timestamp": "1556275410836.135254",
        "TenantClass": 0,
        "Source": "RemoteBlockReader2.java:361",
        "ThreadID": 1,
        "ThreadName": "",
        "EventID": "45437A8A9EBA19C5",
        "ProcessID": 21035
      },
      {
        "Cycles": 0,
        "Agent": "edu.brown.cs.systems.xtrace.logging.BaggageWrappers",
        "ProcessName": "Data",
        "TaskID": "B20A85C2F324C47E",
        "ParentEventID": [
          "A2973AD227E61751",
          "45437A8A9EBA19C5"
        ],
        "Label": "Merged current baggage with other baggage",
        "Title": "X-Trace Task",
        "Host": "pinky19.mpi-sws.org",
        "HRT": 25491770896186349,
        "Operation": "join",
        "Timestamp": "1556275410836.237305",
        "TenantClass": 0,
        "Source": "DataXceiver.java:574",
        "ThreadID": 9602,
        "ThreadName": "",
        "EventID": "3849F3D7E5A8F43D",
        "BaggageBytes": "[[248 5] [240 0] [0 178 10 133 194 243 36 196 126] [240 1] [0 162 151 58 210 39 230 23 81] [0 69 67 122 138 158 186 25 197] [240 3] [0 2]]",
        "ProcessID": 2319
      },
      {
        "Cycles": 0,
        "Agent": "Execution-Sleep",
        "ProcessName": "Data",
        "TaskID": "B20A85C2F324C47E",
        "ParentEventID": [
          "007D5DB165777CC5"
        ],
        "Label": "waited",
        "Title": "X-Trace Task",
        "Host": "pinky19.mpi-sws.org",
        "Duration": "76792",
        "HRT": 25491770896128578,
        "Operation": "waited",
        "Timestamp": "1556275410836.179443",
        "TenantClass": 0,
        "Source": "SocketIOWithTimeout.java:335",
        "ThreadID": 9602,
        "ThreadName": "",
        "EventID": "A2973AD227E61751",
        "BaggageBytes": "[[248 5] [240 0] [0 178 10 133 194 243 36 196 126] [240 1] [0 0 125 93 177 101 119 124 197] [240 3] [0 2]]",
        "ProcessID": 2319
      },
      {
        "Cycles": 0,
        "Agent": "Execution-CPU",
        "ProcessName": "Data",
        "TaskID": "B20A85C2F324C47E",
        "ParentEventID": [
          "3849F3D7E5A8F43D"
        ],
        "Label": "unset",
        "Title": "X-Trace Task",
        "Host": "pinky19.mpi-sws.org",
        "Duration": "512252",
        "HRT": 25491770896207119,
        "Operation": "unset",
        "Timestamp": "1556275410836.258057",
        "TenantClass": 0,
        "Source": "DataXceiver.java:261",
        "ThreadID": 9602,
        "ThreadName": "",
        "EventID": "FCDE0A7328E5BFB8",
        "BaggageBytes": "[[248 5] [240 0] [0 178 10 133 194 243 36 196 126] [240 1] [0 56 73 243 215 229 168 244 61] [240 3] [0 2]]",
        "ProcessID": 2319
      },
      {
        "Cycles": 0,
        "Agent": "edu.brown.cs.systems.retro.benchmarks.hdfs_client.Reader",
        "ProcessName": "Read",
        "TaskID": "B20A85C2F324C47E",
        "ParentEventID": [
          "0"
        ],
        "Label": "Reading file",
        "Title": "X-Trace Task",
        "Host": "pinky19.mpi-sws.org",
        "HRT": 25491770894639896,
        "Timestamp": "1556275410834.700684",
        "TenantClass": 0,
        "ThreadID": 1,
        "ThreadName": "",
        "EventID": "2F4D63BDCC12A325",
        "ProcessID": 21035,
        "Tag": [
          "reader_1kb",
          "Read Size: 1024"
        ]
      }
    ]
  }
]