[
  {
    "id": "82B97A99F4CE0A9D",
    "reports": [
      {
        "Cycles": 0,
        "Agent": "edu.brown.cs.systems.retro.benchmarks.hdfs_client.Reader",
        "ProcessName": "Read",
        "TaskID": "82B97A99F4CE0A9D",
        "ParentEventID": [
          "0"
        ],
        "Label": "Reading file",
        "Title": "X-Trace Task",
        "Host": "pinky19.mpi-sws.org",
        "HRT": 25491843997031495,
        "Timestamp": "1556275483937.207764",
        "TenantClass": 0,
        "ThreadID": 1,
        "ThreadName": "",
        "EventID": "5057D81C47D990D3",
        "ProcessID": 21035,
        "Tag": [
          "reader_1kb",
          "Read Size: 1024"
        ]
      },
      {
        "Cycles": 0,
        "Agent": "Execution-CPU",
        "ProcessName": "Read",
        "TaskID": "82B97A99F4CE0A9D",
        "ParentEventID": [
          "D1C6E8B7FB455646"
        ],
        "Label": "unset",
        "Title": "X-Trace Task",
        "Host": "pinky19.mpi-sws.org",
        "Duration": "21804460",
        "HRT": 25491843997117104,
        "Operation": "unset",
        "Timestamp": "1556275483937.293457",
        "TenantClass": 0,
        "Source": "Client.java:1027",
        "ThreadID": 1,
        "ThreadName": "",
        "EventID": "D031D42A73EF77DB",
        "ProcessID": 21035
      },
      {
        "Cycles": 0,
        "Agent": "org.apache.hadoop.ipc.ProtobufRpcEngine",
        "ProcessName": "Read",
        "TaskID": "82B97A99F4CE0A9D",
        "ParentEventID": [
          "9D76A24D3E61B1C9"
        ],
        "Label": "Invoking org.apache.hadoop.hdfs.protocol.ClientProtocol.getBlockLocations",
        "Title": "X-Trace Task",
        "Host": "pinky19.mpi-sws.org",
        "HRT": 25491843997084542,
        "Timestamp": "1556275483937.260742",
        "TenantClass": 0,
        "Source": "ProtobufRpcEngine.java:228",
        "ThreadID": 1,
        "ThreadName": "",
        "EventID": "D1C6E8B7FB455646",
        "ProcessID": 21035
      },
      {
        "Cycles": 0,
        "Agent": "Execution-CPU",
        "ProcessName": "Read",
        "TaskID": "82B97A99F4CE0A9D",
        "ParentEventID": [
          "D031D42A73EF77DB"
        ],
        "Label": "set",
        "Title": "X-Trace Task",
        "Host": "pinky19.mpi-sws.org",
        "HRT": 25491843997167424,
        "Operation": "set",
        "Timestamp": "1556275483937.343750",
        "TenantClass": 0,
        "Source": "Client.java:1032",
        "ThreadID": 41,
        "ThreadName": "",
        "EventID": "CDDD1E341815458B",
        "ProcessID": 21035
      },
      {
        "Cycles": 0,
        "Agent": "edu.brown.cs.systems.xtrace.logging.BaggageWrappers",
        "ProcessName": "Read",
        "TaskID": "82B97A99F4CE0A9D",
        "ParentEventID": [
          "CDDD1E341815458B"
        ],
        "Label": "Forking current baggage with Baggage.fork()",
        "Title": "X-Trace Task",
        "Host": "pinky19.mpi-sws.org",
        "HRT": 25491843997186864,
        "Operation": "fork",
        "Timestamp": "1556275483937.363037",
        "TenantClass": 0,
        "Source": "Client.java:1043",
        "ThreadID": 41,
        "ThreadName": "",
        "EventID": "87A7065E6A6DD2D2",
        "ProcessID": 21035
      },
      {
        "Cycles": 0,
        "Agent": "edu.brown.cs.systems.retro.benchmarks.hdfs_client.Reader",
        "ProcessName": "Read",
        "TaskID": "82B97A99F4CE0A9D",
        "ParentEventID": [
          "5057D81C47D990D3"
        ],
        "Label": "Reading file",
        "Title": "X-Trace Task",
        "Host": "pinky19.mpi-sws.org",
        "HRT": 25491843997048319,
        "Timestamp": "1556275483937.224609",
        "TenantClass": 0,
        "ThreadID": 1,
        "ThreadName": "",
        "EventID": "9D76A24D3E61B1C9",
        "ProcessID": 21035
      },
      {
        "Cycles": 0,
        "Agent": "Execution-CPU",
        "ProcessName": "Name",
        "TaskID": "82B97A99F4CE0A9D",
        "ParentEventID": [
          "87A7065E6A6DD2D2"
        ],
        "Label": "set",
        "Title": "X-Trace Task",
        "Host": "pinky19.mpi-sws.org",
        "HRT": 25491843997337171,
        "Operation": "set",
        "Timestamp": "1556275483937.540283",
        "TenantClass": 0,
        "Source": "Server.java:1840",
        "ThreadID": 48,
        "ThreadName": "",
        "EventID": "A3542D2703A93631",
        "BaggageBytes": "[[248 5] [240 0] [0 130 185 122 153 244 206 10 157] [240 1] [0 135 167 6 94 106 109 210 210] [240 3] [0 2]]",
        "ProcessID": 2171
      },
      {
        "Cycles": 0,
        "Agent": "Execution-CPU",
        "ProcessName": "Read",
        "TaskID": "82B97A99F4CE0A9D",
        "ParentEventID": [
          "77EDBEE7760B28D2"
        ],
        "Label": "set",
        "Title": "X-Trace Task",
        "Host": "pinky19.mpi-sws.org",
        "HRT": 25491843997278673,
        "Operation": "set",
        "Timestamp": "1556275483937.454834",
        "TenantClass": 0,
        "Source": "Client.java:1104",
        "ThreadID": 1,
        "ThreadName": "",
        "EventID": "8B56E156E19A0AAC",
        "ProcessID": 21035
      },
      {
        "Cycles": 0,
        "Agent": "Execution-CPU",
        "ProcessName": "Name",
        "TaskID": "82B97A99F4CE0A9D",
        "ParentEventID": [
          "DC5DD474508C1F35"
        ],
        "Label": "unset",
        "Title": "X-Trace Task",
        "Host": "pinky19.mpi-sws.org",
        "Duration": "25552",
        "HRT": 25491843997391945,
        "Operation": "unset",
        "Timestamp": "1556275483937.594971",
        "TenantClass": 0,
        "Source": "Server.java:1828",
        "ThreadID": 48,
        "ThreadName": "",
        "EventID": "9C31700FEFAF3C97",
        "BaggageBytes": "[[248 5] [240 0] [0 130 185 122 153 244 206 10 157] [240 1] [0 220 93 212 116 80 140 31 53] [240 3] [0 2]]",
        "ProcessID": 2171
      },
      {
        "Cycles": 0,
        "Agent": "Execution-CPU",
        "ProcessName": "Name",
        "TaskID": "82B97A99F4CE0A9D",
        "ParentEventID": [
          "DC5DD474508C1F35"
        ],
        "Label": "set",
        "Title": "X-Trace Task",
        "Host": "pinky19.mpi-sws.org",
        "HRT": 25491843997406389,
        "Operation": "set",
        "Timestamp": "1556275483937.609375",
        "TenantClass": 0,
        "Source": "Server.java:2071",
        "ThreadID": 63,
        "ThreadName": "",
        "EventID": "74EAC64963A3F15E",
        "BaggageBytes": "[[248 5] [240 0] [0 130 185 122 153 244 206 10 157] [240 1] [0 220 93 212 116 80 140 31 53] [240 3] [0 2]]",
        "ProcessID": 2171
      },
      {
        "Cycles": 0,
        "Agent": "org.apache.hadoop.ipc.Server",
        "ProcessName": "Name",
        "TaskID": "82B97A99F4CE0A9D",
        "ParentEventID": [
          "74EAC64963A3F15E"
        ],
        "Label": "getBlockLocations in org.apache.hadoop.hdfs.protocol.ClientProtocol",
        "Title": "X-Trace Task",
        "Host": "pinky19.mpi-sws.org",
        "HRT": 25491843997460077,
        "Timestamp": "1556275483937.663086",
        "TenantClass": 0,
        "Source": "ProtobufRpcEngine.java:601",
        "ThreadID": 63,
        "ThreadName": "",
        "EventID": "F5DA9ABCA9E2CC10",
        "BaggageBytes": "[[248 5] [240 0] [0 130 185 122 153 244 206 10 157] [240 1] [0 116 234 198 73 99 163 241 94] [240 3] [0 2]]",
        "ProcessID": 2171
      },
      {
        "Cycles": 0,
        "Agent": "org.apache.hadoop.hdfs.server.namenode.FSNamesystem.audit",
        "ProcessName": "Name",
        "TaskID": "82B97A99F4CE0A9D",
        "ParentEventID": [
          "F5DA9ABCA9E2CC10"
        ],
        "Label": "allowed=true\tugi=plascas (auth:SIMPLE)\tip=/139.19.171.63\tcmd=open\tsrc=/ds/LhwGTFYoux2WFuWP\tdst=null\tperm=null\tproto=rpc",
        "Title": "X-Trace Task",
        "Host": "pinky19.mpi-sws.org",
        "HRT": 25491843997536413,
        "Timestamp": "1556275483937.739502",
        "TenantClass": 0,
        "Source": "FSNamesystem.java:8313",
        "ThreadID": 63,
        "ThreadName": "",
        "EventID": "53C84552B44FAE4E",
        "BaggageBytes": "[[248 5] [240 0] [0 130 185 122 153 244 206 10 157] [240 1] [0 245 218 154 188 169 226 204 16] [240 3] [0 2]]",
        "ProcessID": 2171
      },
      {
        "Cycles": 0,
        "Agent": "edu.brown.cs.systems.xtrace.logging.BaggageWrappers",
        "ProcessName": "Name",
        "TaskID": "82B97A99F4CE0A9D",
        "ParentEventID": [
          "53C84552B44FAE4E"
        ],
        "Label": "Forking current baggage with Baggage.fork()",
        "Title": "X-Trace Task",
        "Host": "pinky19.mpi-sws.org",
        "HRT": 25491843997592570,
        "Operation": "fork",
        "Timestamp": "1556275483937.795654",
        "TenantClass": 0,
        "Source": "Server.java:2398",
        "ThreadID": 63,
        "ThreadName": "",
        "EventID": "697A54780B06251F",
        "BaggageBytes": "[[248 5] [240 0] [0 130 185 122 153 244 206 10 157] [240 1] [0 83 200 69 82 180 79 174 78] [240 3] [0 2]]",
        "ProcessID": 2171
      },
      {
        "Cycles": 0,
        "Agent": "Execution-CPU",
        "ProcessName": "Read",
        "TaskID": "82B97A99F4CE0A9D",
        "ParentEventID": [
          "87A7065E6A6DD2D2"
        ],
        "Label": "unset",
        "Title": "X-Trace Task",
        "Host": "pinky19.mpi-sws.org",
        "Duration": "71909",
        "HRT": 25491843997257278,
        "Operation": "unset",
        "Timestamp": "1556275483937.433594",
        "TenantClass": 0,
        "Source": "Client.java:1062",
        "ThreadID": 41,
        "ThreadName": "",
        "EventID": "77EDBEE7760B28D2",
        "ProcessID": 21035
      },
      {
        "Cycles": 0,
        "Agent": "edu.brown.cs.systems.xtrace.logging.BaggageWrappers",
        "ProcessName": "Name",
        "TaskID": "82B97A99F4CE0A9D",
        "ParentEventID": [
          "A3542D2703A93631"
        ],
        "Label": "Forking current baggage with Baggage.fork()",
        "Title": "X-Trace Task",
        "Host": "pinky19.mpi-sws.org",
        "HRT": 25491843997369980,
        "Operation": "fork",
        "Timestamp": "1556275483937.572998",
        "TenantClass": 0,
        "Source": "Server.java:550",
        "ThreadID": 48,
        "ThreadName": "",
        "EventID": "DC5DD474508C1F35",
        "BaggageBytes": "[[248 5] [240 0] [0 130 185 122 153 244 206 10 157] [240 1] [0 163 84 45 39 3 169 54 49] [240 3] [0 2]]",
        "ProcessID": 2171
      },
      {
        "Cycles": 0,
        "Agent": "Execution-CPU",
        "ProcessName": "Read",
        "TaskID": "82B97A99F4CE0A9D",
        "ParentEventID": [
          "697A54780B06251F"
        ],
        "Label": "set",
        "Title": "X-Trace Task",
        "Host": "pinky19.mpi-sws.org",
        "HRT": 25491843997796574,
        "Operation": "set",
        "Timestamp": "1556275483937.972900",
        "TenantClass": 0,
        "Source": "Client.java:302",
        "ThreadID": 37,
        "ThreadName": "",
        "EventID": "89479B2B9E20F94D",
        "ProcessID": 21035
      },
      {
        "Cycles": 0,
        "Agent": "Execution-CPU",
        "ProcessName": "Name",
        "TaskID": "82B97A99F4CE0A9D",
        "ParentEventID": [
          "697A54780B06251F"
        ],
        "Label": "unset",
        "Title": "X-Trace Task",
        "Host": "pinky19.mpi-sws.org",
        "Duration": "280846",
        "HRT": 25491843997722818,
        "Operation": "unset",
        "Timestamp": "1556275483937.925781",
        "TenantClass": 0,
        "Source": "Server.java:1058",
        "ThreadID": 63,
        "ThreadName": "",
        "EventID": "A03356FCAA887A2E",
        "BaggageBytes": "[[248 5] [240 0] [0 130 185 122 153 244 206 10 157] [240 1] [0 105 122 84 120 11 6 37 31] [240 3] [0 2]]",
        "ProcessID": 2171
      },
      {
        "Cycles": 0,
        "Agent": "Execution-CPU",
        "ProcessName": "Read",
        "TaskID": "82B97A99F4CE0A9D",
        "ParentEventID": [
          "89479B2B9E20F94D"
        ],
        "Label": "unset",
        "Title": "X-Trace Task",
        "Host": "pinky19.mpi-sws.org",
        "Duration": "9531",
        "HRT": 25491843997822651,
        "Operation": "unset",
        "Timestamp": "1556275483937.999023",
        "TenantClass": 0,
        "Source": "Client.java:1168",
        "ThreadID": 37,
        "ThreadName": "",
        "EventID": "FA69FD62654AD03C",
        "ProcessID": 21035
      },
      {
        "Cycles": 0,
        "Agent": "Execution-Sleep",
        "ProcessName": "Read",
        "TaskID": "82B97A99F4CE0A9D",
        "ParentEventID": [
          "8B56E156E19A0AAC"
        ],
        "Label": "waited",
        "Title": "X-Trace Task",
        "Host": "pinky19.mpi-sws.org",
        "Duration": "553431",
        "HRT": 25491843997841110,
        "Operation": "waited",
        "Timestamp": "1556275483938.017334",
        "TenantClass": 0,
        "Source": "Client.java:1537",
        "ThreadID": 1,
        "ThreadName": "",
        "EventID": "4851BDAD0ECD0427",
        "ProcessID": 21035
      },
      {
        "Cycles": 0,
        "Agent": "edu.brown.cs.systems.xtrace.logging.BaggageWrappers",
        "ProcessName": "Read",
        "TaskID": "82B97A99F4CE0A9D",
        "ParentEventID": [
          "FA69FD62654AD03C",
          "4851BDAD0ECD0427"
        ],
        "Label": "Merged current baggage with other baggage",
        "Title": "X-Trace Task",
        "Host": "pinky19.mpi-sws.org",
        "HRT": 25491843997882469,
        "Operation": "join",
        "Timestamp": "1556275483938.058838",
        "TenantClass": 0,
        "Source": "Client.java:1545",
        "ThreadID": 1,
        "ThreadName": "",
        "EventID": "3ED7D6966254ED40",
        "ProcessID": 21035
      },
      {
        "Cycles": 0,
        "Agent": "org.apache.hadoop.ipc.ProtobufRpcEngine",
        "ProcessName": "Read",
        "TaskID": "82B97A99F4CE0A9D",
        "ParentEventID": [
          "3ED7D6966254ED40"
        ],
        "Label": "org.apache.hadoop.hdfs.protocol.ClientProtocol.getBlockLocations completed",
        "Title": "X-Trace Task",
        "Host": "pinky19.mpi-sws.org",
        "HRT": 25491843997942267,
        "Timestamp": "1556275483938.118652",
        "TenantClass": 0,
        "Source": "ProtobufRpcEngine.java:275",
        "ThreadID": 1,
        "ThreadName": "",
        "EventID": "8E8C5BE2D42EEAB4",
        "ProcessID": 21035
      },
      {
        "Cycles": 0,
        "Agent": "edu.brown.cs.systems.xtrace.logging.BaggageWrappers",
        "ProcessName": "Read",
        "TaskID": "82B97A99F4CE0A9D",
        "ParentEventID": [
          "8E8C5BE2D42EEAB4"
        ],
        "Label": "Forking current baggage with Baggage.fork()",
        "Title": "X-Trace Task",
        "Host": "pinky19.mpi-sws.org",
        "HRT": 25491843998038216,
        "Operation": "fork",
        "Timestamp": "1556275483938.214600",
        "TenantClass": 0,
        "Source": "DataTransferProtoUtil.java:94",
        "ThreadID": 1,
        "ThreadName": "",
        "EventID": "8EAE9AEFF68261B2",
        "ProcessID": 21035
      },
      {
        "Cycles": 0,
        "Agent": "Execution-Sleep",
        "ProcessName": "Read",
        "TaskID": "82B97A99F4CE0A9D",
        "ParentEventID": [
          "8EAE9AEFF68261B2"
        ],
        "Label": "waited",
        "Title": "X-Trace Task",
        "Host": "pinky19.mpi-sws.org",
        "Duration": "872933",
        "HRT": 25491843999033720,
        "Operation": "waited",
        "Timestamp": "1556275483939.209961",
        "TenantClass": 0,
        "Source": "SocketIOWithTimeout.java:335",
        "ThreadID": 1,
        "ThreadName": "",
        "EventID": "3A91CADB8B0FF1E8",
        "ProcessID": 21035
      },
      {
        "Cycles": 0,
        "Agent": "edu.brown.cs.systems.xtrace.logging.BaggageWrappers",
        "ProcessName": "Read",
        "TaskID": "82B97A99F4CE0A9D",
        "ParentEventID": [
          "3A91CADB8B0FF1E8",
          "E8A654EB48F052A4"
        ],
        "Label": "Merged current baggage with other baggage",
        "Title": "X-Trace Task",
        "Host": "pinky19.mpi-sws.org",
        "HRT": 25491843999139519,
        "Operation": "join",
        "Timestamp": "1556275483939.315674",
        "TenantClass": 0,
        "Source": "RemoteBlockReader2.java:429",
        "ThreadID": 1,
        "ThreadName": "",
        "EventID": "518736BE8A4D825E",
        "ProcessID": 21035
      },
      {
        "Cycles": 0,
        "Agent": "Execution-Sleep",
        "ProcessName": "Read",
        "TaskID": "82B97A99F4CE0A9D",
        "ParentEventID": [
          "518736BE8A4D825E"
        ],
        "Label": "waited",
        "Title": "X-Trace Task",
        "Host": "pinky19.mpi-sws.org",
        "Duration": "135552",
        "HRT": 25491843999398588,
        "Operation": "waited",
        "Timestamp": "1556275483939.574951",
        "TenantClass": 0,
        "Source": "SocketIOWithTimeout.java:335",
        "ThreadID": 1,
        "ThreadName": "",
        "EventID": "4AAB7C3F4554550D",
        "ProcessID": 21035
      },
      {
        "Cycles": 0,
        "Agent": "edu.brown.cs.systems.xtrace.logging.BaggageWrappers",
        "ProcessName": "Read",
        "TaskID": "82B97A99F4CE0A9D",
        "ParentEventID": [
          "4AAB7C3F4554550D",
          "24CC3AECE04C10B5"
        ],
        "Label": "Merged current baggage with other baggage",
        "Title": "X-Trace Task",
        "Host": "pinky19.mpi-sws.org",
        "HRT": 25491843999456184,
        "Operation": "join",
        "Timestamp": "1556275483939.632568",
        "TenantClass": 0,
        "Source": "PacketHeader.java:168",
        "ThreadID": 1,
        "ThreadName": "",
        "EventID": "8B0343418416ECB4",
        "ProcessID": 21035
      },
      {
        "Cycles": 0,
        "Agent": "Execution-Sleep",
        "ProcessName": "Read",
        "TaskID": "82B97A99F4CE0A9D",
        "ParentEventID": [
          "8B0343418416ECB4"
        ],
        "Label": "waited",
        "Title": "X-Trace Task",
        "Host": "pinky19.mpi-sws.org",
        "Duration": "41046",
        "HRT": 25491843999540755,
        "Operation": "waited",
        "Timestamp": "1556275483939.717041",
        "TenantClass": 0,
        "Source": "SocketIOWithTimeout.java:335",
        "ThreadID": 1,
        "ThreadName": "",
        "EventID": "434B478CA6228FB0",
        "ProcessID": 21035
      },
      {
        "Cycles": 0,
        "Agent": "edu.brown.cs.systems.xtrace.logging.BaggageWrappers",
        "ProcessName": "Read",
        "TaskID": "82B97A99F4CE0A9D",
        "ParentEventID": [
          "434B478CA6228FB0",
          "945AE08612963FD1"
        ],
        "Label": "Merged current baggage with other baggage",
        "Title": "X-Trace Task",
        "Host": "pinky19.mpi-sws.org",
        "HRT": 25491843999621440,
        "Operation": "join",
        "Timestamp": "1556275483939.797607",
        "TenantClass": 0,
        "Source": "PacketHeader.java:168",
        "ThreadID": 1,
        "ThreadName": "",
        "EventID": "E8E8BB8DA8A663DF",
        "ProcessID": 21035
      },
      {
        "Cycles": 0,
        "Agent": "edu.brown.cs.systems.xtrace.logging.BaggageWrappers",
        "ProcessName": "Read",
        "TaskID": "82B97A99F4CE0A9D",
        "ParentEventID": [
          "E8E8BB8DA8A663DF"
        ],
        "Label": "Forking current baggage with Baggage.fork()",
        "Title": "X-Trace Task",
        "Host": "pinky19.mpi-sws.org",
        "HRT": 25491843999632255,
        "Operation": "fork",
        "Timestamp": "1556275483939.808594",
        "TenantClass": 0,
        "Source": "RemoteBlockReader2.java:361",
        "ThreadID": 1,
        "ThreadName": "",
        "EventID": "32F983A976E0D2DC",
        "ProcessID": 21035
      },
      {
        "Cycles": 0,
        "Agent": "Execution-CPU",
        "ProcessName": "Data",
        "TaskID": "82B97A99F4CE0A9D",
        "ParentEventID": [
          "8EAE9AEFF68261B2"
        ],
        "Label": "set",
        "Title": "X-Trace Task",
        "Host": "pinky27.mpi-sws.org",
        "HRT": 14091119044569773,
        "Operation": "set",
        "Timestamp": "1556275483938.647705",
        "TenantClass": 0,
        "Source": "Receiver.java:117",
        "ThreadID": 6493,
        "ThreadName": "",
        "EventID": "6C279B6C1CE59394",
        "BaggageBytes": "[[248 5] [240 0] [0 130 185 122 153 244 206 10 157] [240 1] [0 142 174 154 239 246 130 97 178] [240 3] [0 2]]",
        "ProcessID": 31438
      },
      {
        "Cycles": 0,
        "Agent": "edu.brown.cs.systems.xtrace.logging.BaggageWrappers",
        "ProcessName": "Data",
        "TaskID": "82B97A99F4CE0A9D",
        "ParentEventID": [
          "FEADD27AF85CFD71"
        ],
        "Label": "Forking current baggage with Baggage.fork()",
        "Title": "X-Trace Task",
        "Host": "pinky27.mpi-sws.org",
        "HRT": 14091119044880727,
        "Operation": "fork",
        "Timestamp": "1556275483938.958740",
        "TenantClass": 0,
        "Source": "DataXceiver.java:1257",
        "ThreadID": 6493,
        "ThreadName": "",
        "EventID": "E8A654EB48F052A4",
        "BaggageBytes": "[[248 5] [240 0] [0 130 185 122 153 244 206 10 157] [240 1] [0 254 173 210 122 248 92 253 113] [240 3] [0 2]]",
        "ProcessID": 31438
      },
      {
        "Cycles": 0,
        "Agent": "edu.brown.cs.systems.xtrace.logging.XTraceInit",
        "ProcessName": "Data",
        "TaskID": "82B97A99F4CE0A9D",
        "ParentEventID": [
          "6C279B6C1CE59394"
        ],
        "Label": "Thread.setName: DataXceiver for client DFSClient_NONMAPREDUCE_1377588049_1 at /139.19.171.63:35816 [Sending block BP-1633380353-139.19.171.63-1554193446451:blk_1073755395_14571]",
        "Title": "X-Trace Task",
        "Host": "pinky27.mpi-sws.org",
        "HRT": 14091119044697473,
        "Timestamp": "1556275483938.775391",
        "TenantClass": 0,
        "Source": "DataXceiver.java:168",
        "ThreadID": 6493,
        "ThreadName": "",
        "EventID": "FEADD27AF85CFD71",
        "BaggageBytes": "[[248 5] [240 0] [0 130 185 122 153 244 206 10 157] [240 1] [0 108 39 155 108 28 229 147 148] [240 3] [0 2]]",
        "ProcessID": 31438
      },
      {
        "Cycles": 0,
        "Agent": "edu.brown.cs.systems.xtrace.logging.BaggageWrappers",
        "ProcessName": "Data",
        "TaskID": "82B97A99F4CE0A9D",
        "ParentEventID": [
          "E8A654EB48F052A4"
        ],
        "Label": "Forking current baggage with Baggage.fork()",
        "Title": "X-Trace Task",
        "Host": "pinky27.mpi-sws.org",
        "HRT": 14091119045018336,
        "Operation": "fork",
        "Timestamp": "1556275483939.096436",
        "TenantClass": 0,
        "Source": "PacketHeader.java:95",
        "ThreadID": 6493,
        "ThreadName": "",
        "EventID": "24CC3AECE04C10B5",
        "BaggageBytes": "[[248 5] [240 0] [0 130 185 122 153 244 206 10 157] [240 1] [0 232 166 84 235 72 240 82 164] [240 3] [0 2]]",
        "ProcessID": 31438
      },
      {
        "Cycles": 0,
        "Agent": "Execution-Sleep",
        "ProcessName": "Data",
        "TaskID": "82B97A99F4CE0A9D",
        "ParentEventID": [
          "24CC3AECE04C10B5"
        ],
        "Label": "waited",
        "Title": "X-Trace Task",
        "Host": "pinky27.mpi-sws.org",
        "Duration": "8221",
        "HRT": 14091119045144132,
        "Operation": "waited",
        "Timestamp": "1556275483939.222168",
        "TenantClass": 0,
        "Source": "SocketIOWithTimeout.java:335",
        "ThreadID": 6493,
        "ThreadName": "",
        "EventID": "90C4503B046E29B4",
        "BaggageBytes": "[[248 5] [240 0] [0 130 185 122 153 244 206 10 157] [240 1] [0 36 204 58 236 224 76 16 181] [240 3] [0 2]]",
        "ProcessID": 31438
      },
      {
        "Cycles": 0,
        "Agent": "edu.brown.cs.systems.xtrace.logging.BaggageWrappers",
        "ProcessName": "Data",
        "TaskID": "82B97A99F4CE0A9D",
        "ParentEventID": [
          "90C4503B046E29B4"
        ],
        "Label": "Forking current baggage with Baggage.fork()",
        "Title": "X-Trace Task",
        "Host": "pinky27.mpi-sws.org",
        "HRT": 14091119045298787,
        "Operation": "fork",
        "Timestamp": "1556275483939.376709",
        "TenantClass": 0,
        "Source": "PacketHeader.java:95",
        "ThreadID": 6493,
        "ThreadName": "",
        "EventID": "945AE08612963FD1",
        "BaggageBytes": "[[248 5] [240 0] [0 130 185 122 153 244 206 10 157] [240 1] [0 144 196 80 59 4 110 41 180] [240 3] [0 2]]",
        "ProcessID": 31438
      },
      {
        "Cycles": 0,
        "Agent": "Execution-Sleep",
        "ProcessName": "Data",
        "TaskID": "82B97A99F4CE0A9D",
        "ParentEventID": [
          "945AE08612963FD1"
        ],
        "Label": "waited",
        "Title": "X-Trace Task",
        "Host": "pinky27.mpi-sws.org",
        "Duration": "514037",
        "HRT": 14091119045975482,
        "Operation": "waited",
        "Timestamp": "1556275483940.053467",
        "TenantClass": 0,
        "Source": "SocketIOWithTimeout.java:335",
        "ThreadID": 6493,
        "ThreadName": "",
        "EventID": "78B4C3D67FCDD3ED",
        "BaggageBytes": "[[248 5] [240 0] [0 130 185 122 153 244 206 10 157] [240 1] [0 148 90 224 134 18 150 63 209] [240 3] [0 2]]",
        "ProcessID": 31438
      },
      {
        "Cycles": 0,
        "Agent": "Execution-CPU",
        "ProcessName": "Data",
        "TaskID": "82B97A99F4CE0A9D",
        "ParentEventID": [
          "7C256213D2215347"
        ],
        "Label": "unset",
        "Title": "X-Trace Task",
        "Host": "pinky27.mpi-sws.org",
        "Duration": "1472877",
        "HRT": 14091119046134833,
        "Operation": "unset",
        "Timestamp": "1556275483940.212891",
        "TenantClass": 0,
        "Source": "DataXceiver.java:261",
        "ThreadID": 6493,
        "ThreadName": "",
        "EventID": "97B55D174BFB2370",
        "BaggageBytes": "[[248 5] [240 0] [0 130 185 122 153 244 206 10 157] [240 1] [0 124 37 98 19 210 33 83 71] [240 3] [0 2]]",
        "ProcessID": 31438
      },
      {
        "Cycles": 0,
        "Agent": "edu.brown.cs.systems.xtrace.logging.BaggageWrappers",
        "ProcessName": "Data",
        "TaskID": "82B97A99F4CE0A9D",
        "ParentEventID": [
          "78B4C3D67FCDD3ED",
          "32F983A976E0D2DC"
        ],
        "Label": "Merged current baggage with other baggage",
        "Title": "X-Trace Task",
        "Host": "pinky27.mpi-sws.org",
        "HRT": 14091119046087682,
        "Operation": "join",
        "Timestamp": "1556275483940.165771",
        "TenantClass": 0,
        "Source": "DataXceiver.java:574",
        "ThreadID": 6493,
        "ThreadName": "",
        "EventID": "7C256213D2215347",
        "BaggageBytes": "[[248 5] [240 0] [0 130 185 122 153 244 206 10 157] [240 1] [0 50 249 131 169 118 224 210 220] [0 120 180 195 214 127 205 211 237] [240 3] [0 2]]",
        "ProcessID": 31438
      }
    ]
  }
]