[
  {
    "id": "CAAE072E3924B431",
    "reports": [
      {
        "Cycles": 0,
        "Agent": "Execution-CPU",
        "ProcessName": "Read",
        "TaskID": "CAAE072E3924B431",
        "ParentEventID": [
          "2A2999E6371C81A6"
        ],
        "Label": "unset",
        "Title": "X-Trace Task",
        "Host": "pinky19.mpi-sws.org",
        "Duration": "37984422",
        "HRT": 26966660010741142,
        "Operation": "unset",
        "Timestamp": "1557750299950.477051",
        "TenantClass": 0,
        "Source": "Client.java:1027",
        "ThreadID": 1,
        "ThreadName": "",
        "EventID": "2CF3044D5058AB86",
        "ProcessID": 2801
      },
      {
        "Cycles": 0,
        "Agent": "org.apache.hadoop.ipc.ProtobufRpcEngine",
        "ProcessName": "Read",
        "TaskID": "CAAE072E3924B431",
        "ParentEventID": [
          "05E2DFDB5AD6AE6A"
        ],
        "Label": "Invoking org.apache.hadoop.hdfs.protocol.ClientProtocol.getBlockLocations",
        "Title": "X-Trace Task",
        "Host": "pinky19.mpi-sws.org",
        "HRT": 26966660010717033,
        "Timestamp": "1557750299950.452881",
        "TenantClass": 0,
        "Source": "ProtobufRpcEngine.java:228",
        "ThreadID": 1,
        "ThreadName": "",
        "EventID": "2A2999E6371C81A6",
        "ProcessID": 2801
      },
      {
        "Cycles": 0,
        "Agent": "Execution-CPU",
        "ProcessName": "Read",
        "TaskID": "CAAE072E3924B431",
        "ParentEventID": [
          "2CF3044D5058AB86"
        ],
        "Label": "set",
        "Title": "X-Trace Task",
        "Host": "pinky19.mpi-sws.org",
        "HRT": 26966660010787795,
        "Operation": "set",
        "Timestamp": "1557750299950.523682",
        "TenantClass": 0,
        "Source": "Client.java:1032",
        "ThreadID": 41,
        "ThreadName": "",
        "EventID": "B644174197A7432B",
        "ProcessID": 2801
      },
      {
        "Cycles": 0,
        "Agent": "edu.brown.cs.systems.xtrace.logging.BaggageWrappers",
        "ProcessName": "Read",
        "TaskID": "CAAE072E3924B431",
        "ParentEventID": [
          "B644174197A7432B"
        ],
        "Label": "Forking current baggage with Baggage.fork()",
        "Title": "X-Trace Task",
        "Host": "pinky19.mpi-sws.org",
        "HRT": 26966660010806424,
        "Operation": "fork",
        "Timestamp": "1557750299950.542236",
        "TenantClass": 0,
        "Source": "Client.java:1043",
        "ThreadID": 41,
        "ThreadName": "",
        "EventID": "C6E6811B57044BD6",
        "ProcessID": 2801
      },
      {
        "Cycles": 0,
        "Agent": "Execution-CPU",
        "ProcessName": "Read",
        "TaskID": "CAAE072E3924B431",
        "ParentEventID": [
          "C6E6811B57044BD6"
        ],
        "Label": "unset",
        "Title": "X-Trace Task",
        "Host": "pinky19.mpi-sws.org",
        "Duration": "67700",
        "HRT": 26966660010873344,
        "Operation": "unset",
        "Timestamp": "1557750299950.609131",
        "TenantClass": 0,
        "Source": "Client.java:1062",
        "ThreadID": 41,
        "ThreadName": "",
        "EventID": "1079854ABD8837C1",
        "ProcessID": 2801
      },
      {
        "Cycles": 0,
        "Agent": "edu.brown.cs.systems.retro.benchmarks.hdfs_client.Reader",
        "ProcessName": "Read",
        "TaskID": "CAAE072E3924B431",
        "ParentEventID": [
          "9D8D72B3E0AE80A5"
        ],
        "Label": "Reading file",
        "Title": "X-Trace Task",
        "Host": "pinky19.mpi-sws.org",
        "HRT": 26966660010685170,
        "Timestamp": "1557750299950.421143",
        "TenantClass": 0,
        "ThreadID": 1,
        "ThreadName": "",
        "EventID": "05E2DFDB5AD6AE6A",
        "ProcessID": 2801
      },
      {
        "Cycles": 0,
        "Agent": "Execution-CPU",
        "ProcessName": "Read",
        "TaskID": "CAAE072E3924B431",
        "ParentEventID": [
          "1079854ABD8837C1"
        ],
        "Label": "set",
        "Title": "X-Trace Task",
        "Host": "pinky19.mpi-sws.org",
        "HRT": 26966660010896042,
        "Operation": "set",
        "Timestamp": "1557750299950.631836",
        "TenantClass": 0,
        "Source": "Client.java:1104",
        "ThreadID": 1,
        "ThreadName": "",
        "EventID": "47EF45D989027693",
        "ProcessID": 2801
      },
      {
        "Cycles": 0,
        "Agent": "edu.brown.cs.systems.xtrace.logging.BaggageWrappers",
        "ProcessName": "Name",
        "TaskID": "CAAE072E3924B431",
        "ParentEventID": [
          "B3B9F0E4A1CEA941"
        ],
        "Label": "Forking current baggage with Baggage.fork()",
        "Title": "X-Trace Task",
        "Host": "pinky19.mpi-sws.org",
        "HRT": 26966660010955554,
        "Operation": "fork",
        "Timestamp": "1557750299950.570557",
        "TenantClass": 0,
        "Source": "Server.java:550",
        "ThreadID": 48,
        "ThreadName": "",
        "EventID": "62BCE55E04821881",
        "BaggageBytes": "[[248 5] [240 0] [0 202 174 7 46 57 36 180 49] [240 1] [0 179 185 240 228 161 206 169 65] [240 3] [0 2]]",
        "ProcessID": 2171
      },
      {
        "Cycles": 0,
        "Agent": "Execution-CPU",
        "ProcessName": "Name",
        "TaskID": "CAAE072E3924B431",
        "ParentEventID": [
          "62BCE55E04821881"
        ],
        "Label": "unset",
        "Title": "X-Trace Task",
        "Host": "pinky19.mpi-sws.org",
        "Duration": "25892",
        "HRT": 26966660010977558,
        "Operation": "unset",
        "Timestamp": "1557750299950.592529",
        "TenantClass": 0,
        "Source": "Server.java:1828",
        "ThreadID": 48,
        "ThreadName": "",
        "EventID": "54F2410B562C8335",
        "BaggageBytes": "[[248 5] [240 0] [0 202 174 7 46 57 36 180 49] [240 1] [0 98 188 229 94 4 130 24 129] [240 3] [0 2]]",
        "ProcessID": 2171
      },
      {
        "Cycles": 0,
        "Agent": "Execution-CPU",
        "ProcessName": "Name",
        "TaskID": "CAAE072E3924B431",
        "ParentEventID": [
          "62BCE55E04821881"
        ],
        "Label": "set",
        "Title": "X-Trace Task",
        "Host": "pinky19.mpi-sws.org",
        "HRT": 26966660010987578,
        "Operation": "set",
        "Timestamp": "1557750299950.602539",
        "TenantClass": 0,
        "Source": "Server.java:2071",
        "ThreadID": 62,
        "ThreadName": "",
        "EventID": "3D10607858E9FF3E",
        "BaggageBytes": "[[248 5] [240 0] [0 202 174 7 46 57 36 180 49] [240 1] [0 98 188 229 94 4 130 24 129] [240 3] [0 2]]",
        "ProcessID": 2171
      },
      {
        "Cycles": 0,
        "Agent": "Execution-CPU",
        "ProcessName": "Name",
        "TaskID": "CAAE072E3924B431",
        "ParentEventID": [
          "C6E6811B57044BD6"
        ],
        "Label": "set",
        "Title": "X-Trace Task",
        "Host": "pinky19.mpi-sws.org",
        "HRT": 26966660010926752,
        "Operation": "set",
        "Timestamp": "1557750299950.541748",
        "TenantClass": 0,
        "Source": "Server.java:1840",
        "ThreadID": 48,
        "ThreadName": "",
        "EventID": "B3B9F0E4A1CEA941",
        "BaggageBytes": "[[248 5] [240 0] [0 202 174 7 46 57 36 180 49] [240 1] [0 198 230 129 27 87 4 75 214] [240 3] [0 2]]",
        "ProcessID": 2171
      },
      {
        "Cycles": 0,
        "Agent": "org.apache.hadoop.ipc.Server",
        "ProcessName": "Name",
        "TaskID": "CAAE072E3924B431",
        "ParentEventID": [
          "3D10607858E9FF3E"
        ],
        "Label": "getBlockLocations in org.apache.hadoop.hdfs.protocol.ClientProtocol",
        "Title": "X-Trace Task",
        "Host": "pinky19.mpi-sws.org",
        "HRT": 26966660011027987,
        "Timestamp": "1557750299950.643066",
        "TenantClass": 0,
        "Source": "ProtobufRpcEngine.java:601",
        "ThreadID": 62,
        "ThreadName": "",
        "EventID": "98C62A1EC04B078F",
        "BaggageBytes": "[[248 5] [240 0] [0 202 174 7 46 57 36 180 49] [240 1] [0 61 16 96 120 88 233 255 62] [240 3] [0 2]]",
        "ProcessID": 2171
      },
      {
        "Cycles": 0,
        "Agent": "edu.brown.cs.systems.xtrace.logging.BaggageWrappers",
        "ProcessName": "Name",
        "TaskID": "CAAE072E3924B431",
        "ParentEventID": [
          "95ABC7EB9737BB1A"
        ],
        "Label": "Forking current baggage with Baggage.fork()",
        "Title": "X-Trace Task",
        "Host": "pinky19.mpi-sws.org",
        "HRT": 26966660011119608,
        "Operation": "fork",
        "Timestamp": "1557750299950.734619",
        "TenantClass": 0,
        "Source": "Server.java:2398",
        "ThreadID": 62,
        "ThreadName": "",
        "EventID": "02FA168789A5E4E5",
        "BaggageBytes": "[[248 5] [240 0] [0 202 174 7 46 57 36 180 49] [240 1] [0 149 171 199 235 151 55 187 26] [240 3] [0 2]]",
        "ProcessID": 2171
      },
      {
        "Cycles": 0,
        "Agent": "Execution-CPU",
        "ProcessName": "Name",
        "TaskID": "CAAE072E3924B431",
        "ParentEventID": [
          "02FA168789A5E4E5"
        ],
        "Label": "unset",
        "Title": "X-Trace Task",
        "Host": "pinky19.mpi-sws.org",
        "Duration": "212256",
        "HRT": 26966660011226716,
        "Operation": "unset",
        "Timestamp": "1557750299950.841797",
        "TenantClass": 0,
        "Source": "Server.java:1058",
        "ThreadID": 62,
        "ThreadName": "",
        "EventID": "203C2ACDF07F499F",
        "BaggageBytes": "[[248 5] [240 0] [0 202 174 7 46 57 36 180 49] [240 1] [0 2 250 22 135 137 165 228 229] [240 3] [0 2]]",
        "ProcessID": 2171
      },
      {
        "Cycles": 0,
        "Agent": "org.apache.hadoop.hdfs.server.namenode.FSNamesystem.audit",
        "ProcessName": "Name",
        "TaskID": "CAAE072E3924B431",
        "ParentEventID": [
          "98C62A1EC04B078F"
        ],
        "Label": "allowed=true\tugi=plascas (auth:SIMPLE)\tip=/139.19.171.63\tcmd=open\tsrc=/ds/hywG2gIb2EdiFhaL\tdst=null\tperm=null\tproto=rpc",
        "Title": "X-Trace Task",
        "Host": "pinky19.mpi-sws.org",
        "HRT": 26966660011076516,
        "Timestamp": "1557750299950.691650",
        "TenantClass": 0,
        "Source": "FSNamesystem.java:8313",
        "ThreadID": 62,
        "ThreadName": "",
        "EventID": "95ABC7EB9737BB1A",
        "BaggageBytes": "[[248 5] [240 0] [0 202 174 7 46 57 36 180 49] [240 1] [0 152 198 42 30 192 75 7 143] [240 3] [0 2]]",
        "ProcessID": 2171
      },
      {
        "Cycles": 0,
        "Agent": "Execution-CPU",
        "ProcessName": "Read",
        "TaskID": "CAAE072E3924B431",
        "ParentEventID": [
          "02FA168789A5E4E5"
        ],
        "Label": "set",
        "Title": "X-Trace Task",
        "Host": "pinky19.mpi-sws.org",
        "HRT": 26966660011300453,
        "Operation": "set",
        "Timestamp": "1557750299951.036377",
        "TenantClass": 0,
        "Source": "Client.java:302",
        "ThreadID": 40,
        "ThreadName": "",
        "EventID": "6C0A72783D79EF4B",
        "ProcessID": 2801
      },
      {
        "Cycles": 0,
        "Agent": "Execution-CPU",
        "ProcessName": "Read",
        "TaskID": "CAAE072E3924B431",
        "ParentEventID": [
          "6C0A72783D79EF4B"
        ],
        "Label": "unset",
        "Title": "X-Trace Task",
        "Host": "pinky19.mpi-sws.org",
        "Duration": "9740",
        "HRT": 26966660011325984,
        "Operation": "unset",
        "Timestamp": "1557750299951.061768",
        "TenantClass": 0,
        "Source": "Client.java:1168",
        "ThreadID": 40,
        "ThreadName": "",
        "EventID": "745DF09D040E9912",
        "ProcessID": 2801
      },
      {
        "Cycles": 0,
        "Agent": "Execution-Sleep",
        "ProcessName": "Read",
        "TaskID": "CAAE072E3924B431",
        "ParentEventID": [
          "47EF45D989027693"
        ],
        "Label": "waited",
        "Title": "X-Trace Task",
        "Host": "pinky19.mpi-sws.org",
        "Duration": "437623",
        "HRT": 26966660011344365,
        "Operation": "waited",
        "Timestamp": "1557750299951.080322",
        "TenantClass": 0,
        "Source": "Client.java:1537",
        "ThreadID": 1,
        "ThreadName": "",
        "EventID": "A8B6025A4FC50B5B",
        "ProcessID": 2801
      },
      {
        "Cycles": 0,
        "Agent": "org.apache.hadoop.ipc.ProtobufRpcEngine",
        "ProcessName": "Read",
        "TaskID": "CAAE072E3924B431",
        "ParentEventID": [
          "21194DBEF9D22535"
        ],
        "Label": "org.apache.hadoop.hdfs.protocol.ClientProtocol.getBlockLocations completed",
        "Title": "X-Trace Task",
        "Host": "pinky19.mpi-sws.org",
        "HRT": 26966660011403312,
        "Timestamp": "1557750299951.139160",
        "TenantClass": 0,
        "Source": "ProtobufRpcEngine.java:275",
        "ThreadID": 1,
        "ThreadName": "",
        "EventID": "A83AFD041437A4C2",
        "ProcessID": 2801
      },
      {
        "Cycles": 0,
        "Agent": "edu.brown.cs.systems.xtrace.logging.BaggageWrappers",
        "ProcessName": "Read",
        "TaskID": "CAAE072E3924B431",
        "ParentEventID": [
          "745DF09D040E9912",
          "A8B6025A4FC50B5B"
        ],
        "Label": "Merged current baggage with other baggage",
        "Title": "X-Trace Task",
        "Host": "pinky19.mpi-sws.org",
        "HRT": 26966660011355610,
        "Operation": "join",
        "Timestamp": "1557750299951.091553",
        "TenantClass": 0,
        "Source": "Client.java:1545",
        "ThreadID": 1,
        "ThreadName": "",
        "EventID": "21194DBEF9D22535",
        "ProcessID": 2801
      },
      {
        "Cycles": 0,
        "Agent": "Execution-Sleep",
        "ProcessName": "Read",
        "TaskID": "CAAE072E3924B431",
        "ParentEventID": [
          "A83AFD041437A4C2"
        ],
        "Label": "waited",
        "Title": "X-Trace Task",
        "Host": "pinky19.mpi-sws.org",
        "Duration": "102174",
        "HRT": 26966660011606608,
        "Operation": "waited",
        "Timestamp": "1557750299951.342529",
        "TenantClass": 0,
        "Source": "SocketIOWithTimeout.java:335",
        "ThreadID": 1,
        "ThreadName": "",
        "EventID": "65A78FDF61D50324",
        "ProcessID": 2801
      },
      {
        "Cycles": 0,
        "Agent": "edu.brown.cs.systems.xtrace.logging.BaggageWrappers",
        "ProcessName": "Read",
        "TaskID": "CAAE072E3924B431",
        "ParentEventID": [
          "65A78FDF61D50324"
        ],
        "Label": "Forking current baggage with Baggage.fork()",
        "Title": "X-Trace Task",
        "Host": "pinky19.mpi-sws.org",
        "HRT": 26966660011648024,
        "Operation": "fork",
        "Timestamp": "1557750299951.384033",
        "TenantClass": 0,
        "Source": "DataTransferProtoUtil.java:94",
        "ThreadID": 1,
        "ThreadName": "",
        "EventID": "01CFF0A625B4F66A",
        "ProcessID": 2801
      },
      {
        "Cycles": 0,
        "Agent": "Execution-CPU",
        "ProcessName": "Data",
        "TaskID": "CAAE072E3924B431",
        "ParentEventID": [
          "01CFF0A625B4F66A"
        ],
        "Label": "set",
        "Title": "X-Trace Task",
        "Host": "pinky20.mpi-sws.org",
        "HRT": 6569864371140588,
        "Operation": "set",
        "Timestamp": "1557750299951.654785",
        "TenantClass": 0,
        "Source": "Receiver.java:117",
        "ThreadID": 14836,
        "ThreadName": "",
        "EventID": "59BBD58487D67A9D",
        "BaggageBytes": "[[248 5] [240 0] [0 202 174 7 46 57 36 180 49] [240 1] [0 1 207 240 166 37 180 246 106] [240 3] [0 2]]",
        "ProcessID": 13111
      },
      {
        "Cycles": 0,
        "Agent": "edu.brown.cs.systems.xtrace.logging.XTraceInit",
        "ProcessName": "Data",
        "TaskID": "CAAE072E3924B431",
        "ParentEventID": [
          "59BBD58487D67A9D"
        ],
        "Label": "Thread.setName: DataXceiver for client DFSClient_NONMAPREDUCE_310321604_1 at /139.19.171.63:48816 [Sending block BP-1633380353-139.19.171.63-1554193446451:blk_1073766387_25563]",
        "Title": "X-Trace Task",
        "Host": "pinky20.mpi-sws.org",
        "HRT": 6569864371222721,
        "Timestamp": "1557750299951.737061",
        "TenantClass": 0,
        "Source": "DataXceiver.java:168",
        "ThreadID": 14836,
        "ThreadName": "",
        "EventID": "9A6E780A45F41D57",
        "BaggageBytes": "[[248 5] [240 0] [0 202 174 7 46 57 36 180 49] [240 1] [0 89 187 213 132 135 214 122 157] [240 3] [0 2]]",
        "ProcessID": 13111
      },
      {
        "Cycles": 0,
        "Agent": "Execution-Sleep",
        "ProcessName": "Read",
        "TaskID": "CAAE072E3924B431",
        "ParentEventID": [
          "01CFF0A625B4F66A"
        ],
        "Label": "waited",
        "Title": "X-Trace Task",
        "Host": "pinky19.mpi-sws.org",
        "Duration": "689908",
        "HRT": 26966660012421953,
        "Operation": "waited",
        "Timestamp": "1557750299952.157959",
        "TenantClass": 0,
        "Source": "SocketIOWithTimeout.java:335",
        "ThreadID": 1,
        "ThreadName": "",
        "EventID": "D744842B3B96EA3D",
        "ProcessID": 2801
      },
      {
        "Cycles": 0,
        "Agent": "edu.brown.cs.systems.xtrace.logging.BaggageWrappers",
        "ProcessName": "Data",
        "TaskID": "CAAE072E3924B431",
        "ParentEventID": [
          "9A6E780A45F41D57"
        ],
        "Label": "Forking current baggage with Baggage.fork()",
        "Title": "X-Trace Task",
        "Host": "pinky20.mpi-sws.org",
        "HRT": 6569864371418131,
        "Operation": "fork",
        "Timestamp": "1557750299951.932373",
        "TenantClass": 0,
        "Source": "DataXceiver.java:1257",
        "ThreadID": 14836,
        "ThreadName": "",
        "EventID": "46758BC2BDF41001",
        "BaggageBytes": "[[248 5] [240 0] [0 202 174 7 46 57 36 180 49] [240 1] [0 154 110 120 10 69 244 29 87] [240 3] [0 2]]",
        "ProcessID": 13111
      },
      {
        "Cycles": 0,
        "Agent": "edu.brown.cs.systems.xtrace.logging.BaggageWrappers",
        "ProcessName": "Read",
        "TaskID": "CAAE072E3924B431",
        "ParentEventID": [
          "D744842B3B96EA3D",
          "46758BC2BDF41001"
        ],
        "Label": "Merged current baggage with other baggage",
        "Title": "X-Trace Task",
        "Host": "pinky19.mpi-sws.org",
        "HRT": 26966660012477236,
        "Operation": "join",
        "Timestamp": "1557750299952.213135",
        "TenantClass": 0,
        "Source": "RemoteBlockReader2.java:429",
        "ThreadID": 1,
        "ThreadName": "",
        "EventID": "85C9497A9F946162",
        "ProcessID": 2801
      },
      {
        "Cycles": 0,
        "Agent": "edu.brown.cs.systems.xtrace.logging.BaggageWrappers",
        "ProcessName": "Data",
        "TaskID": "CAAE072E3924B431",
        "ParentEventID": [
          "46758BC2BDF41001"
        ],
        "Label": "Forking current baggage with Baggage.fork()",
        "Title": "X-Trace Task",
        "Host": "pinky20.mpi-sws.org",
        "HRT": 6569864371540971,
        "Operation": "fork",
        "Timestamp": "1557750299952.055176",
        "TenantClass": 0,
        "Source": "PacketHeader.java:95",
        "ThreadID": 14836,
        "ThreadName": "",
        "EventID": "33A0D7BF2F0F7844",
        "BaggageBytes": "[[248 5] [240 0] [0 202 174 7 46 57 36 180 49] [240 1] [0 70 117 139 194 189 244 16 1] [240 3] [0 2]]",
        "ProcessID": 13111
      },
      {
        "Cycles": 0,
        "Agent": "Execution-Sleep",
        "ProcessName": "Read",
        "TaskID": "CAAE072E3924B431",
        "ParentEventID": [
          "85C9497A9F946162"
        ],
        "Label": "waited",
        "Title": "X-Trace Task",
        "Host": "pinky19.mpi-sws.org",
        "Duration": "31982",
        "HRT": 26966660012548517,
        "Operation": "waited",
        "Timestamp": "1557750299952.284424",
        "TenantClass": 0,
        "Source": "SocketIOWithTimeout.java:335",
        "ThreadID": 1,
        "ThreadName": "",
        "EventID": "4A7046E11030D548",
        "ProcessID": 2801
      },
      {
        "Cycles": 0,
        "Agent": "edu.brown.cs.systems.xtrace.logging.BaggageWrappers",
        "ProcessName": "Data",
        "TaskID": "CAAE072E3924B431",
        "ParentEventID": [
          "6C8411D251031A70"
        ],
        "Label": "Forking current baggage with Baggage.fork()",
        "Title": "X-Trace Task",
        "Host": "pinky20.mpi-sws.org",
        "HRT": 6569864371799547,
        "Operation": "fork",
        "Timestamp": "1557750299952.313721",
        "TenantClass": 0,
        "Source": "PacketHeader.java:95",
        "ThreadID": 14836,
        "ThreadName": "",
        "EventID": "E01102765099BCB5",
        "BaggageBytes": "[[248 5] [240 0] [0 202 174 7 46 57 36 180 49] [240 1] [0 108 132 17 210 81 3 26 112] [240 3] [0 2]]",
        "ProcessID": 13111
      },
      {
        "Cycles": 0,
        "Agent": "Execution-Sleep",
        "ProcessName": "Data",
        "TaskID": "CAAE072E3924B431",
        "ParentEventID": [
          "33A0D7BF2F0F7844"
        ],
        "Label": "waited",
        "Title": "X-Trace Task",
        "Host": "pinky20.mpi-sws.org",
        "Duration": "11177",
        "HRT": 6569864371664336,
        "Operation": "waited",
        "Timestamp": "1557750299952.178711",
        "TenantClass": 0,
        "Source": "SocketIOWithTimeout.java:335",
        "ThreadID": 14836,
        "ThreadName": "",
        "EventID": "6C8411D251031A70",
        "BaggageBytes": "[[248 5] [240 0] [0 202 174 7 46 57 36 180 49] [240 1] [0 51 160 215 191 47 15 120 68] [240 3] [0 2]]",
        "ProcessID": 13111
      },
      {
        "Cycles": 0,
        "Agent": "Execution-Sleep",
        "ProcessName": "Read",
        "TaskID": "CAAE072E3924B431",
        "ParentEventID": [
          "4A7046E11030D548"
        ],
        "Label": "waited",
        "Title": "X-Trace Task",
        "Host": "pinky19.mpi-sws.org",
        "Duration": "302443",
        "HRT": 26966660012902101,
        "Operation": "waited",
        "Timestamp": "1557750299952.637939",
        "TenantClass": 0,
        "Source": "SocketIOWithTimeout.java:335",
        "ThreadID": 1,
        "ThreadName": "",
        "EventID": "B5AE83E4BAE41E3A",
        "ProcessID": 2801
      },
      {
        "Cycles": 0,
        "Agent": "Execution-Sleep",
        "ProcessName": "Read",
        "TaskID": "CAAE072E3924B431",
        "ParentEventID": [
          "05163C129D1D05EF"
        ],
        "Label": "waited",
        "Title": "X-Trace Task",
        "Host": "pinky19.mpi-sws.org",
        "Duration": "131797",
        "HRT": 26966660013401598,
        "Operation": "waited",
        "Timestamp": "1557750299953.137451",
        "TenantClass": 0,
        "Source": "SocketIOWithTimeout.java:335",
        "ThreadID": 1,
        "ThreadName": "",
        "EventID": "F56DDCD486152F90",
        "ProcessID": 2801
      },
      {
        "Cycles": 0,
        "Agent": "Execution-Sleep",
        "ProcessName": "Read",
        "TaskID": "CAAE072E3924B431",
        "ParentEventID": [
          "B5AE83E4BAE41E3A"
        ],
        "Label": "waited",
        "Title": "X-Trace Task",
        "Host": "pinky19.mpi-sws.org",
        "Duration": "243530",
        "HRT": 26966660013216511,
        "Operation": "waited",
        "Timestamp": "1557750299952.952393",
        "TenantClass": 0,
        "Source": "SocketIOWithTimeout.java:335",
        "ThreadID": 1,
        "ThreadName": "",
        "EventID": "05163C129D1D05EF",
        "ProcessID": 2801
      },
      {
        "Cycles": 0,
        "Agent": "edu.brown.cs.systems.xtrace.logging.BaggageWrappers",
        "ProcessName": "Read",
        "TaskID": "CAAE072E3924B431",
        "ParentEventID": [
          "F56DDCD486152F90",
          "33A0D7BF2F0F7844"
        ],
        "Label": "Merged current baggage with other baggage",
        "Title": "X-Trace Task",
        "Host": "pinky19.mpi-sws.org",
        "HRT": 26966660013456198,
        "Operation": "join",
        "Timestamp": "1557750299953.192139",
        "TenantClass": 0,
        "Source": "PacketHeader.java:168",
        "ThreadID": 1,
        "ThreadName": "",
        "EventID": "672450A9E8B74B6C",
        "ProcessID": 2801
      },
      {
        "Cycles": 0,
        "Agent": "edu.brown.cs.systems.xtrace.logging.BaggageWrappers",
        "ProcessName": "Read",
        "TaskID": "CAAE072E3924B431",
        "ParentEventID": [
          "CB70247063DB69EA"
        ],
        "Label": "Forking current baggage with Baggage.fork()",
        "Title": "X-Trace Task",
        "Host": "pinky19.mpi-sws.org",
        "HRT": 26966660013584780,
        "Operation": "fork",
        "Timestamp": "1557750299953.320557",
        "TenantClass": 0,
        "Source": "RemoteBlockReader2.java:361",
        "ThreadID": 1,
        "ThreadName": "",
        "EventID": "4666C7AC0BEE8083",
        "ProcessID": 2801
      },
      {
        "Cycles": 0,
        "Agent": "edu.brown.cs.systems.xtrace.logging.BaggageWrappers",
        "ProcessName": "Read",
        "TaskID": "CAAE072E3924B431",
        "ParentEventID": [
          "672450A9E8B74B6C",
          "E01102765099BCB5"
        ],
        "Label": "Merged current baggage with other baggage",
        "Title": "X-Trace Task",
        "Host": "pinky19.mpi-sws.org",
        "HRT": 26966660013575620,
        "Operation": "join",
        "Timestamp": "1557750299953.311523",
        "TenantClass": 0,
        "Source": "PacketHeader.java:168",
        "ThreadID": 1,
        "ThreadName": "",
        "EventID": "CB70247063DB69EA",
        "ProcessID": 2801
      },
      {
        "Cycles": 0,
        "Agent": "edu.brown.cs.systems.xtrace.logging.BaggageWrappers",
        "ProcessName": "Read",
        "TaskID": "CAAE072E3924B431",
        "ParentEventID": [
          "4666C7AC0BEE8083"
        ],
        "Label": "Forking current baggage with Baggage.fork()",
        "Title": "X-Trace Task",
        "Host": "pinky19.mpi-sws.org",
        "HRT": 26966660013638682,
        "Operation": "fork",
        "Timestamp": "1557750299953.374512",
        "TenantClass": 0,
        "Source": "DataTransferProtoUtil.java:94",
        "ThreadID": 1,
        "ThreadName": "",
        "EventID": "ED4496EF7F65A4C6",
        "ProcessID": 2801
      },
      {
        "Cycles": 0,
        "Agent": "Execution-Sleep",
        "ProcessName": "Data",
        "TaskID": "CAAE072E3924B431",
        "ParentEventID": [
          "E01102765099BCB5"
        ],
        "Label": "waited",
        "Title": "X-Trace Task",
        "Host": "pinky20.mpi-sws.org",
        "Duration": "826332",
        "HRT": 6569864372799063,
        "Operation": "waited",
        "Timestamp": "1557750299953.313232",
        "TenantClass": 0,
        "Source": "SocketIOWithTimeout.java:335",
        "ThreadID": 14836,
        "ThreadName": "",
        "EventID": "3AB316FFB21B48E4",
        "BaggageBytes": "[[248 5] [240 0] [0 202 174 7 46 57 36 180 49] [240 1] [0 224 17 2 118 80 153 188 181] [240 3] [0 2]]",
        "ProcessID": 13111
      },
      {
        "Cycles": 0,
        "Agent": "edu.brown.cs.systems.xtrace.logging.BaggageWrappers",
        "ProcessName": "Data",
        "TaskID": "CAAE072E3924B431",
        "ParentEventID": [
          "3AB316FFB21B48E4",
          "4666C7AC0BEE8083"
        ],
        "Label": "Merged current baggage with other baggage",
        "Title": "X-Trace Task",
        "Host": "pinky20.mpi-sws.org",
        "HRT": 6569864373069143,
        "Operation": "join",
        "Timestamp": "1557750299953.583496",
        "TenantClass": 0,
        "Source": "DataXceiver.java:574",
        "ThreadID": 14836,
        "ThreadName": "",
        "EventID": "26305D08C0DEF16A",
        "BaggageBytes": "[[248 5] [240 0] [0 202 174 7 46 57 36 180 49] [240 1] [0 58 179 22 255 178 27 72 228] [0 70 102 199 172 11 238 128 131] [240 3] [0 2]]",
        "ProcessID": 13111
      },
      {
        "Cycles": 0,
        "Agent": "Execution-CPU",
        "ProcessName": "Data",
        "TaskID": "CAAE072E3924B431",
        "ParentEventID": [
          "ED4496EF7F65A4C6"
        ],
        "Label": "set",
        "Title": "X-Trace Task",
        "Host": "pinky20.mpi-sws.org",
        "HRT": 6569864373195452,
        "Operation": "set",
        "Timestamp": "1557750299953.709717",
        "TenantClass": 0,
        "Source": "Receiver.java:117",
        "ThreadID": 14836,
        "ThreadName": "",
        "EventID": "D98E2BFD90D6B4AD",
        "BaggageBytes": "[[248 5] [240 0] [0 202 174 7 46 57 36 180 49] [240 1] [0 237 68 150 239 127 101 164 198] [240 3] [0 2]]",
        "ProcessID": 13111
      },
      {
        "Cycles": 0,
        "Agent": "Execution-CPU",
        "ProcessName": "Data",
        "TaskID": "CAAE072E3924B431",
        "ParentEventID": [
          "26305D08C0DEF16A"
        ],
        "Label": "unset",
        "Title": "X-Trace Task",
        "Host": "pinky20.mpi-sws.org",
        "Duration": "1928307",
        "HRT": 6569864373125167,
        "Operation": "unset",
        "Timestamp": "1557750299953.639404",
        "TenantClass": 0,
        "Source": "DataXceiver.java:261",
        "ThreadID": 14836,
        "ThreadName": "",
        "EventID": "EFFEE03FFE3A5FA0",
        "BaggageBytes": "[[248 5] [240 0] [0 202 174 7 46 57 36 180 49] [240 1] [0 38 48 93 8 192 222 241 106] [240 3] [0 2]]",
        "ProcessID": 13111
      },
      {
        "Cycles": 0,
        "Agent": "edu.brown.cs.systems.xtrace.logging.XTraceInit",
        "ProcessName": "Data",
        "TaskID": "CAAE072E3924B431",
        "ParentEventID": [
          "D98E2BFD90D6B4AD"
        ],
        "Label": "Thread.setName: DataXceiver for client DFSClient_NONMAPREDUCE_310321604_1 at /139.19.171.63:48816 [Sending block BP-1633380353-139.19.171.63-1554193446451:blk_1073766387_25563]",
        "Title": "X-Trace Task",
        "Host": "pinky20.mpi-sws.org",
        "HRT": 6569864373277095,
        "Timestamp": "1557750299953.791504",
        "TenantClass": 0,
        "Source": "DataXceiver.java:168",
        "ThreadID": 14836,
        "ThreadName": "",
        "EventID": "6679544D93E2BB84",
        "BaggageBytes": "[[248 5] [240 0] [0 202 174 7 46 57 36 180 49] [240 1] [0 217 142 43 253 144 214 180 173] [240 3] [0 2]]",
        "ProcessID": 13111
      },
      {
        "Cycles": 0,
        "Agent": "Execution-Sleep",
        "ProcessName": "Read",
        "TaskID": "CAAE072E3924B431",
        "ParentEventID": [
          "ED4496EF7F65A4C6"
        ],
        "Label": "waited",
        "Title": "X-Trace Task",
        "Host": "pinky19.mpi-sws.org",
        "Duration": "764062",
        "HRT": 26966660014494582,
        "Operation": "waited",
        "Timestamp": "1557750299954.230469",
        "TenantClass": 0,
        "Source": "SocketIOWithTimeout.java:335",
        "ThreadID": 1,
        "ThreadName": "",
        "EventID": "7CFD17C086BB74B3",
        "ProcessID": 2801
      },
      {
        "Cycles": 0,
        "Agent": "edu.brown.cs.systems.xtrace.logging.BaggageWrappers",
        "ProcessName": "Data",
        "TaskID": "CAAE072E3924B431",
        "ParentEventID": [
          "6679544D93E2BB84"
        ],
        "Label": "Forking current baggage with Baggage.fork()",
        "Title": "X-Trace Task",
        "Host": "pinky20.mpi-sws.org",
        "HRT": 6569864373478981,
        "Operation": "fork",
        "Timestamp": "1557750299953.993164",
        "TenantClass": 0,
        "Source": "DataXceiver.java:1257",
        "ThreadID": 14836,
        "ThreadName": "",
        "EventID": "22C2F650AAC961CA",
        "BaggageBytes": "[[248 5] [240 0] [0 202 174 7 46 57 36 180 49] [240 1] [0 102 121 84 77 147 226 187 132] [240 3] [0 2]]",
        "ProcessID": 13111
      },
      {
        "Cycles": 0,
        "Agent": "edu.brown.cs.systems.xtrace.logging.BaggageWrappers",
        "ProcessName": "Read",
        "TaskID": "CAAE072E3924B431",
        "ParentEventID": [
          "7CFD17C086BB74B3",
          "22C2F650AAC961CA"
        ],
        "Label": "Merged current baggage with other baggage",
        "Title": "X-Trace Task",
        "Host": "pinky19.mpi-sws.org",
        "HRT": 26966660014539523,
        "Operation": "join",
        "Timestamp": "1557750299954.275391",
        "TenantClass": 0,
        "Source": "RemoteBlockReader2.java:429",
        "ThreadID": 1,
        "ThreadName": "",
        "EventID": "1FB6DFC619BF68F0",
        "ProcessID": 2801
      },
      {
        "Cycles": 0,
        "Agent": "edu.brown.cs.systems.xtrace.logging.BaggageWrappers",
        "ProcessName": "Data",
        "TaskID": "CAAE072E3924B431",
        "ParentEventID": [
          "22C2F650AAC961CA"
        ],
        "Label": "Forking current baggage with Baggage.fork()",
        "Title": "X-Trace Task",
        "Host": "pinky20.mpi-sws.org",
        "HRT": 6569864373635933,
        "Operation": "fork",
        "Timestamp": "1557750299954.150146",
        "TenantClass": 0,
        "Source": "PacketHeader.java:95",
        "ThreadID": 14836,
        "ThreadName": "",
        "EventID": "5E31261773CE36A3",
        "BaggageBytes": "[[248 5] [240 0] [0 202 174 7 46 57 36 180 49] [240 1] [0 34 194 246 80 170 201 97 202] [240 3] [0 2]]",
        "ProcessID": 13111
      },
      {
        "Cycles": 0,
        "Agent": "Execution-Sleep",
        "ProcessName": "Read",
        "TaskID": "CAAE072E3924B431",
        "ParentEventID": [
          "1FB6DFC619BF68F0"
        ],
        "Label": "waited",
        "Title": "X-Trace Task",
        "Host": "pinky19.mpi-sws.org",
        "Duration": "78773",
        "HRT": 26966660014651477,
        "Operation": "waited",
        "Timestamp": "1557750299954.387451",
        "TenantClass": 0,
        "Source": "SocketIOWithTimeout.java:335",
        "ThreadID": 1,
        "ThreadName": "",
        "EventID": "2C009CF23D80B4A8",
        "ProcessID": 2801
      },
      {
        "Cycles": 0,
        "Agent": "edu.brown.cs.systems.xtrace.logging.BaggageWrappers",
        "ProcessName": "Data",
        "TaskID": "CAAE072E3924B431",
        "ParentEventID": [
          "7568D075401D99BD"
        ],
        "Label": "Forking current baggage with Baggage.fork()",
        "Title": "X-Trace Task",
        "Host": "pinky20.mpi-sws.org",
        "HRT": 6569864373959876,
        "Operation": "fork",
        "Timestamp": "1557750299954.474121",
        "TenantClass": 0,
        "Source": "PacketHeader.java:95",
        "ThreadID": 14836,
        "ThreadName": "",
        "EventID": "0476C15825124212",
        "BaggageBytes": "[[248 5] [240 0] [0 202 174 7 46 57 36 180 49] [240 1] [0 117 104 208 117 64 29 153 189] [240 3] [0 2]]",
        "ProcessID": 13111
      },
      {
        "Cycles": 0,
        "Agent": "Execution-Sleep",
        "ProcessName": "Data",
        "TaskID": "CAAE072E3924B431",
        "ParentEventID": [
          "5E31261773CE36A3"
        ],
        "Label": "waited",
        "Title": "X-Trace Task",
        "Host": "pinky20.mpi-sws.org",
        "Duration": "10626",
        "HRT": 6569864373774584,
        "Operation": "waited",
        "Timestamp": "1557750299954.288818",
        "TenantClass": 0,
        "Source": "SocketIOWithTimeout.java:335",
        "ThreadID": 14836,
        "ThreadName": "",
        "EventID": "7568D075401D99BD",
        "BaggageBytes": "[[248 5] [240 0] [0 202 174 7 46 57 36 180 49] [240 1] [0 94 49 38 23 115 206 54 163] [240 3] [0 2]]",
        "ProcessID": 13111
      },
      {
        "Cycles": 0,
        "Agent": "Execution-Sleep",
        "ProcessName": "Read",
        "TaskID": "CAAE072E3924B431",
        "ParentEventID": [
          "2C009CF23D80B4A8"
        ],
        "Label": "waited",
        "Title": "X-Trace Task",
        "Host": "pinky19.mpi-sws.org",
        "Duration": "351683",
        "HRT": 26966660015061692,
        "Operation": "waited",
        "Timestamp": "1557750299954.797607",
        "TenantClass": 0,
        "Source": "SocketIOWithTimeout.java:335",
        "ThreadID": 1,
        "ThreadName": "",
        "EventID": "899FAB07EF6EB012",
        "ProcessID": 2801
      },
      {
        "Cycles": 0,
        "Agent": "Execution-Sleep",
        "ProcessName": "Data",
        "TaskID": "CAAE072E3924B431",
        "ParentEventID": [
          "0476C15825124212"
        ],
        "Label": "waited",
        "Title": "X-Trace Task",
        "Host": "pinky20.mpi-sws.org",
        "Duration": "178789",
        "HRT": 6569864374249193,
        "Operation": "waited",
        "Timestamp": "1557750299954.763428",
        "TenantClass": 0,
        "Source": "SocketIOWithTimeout.java:335",
        "ThreadID": 14836,
        "ThreadName": "",
        "EventID": "CA1ED39C84A9232D",
        "BaggageBytes": "[[248 5] [240 0] [0 202 174 7 46 57 36 180 49] [240 1] [0 4 118 193 88 37 18 66 18] [240 3] [0 2]]",
        "ProcessID": 13111
      },
      {
        "Cycles": 0,
        "Agent": "Execution-Sleep",
        "ProcessName": "Read",
        "TaskID": "CAAE072E3924B431",
        "ParentEventID": [
          "899FAB07EF6EB012"
        ],
        "Label": "waited",
        "Title": "X-Trace Task",
        "Host": "pinky19.mpi-sws.org",
        "Duration": "145065",
        "HRT": 26966660015267916,
        "Operation": "waited",
        "Timestamp": "1557750299955.003906",
        "TenantClass": 0,
        "Source": "SocketIOWithTimeout.java:335",
        "ThreadID": 1,
        "ThreadName": "",
        "EventID": "AE3E22B437B9E5F3",
        "ProcessID": 2801
      },
      {
        "Cycles": 0,
        "Agent": "edu.brown.cs.systems.xtrace.logging.BaggageWrappers",
        "ProcessName": "Data",
        "TaskID": "CAAE072E3924B431",
        "ParentEventID": [
          "CA1ED39C84A9232D"
        ],
        "Label": "Forking current baggage with Baggage.fork()",
        "Title": "X-Trace Task",
        "Host": "pinky20.mpi-sws.org",
        "HRT": 6569864374364376,
        "Operation": "fork",
        "Timestamp": "1557750299954.878662",
        "TenantClass": 0,
        "Source": "PacketHeader.java:95",
        "ThreadID": 14836,
        "ThreadName": "",
        "EventID": "6B70DD853D8B4902",
        "BaggageBytes": "[[248 5] [240 0] [0 202 174 7 46 57 36 180 49] [240 1] [0 202 30 211 156 132 169 35 45] [240 3] [0 2]]",
        "ProcessID": 13111
      },
      {
        "Cycles": 0,
        "Agent": "Execution-Sleep",
        "ProcessName": "Read",
        "TaskID": "CAAE072E3924B431",
        "ParentEventID": [
          "AE3E22B437B9E5F3"
        ],
        "Label": "waited",
        "Title": "X-Trace Task",
        "Host": "pinky19.mpi-sws.org",
        "Duration": "147343",
        "HRT": 26966660015475630,
        "Operation": "waited",
        "Timestamp": "1557750299955.211426",
        "TenantClass": 0,
        "Source": "SocketIOWithTimeout.java:335",
        "ThreadID": 1,
        "ThreadName": "",
        "EventID": "12E269093B758991",
        "ProcessID": 2801
      },
      {
        "Cycles": 0,
        "Agent": "Execution-Sleep",
        "ProcessName": "Data",
        "TaskID": "CAAE072E3924B431",
        "ParentEventID": [
          "6B70DD853D8B4902"
        ],
        "Label": "waited",
        "Title": "X-Trace Task",
        "Host": "pinky20.mpi-sws.org",
        "Duration": "8452",
        "HRT": 6569864374532571,
        "Operation": "waited",
        "Timestamp": "1557750299955.046875",
        "TenantClass": 0,
        "Source": "SocketIOWithTimeout.java:335",
        "ThreadID": 14836,
        "ThreadName": "",
        "EventID": "DDB645370C1B5599",
        "BaggageBytes": "[[248 5] [240 0] [0 202 174 7 46 57 36 180 49] [240 1] [0 107 112 221 133 61 139 73 2] [240 3] [0 2]]",
        "ProcessID": 13111
      },
      {
        "Cycles": 0,
        "Agent": "edu.brown.cs.systems.xtrace.logging.BaggageWrappers",
        "ProcessName": "Read",
        "TaskID": "CAAE072E3924B431",
        "ParentEventID": [
          "5E31261773CE36A3",
          "256F8A24CB98A9FC"
        ],
        "Label": "Merged current baggage with other baggage",
        "Title": "X-Trace Task",
        "Host": "pinky19.mpi-sws.org",
        "HRT": 26966660015724742,
        "Operation": "join",
        "Timestamp": "1557750299955.460693",
        "TenantClass": 0,
        "Source": "PacketHeader.java:168",
        "ThreadID": 1,
        "ThreadName": "",
        "EventID": "BB1128446708B896",
        "ProcessID": 2801
      },
      {
        "Cycles": 0,
        "Agent": "Execution-Sleep",
        "ProcessName": "Read",
        "TaskID": "CAAE072E3924B431",
        "ParentEventID": [
          "12E269093B758991"
        ],
        "Label": "waited",
        "Title": "X-Trace Task",
        "Host": "pinky19.mpi-sws.org",
        "Duration": "167104",
        "HRT": 26966660015685350,
        "Operation": "waited",
        "Timestamp": "1557750299955.421143",
        "TenantClass": 0,
        "Source": "SocketIOWithTimeout.java:335",
        "ThreadID": 1,
        "ThreadName": "",
        "EventID": "256F8A24CB98A9FC",
        "ProcessID": 2801
      },
      {
        "Cycles": 0,
        "Agent": "Execution-Sleep",
        "ProcessName": "Data",
        "TaskID": "CAAE072E3924B431",
        "ParentEventID": [
          "D8ACDAEA9E32B111"
        ],
        "Label": "waited",
        "Title": "X-Trace Task",
        "Host": "pinky20.mpi-sws.org",
        "Duration": "73546",
        "HRT": 6569864374867242,
        "Operation": "waited",
        "Timestamp": "1557750299955.381592",
        "TenantClass": 0,
        "Source": "SocketIOWithTimeout.java:335",
        "ThreadID": 14836,
        "ThreadName": "",
        "EventID": "4B8C32B814C683D0",
        "BaggageBytes": "[[248 5] [240 0] [0 202 174 7 46 57 36 180 49] [240 1] [0 216 172 218 234 158 50 177 17] [240 3] [0 2]]",
        "ProcessID": 13111
      },
      {
        "Cycles": 0,
        "Agent": "edu.brown.cs.systems.xtrace.logging.BaggageWrappers",
        "ProcessName": "Data",
        "TaskID": "CAAE072E3924B431",
        "ParentEventID": [
          "DDB645370C1B5599"
        ],
        "Label": "Forking current baggage with Baggage.fork()",
        "Title": "X-Trace Task",
        "Host": "pinky20.mpi-sws.org",
        "HRT": 6569864374677302,
        "Operation": "fork",
        "Timestamp": "1557750299955.191650",
        "TenantClass": 0,
        "Source": "PacketHeader.java:95",
        "ThreadID": 14836,
        "ThreadName": "",
        "EventID": "D8ACDAEA9E32B111",
        "BaggageBytes": "[[248 5] [240 0] [0 202 174 7 46 57 36 180 49] [240 1] [0 221 182 69 55 12 27 85 153] [240 3] [0 2]]",
        "ProcessID": 13111
      },
      {
        "Cycles": 0,
        "Agent": "Execution-CPU",
        "ProcessName": "Data",
        "TaskID": "CAAE072E3924B431",
        "ParentEventID": [
          "4B8C32B814C683D0"
        ],
        "Label": "unset",
        "Title": "X-Trace Task",
        "Host": "pinky20.mpi-sws.org",
        "Duration": "1945806",
        "HRT": 6569864375204083,
        "Operation": "unset",
        "Timestamp": "1557750299955.718262",
        "TenantClass": 0,
        "Source": "DataXceiver.java:261",
        "ThreadID": 14836,
        "ThreadName": "",
        "EventID": "4D754E1879640BDC",
        "BaggageBytes": "[[248 5] [240 0] [0 202 174 7 46 57 36 180 49] [240 1] [0 75 140 50 184 20 198 131 208] [240 3] [0 2]]",
        "ProcessID": 13111
      },
      {
        "Cycles": 0,
        "Agent": "edu.brown.cs.systems.retro.benchmarks.hdfs_client.Reader",
        "ProcessName": "Read",
        "TaskID": "CAAE072E3924B431",
        "ParentEventID": [
          "0"
        ],
        "Label": "Reading file",
        "Title": "X-Trace Task",
        "Host": "pinky19.mpi-sws.org",
        "HRT": 26966660010667509,
        "Timestamp": "1557750299950.403320",
        "TenantClass": 0,
        "ThreadID": 1,
        "ThreadName": "",
        "EventID": "9D8D72B3E0AE80A5",
        "ProcessID": 2801,
        "Tag": [
          "reader_100kb",
          "Read Size: 102400"
        ]
      }
    ]
  }
]