[
  {
    "id": "B4460BB4906F2ABA",
    "reports": [
      {
        "Cycles": 0,
        "Agent": "edu.brown.cs.systems.retro.benchmarks.hdfs_client.Reader",
        "ProcessName": "Read",
        "TaskID": "B4460BB4906F2ABA",
        "ParentEventID": [
          "7F82CA2E0C4B7BB0"
        ],
        "Label": "Reading file",
        "Title": "X-Trace Task",
        "Host": "pinky19.mpi-sws.org",
        "HRT": 26966720155268914,
        "Timestamp": "1557750360095.719727",
        "TenantClass": 0,
        "ThreadID": 1,
        "ThreadName": "",
        "EventID": "F63EA786354C4291",
        "ProcessID": 2801
      },
      {
        "Cycles": 0,
        "Agent": "Execution-CPU",
        "ProcessName": "Read",
        "TaskID": "B4460BB4906F2ABA",
        "ParentEventID": [
          "BEF6431C720A42E9"
        ],
        "Label": "set",
        "Title": "X-Trace Task",
        "Host": "pinky19.mpi-sws.org",
        "HRT": 26966720155351650,
        "Operation": "set",
        "Timestamp": "1557750360095.802490",
        "TenantClass": 0,
        "Source": "Client.java:1032",
        "ThreadID": 41,
        "ThreadName": "",
        "EventID": "6BCBE3BF60BAF77B",
        "ProcessID": 2801
      },
      {
        "Cycles": 0,
        "Agent": "org.apache.hadoop.ipc.ProtobufRpcEngine",
        "ProcessName": "Read",
        "TaskID": "B4460BB4906F2ABA",
        "ParentEventID": [
          "F63EA786354C4291"
        ],
        "Label": "Invoking org.apache.hadoop.hdfs.protocol.ClientProtocol.getBlockLocations",
        "Title": "X-Trace Task",
        "Host": "pinky19.mpi-sws.org",
        "HRT": 26966720155292485,
        "Timestamp": "1557750360095.743408",
        "TenantClass": 0,
        "Source": "ProtobufRpcEngine.java:228",
        "ThreadID": 1,
        "ThreadName": "",
        "EventID": "CCF6BEF2CBE2B000",
        "ProcessID": 2801
      },
      {
        "Cycles": 0,
        "Agent": "Execution-CPU",
        "ProcessName": "Read",
        "TaskID": "B4460BB4906F2ABA",
        "ParentEventID": [
          "CCF6BEF2CBE2B000"
        ],
        "Label": "unset",
        "Title": "X-Trace Task",
        "Host": "pinky19.mpi-sws.org",
        "Duration": "25870668",
        "HRT": 26966720155307636,
        "Operation": "unset",
        "Timestamp": "1557750360095.758545",
        "TenantClass": 0,
        "Source": "Client.java:1027",
        "ThreadID": 1,
        "ThreadName": "",
        "EventID": "BEF6431C720A42E9",
        "ProcessID": 2801
      },
      {
        "Cycles": 0,
        "Agent": "edu.brown.cs.systems.xtrace.logging.BaggageWrappers",
        "ProcessName": "Read",
        "TaskID": "B4460BB4906F2ABA",
        "ParentEventID": [
          "6BCBE3BF60BAF77B"
        ],
        "Label": "Forking current baggage with Baggage.fork()",
        "Title": "X-Trace Task",
        "Host": "pinky19.mpi-sws.org",
        "HRT": 26966720155369335,
        "Operation": "fork",
        "Timestamp": "1557750360095.820312",
        "TenantClass": 0,
        "Source": "Client.java:1043",
        "ThreadID": 41,
        "ThreadName": "",
        "EventID": "2685208811804696",
        "ProcessID": 2801
      },
      {
        "Cycles": 0,
        "Agent": "Execution-CPU",
        "ProcessName": "Read",
        "TaskID": "B4460BB4906F2ABA",
        "ParentEventID": [
          "2685208811804696"
        ],
        "Label": "unset",
        "Title": "X-Trace Task",
        "Host": "pinky19.mpi-sws.org",
        "Duration": "61754",
        "HRT": 26966720155431146,
        "Operation": "unset",
        "Timestamp": "1557750360095.882080",
        "TenantClass": 0,
        "Source": "Client.java:1062",
        "ThreadID": 41,
        "ThreadName": "",
        "EventID": "6DBB7BB1EB2E3738",
        "ProcessID": 2801
      },
      {
        "Cycles": 0,
        "Agent": "Execution-CPU",
        "ProcessName": "Read",
        "TaskID": "B4460BB4906F2ABA",
        "ParentEventID": [
          "6DBB7BB1EB2E3738"
        ],
        "Label": "set",
        "Title": "X-Trace Task",
        "Host": "pinky19.mpi-sws.org",
        "HRT": 26966720155453300,
        "Operation": "set",
        "Timestamp": "1557750360095.904297",
        "TenantClass": 0,
        "Source": "Client.java:1104",
        "ThreadID": 1,
        "ThreadName": "",
        "EventID": "B6D4A366057FB2A9",
        "ProcessID": 2801
      },
      {
        "Cycles": 0,
        "Agent": "edu.brown.cs.systems.xtrace.logging.BaggageWrappers",
        "ProcessName": "Name",
        "TaskID": "B4460BB4906F2ABA",
        "ParentEventID": [
          "5CD1F73A54BB6C77"
        ],
        "Label": "Forking current baggage with Baggage.fork()",
        "Title": "X-Trace Task",
        "Host": "pinky19.mpi-sws.org",
        "HRT": 26966720155516922,
        "Operation": "fork",
        "Timestamp": "1557750360095.984375",
        "TenantClass": 0,
        "Source": "Server.java:550",
        "ThreadID": 48,
        "ThreadName": "",
        "EventID": "66F852F6D0A84031",
        "BaggageBytes": "[[248 5] [240 0] [0 180 70 11 180 144 111 42 186] [240 1] [0 92 209 247 58 84 187 108 119] [240 3] [0 2]]",
        "ProcessID": 2171
      },
      {
        "Cycles": 0,
        "Agent": "Execution-CPU",
        "ProcessName": "Name",
        "TaskID": "B4460BB4906F2ABA",
        "ParentEventID": [
          "66F852F6D0A84031"
        ],
        "Label": "unset",
        "Title": "X-Trace Task",
        "Host": "pinky19.mpi-sws.org",
        "Duration": "24530",
        "HRT": 26966720155537312,
        "Operation": "unset",
        "Timestamp": "1557750360096.004639",
        "TenantClass": 0,
        "Source": "Server.java:1828",
        "ThreadID": 48,
        "ThreadName": "",
        "EventID": "F17C21A4BFBF9EED",
        "BaggageBytes": "[[248 5] [240 0] [0 180 70 11 180 144 111 42 186] [240 1] [0 102 248 82 246 208 168 64 49] [240 3] [0 2]]",
        "ProcessID": 2171
      },
      {
        "Cycles": 0,
        "Agent": "Execution-CPU",
        "ProcessName": "Name",
        "TaskID": "B4460BB4906F2ABA",
        "ParentEventID": [
          "2685208811804696"
        ],
        "Label": "set",
        "Title": "X-Trace Task",
        "Host": "pinky19.mpi-sws.org",
        "HRT": 26966720155487207,
        "Operation": "set",
        "Timestamp": "1557750360095.954590",
        "TenantClass": 0,
        "Source": "Server.java:1840",
        "ThreadID": 48,
        "ThreadName": "",
        "EventID": "5CD1F73A54BB6C77",
        "BaggageBytes": "[[248 5] [240 0] [0 180 70 11 180 144 111 42 186] [240 1] [0 38 133 32 136 17 128 70 150] [240 3] [0 2]]",
        "ProcessID": 2171
      },
      {
        "Cycles": 0,
        "Agent": "Execution-CPU",
        "ProcessName": "Name",
        "TaskID": "B4460BB4906F2ABA",
        "ParentEventID": [
          "66F852F6D0A84031"
        ],
        "Label": "set",
        "Title": "X-Trace Task",
        "Host": "pinky19.mpi-sws.org",
        "HRT": 26966720155547938,
        "Operation": "set",
        "Timestamp": "1557750360096.015381",
        "TenantClass": 0,
        "Source": "Server.java:2071",
        "ThreadID": 64,
        "ThreadName": "",
        "EventID": "A969BFA38C71DE3A",
        "BaggageBytes": "[[248 5] [240 0] [0 180 70 11 180 144 111 42 186] [240 1] [0 102 248 82 246 208 168 64 49] [240 3] [0 2]]",
        "ProcessID": 2171
      },
      {
        "Cycles": 0,
        "Agent": "org.apache.hadoop.ipc.Server",
        "ProcessName": "Name",
        "TaskID": "B4460BB4906F2ABA",
        "ParentEventID": [
          "A969BFA38C71DE3A"
        ],
        "Label": "getBlockLocations in org.apache.hadoop.hdfs.protocol.ClientProtocol",
        "Title": "X-Trace Task",
        "Host": "pinky19.mpi-sws.org",
        "HRT": 26966720155582476,
        "Timestamp": "1557750360096.049805",
        "TenantClass": 0,
        "Source": "ProtobufRpcEngine.java:601",
        "ThreadID": 64,
        "ThreadName": "",
        "EventID": "75074EE967B1626F",
        "BaggageBytes": "[[248 5] [240 0] [0 180 70 11 180 144 111 42 186] [240 1] [0 169 105 191 163 140 113 222 58] [240 3] [0 2]]",
        "ProcessID": 2171
      },
      {
        "Cycles": 0,
        "Agent": "edu.brown.cs.systems.xtrace.logging.BaggageWrappers",
        "ProcessName": "Name",
        "TaskID": "B4460BB4906F2ABA",
        "ParentEventID": [
          "A75234F58E5BEE23"
        ],
        "Label": "Forking current baggage with Baggage.fork()",
        "Title": "X-Trace Task",
        "Host": "pinky19.mpi-sws.org",
        "HRT": 26966720155673570,
        "Operation": "fork",
        "Timestamp": "1557750360096.140869",
        "TenantClass": 0,
        "Source": "Server.java:2398",
        "ThreadID": 64,
        "ThreadName": "",
        "EventID": "7BDF90E3B952D6DB",
        "BaggageBytes": "[[248 5] [240 0] [0 180 70 11 180 144 111 42 186] [240 1] [0 167 82 52 245 142 91 238 35] [240 3] [0 2]]",
        "ProcessID": 2171
      },
      {
        "Cycles": 0,
        "Agent": "Execution-CPU",
        "ProcessName": "Name",
        "TaskID": "B4460BB4906F2ABA",
        "ParentEventID": [
          "7BDF90E3B952D6DB"
        ],
        "Label": "unset",
        "Title": "X-Trace Task",
        "Host": "pinky19.mpi-sws.org",
        "Duration": "209576",
        "HRT": 26966720155782553,
        "Operation": "unset",
        "Timestamp": "1557750360096.250000",
        "TenantClass": 0,
        "Source": "Server.java:1058",
        "ThreadID": 64,
        "ThreadName": "",
        "EventID": "1B651A6ABF23A1C7",
        "BaggageBytes": "[[248 5] [240 0] [0 180 70 11 180 144 111 42 186] [240 1] [0 123 223 144 227 185 82 214 219] [240 3] [0 2]]",
        "ProcessID": 2171
      },
      {
        "Cycles": 0,
        "Agent": "Execution-CPU",
        "ProcessName": "Read",
        "TaskID": "B4460BB4906F2ABA",
        "ParentEventID": [
          "7BDF90E3B952D6DB"
        ],
        "Label": "set",
        "Title": "X-Trace Task",
        "Host": "pinky19.mpi-sws.org",
        "HRT": 26966720155824473,
        "Operation": "set",
        "Timestamp": "1557750360096.275391",
        "TenantClass": 0,
        "Source": "Client.java:302",
        "ThreadID": 40,
        "ThreadName": "",
        "EventID": "F02D06F6FCDCED7A",
        "ProcessID": 2801
      },
      {
        "Cycles": 0,
        "Agent": "org.apache.hadoop.hdfs.server.namenode.FSNamesystem.audit",
        "ProcessName": "Name",
        "TaskID": "B4460BB4906F2ABA",
        "ParentEventID": [
          "75074EE967B1626F"
        ],
        "Label": "allowed=true\tugi=plascas (auth:SIMPLE)\tip=/139.19.171.63\tcmd=open\tsrc=/ds/WHhLFxHKIjoyfca0\tdst=null\tperm=null\tproto=rpc",
        "Title": "X-Trace Task",
        "Host": "pinky19.mpi-sws.org",
        "HRT": 26966720155630729,
        "Timestamp": "1557750360096.098145",
        "TenantClass": 0,
        "Source": "FSNamesystem.java:8313",
        "ThreadID": 64,
        "ThreadName": "",
        "EventID": "A75234F58E5BEE23",
        "BaggageBytes": "[[248 5] [240 0] [0 180 70 11 180 144 111 42 186] [240 1] [0 117 7 78 233 103 177 98 111] [240 3] [0 2]]",
        "ProcessID": 2171
      },
      {
        "Cycles": 0,
        "Agent": "Execution-CPU",
        "ProcessName": "Read",
        "TaskID": "B4460BB4906F2ABA",
        "ParentEventID": [
          "F02D06F6FCDCED7A"
        ],
        "Label": "unset",
        "Title": "X-Trace Task",
        "Host": "pinky19.mpi-sws.org",
        "Duration": "4929",
        "HRT": 26966720155843937,
        "Operation": "unset",
        "Timestamp": "1557750360096.294922",
        "TenantClass": 0,
        "Source": "Client.java:1168",
        "ThreadID": 40,
        "ThreadName": "",
        "EventID": "D9FF7565E8425A99",
        "ProcessID": 2801
      },
      {
        "Cycles": 0,
        "Agent": "edu.brown.cs.systems.xtrace.logging.BaggageWrappers",
        "ProcessName": "Read",
        "TaskID": "B4460BB4906F2ABA",
        "ParentEventID": [
          "A49264DF1FC512FE",
          "D9FF7565E8425A99"
        ],
        "Label": "Merged current baggage with other baggage",
        "Title": "X-Trace Task",
        "Host": "pinky19.mpi-sws.org",
        "HRT": 26966720155877573,
        "Operation": "join",
        "Timestamp": "1557750360096.328613",
        "TenantClass": 0,
        "Source": "Client.java:1545",
        "ThreadID": 1,
        "ThreadName": "",
        "EventID": "7EF0EF07D91A33BF",
        "ProcessID": 2801
      },
      {
        "Cycles": 0,
        "Agent": "Execution-Sleep",
        "ProcessName": "Read",
        "TaskID": "B4460BB4906F2ABA",
        "ParentEventID": [
          "B6D4A366057FB2A9"
        ],
        "Label": "waited",
        "Title": "X-Trace Task",
        "Host": "pinky19.mpi-sws.org",
        "Duration": "398738",
        "HRT": 26966720155862411,
        "Operation": "waited",
        "Timestamp": "1557750360096.313232",
        "TenantClass": 0,
        "Source": "Client.java:1537",
        "ThreadID": 1,
        "ThreadName": "",
        "EventID": "A49264DF1FC512FE",
        "ProcessID": 2801
      },
      {
        "Cycles": 0,
        "Agent": "org.apache.hadoop.ipc.ProtobufRpcEngine",
        "ProcessName": "Read",
        "TaskID": "B4460BB4906F2ABA",
        "ParentEventID": [
          "7EF0EF07D91A33BF"
        ],
        "Label": "org.apache.hadoop.hdfs.protocol.ClientProtocol.getBlockLocations completed",
        "Title": "X-Trace Task",
        "Host": "pinky19.mpi-sws.org",
        "HRT": 26966720155957614,
        "Timestamp": "1557750360096.408447",
        "TenantClass": 0,
        "Source": "ProtobufRpcEngine.java:275",
        "ThreadID": 1,
        "ThreadName": "",
        "EventID": "A961744E12D53D93",
        "ProcessID": 2801
      },
      {
        "Cycles": 0,
        "Agent": "Execution-Sleep",
        "ProcessName": "Read",
        "TaskID": "B4460BB4906F2ABA",
        "ParentEventID": [
          "A961744E12D53D93"
        ],
        "Label": "waited",
        "Title": "X-Trace Task",
        "Host": "pinky19.mpi-sws.org",
        "Duration": "172424",
        "HRT": 26966720156214231,
        "Operation": "waited",
        "Timestamp": "1557750360096.665039",
        "TenantClass": 0,
        "Source": "SocketIOWithTimeout.java:335",
        "ThreadID": 1,
        "ThreadName": "",
        "EventID": "4D8BC8A61BA44C07",
        "ProcessID": 2801
      },
      {
        "Cycles": 0,
        "Agent": "edu.brown.cs.systems.xtrace.logging.BaggageWrappers",
        "ProcessName": "Read",
        "TaskID": "B4460BB4906F2ABA",
        "ParentEventID": [
          "4D8BC8A61BA44C07"
        ],
        "Label": "Forking current baggage with Baggage.fork()",
        "Title": "X-Trace Task",
        "Host": "pinky19.mpi-sws.org",
        "HRT": 26966720156251076,
        "Operation": "fork",
        "Timestamp": "1557750360096.701904",
        "TenantClass": 0,
        "Source": "DataTransferProtoUtil.java:94",
        "ThreadID": 1,
        "ThreadName": "",
        "EventID": "A25CD65526F6D7F0",
        "ProcessID": 2801
      },
      {
        "Cycles": 0,
        "Agent": "edu.brown.cs.systems.xtrace.logging.XTraceInit",
        "ProcessName": "Data",
        "TaskID": "B4460BB4906F2ABA",
        "ParentEventID": [
          "54E31D4CC565A1C7"
        ],
        "Label": "Thread.setName: DataXceiver for client DFSClient_NONMAPREDUCE_310321604_1 at /139.19.171.63:58772 [Sending block BP-1633380353-139.19.171.63-1554193446451:blk_1073755251_14427]",
        "Title": "X-Trace Task",
        "Host": "pinky22.mpi-sws.org",
        "HRT": 47516692411235306,
        "Timestamp": "1557750360097.353271",
        "TenantClass": 0,
        "Source": "DataXceiver.java:168",
        "ThreadID": 15939,
        "ThreadName": "",
        "EventID": "BCF4558920629C9D",
        "BaggageBytes": "[[248 5] [240 0] [0 180 70 11 180 144 111 42 186] [240 1] [0 84 227 29 76 197 101 161 199] [240 3] [0 2]]",
        "ProcessID": 28841
      },
      {
        "Cycles": 0,
        "Agent": "Execution-CPU",
        "ProcessName": "Data",
        "TaskID": "B4460BB4906F2ABA",
        "ParentEventID": [
          "A25CD65526F6D7F0"
        ],
        "Label": "set",
        "Title": "X-Trace Task",
        "Host": "pinky22.mpi-sws.org",
        "HRT": 47516692411129549,
        "Operation": "set",
        "Timestamp": "1557750360097.247314",
        "TenantClass": 0,
        "Source": "Receiver.java:117",
        "ThreadID": 15939,
        "ThreadName": "",
        "EventID": "54E31D4CC565A1C7",
        "BaggageBytes": "[[248 5] [240 0] [0 180 70 11 180 144 111 42 186] [240 1] [0 162 92 214 85 38 246 215 240] [240 3] [0 2]]",
        "ProcessID": 28841
      },
      {
        "Cycles": 0,
        "Agent": "edu.brown.cs.systems.xtrace.logging.BaggageWrappers",
        "ProcessName": "Data",
        "TaskID": "B4460BB4906F2ABA",
        "ParentEventID": [
          "BCF4558920629C9D"
        ],
        "Label": "Forking current baggage with Baggage.fork()",
        "Title": "X-Trace Task",
        "Host": "pinky22.mpi-sws.org",
        "HRT": 47516692411456616,
        "Operation": "fork",
        "Timestamp": "1557750360097.574463",
        "TenantClass": 0,
        "Source": "DataXceiver.java:1257",
        "ThreadID": 15939,
        "ThreadName": "",
        "EventID": "EBECB8461B031F0F",
        "BaggageBytes": "[[248 5] [240 0] [0 180 70 11 180 144 111 42 186] [240 1] [0 188 244 85 137 32 98 156 157] [240 3] [0 2]]",
        "ProcessID": 28841
      },
      {
        "Cycles": 0,
        "Agent": "edu.brown.cs.systems.xtrace.logging.BaggageWrappers",
        "ProcessName": "Read",
        "TaskID": "B4460BB4906F2ABA",
        "ParentEventID": [
          "EBECB8461B031F0F",
          "C19C57B6A6A7F7E4"
        ],
        "Label": "Merged current baggage with other baggage",
        "Title": "X-Trace Task",
        "Host": "pinky19.mpi-sws.org",
        "HRT": 26966720157393222,
        "Operation": "join",
        "Timestamp": "1557750360097.844238",
        "TenantClass": 0,
        "Source": "RemoteBlockReader2.java:429",
        "ThreadID": 1,
        "ThreadName": "",
        "EventID": "05D3B7205BE382C1",
        "ProcessID": 2801
      },
      {
        "Cycles": 0,
        "Agent": "Execution-Sleep",
        "ProcessName": "Read",
        "TaskID": "B4460BB4906F2ABA",
        "ParentEventID": [
          "A25CD65526F6D7F0"
        ],
        "Label": "waited",
        "Title": "X-Trace Task",
        "Host": "pinky19.mpi-sws.org",
        "Duration": "976858",
        "HRT": 26966720157312043,
        "Operation": "waited",
        "Timestamp": "1557750360097.762939",
        "TenantClass": 0,
        "Source": "SocketIOWithTimeout.java:335",
        "ThreadID": 1,
        "ThreadName": "",
        "EventID": "C19C57B6A6A7F7E4",
        "ProcessID": 2801
      },
      {
        "Cycles": 0,
        "Agent": "Execution-Sleep",
        "ProcessName": "Read",
        "TaskID": "B4460BB4906F2ABA",
        "ParentEventID": [
          "05D3B7205BE382C1"
        ],
        "Label": "waited",
        "Title": "X-Trace Task",
        "Host": "pinky19.mpi-sws.org",
        "Duration": "49116",
        "HRT": 26966720157487959,
        "Operation": "waited",
        "Timestamp": "1557750360097.938965",
        "TenantClass": 0,
        "Source": "SocketIOWithTimeout.java:335",
        "ThreadID": 1,
        "ThreadName": "",
        "EventID": "FD5ADC50C4E66B84",
        "ProcessID": 2801
      },
      {
        "Cycles": 0,
        "Agent": "edu.brown.cs.systems.xtrace.logging.BaggageWrappers",
        "ProcessName": "Data",
        "TaskID": "B4460BB4906F2ABA",
        "ParentEventID": [
          "EBECB8461B031F0F"
        ],
        "Label": "Forking current baggage with Baggage.fork()",
        "Title": "X-Trace Task",
        "Host": "pinky22.mpi-sws.org",
        "HRT": 47516692411604050,
        "Operation": "fork",
        "Timestamp": "1557750360097.721924",
        "TenantClass": 0,
        "Source": "PacketHeader.java:95",
        "ThreadID": 15939,
        "ThreadName": "",
        "EventID": "7D60D32306774A6B",
        "BaggageBytes": "[[248 5] [240 0] [0 180 70 11 180 144 111 42 186] [240 1] [0 235 236 184 70 27 3 31 15] [240 3] [0 2]]",
        "ProcessID": 28841
      },
      {
        "Cycles": 0,
        "Agent": "Execution-Sleep",
        "ProcessName": "Data",
        "TaskID": "B4460BB4906F2ABA",
        "ParentEventID": [
          "7D60D32306774A6B"
        ],
        "Label": "waited",
        "Title": "X-Trace Task",
        "Host": "pinky22.mpi-sws.org",
        "Duration": "12657",
        "HRT": 47516692411776354,
        "Operation": "waited",
        "Timestamp": "1557750360097.894287",
        "TenantClass": 0,
        "Source": "SocketIOWithTimeout.java:335",
        "ThreadID": 15939,
        "ThreadName": "",
        "EventID": "D5C8D472CA3D1EB7",
        "BaggageBytes": "[[248 5] [240 0] [0 180 70 11 180 144 111 42 186] [240 1] [0 125 96 211 35 6 119 74 107] [240 3] [0 2]]",
        "ProcessID": 28841
      },
      {
        "Cycles": 0,
        "Agent": "edu.brown.cs.systems.xtrace.logging.BaggageWrappers",
        "ProcessName": "Data",
        "TaskID": "B4460BB4906F2ABA",
        "ParentEventID": [
          "D5C8D472CA3D1EB7"
        ],
        "Label": "Forking current baggage with Baggage.fork()",
        "Title": "X-Trace Task",
        "Host": "pinky22.mpi-sws.org",
        "HRT": 47516692411957101,
        "Operation": "fork",
        "Timestamp": "1557750360098.074951",
        "TenantClass": 0,
        "Source": "PacketHeader.java:95",
        "ThreadID": 15939,
        "ThreadName": "",
        "EventID": "8F6A73F3D52170E4",
        "BaggageBytes": "[[248 5] [240 0] [0 180 70 11 180 144 111 42 186] [240 1] [0 213 200 212 114 202 61 30 183] [240 3] [0 2]]",
        "ProcessID": 28841
      },
      {
        "Cycles": 0,
        "Agent": "Execution-Sleep",
        "ProcessName": "Read",
        "TaskID": "B4460BB4906F2ABA",
        "ParentEventID": [
          "6C9AC11274C6F302"
        ],
        "Label": "waited",
        "Title": "X-Trace Task",
        "Host": "pinky19.mpi-sws.org",
        "Duration": "145194",
        "HRT": 26966720158067662,
        "Operation": "waited",
        "Timestamp": "1557750360098.518555",
        "TenantClass": 0,
        "Source": "SocketIOWithTimeout.java:335",
        "ThreadID": 1,
        "ThreadName": "",
        "EventID": "CD86A2EF4DAE3345",
        "ProcessID": 2801
      },
      {
        "Cycles": 0,
        "Agent": "Execution-Sleep",
        "ProcessName": "Read",
        "TaskID": "B4460BB4906F2ABA",
        "ParentEventID": [
          "FD5ADC50C4E66B84"
        ],
        "Label": "waited",
        "Title": "X-Trace Task",
        "Host": "pinky19.mpi-sws.org",
        "Duration": "319867",
        "HRT": 26966720157872777,
        "Operation": "waited",
        "Timestamp": "1557750360098.323730",
        "TenantClass": 0,
        "Source": "SocketIOWithTimeout.java:335",
        "ThreadID": 1,
        "ThreadName": "",
        "EventID": "6C9AC11274C6F302",
        "ProcessID": 2801
      },
      {
        "Cycles": 0,
        "Agent": "Execution-Sleep",
        "ProcessName": "Read",
        "TaskID": "B4460BB4906F2ABA",
        "ParentEventID": [
          "CD86A2EF4DAE3345"
        ],
        "Label": "waited",
        "Title": "X-Trace Task",
        "Host": "pinky19.mpi-sws.org",
        "Duration": "137796",
        "HRT": 26966720158254844,
        "Operation": "waited",
        "Timestamp": "1557750360098.705811",
        "TenantClass": 0,
        "Source": "SocketIOWithTimeout.java:335",
        "ThreadID": 1,
        "ThreadName": "",
        "EventID": "C9FE9E2DAAEFE190",
        "ProcessID": 2801
      },
      {
        "Cycles": 0,
        "Agent": "edu.brown.cs.systems.xtrace.logging.BaggageWrappers",
        "ProcessName": "Read",
        "TaskID": "B4460BB4906F2ABA",
        "ParentEventID": [
          "7D60D32306774A6B",
          "EA6AFE73C0493F66"
        ],
        "Label": "Merged current baggage with other baggage",
        "Title": "X-Trace Task",
        "Host": "pinky19.mpi-sws.org",
        "HRT": 26966720158400766,
        "Operation": "join",
        "Timestamp": "1557750360098.851807",
        "TenantClass": 0,
        "Source": "PacketHeader.java:168",
        "ThreadID": 1,
        "ThreadName": "",
        "EventID": "DA12ABB82DE7DFFD",
        "ProcessID": 2801
      },
      {
        "Cycles": 0,
        "Agent": "Execution-Sleep",
        "ProcessName": "Read",
        "TaskID": "B4460BB4906F2ABA",
        "ParentEventID": [
          "C9FE9E2DAAEFE190"
        ],
        "Label": "waited",
        "Title": "X-Trace Task",
        "Host": "pinky19.mpi-sws.org",
        "Duration": "30368",
        "HRT": 26966720158364067,
        "Operation": "waited",
        "Timestamp": "1557750360098.814941",
        "TenantClass": 0,
        "Source": "SocketIOWithTimeout.java:335",
        "ThreadID": 1,
        "ThreadName": "",
        "EventID": "EA6AFE73C0493F66",
        "ProcessID": 2801
      },
      {
        "Cycles": 0,
        "Agent": "edu.brown.cs.systems.xtrace.logging.BaggageWrappers",
        "ProcessName": "Read",
        "TaskID": "B4460BB4906F2ABA",
        "ParentEventID": [
          "F6AB5E6E9B937701"
        ],
        "Label": "Forking current baggage with Baggage.fork()",
        "Title": "X-Trace Task",
        "Host": "pinky19.mpi-sws.org",
        "HRT": 26966720158503495,
        "Operation": "fork",
        "Timestamp": "1557750360098.954346",
        "TenantClass": 0,
        "Source": "RemoteBlockReader2.java:361",
        "ThreadID": 1,
        "ThreadName": "",
        "EventID": "C5C4C41A9D7326A3",
        "ProcessID": 2801
      },
      {
        "Cycles": 0,
        "Agent": "edu.brown.cs.systems.xtrace.logging.BaggageWrappers",
        "ProcessName": "Read",
        "TaskID": "B4460BB4906F2ABA",
        "ParentEventID": [
          "8F6A73F3D52170E4",
          "DA12ABB82DE7DFFD"
        ],
        "Label": "Merged current baggage with other baggage",
        "Title": "X-Trace Task",
        "Host": "pinky19.mpi-sws.org",
        "HRT": 26966720158495149,
        "Operation": "join",
        "Timestamp": "1557750360098.946045",
        "TenantClass": 0,
        "Source": "PacketHeader.java:168",
        "ThreadID": 1,
        "ThreadName": "",
        "EventID": "F6AB5E6E9B937701",
        "ProcessID": 2801
      },
      {
        "Cycles": 0,
        "Agent": "edu.brown.cs.systems.xtrace.logging.BaggageWrappers",
        "ProcessName": "Read",
        "TaskID": "B4460BB4906F2ABA",
        "ParentEventID": [
          "C5C4C41A9D7326A3"
        ],
        "Label": "Forking current baggage with Baggage.fork()",
        "Title": "X-Trace Task",
        "Host": "pinky19.mpi-sws.org",
        "HRT": 26966720158553823,
        "Operation": "fork",
        "Timestamp": "1557750360099.004639",
        "TenantClass": 0,
        "Source": "DataTransferProtoUtil.java:94",
        "ThreadID": 1,
        "ThreadName": "",
        "EventID": "96C4059FBD730638",
        "ProcessID": 2801
      },
      {
        "Cycles": 0,
        "Agent": "Execution-Sleep",
        "ProcessName": "Data",
        "TaskID": "B4460BB4906F2ABA",
        "ParentEventID": [
          "8F6A73F3D52170E4"
        ],
        "Label": "waited",
        "Title": "X-Trace Task",
        "Host": "pinky22.mpi-sws.org",
        "Duration": "758219",
        "HRT": 47516692412887587,
        "Operation": "waited",
        "Timestamp": "1557750360099.005371",
        "TenantClass": 0,
        "Source": "SocketIOWithTimeout.java:335",
        "ThreadID": 15939,
        "ThreadName": "",
        "EventID": "D93C68BAE8EF3851",
        "BaggageBytes": "[[248 5] [240 0] [0 180 70 11 180 144 111 42 186] [240 1] [0 143 106 115 243 213 33 112 228] [240 3] [0 2]]",
        "ProcessID": 28841
      },
      {
        "Cycles": 0,
        "Agent": "edu.brown.cs.systems.xtrace.logging.BaggageWrappers",
        "ProcessName": "Data",
        "TaskID": "B4460BB4906F2ABA",
        "ParentEventID": [
          "C5C4C41A9D7326A3",
          "D93C68BAE8EF3851"
        ],
        "Label": "Merged current baggage with other baggage",
        "Title": "X-Trace Task",
        "Host": "pinky22.mpi-sws.org",
        "HRT": 47516692413098974,
        "Operation": "join",
        "Timestamp": "1557750360099.216797",
        "TenantClass": 0,
        "Source": "DataXceiver.java:574",
        "ThreadID": 15939,
        "ThreadName": "",
        "EventID": "DE090580A4E95999",
        "BaggageBytes": "[[248 5] [240 0] [0 180 70 11 180 144 111 42 186] [240 1] [0 197 196 196 26 157 115 38 163] [0 217 60 104 186 232 239 56 81] [240 3] [0 2]]",
        "ProcessID": 28841
      },
      {
        "Cycles": 0,
        "Agent": "Execution-CPU",
        "ProcessName": "Data",
        "TaskID": "B4460BB4906F2ABA",
        "ParentEventID": [
          "DE090580A4E95999"
        ],
        "Label": "unset",
        "Title": "X-Trace Task",
        "Host": "pinky22.mpi-sws.org",
        "Duration": "1980845",
        "HRT": 47516692413184681,
        "Operation": "unset",
        "Timestamp": "1557750360099.302490",
        "TenantClass": 0,
        "Source": "DataXceiver.java:261",
        "ThreadID": 15939,
        "ThreadName": "",
        "EventID": "9D575CB75B16D7F6",
        "BaggageBytes": "[[248 5] [240 0] [0 180 70 11 180 144 111 42 186] [240 1] [0 222 9 5 128 164 233 89 153] [240 3] [0 2]]",
        "ProcessID": 28841
      },
      {
        "Cycles": 0,
        "Agent": "edu.brown.cs.systems.xtrace.logging.XTraceInit",
        "ProcessName": "Data",
        "TaskID": "B4460BB4906F2ABA",
        "ParentEventID": [
          "6F6FF01509BCEBBC"
        ],
        "Label": "Thread.setName: DataXceiver for client DFSClient_NONMAPREDUCE_310321604_1 at /139.19.171.63:58772 [Sending block BP-1633380353-139.19.171.63-1554193446451:blk_1073755251_14427]",
        "Title": "X-Trace Task",
        "Host": "pinky22.mpi-sws.org",
        "HRT": 47516692413357931,
        "Timestamp": "1557750360099.475830",
        "TenantClass": 0,
        "Source": "DataXceiver.java:168",
        "ThreadID": 15939,
        "ThreadName": "",
        "EventID": "897FFB72457F33C1",
        "BaggageBytes": "[[248 5] [240 0] [0 180 70 11 180 144 111 42 186] [240 1] [0 111 111 240 21 9 188 235 188] [240 3] [0 2]]",
        "ProcessID": 28841
      },
      {
        "Cycles": 0,
        "Agent": "Execution-CPU",
        "ProcessName": "Data",
        "TaskID": "B4460BB4906F2ABA",
        "ParentEventID": [
          "96C4059FBD730638"
        ],
        "Label": "set",
        "Title": "X-Trace Task",
        "Host": "pinky22.mpi-sws.org",
        "HRT": 47516692413256344,
        "Operation": "set",
        "Timestamp": "1557750360099.374268",
        "TenantClass": 0,
        "Source": "Receiver.java:117",
        "ThreadID": 15939,
        "ThreadName": "",
        "EventID": "6F6FF01509BCEBBC",
        "BaggageBytes": "[[248 5] [240 0] [0 180 70 11 180 144 111 42 186] [240 1] [0 150 196 5 159 189 115 6 56] [240 3] [0 2]]",
        "ProcessID": 28841
      },
      {
        "Cycles": 0,
        "Agent": "edu.brown.cs.systems.xtrace.logging.BaggageWrappers",
        "ProcessName": "Data",
        "TaskID": "B4460BB4906F2ABA",
        "ParentEventID": [
          "897FFB72457F33C1"
        ],
        "Label": "Forking current baggage with Baggage.fork()",
        "Title": "X-Trace Task",
        "Host": "pinky22.mpi-sws.org",
        "HRT": 47516692413588814,
        "Operation": "fork",
        "Timestamp": "1557750360099.706787",
        "TenantClass": 0,
        "Source": "DataXceiver.java:1257",
        "ThreadID": 15939,
        "ThreadName": "",
        "EventID": "95BBF12C6E8DE0AE",
        "BaggageBytes": "[[248 5] [240 0] [0 180 70 11 180 144 111 42 186] [240 1] [0 137 127 251 114 69 127 51 193] [240 3] [0 2]]",
        "ProcessID": 28841
      },
      {
        "Cycles": 0,
        "Agent": "Execution-Sleep",
        "ProcessName": "Read",
        "TaskID": "B4460BB4906F2ABA",
        "ParentEventID": [
          "96C4059FBD730638"
        ],
        "Label": "waited",
        "Title": "X-Trace Task",
        "Host": "pinky19.mpi-sws.org",
        "Duration": "818664",
        "HRT": 26966720159434850,
        "Operation": "waited",
        "Timestamp": "1557750360099.885742",
        "TenantClass": 0,
        "Source": "SocketIOWithTimeout.java:335",
        "ThreadID": 1,
        "ThreadName": "",
        "EventID": "0F49430CC876AFFB",
        "ProcessID": 2801
      },
      {
        "Cycles": 0,
        "Agent": "edu.brown.cs.systems.xtrace.logging.BaggageWrappers",
        "ProcessName": "Data",
        "TaskID": "B4460BB4906F2ABA",
        "ParentEventID": [
          "95BBF12C6E8DE0AE"
        ],
        "Label": "Forking current baggage with Baggage.fork()",
        "Title": "X-Trace Task",
        "Host": "pinky22.mpi-sws.org",
        "HRT": 47516692413737328,
        "Operation": "fork",
        "Timestamp": "1557750360099.855225",
        "TenantClass": 0,
        "Source": "PacketHeader.java:95",
        "ThreadID": 15939,
        "ThreadName": "",
        "EventID": "BB7C4E6F9732A481",
        "BaggageBytes": "[[248 5] [240 0] [0 180 70 11 180 144 111 42 186] [240 1] [0 149 187 241 44 110 141 224 174] [240 3] [0 2]]",
        "ProcessID": 28841
      },
      {
        "Cycles": 0,
        "Agent": "edu.brown.cs.systems.xtrace.logging.BaggageWrappers",
        "ProcessName": "Read",
        "TaskID": "B4460BB4906F2ABA",
        "ParentEventID": [
          "95BBF12C6E8DE0AE",
          "0F49430CC876AFFB"
        ],
        "Label": "Merged current baggage with other baggage",
        "Title": "X-Trace Task",
        "Host": "pinky19.mpi-sws.org",
        "HRT": 26966720159518213,
        "Operation": "join",
        "Timestamp": "1557750360099.969238",
        "TenantClass": 0,
        "Source": "RemoteBlockReader2.java:429",
        "ThreadID": 1,
        "ThreadName": "",
        "EventID": "7F0124BAFBCADBAF",
        "ProcessID": 2801
      },
      {
        "Cycles": 0,
        "Agent": "Execution-Sleep",
        "ProcessName": "Read",
        "TaskID": "B4460BB4906F2ABA",
        "ParentEventID": [
          "7F0124BAFBCADBAF"
        ],
        "Label": "waited",
        "Title": "X-Trace Task",
        "Host": "pinky19.mpi-sws.org",
        "Duration": "4171",
        "HRT": 26966720159573701,
        "Operation": "waited",
        "Timestamp": "1557750360100.024658",
        "TenantClass": 0,
        "Source": "SocketIOWithTimeout.java:335",
        "ThreadID": 1,
        "ThreadName": "",
        "EventID": "CD00A7F07CD4352F",
        "ProcessID": 2801
      },
      {
        "Cycles": 0,
        "Agent": "Execution-Sleep",
        "ProcessName": "Data",
        "TaskID": "B4460BB4906F2ABA",
        "ParentEventID": [
          "BB7C4E6F9732A481"
        ],
        "Label": "waited",
        "Title": "X-Trace Task",
        "Host": "pinky22.mpi-sws.org",
        "Duration": "8551",
        "HRT": 47516692413861550,
        "Operation": "waited",
        "Timestamp": "1557750360099.979492",
        "TenantClass": 0,
        "Source": "SocketIOWithTimeout.java:335",
        "ThreadID": 15939,
        "ThreadName": "",
        "EventID": "27D79814B5C62DD5",
        "BaggageBytes": "[[248 5] [240 0] [0 180 70 11 180 144 111 42 186] [240 1] [0 187 124 78 111 151 50 164 129] [240 3] [0 2]]",
        "ProcessID": 28841
      },
      {
        "Cycles": 0,
        "Agent": "Execution-Sleep",
        "ProcessName": "Read",
        "TaskID": "B4460BB4906F2ABA",
        "ParentEventID": [
          "CD00A7F07CD4352F"
        ],
        "Label": "waited",
        "Title": "X-Trace Task",
        "Host": "pinky19.mpi-sws.org",
        "Duration": "302948",
        "HRT": 26966720159965994,
        "Operation": "waited",
        "Timestamp": "1557750360100.416992",
        "TenantClass": 0,
        "Source": "SocketIOWithTimeout.java:335",
        "ThreadID": 1,
        "ThreadName": "",
        "EventID": "C9865D6AC5130939",
        "ProcessID": 2801
      },
      {
        "Cycles": 0,
        "Agent": "edu.brown.cs.systems.xtrace.logging.BaggageWrappers",
        "ProcessName": "Data",
        "TaskID": "B4460BB4906F2ABA",
        "ParentEventID": [
          "27D79814B5C62DD5"
        ],
        "Label": "Forking current baggage with Baggage.fork()",
        "Title": "X-Trace Task",
        "Host": "pinky22.mpi-sws.org",
        "HRT": 47516692414013963,
        "Operation": "fork",
        "Timestamp": "1557750360100.131836",
        "TenantClass": 0,
        "Source": "PacketHeader.java:95",
        "ThreadID": 15939,
        "ThreadName": "",
        "EventID": "5787A4F124DC55A9",
        "BaggageBytes": "[[248 5] [240 0] [0 180 70 11 180 144 111 42 186] [240 1] [0 39 215 152 20 181 198 45 213] [240 3] [0 2]]",
        "ProcessID": 28841
      },
      {
        "Cycles": 0,
        "Agent": "Execution-Sleep",
        "ProcessName": "Read",
        "TaskID": "B4460BB4906F2ABA",
        "ParentEventID": [
          "C9865D6AC5130939"
        ],
        "Label": "waited",
        "Title": "X-Trace Task",
        "Host": "pinky19.mpi-sws.org",
        "Duration": "147157",
        "HRT": 26966720160172079,
        "Operation": "waited",
        "Timestamp": "1557750360100.623047",
        "TenantClass": 0,
        "Source": "SocketIOWithTimeout.java:335",
        "ThreadID": 1,
        "ThreadName": "",
        "EventID": "2F2A7A7B2D30DFED",
        "ProcessID": 2801
      },
      {
        "Cycles": 0,
        "Agent": "Execution-Sleep",
        "ProcessName": "Data",
        "TaskID": "B4460BB4906F2ABA",
        "ParentEventID": [
          "5787A4F124DC55A9"
        ],
        "Label": "waited",
        "Title": "X-Trace Task",
        "Host": "pinky22.mpi-sws.org",
        "Duration": "191687",
        "HRT": 47516692414300271,
        "Operation": "waited",
        "Timestamp": "1557750360100.418213",
        "TenantClass": 0,
        "Source": "SocketIOWithTimeout.java:335",
        "ThreadID": 15939,
        "ThreadName": "",
        "EventID": "BB1868D1D0B8B7B3",
        "BaggageBytes": "[[248 5] [240 0] [0 180 70 11 180 144 111 42 186] [240 1] [0 87 135 164 241 36 220 85 169] [240 3] [0 2]]",
        "ProcessID": 28841
      },
      {
        "Cycles": 0,
        "Agent": "Execution-Sleep",
        "ProcessName": "Read",
        "TaskID": "B4460BB4906F2ABA",
        "ParentEventID": [
          "2F2A7A7B2D30DFED"
        ],
        "Label": "waited",
        "Title": "X-Trace Task",
        "Host": "pinky19.mpi-sws.org",
        "Duration": "106761",
        "HRT": 26966720160325106,
        "Operation": "waited",
        "Timestamp": "1557750360100.776123",
        "TenantClass": 0,
        "Source": "SocketIOWithTimeout.java:335",
        "ThreadID": 1,
        "ThreadName": "",
        "EventID": "D71CF198A149FBD5",
        "ProcessID": 2801
      },
      {
        "Cycles": 0,
        "Agent": "edu.brown.cs.systems.xtrace.logging.BaggageWrappers",
        "ProcessName": "Read",
        "TaskID": "B4460BB4906F2ABA",
        "ParentEventID": [
          "D71CF198A149FBD5",
          "BB7C4E6F9732A481"
        ],
        "Label": "Merged current baggage with other baggage",
        "Title": "X-Trace Task",
        "Host": "pinky19.mpi-sws.org",
        "HRT": 26966720160362617,
        "Operation": "join",
        "Timestamp": "1557750360100.813477",
        "TenantClass": 0,
        "Source": "PacketHeader.java:168",
        "ThreadID": 1,
        "ThreadName": "",
        "EventID": "4BCF5598CB94C57D",
        "ProcessID": 2801
      },
      {
        "Cycles": 0,
        "Agent": "edu.brown.cs.systems.xtrace.logging.BaggageWrappers",
        "ProcessName": "Data",
        "TaskID": "B4460BB4906F2ABA",
        "ParentEventID": [
          "BB1868D1D0B8B7B3"
        ],
        "Label": "Forking current baggage with Baggage.fork()",
        "Title": "X-Trace Task",
        "Host": "pinky22.mpi-sws.org",
        "HRT": 47516692414443016,
        "Operation": "fork",
        "Timestamp": "1557750360100.560791",
        "TenantClass": 0,
        "Source": "PacketHeader.java:95",
        "ThreadID": 15939,
        "ThreadName": "",
        "EventID": "B2A2CB766480808B",
        "BaggageBytes": "[[248 5] [240 0] [0 180 70 11 180 144 111 42 186] [240 1] [0 187 24 104 209 208 184 183 179] [240 3] [0 2]]",
        "ProcessID": 28841
      },
      {
        "Cycles": 0,
        "Agent": "edu.brown.cs.systems.retro.benchmarks.hdfs_client.Reader",
        "ProcessName": "Read",
        "TaskID": "B4460BB4906F2ABA",
        "ParentEventID": [
          "0"
        ],
        "Label": "Reading file",
        "Title": "X-Trace Task",
        "Host": "pinky19.mpi-sws.org",
        "HRT": 26966720155253517,
        "Timestamp": "1557750360095.704346",
        "TenantClass": 0,
        "ThreadID": 1,
        "ThreadName": "",
        "EventID": "7F82CA2E0C4B7BB0",
        "ProcessID": 2801,
        "Tag": [
          "reader_100kb",
          "Read Size: 102400"
        ]
      },
      {
        "Cycles": 0,
        "Agent": "Execution-Sleep",
        "ProcessName": "Data",
        "TaskID": "B4460BB4906F2ABA",
        "ParentEventID": [
          "B2A2CB766480808B"
        ],
        "Label": "waited",
        "Title": "X-Trace Task",
        "Host": "pinky22.mpi-sws.org",
        "Duration": "6772",
        "HRT": 47516692414557288,
        "Operation": "waited",
        "Timestamp": "1557750360100.675049",
        "TenantClass": 0,
        "Source": "SocketIOWithTimeout.java:335",
        "ThreadID": 15939,
        "ThreadName": "",
        "EventID": "C1D0C941B401A234",
        "BaggageBytes": "[[248 5] [240 0] [0 180 70 11 180 144 111 42 186] [240 1] [0 178 162 203 118 100 128 128 139] [240 3] [0 2]]",
        "ProcessID": 28841
      },
      {
        "Cycles": 0,
        "Agent": "edu.brown.cs.systems.xtrace.logging.BaggageWrappers",
        "ProcessName": "Data",
        "TaskID": "B4460BB4906F2ABA",
        "ParentEventID": [
          "C1D0C941B401A234"
        ],
        "Label": "Forking current baggage with Baggage.fork()",
        "Title": "X-Trace Task",
        "Host": "pinky22.mpi-sws.org",
        "HRT": 47516692414717223,
        "Operation": "fork",
        "Timestamp": "1557750360100.834961",
        "TenantClass": 0,
        "Source": "PacketHeader.java:95",
        "ThreadID": 15939,
        "ThreadName": "",
        "EventID": "CD31B7839BA0A6C5",
        "BaggageBytes": "[[248 5] [240 0] [0 180 70 11 180 144 111 42 186] [240 1] [0 193 208 201 65 180 1 162 52] [240 3] [0 2]]",
        "ProcessID": 28841
      },
      {
        "Cycles": 0,
        "Agent": "Execution-CPU",
        "ProcessName": "Data",
        "TaskID": "B4460BB4906F2ABA",
        "ParentEventID": [
          "CD31B7839BA0A6C5"
        ],
        "Label": "unset",
        "Title": "X-Trace Task",
        "Host": "pinky22.mpi-sws.org",
        "Duration": "1780751",
        "HRT": 47516692415113869,
        "Operation": "unset",
        "Timestamp": "1557750360101.231689",
        "TenantClass": 0,
        "Source": "DataXceiver.java:261",
        "ThreadID": 15939,
        "ThreadName": "",
        "EventID": "38311C812A2AD246",
        "BaggageBytes": "[[248 5] [240 0] [0 180 70 11 180 144 111 42 186] [240 1] [0 205 49 183 131 155 160 166 197] [240 3] [0 2]]",
        "ProcessID": 28841
      }
    ]
  }
]