[
  {
    "id": "524C6DC6F06DD776",
    "reports": [
      {
        "Cycles": 0,
        "Agent": "org.apache.hadoop.ipc.ProtobufRpcEngine",
        "ProcessName": "Read",
        "TaskID": "524C6DC6F06DD776",
        "ParentEventID": [
          "272EF85B58454AB2"
        ],
        "Label": "Invoking org.apache.hadoop.hdfs.protocol.ClientProtocol.getBlockLocations",
        "Title": "X-Trace Task",
        "Host": "pinky19.mpi-sws.org",
        "HRT": 26962457485661281,
        "Timestamp": "1557746097426.149902",
        "TenantClass": 0,
        "Source": "ProtobufRpcEngine.java:228",
        "ThreadID": 1,
        "ThreadName": "",
        "EventID": "81B075F9BD16AC07",
        "ProcessID": 36430
      },
      {
        "Cycles": 0,
        "Agent": "edu.brown.cs.systems.retro.benchmarks.hdfs_client.Reader",
        "ProcessName": "Read",
        "TaskID": "524C6DC6F06DD776",
        "ParentEventID": [
          "CFC6DBFD006DB316"
        ],
        "Label": "Reading file",
        "Title": "X-Trace Task",
        "Host": "pinky19.mpi-sws.org",
        "HRT": 26962457485619791,
        "Timestamp": "1557746097426.108398",
        "TenantClass": 0,
        "ThreadID": 1,
        "ThreadName": "",
        "EventID": "272EF85B58454AB2",
        "ProcessID": 36430
      },
      {
        "Cycles": 0,
        "Agent": "Execution-CPU",
        "ProcessName": "Read",
        "TaskID": "524C6DC6F06DD776",
        "ParentEventID": [
          "7DC78630681DCE4F"
        ],
        "Label": "set",
        "Title": "X-Trace Task",
        "Host": "pinky19.mpi-sws.org",
        "HRT": 26962457485743432,
        "Operation": "set",
        "Timestamp": "1557746097426.232178",
        "TenantClass": 0,
        "Source": "Client.java:1032",
        "ThreadID": 41,
        "ThreadName": "",
        "EventID": "4E89DFB575A7C4C9",
        "ProcessID": 36430
      },
      {
        "Cycles": 0,
        "Agent": "Execution-CPU",
        "ProcessName": "Read",
        "TaskID": "524C6DC6F06DD776",
        "ParentEventID": [
          "81B075F9BD16AC07"
        ],
        "Label": "unset",
        "Title": "X-Trace Task",
        "Host": "pinky19.mpi-sws.org",
        "Duration": "22253638",
        "HRT": 26962457485690220,
        "Operation": "unset",
        "Timestamp": "1557746097426.178955",
        "TenantClass": 0,
        "Source": "Client.java:1027",
        "ThreadID": 1,
        "ThreadName": "",
        "EventID": "7DC78630681DCE4F",
        "ProcessID": 36430
      },
      {
        "Cycles": 0,
        "Agent": "Execution-CPU",
        "ProcessName": "Read",
        "TaskID": "524C6DC6F06DD776",
        "ParentEventID": [
          "21EE6902C88BD96B"
        ],
        "Label": "unset",
        "Title": "X-Trace Task",
        "Host": "pinky19.mpi-sws.org",
        "Duration": "74543",
        "HRT": 26962457485836239,
        "Operation": "unset",
        "Timestamp": "1557746097426.324951",
        "TenantClass": 0,
        "Source": "Client.java:1062",
        "ThreadID": 41,
        "ThreadName": "",
        "EventID": "6CC5921FAD5E7A69",
        "ProcessID": 36430
      },
      {
        "Cycles": 0,
        "Agent": "Execution-CPU",
        "ProcessName": "Read",
        "TaskID": "524C6DC6F06DD776",
        "ParentEventID": [
          "6CC5921FAD5E7A69"
        ],
        "Label": "set",
        "Title": "X-Trace Task",
        "Host": "pinky19.mpi-sws.org",
        "HRT": 26962457485861022,
        "Operation": "set",
        "Timestamp": "1557746097426.349609",
        "TenantClass": 0,
        "Source": "Client.java:1104",
        "ThreadID": 1,
        "ThreadName": "",
        "EventID": "62E437696577C96F",
        "ProcessID": 36430
      },
      {
        "Cycles": 0,
        "Agent": "edu.brown.cs.systems.xtrace.logging.BaggageWrappers",
        "ProcessName": "Read",
        "TaskID": "524C6DC6F06DD776",
        "ParentEventID": [
          "4E89DFB575A7C4C9"
        ],
        "Label": "Forking current baggage with Baggage.fork()",
        "Title": "X-Trace Task",
        "Host": "pinky19.mpi-sws.org",
        "HRT": 26962457485762608,
        "Operation": "fork",
        "Timestamp": "1557746097426.251221",
        "TenantClass": 0,
        "Source": "Client.java:1043",
        "ThreadID": 41,
        "ThreadName": "",
        "EventID": "21EE6902C88BD96B",
        "ProcessID": 36430
      },
      {
        "Cycles": 0,
        "Agent": "edu.brown.cs.systems.xtrace.logging.BaggageWrappers",
        "ProcessName": "Name",
        "TaskID": "524C6DC6F06DD776",
        "ParentEventID": [
          "C5F4D3D072BC3A4D"
        ],
        "Label": "Forking current baggage with Baggage.fork()",
        "Title": "X-Trace Task",
        "Host": "pinky19.mpi-sws.org",
        "HRT": 26962457485918341,
        "Operation": "fork",
        "Timestamp": "1557746097426.423096",
        "TenantClass": 0,
        "Source": "Server.java:550",
        "ThreadID": 48,
        "ThreadName": "",
        "EventID": "0554D2CDE9B21E29",
        "BaggageBytes": "[[248 5] [240 0] [0 82 76 109 198 240 109 215 118] [240 1] [0 197 244 211 208 114 188 58 77] [240 3] [0 2]]",
        "ProcessID": 2171
      },
      {
        "Cycles": 0,
        "Agent": "Execution-CPU",
        "ProcessName": "Name",
        "TaskID": "524C6DC6F06DD776",
        "ParentEventID": [
          "0554D2CDE9B21E29"
        ],
        "Label": "unset",
        "Title": "X-Trace Task",
        "Host": "pinky19.mpi-sws.org",
        "Duration": "23220",
        "HRT": 26962457485937695,
        "Operation": "unset",
        "Timestamp": "1557746097426.442383",
        "TenantClass": 0,
        "Source": "Server.java:1828",
        "ThreadID": 48,
        "ThreadName": "",
        "EventID": "90DA5D3B06438111",
        "BaggageBytes": "[[248 5] [240 0] [0 82 76 109 198 240 109 215 118] [240 1] [0 5 84 210 205 233 178 30 41] [240 3] [0 2]]",
        "ProcessID": 2171
      },
      {
        "Cycles": 0,
        "Agent": "Execution-CPU",
        "ProcessName": "Name",
        "TaskID": "524C6DC6F06DD776",
        "ParentEventID": [
          "0554D2CDE9B21E29"
        ],
        "Label": "set",
        "Title": "X-Trace Task",
        "Host": "pinky19.mpi-sws.org",
        "HRT": 26962457485945830,
        "Operation": "set",
        "Timestamp": "1557746097426.450684",
        "TenantClass": 0,
        "Source": "Server.java:2071",
        "ThreadID": 55,
        "ThreadName": "",
        "EventID": "334791D492C2E2ED",
        "BaggageBytes": "[[248 5] [240 0] [0 82 76 109 198 240 109 215 118] [240 1] [0 5 84 210 205 233 178 30 41] [240 3] [0 2]]",
        "ProcessID": 2171
      },
      {
        "Cycles": 0,
        "Agent": "org.apache.hadoop.ipc.Server",
        "ProcessName": "Name",
        "TaskID": "524C6DC6F06DD776",
        "ParentEventID": [
          "334791D492C2E2ED"
        ],
        "Label": "getBlockLocations in org.apache.hadoop.hdfs.protocol.ClientProtocol",
        "Title": "X-Trace Task",
        "Host": "pinky19.mpi-sws.org",
        "HRT": 26962457485982230,
        "Timestamp": "1557746097426.487061",
        "TenantClass": 0,
        "Source": "ProtobufRpcEngine.java:601",
        "ThreadID": 55,
        "ThreadName": "",
        "EventID": "286B532B7B57DD47",
        "BaggageBytes": "[[248 5] [240 0] [0 82 76 109 198 240 109 215 118] [240 1] [0 51 71 145 212 146 194 226 237] [240 3] [0 2]]",
        "ProcessID": 2171
      },
      {
        "Cycles": 0,
        "Agent": "org.apache.hadoop.hdfs.server.namenode.FSNamesystem.audit",
        "ProcessName": "Name",
        "TaskID": "524C6DC6F06DD776",
        "ParentEventID": [
          "286B532B7B57DD47"
        ],
        "Label": "allowed=true\tugi=plascas (auth:SIMPLE)\tip=/139.19.171.63\tcmd=open\tsrc=/ds/FxV2o9WpALf4mlPL\tdst=null\tperm=null\tproto=rpc",
        "Title": "X-Trace Task",
        "Host": "pinky19.mpi-sws.org",
        "HRT": 26962457486033387,
        "Timestamp": "1557746097426.538086",
        "TenantClass": 0,
        "Source": "FSNamesystem.java:8313",
        "ThreadID": 55,
        "ThreadName": "",
        "EventID": "321898B48ED59749",
        "BaggageBytes": "[[248 5] [240 0] [0 82 76 109 198 240 109 215 118] [240 1] [0 40 107 83 43 123 87 221 71] [240 3] [0 2]]",
        "ProcessID": 2171
      },
      {
        "Cycles": 0,
        "Agent": "Execution-CPU",
        "ProcessName": "Name",
        "TaskID": "524C6DC6F06DD776",
        "ParentEventID": [
          "21EE6902C88BD96B"
        ],
        "Label": "set",
        "Title": "X-Trace Task",
        "Host": "pinky19.mpi-sws.org",
        "HRT": 26962457485889736,
        "Operation": "set",
        "Timestamp": "1557746097426.394531",
        "TenantClass": 0,
        "Source": "Server.java:1840",
        "ThreadID": 48,
        "ThreadName": "",
        "EventID": "C5F4D3D072BC3A4D",
        "BaggageBytes": "[[248 5] [240 0] [0 82 76 109 198 240 109 215 118] [240 1] [0 33 238 105 2 200 139 217 107] [240 3] [0 2]]",
        "ProcessID": 2171
      },
      {
        "Cycles": 0,
        "Agent": "edu.brown.cs.systems.xtrace.logging.BaggageWrappers",
        "ProcessName": "Name",
        "TaskID": "524C6DC6F06DD776",
        "ParentEventID": [
          "321898B48ED59749"
        ],
        "Label": "Forking current baggage with Baggage.fork()",
        "Title": "X-Trace Task",
        "Host": "pinky19.mpi-sws.org",
        "HRT": 26962457486076808,
        "Operation": "fork",
        "Timestamp": "1557746097426.581543",
        "TenantClass": 0,
        "Source": "Server.java:2398",
        "ThreadID": 55,
        "ThreadName": "",
        "EventID": "775D88F3CDA3E882",
        "BaggageBytes": "[[248 5] [240 0] [0 82 76 109 198 240 109 215 118] [240 1] [0 50 24 152 180 142 213 151 73] [240 3] [0 2]]",
        "ProcessID": 2171
      },
      {
        "Cycles": 0,
        "Agent": "Execution-CPU",
        "ProcessName": "Name",
        "TaskID": "524C6DC6F06DD776",
        "ParentEventID": [
          "775D88F3CDA3E882"
        ],
        "Label": "unset",
        "Title": "X-Trace Task",
        "Host": "pinky19.mpi-sws.org",
        "Duration": "212765",
        "HRT": 26962457486183540,
        "Operation": "unset",
        "Timestamp": "1557746097426.688232",
        "TenantClass": 0,
        "Source": "Server.java:1058",
        "ThreadID": 55,
        "ThreadName": "",
        "EventID": "8D1E623F0D06830F",
        "BaggageBytes": "[[248 5] [240 0] [0 82 76 109 198 240 109 215 118] [240 1] [0 119 93 136 243 205 163 232 130] [240 3] [0 2]]",
        "ProcessID": 2171
      },
      {
        "Cycles": 0,
        "Agent": "Execution-CPU",
        "ProcessName": "Read",
        "TaskID": "524C6DC6F06DD776",
        "ParentEventID": [
          "CC429624C578B9BD"
        ],
        "Label": "unset",
        "Title": "X-Trace Task",
        "Host": "pinky19.mpi-sws.org",
        "Duration": "12879",
        "HRT": 26962457486264032,
        "Operation": "unset",
        "Timestamp": "1557746097426.752686",
        "TenantClass": 0,
        "Source": "Client.java:1168",
        "ThreadID": 37,
        "ThreadName": "",
        "EventID": "B0C83CDE8CAD9294",
        "ProcessID": 36430
      },
      {
        "Cycles": 0,
        "Agent": "Execution-Sleep",
        "ProcessName": "Read",
        "TaskID": "524C6DC6F06DD776",
        "ParentEventID": [
          "62E437696577C96F"
        ],
        "Label": "waited",
        "Title": "X-Trace Task",
        "Host": "pinky19.mpi-sws.org",
        "Duration": "407667",
        "HRT": 26962457486286422,
        "Operation": "waited",
        "Timestamp": "1557746097426.775146",
        "TenantClass": 0,
        "Source": "Client.java:1537",
        "ThreadID": 1,
        "ThreadName": "",
        "EventID": "63C144DA24896D84",
        "ProcessID": 36430
      },
      {
        "Cycles": 0,
        "Agent": "Execution-CPU",
        "ProcessName": "Read",
        "TaskID": "524C6DC6F06DD776",
        "ParentEventID": [
          "775D88F3CDA3E882"
        ],
        "Label": "set",
        "Title": "X-Trace Task",
        "Host": "pinky19.mpi-sws.org",
        "HRT": 26962457486236123,
        "Operation": "set",
        "Timestamp": "1557746097426.724854",
        "TenantClass": 0,
        "Source": "Client.java:302",
        "ThreadID": 37,
        "ThreadName": "",
        "EventID": "CC429624C578B9BD",
        "ProcessID": 36430
      },
      {
        "Cycles": 0,
        "Agent": "edu.brown.cs.systems.xtrace.logging.BaggageWrappers",
        "ProcessName": "Read",
        "TaskID": "524C6DC6F06DD776",
        "ParentEventID": [
          "B0C83CDE8CAD9294",
          "63C144DA24896D84"
        ],
        "Label": "Merged current baggage with other baggage",
        "Title": "X-Trace Task",
        "Host": "pinky19.mpi-sws.org",
        "HRT": 26962457486307300,
        "Operation": "join",
        "Timestamp": "1557746097426.795898",
        "TenantClass": 0,
        "Source": "Client.java:1545",
        "ThreadID": 1,
        "ThreadName": "",
        "EventID": "947D571EFA9874A8",
        "ProcessID": 36430
      },
      {
        "Cycles": 0,
        "Agent": "edu.brown.cs.systems.xtrace.logging.BaggageWrappers",
        "ProcessName": "Read",
        "TaskID": "524C6DC6F06DD776",
        "ParentEventID": [
          "DDE756F25E054ACC"
        ],
        "Label": "Forking current baggage with Baggage.fork()",
        "Title": "X-Trace Task",
        "Host": "pinky19.mpi-sws.org",
        "HRT": 26962457486422991,
        "Operation": "fork",
        "Timestamp": "1557746097426.911621",
        "TenantClass": 0,
        "Source": "DataTransferProtoUtil.java:94",
        "ThreadID": 1,
        "ThreadName": "",
        "EventID": "2A6ED4B3887EB811",
        "ProcessID": 36430
      },
      {
        "Cycles": 0,
        "Agent": "Execution-CPU",
        "ProcessName": "Data",
        "TaskID": "524C6DC6F06DD776",
        "ParentEventID": [
          "2A6ED4B3887EB811"
        ],
        "Label": "set",
        "Title": "X-Trace Task",
        "Host": "pinky25.mpi-sws.org",
        "HRT": 47511562728316228,
        "Operation": "set",
        "Timestamp": "1557746097427.202881",
        "TenantClass": 0,
        "Source": "Receiver.java:117",
        "ThreadID": 14040,
        "ThreadName": "",
        "EventID": "36A1AABFE947A9FA",
        "BaggageBytes": "[[248 5] [240 0] [0 82 76 109 198 240 109 215 118] [240 1] [0 42 110 212 179 136 126 184 17] [240 3] [0 2]]",
        "ProcessID": 28198
      },
      {
        "Cycles": 0,
        "Agent": "edu.brown.cs.systems.xtrace.logging.XTraceInit",
        "ProcessName": "Data",
        "TaskID": "524C6DC6F06DD776",
        "ParentEventID": [
          "36A1AABFE947A9FA"
        ],
        "Label": "Thread.setName: DataXceiver for client DFSClient_NONMAPREDUCE_778905418_1 at /139.19.171.63:41180 [Sending block BP-1633380353-139.19.171.63-1554193446451:blk_1073763299_22475]",
        "Title": "X-Trace Task",
        "Host": "pinky25.mpi-sws.org",
        "HRT": 47511562728417160,
        "Timestamp": "1557746097427.303955",
        "TenantClass": 0,
        "Source": "DataXceiver.java:168",
        "ThreadID": 14040,
        "ThreadName": "",
        "EventID": "BD8E3A98CCC2165C",
        "BaggageBytes": "[[248 5] [240 0] [0 82 76 109 198 240 109 215 118] [240 1] [0 54 161 170 191 233 71 169 250] [240 3] [0 2]]",
        "ProcessID": 28198
      },
      {
        "Cycles": 0,
        "Agent": "org.apache.hadoop.ipc.ProtobufRpcEngine",
        "ProcessName": "Read",
        "TaskID": "524C6DC6F06DD776",
        "ParentEventID": [
          "947D571EFA9874A8"
        ],
        "Label": "org.apache.hadoop.hdfs.protocol.ClientProtocol.getBlockLocations completed",
        "Title": "X-Trace Task",
        "Host": "pinky19.mpi-sws.org",
        "HRT": 26962457486349575,
        "Timestamp": "1557746097426.838135",
        "TenantClass": 0,
        "Source": "ProtobufRpcEngine.java:275",
        "ThreadID": 1,
        "ThreadName": "",
        "EventID": "DDE756F25E054ACC",
        "ProcessID": 36430
      },
      {
        "Cycles": 0,
        "Agent": "edu.brown.cs.systems.xtrace.logging.BaggageWrappers",
        "ProcessName": "Data",
        "TaskID": "524C6DC6F06DD776",
        "ParentEventID": [
          "BD8E3A98CCC2165C"
        ],
        "Label": "Forking current baggage with Baggage.fork()",
        "Title": "X-Trace Task",
        "Host": "pinky25.mpi-sws.org",
        "HRT": 47511562728557831,
        "Operation": "fork",
        "Timestamp": "1557746097427.444580",
        "TenantClass": 0,
        "Source": "DataXceiver.java:1257",
        "ThreadID": 14040,
        "ThreadName": "",
        "EventID": "57A3C2C7E6119147",
        "BaggageBytes": "[[248 5] [240 0] [0 82 76 109 198 240 109 215 118] [240 1] [0 189 142 58 152 204 194 22 92] [240 3] [0 2]]",
        "ProcessID": 28198
      },
      {
        "Cycles": 0,
        "Agent": "edu.brown.cs.systems.xtrace.logging.BaggageWrappers",
        "ProcessName": "Read",
        "TaskID": "524C6DC6F06DD776",
        "ParentEventID": [
          "2C30F775AFA57F93",
          "57A3C2C7E6119147"
        ],
        "Label": "Merged current baggage with other baggage",
        "Title": "X-Trace Task",
        "Host": "pinky19.mpi-sws.org",
        "HRT": 26962457487111390,
        "Operation": "join",
        "Timestamp": "1557746097427.600098",
        "TenantClass": 0,
        "Source": "RemoteBlockReader2.java:429",
        "ThreadID": 1,
        "ThreadName": "",
        "EventID": "65AC28D0424DB712",
        "ProcessID": 36430
      },
      {
        "Cycles": 0,
        "Agent": "edu.brown.cs.systems.xtrace.logging.BaggageWrappers",
        "ProcessName": "Data",
        "TaskID": "524C6DC6F06DD776",
        "ParentEventID": [
          "57A3C2C7E6119147"
        ],
        "Label": "Forking current baggage with Baggage.fork()",
        "Title": "X-Trace Task",
        "Host": "pinky25.mpi-sws.org",
        "HRT": 47511562728639509,
        "Operation": "fork",
        "Timestamp": "1557746097427.526367",
        "TenantClass": 0,
        "Source": "PacketHeader.java:95",
        "ThreadID": 14040,
        "ThreadName": "",
        "EventID": "E55E6D1564424B1C",
        "BaggageBytes": "[[248 5] [240 0] [0 82 76 109 198 240 109 215 118] [240 1] [0 87 163 194 199 230 17 145 71] [240 3] [0 2]]",
        "ProcessID": 28198
      },
      {
        "Cycles": 0,
        "Agent": "Execution-Sleep",
        "ProcessName": "Data",
        "TaskID": "524C6DC6F06DD776",
        "ParentEventID": [
          "E55E6D1564424B1C"
        ],
        "Label": "waited",
        "Title": "X-Trace Task",
        "Host": "pinky25.mpi-sws.org",
        "Duration": "4621",
        "HRT": 47511562728703585,
        "Operation": "waited",
        "Timestamp": "1557746097427.590332",
        "TenantClass": 0,
        "Source": "SocketIOWithTimeout.java:335",
        "ThreadID": 14040,
        "ThreadName": "",
        "EventID": "38DE920DB6C49968",
        "BaggageBytes": "[[248 5] [240 0] [0 82 76 109 198 240 109 215 118] [240 1] [0 229 94 109 21 100 66 75 28] [240 3] [0 2]]",
        "ProcessID": 28198
      },
      {
        "Cycles": 0,
        "Agent": "edu.brown.cs.systems.xtrace.logging.BaggageWrappers",
        "ProcessName": "Data",
        "TaskID": "524C6DC6F06DD776",
        "ParentEventID": [
          "38DE920DB6C49968"
        ],
        "Label": "Forking current baggage with Baggage.fork()",
        "Title": "X-Trace Task",
        "Host": "pinky25.mpi-sws.org",
        "HRT": 47511562728774688,
        "Operation": "fork",
        "Timestamp": "1557746097427.661377",
        "TenantClass": 0,
        "Source": "PacketHeader.java:95",
        "ThreadID": 14040,
        "ThreadName": "",
        "EventID": "9BE50E5CFF9739F4",
        "BaggageBytes": "[[248 5] [240 0] [0 82 76 109 198 240 109 215 118] [240 1] [0 56 222 146 13 182 196 153 104] [240 3] [0 2]]",
        "ProcessID": 28198
      },
      {
        "Cycles": 0,
        "Agent": "Execution-Sleep",
        "ProcessName": "Read",
        "TaskID": "524C6DC6F06DD776",
        "ParentEventID": [
          "2A6ED4B3887EB811"
        ],
        "Label": "waited",
        "Title": "X-Trace Task",
        "Host": "pinky19.mpi-sws.org",
        "Duration": "516104",
        "HRT": 26962457487039031,
        "Operation": "waited",
        "Timestamp": "1557746097427.527588",
        "TenantClass": 0,
        "Source": "SocketIOWithTimeout.java:335",
        "ThreadID": 1,
        "ThreadName": "",
        "EventID": "2C30F775AFA57F93",
        "ProcessID": 36430
      },
      {
        "Cycles": 0,
        "Agent": "Execution-Sleep",
        "ProcessName": "Read",
        "TaskID": "524C6DC6F06DD776",
        "ParentEventID": [
          "65AC28D0424DB712"
        ],
        "Label": "waited",
        "Title": "X-Trace Task",
        "Host": "pinky19.mpi-sws.org",
        "Duration": "92867",
        "HRT": 26962457487290866,
        "Operation": "waited",
        "Timestamp": "1557746097427.779541",
        "TenantClass": 0,
        "Source": "SocketIOWithTimeout.java:335",
        "ThreadID": 1,
        "ThreadName": "",
        "EventID": "A1D3CDB533F427B1",
        "ProcessID": 36430
      },
      {
        "Cycles": 0,
        "Agent": "edu.brown.cs.systems.xtrace.logging.BaggageWrappers",
        "ProcessName": "Read",
        "TaskID": "524C6DC6F06DD776",
        "ParentEventID": [
          "A1D3CDB533F427B1",
          "E55E6D1564424B1C"
        ],
        "Label": "Merged current baggage with other baggage",
        "Title": "X-Trace Task",
        "Host": "pinky19.mpi-sws.org",
        "HRT": 26962457487342184,
        "Operation": "join",
        "Timestamp": "1557746097427.830811",
        "TenantClass": 0,
        "Source": "PacketHeader.java:168",
        "ThreadID": 1,
        "ThreadName": "",
        "EventID": "40EB885CC446B74C",
        "ProcessID": 36430
      },
      {
        "Cycles": 0,
        "Agent": "edu.brown.cs.systems.xtrace.logging.BaggageWrappers",
        "ProcessName": "Read",
        "TaskID": "524C6DC6F06DD776",
        "ParentEventID": [
          "1F7432797030ABF4"
        ],
        "Label": "Forking current baggage with Baggage.fork()",
        "Title": "X-Trace Task",
        "Host": "pinky19.mpi-sws.org",
        "HRT": 26962457487407890,
        "Operation": "fork",
        "Timestamp": "1557746097427.896484",
        "TenantClass": 0,
        "Source": "RemoteBlockReader2.java:361",
        "ThreadID": 1,
        "ThreadName": "",
        "EventID": "4370C45156E15788",
        "ProcessID": 36430
      },
      {
        "Cycles": 0,
        "Agent": "edu.brown.cs.systems.xtrace.logging.BaggageWrappers",
        "ProcessName": "Read",
        "TaskID": "524C6DC6F06DD776",
        "ParentEventID": [
          "40EB885CC446B74C",
          "9BE50E5CFF9739F4"
        ],
        "Label": "Merged current baggage with other baggage",
        "Title": "X-Trace Task",
        "Host": "pinky19.mpi-sws.org",
        "HRT": 26962457487397999,
        "Operation": "join",
        "Timestamp": "1557746097427.886719",
        "TenantClass": 0,
        "Source": "PacketHeader.java:168",
        "ThreadID": 1,
        "ThreadName": "",
        "EventID": "1F7432797030ABF4",
        "ProcessID": 36430
      },
      {
        "Cycles": 0,
        "Agent": "Execution-Sleep",
        "ProcessName": "Data",
        "TaskID": "524C6DC6F06DD776",
        "ParentEventID": [
          "9BE50E5CFF9739F4"
        ],
        "Label": "waited",
        "Title": "X-Trace Task",
        "Host": "pinky25.mpi-sws.org",
        "Duration": "225225",
        "HRT": 47511562729091093,
        "Operation": "waited",
        "Timestamp": "1557746097427.977783",
        "TenantClass": 0,
        "Source": "SocketIOWithTimeout.java:335",
        "ThreadID": 14040,
        "ThreadName": "",
        "EventID": "4E636713DB479F4D",
        "BaggageBytes": "[[248 5] [240 0] [0 82 76 109 198 240 109 215 118] [240 1] [0 155 229 14 92 255 151 57 244] [240 3] [0 2]]",
        "ProcessID": 28198
      },
      {
        "Cycles": 0,
        "Agent": "edu.brown.cs.systems.xtrace.logging.BaggageWrappers",
        "ProcessName": "Data",
        "TaskID": "524C6DC6F06DD776",
        "ParentEventID": [
          "4370C45156E15788",
          "4E636713DB479F4D"
        ],
        "Label": "Merged current baggage with other baggage",
        "Title": "X-Trace Task",
        "Host": "pinky25.mpi-sws.org",
        "HRT": 47511562729165274,
        "Operation": "join",
        "Timestamp": "1557746097428.052002",
        "TenantClass": 0,
        "Source": "DataXceiver.java:574",
        "ThreadID": 14040,
        "ThreadName": "",
        "EventID": "1421DF6BE6FA5CF1",
        "BaggageBytes": "[[248 5] [240 0] [0 82 76 109 198 240 109 215 118] [240 1] [0 67 112 196 81 86 225 87 136] [0 78 99 103 19 219 71 159 77] [240 3] [0 2]]",
        "ProcessID": 28198
      },
      {
        "Cycles": 0,
        "Agent": "Execution-CPU",
        "ProcessName": "Data",
        "TaskID": "524C6DC6F06DD776",
        "ParentEventID": [
          "1421DF6BE6FA5CF1"
        ],
        "Label": "unset",
        "Title": "X-Trace Task",
        "Host": "pinky25.mpi-sws.org",
        "Duration": "812468",
        "HRT": 47511562729200953,
        "Operation": "unset",
        "Timestamp": "1557746097428.087646",
        "TenantClass": 0,
        "Source": "DataXceiver.java:261",
        "ThreadID": 14040,
        "ThreadName": "",
        "EventID": "2933AC8DB0E5A6CA",
        "BaggageBytes": "[[248 5] [240 0] [0 82 76 109 198 240 109 215 118] [240 1] [0 20 33 223 107 230 250 92 241] [240 3] [0 2]]",
        "ProcessID": 28198
      },
      {
        "Cycles": 0,
        "Agent": "edu.brown.cs.systems.retro.benchmarks.hdfs_client.Reader",
        "ProcessName": "Read",
        "TaskID": "524C6DC6F06DD776",
        "ParentEventID": [
          "0"
        ],
        "Label": "Reading file",
        "Title": "X-Trace Task",
        "Host": "pinky19.mpi-sws.org",
        "HRT": 26962457485602912,
        "Timestamp": "1557746097426.091553",
        "TenantClass": 0,
        "ThreadID": 1,
        "ThreadName": "",
        "EventID": "CFC6DBFD006DB316",
        "ProcessID": 36430,
        "Tag": [
          "reader_10kb",
          "Read Size: 10240"
        ]
      }
    ]
  }
]