[
  {
    "id": "3A40C05841EC6F97",
    "reports": [
      {
        "Cycles": 0,
        "Agent": "org.apache.hadoop.ipc.ProtobufRpcEngine",
        "ProcessName": "Read",
        "TaskID": "3A40C05841EC6F97",
        "ParentEventID": [
          "054199C4F2FE2585"
        ],
        "Label": "Invoking org.apache.hadoop.hdfs.protocol.ClientProtocol.getBlockLocations",
        "Title": "X-Trace Task",
        "Host": "pinky19.mpi-sws.org",
        "HRT": 26962553416908326,
        "Timestamp": "1557746193356.867920",
        "TenantClass": 0,
        "Source": "ProtobufRpcEngine.java:228",
        "ThreadID": 1,
        "ThreadName": "",
        "EventID": "4F2B9937DF8855A3",
        "ProcessID": 36430
      },
      {
        "Cycles": 0,
        "Agent": "edu.brown.cs.systems.retro.benchmarks.hdfs_client.Reader",
        "ProcessName": "Read",
        "TaskID": "3A40C05841EC6F97",
        "ParentEventID": [
          "3BD17E6467D7AB06"
        ],
        "Label": "Reading file",
        "Title": "X-Trace Task",
        "Host": "pinky19.mpi-sws.org",
        "HRT": 26962553416864833,
        "Timestamp": "1557746193356.824463",
        "TenantClass": 0,
        "ThreadID": 1,
        "ThreadName": "",
        "EventID": "054199C4F2FE2585",
        "ProcessID": 36430
      },
      {
        "Cycles": 0,
        "Agent": "Execution-CPU",
        "ProcessName": "Read",
        "TaskID": "3A40C05841EC6F97",
        "ParentEventID": [
          "4F2B9937DF8855A3"
        ],
        "Label": "unset",
        "Title": "X-Trace Task",
        "Host": "pinky19.mpi-sws.org",
        "Duration": "21541932",
        "HRT": 26962553416938654,
        "Operation": "unset",
        "Timestamp": "1557746193356.898193",
        "TenantClass": 0,
        "Source": "Client.java:1027",
        "ThreadID": 1,
        "ThreadName": "",
        "EventID": "39B7DF7669E25958",
        "ProcessID": 36430
      },
      {
        "Cycles": 0,
        "Agent": "Execution-CPU",
        "ProcessName": "Read",
        "TaskID": "3A40C05841EC6F97",
        "ParentEventID": [
          "39B7DF7669E25958"
        ],
        "Label": "set",
        "Title": "X-Trace Task",
        "Host": "pinky19.mpi-sws.org",
        "HRT": 26962553416991720,
        "Operation": "set",
        "Timestamp": "1557746193356.951416",
        "TenantClass": 0,
        "Source": "Client.java:1032",
        "ThreadID": 41,
        "ThreadName": "",
        "EventID": "DB35408ACE6B9FD9",
        "ProcessID": 36430
      },
      {
        "Cycles": 0,
        "Agent": "edu.brown.cs.systems.xtrace.logging.BaggageWrappers",
        "ProcessName": "Read",
        "TaskID": "3A40C05841EC6F97",
        "ParentEventID": [
          "DB35408ACE6B9FD9"
        ],
        "Label": "Forking current baggage with Baggage.fork()",
        "Title": "X-Trace Task",
        "Host": "pinky19.mpi-sws.org",
        "HRT": 26962553417013632,
        "Operation": "fork",
        "Timestamp": "1557746193356.973145",
        "TenantClass": 0,
        "Source": "Client.java:1043",
        "ThreadID": 41,
        "ThreadName": "",
        "EventID": "E44FF2B94101D5A9",
        "ProcessID": 36430
      },
      {
        "Cycles": 0,
        "Agent": "Execution-CPU",
        "ProcessName": "Read",
        "TaskID": "3A40C05841EC6F97",
        "ParentEventID": [
          "84AEE79147703400"
        ],
        "Label": "set",
        "Title": "X-Trace Task",
        "Host": "pinky19.mpi-sws.org",
        "HRT": 26962553417113679,
        "Operation": "set",
        "Timestamp": "1557746193357.073242",
        "TenantClass": 0,
        "Source": "Client.java:1104",
        "ThreadID": 1,
        "ThreadName": "",
        "EventID": "57849B6607CD5D05",
        "ProcessID": 36430
      },
      {
        "Cycles": 0,
        "Agent": "Execution-CPU",
        "ProcessName": "Read",
        "TaskID": "3A40C05841EC6F97",
        "ParentEventID": [
          "E44FF2B94101D5A9"
        ],
        "Label": "unset",
        "Title": "X-Trace Task",
        "Host": "pinky19.mpi-sws.org",
        "Duration": "76704",
        "HRT": 26962553417089657,
        "Operation": "unset",
        "Timestamp": "1557746193357.049316",
        "TenantClass": 0,
        "Source": "Client.java:1062",
        "ThreadID": 41,
        "ThreadName": "",
        "EventID": "84AEE79147703400",
        "ProcessID": 36430
      },
      {
        "Cycles": 0,
        "Agent": "Execution-CPU",
        "ProcessName": "Name",
        "TaskID": "3A40C05841EC6F97",
        "ParentEventID": [
          "E44FF2B94101D5A9"
        ],
        "Label": "set",
        "Title": "X-Trace Task",
        "Host": "pinky19.mpi-sws.org",
        "HRT": 26962553417134749,
        "Operation": "set",
        "Timestamp": "1557746193357.129150",
        "TenantClass": 0,
        "Source": "Server.java:1840",
        "ThreadID": 48,
        "ThreadName": "",
        "EventID": "2E683AAC83D79C9B",
        "BaggageBytes": "[[248 5] [240 0] [0 58 64 192 88 65 236 111 151] [240 1] [0 228 79 242 185 65 1 213 169] [240 3] [0 2]]",
        "ProcessID": 2171
      },
      {
        "Cycles": 0,
        "Agent": "Execution-CPU",
        "ProcessName": "Name",
        "TaskID": "3A40C05841EC6F97",
        "ParentEventID": [
          "887A3AB898DDB584"
        ],
        "Label": "unset",
        "Title": "X-Trace Task",
        "Host": "pinky19.mpi-sws.org",
        "Duration": "22081",
        "HRT": 26962553417182338,
        "Operation": "unset",
        "Timestamp": "1557746193357.176758",
        "TenantClass": 0,
        "Source": "Server.java:1828",
        "ThreadID": 48,
        "ThreadName": "",
        "EventID": "998E160B4AB028B4",
        "BaggageBytes": "[[248 5] [240 0] [0 58 64 192 88 65 236 111 151] [240 1] [0 136 122 58 184 152 221 181 132] [240 3] [0 2]]",
        "ProcessID": 2171
      },
      {
        "Cycles": 0,
        "Agent": "Execution-CPU",
        "ProcessName": "Name",
        "TaskID": "3A40C05841EC6F97",
        "ParentEventID": [
          "887A3AB898DDB584"
        ],
        "Label": "set",
        "Title": "X-Trace Task",
        "Host": "pinky19.mpi-sws.org",
        "HRT": 26962553417192312,
        "Operation": "set",
        "Timestamp": "1557746193357.186768",
        "TenantClass": 0,
        "Source": "Server.java:2071",
        "ThreadID": 55,
        "ThreadName": "",
        "EventID": "22D6D8B5F742607A",
        "BaggageBytes": "[[248 5] [240 0] [0 58 64 192 88 65 236 111 151] [240 1] [0 136 122 58 184 152 221 181 132] [240 3] [0 2]]",
        "ProcessID": 2171
      },
      {
        "Cycles": 0,
        "Agent": "edu.brown.cs.systems.xtrace.logging.BaggageWrappers",
        "ProcessName": "Name",
        "TaskID": "3A40C05841EC6F97",
        "ParentEventID": [
          "2E683AAC83D79C9B"
        ],
        "Label": "Forking current baggage with Baggage.fork()",
        "Title": "X-Trace Task",
        "Host": "pinky19.mpi-sws.org",
        "HRT": 26962553417163252,
        "Operation": "fork",
        "Timestamp": "1557746193357.157715",
        "TenantClass": 0,
        "Source": "Server.java:550",
        "ThreadID": 48,
        "ThreadName": "",
        "EventID": "887A3AB898DDB584",
        "BaggageBytes": "[[248 5] [240 0] [0 58 64 192 88 65 236 111 151] [240 1] [0 46 104 58 172 131 215 156 155] [240 3] [0 2]]",
        "ProcessID": 2171
      },
      {
        "Cycles": 0,
        "Agent": "org.apache.hadoop.ipc.Server",
        "ProcessName": "Name",
        "TaskID": "3A40C05841EC6F97",
        "ParentEventID": [
          "22D6D8B5F742607A"
        ],
        "Label": "getBlockLocations in org.apache.hadoop.hdfs.protocol.ClientProtocol",
        "Title": "X-Trace Task",
        "Host": "pinky19.mpi-sws.org",
        "HRT": 26962553417232383,
        "Timestamp": "1557746193357.226807",
        "TenantClass": 0,
        "Source": "ProtobufRpcEngine.java:601",
        "ThreadID": 55,
        "ThreadName": "",
        "EventID": "5057193B3BBD460B",
        "BaggageBytes": "[[248 5] [240 0] [0 58 64 192 88 65 236 111 151] [240 1] [0 34 214 216 181 247 66 96 122] [240 3] [0 2]]",
        "ProcessID": 2171
      },
      {
        "Cycles": 0,
        "Agent": "edu.brown.cs.systems.xtrace.logging.BaggageWrappers",
        "ProcessName": "Name",
        "TaskID": "3A40C05841EC6F97",
        "ParentEventID": [
          "928318D0CA9B400B"
        ],
        "Label": "Forking current baggage with Baggage.fork()",
        "Title": "X-Trace Task",
        "Host": "pinky19.mpi-sws.org",
        "HRT": 26962553417322007,
        "Operation": "fork",
        "Timestamp": "1557746193357.316406",
        "TenantClass": 0,
        "Source": "Server.java:2398",
        "ThreadID": 55,
        "ThreadName": "",
        "EventID": "DCDEA35D9BC108E1",
        "BaggageBytes": "[[248 5] [240 0] [0 58 64 192 88 65 236 111 151] [240 1] [0 146 131 24 208 202 155 64 11] [240 3] [0 2]]",
        "ProcessID": 2171
      },
      {
        "Cycles": 0,
        "Agent": "org.apache.hadoop.hdfs.server.namenode.FSNamesystem.audit",
        "ProcessName": "Name",
        "TaskID": "3A40C05841EC6F97",
        "ParentEventID": [
          "5057193B3BBD460B"
        ],
        "Label": "allowed=true\tugi=plascas (auth:SIMPLE)\tip=/139.19.171.63\tcmd=open\tsrc=/ds/OkqPqjeUy4YreSpr\tdst=null\tperm=null\tproto=rpc",
        "Title": "X-Trace Task",
        "Host": "pinky19.mpi-sws.org",
        "HRT": 26962553417278929,
        "Timestamp": "1557746193357.273438",
        "TenantClass": 0,
        "Source": "FSNamesystem.java:8313",
        "ThreadID": 55,
        "ThreadName": "",
        "EventID": "928318D0CA9B400B",
        "BaggageBytes": "[[248 5] [240 0] [0 58 64 192 88 65 236 111 151] [240 1] [0 80 87 25 59 59 189 70 11] [240 3] [0 2]]",
        "ProcessID": 2171
      },
      {
        "Cycles": 0,
        "Agent": "Execution-CPU",
        "ProcessName": "Name",
        "TaskID": "3A40C05841EC6F97",
        "ParentEventID": [
          "DCDEA35D9BC108E1"
        ],
        "Label": "unset",
        "Title": "X-Trace Task",
        "Host": "pinky19.mpi-sws.org",
        "Duration": "212034",
        "HRT": 26962553417432865,
        "Operation": "unset",
        "Timestamp": "1557746193357.427246",
        "TenantClass": 0,
        "Source": "Server.java:1058",
        "ThreadID": 55,
        "ThreadName": "",
        "EventID": "1EB9CC585398B6CE",
        "BaggageBytes": "[[248 5] [240 0] [0 58 64 192 88 65 236 111 151] [240 1] [0 220 222 163 93 155 193 8 225] [240 3] [0 2]]",
        "ProcessID": 2171
      },
      {
        "Cycles": 0,
        "Agent": "Execution-CPU",
        "ProcessName": "Read",
        "TaskID": "3A40C05841EC6F97",
        "ParentEventID": [
          "DCDEA35D9BC108E1"
        ],
        "Label": "set",
        "Title": "X-Trace Task",
        "Host": "pinky19.mpi-sws.org",
        "HRT": 26962553417512862,
        "Operation": "set",
        "Timestamp": "1557746193357.472412",
        "TenantClass": 0,
        "Source": "Client.java:302",
        "ThreadID": 37,
        "ThreadName": "",
        "EventID": "967A6C4A1490D077",
        "ProcessID": 36430
      },
      {
        "Cycles": 0,
        "Agent": "Execution-CPU",
        "ProcessName": "Read",
        "TaskID": "3A40C05841EC6F97",
        "ParentEventID": [
          "967A6C4A1490D077"
        ],
        "Label": "unset",
        "Title": "X-Trace Task",
        "Host": "pinky19.mpi-sws.org",
        "Duration": "12284",
        "HRT": 26962553417541652,
        "Operation": "unset",
        "Timestamp": "1557746193357.501221",
        "TenantClass": 0,
        "Source": "Client.java:1168",
        "ThreadID": 37,
        "ThreadName": "",
        "EventID": "4CE95F2F934A50AB",
        "ProcessID": 36430
      },
      {
        "Cycles": 0,
        "Agent": "Execution-Sleep",
        "ProcessName": "Read",
        "TaskID": "3A40C05841EC6F97",
        "ParentEventID": [
          "57849B6607CD5D05"
        ],
        "Label": "waited",
        "Title": "X-Trace Task",
        "Host": "pinky19.mpi-sws.org",
        "Duration": "434376",
        "HRT": 26962553417562944,
        "Operation": "waited",
        "Timestamp": "1557746193357.522461",
        "TenantClass": 0,
        "Source": "Client.java:1537",
        "ThreadID": 1,
        "ThreadName": "",
        "EventID": "600230F19888560F",
        "ProcessID": 36430
      },
      {
        "Cycles": 0,
        "Agent": "org.apache.hadoop.ipc.ProtobufRpcEngine",
        "ProcessName": "Read",
        "TaskID": "3A40C05841EC6F97",
        "ParentEventID": [
          "BFF27A3E4EFC7F93"
        ],
        "Label": "org.apache.hadoop.hdfs.protocol.ClientProtocol.getBlockLocations completed",
        "Title": "X-Trace Task",
        "Host": "pinky19.mpi-sws.org",
        "HRT": 26962553417649542,
        "Timestamp": "1557746193357.609131",
        "TenantClass": 0,
        "Source": "ProtobufRpcEngine.java:275",
        "ThreadID": 1,
        "ThreadName": "",
        "EventID": "0873D8BC924DD8A9",
        "ProcessID": 36430
      },
      {
        "Cycles": 0,
        "Agent": "edu.brown.cs.systems.xtrace.logging.BaggageWrappers",
        "ProcessName": "Read",
        "TaskID": "3A40C05841EC6F97",
        "ParentEventID": [
          "0873D8BC924DD8A9"
        ],
        "Label": "Forking current baggage with Baggage.fork()",
        "Title": "X-Trace Task",
        "Host": "pinky19.mpi-sws.org",
        "HRT": 26962553417750406,
        "Operation": "fork",
        "Timestamp": "1557746193357.709961",
        "TenantClass": 0,
        "Source": "DataTransferProtoUtil.java:94",
        "ThreadID": 1,
        "ThreadName": "",
        "EventID": "2FEB4CF8D0EF61B2",
        "ProcessID": 36430
      },
      {
        "Cycles": 0,
        "Agent": "edu.brown.cs.systems.xtrace.logging.BaggageWrappers",
        "ProcessName": "Read",
        "TaskID": "3A40C05841EC6F97",
        "ParentEventID": [
          "4CE95F2F934A50AB",
          "600230F19888560F"
        ],
        "Label": "Merged current baggage with other baggage",
        "Title": "X-Trace Task",
        "Host": "pinky19.mpi-sws.org",
        "HRT": 26962553417584005,
        "Operation": "join",
        "Timestamp": "1557746193357.543701",
        "TenantClass": 0,
        "Source": "Client.java:1545",
        "ThreadID": 1,
        "ThreadName": "",
        "EventID": "BFF27A3E4EFC7F93",
        "ProcessID": 36430
      },
      {
        "Cycles": 0,
        "Agent": "Execution-CPU",
        "ProcessName": "Data",
        "TaskID": "3A40C05841EC6F97",
        "ParentEventID": [
          "2FEB4CF8D0EF61B2"
        ],
        "Label": "set",
        "Title": "X-Trace Task",
        "Host": "pinky19.mpi-sws.org",
        "HRT": 26962553417904959,
        "Operation": "set",
        "Timestamp": "1557746193357.891846",
        "TenantClass": 0,
        "Source": "Receiver.java:117",
        "ThreadID": 36633,
        "ThreadName": "",
        "EventID": "7D79D21B3C6F6711",
        "BaggageBytes": "[[248 5] [240 0] [0 58 64 192 88 65 236 111 151] [240 1] [0 47 235 76 248 208 239 97 178] [240 3] [0 2]]",
        "ProcessID": 2319
      },
      {
        "Cycles": 0,
        "Agent": "edu.brown.cs.systems.xtrace.logging.BaggageWrappers",
        "ProcessName": "Data",
        "TaskID": "3A40C05841EC6F97",
        "ParentEventID": [
          "CCB5CD74E56ED849"
        ],
        "Label": "Forking current baggage with Baggage.fork()",
        "Title": "X-Trace Task",
        "Host": "pinky19.mpi-sws.org",
        "HRT": 26962553418013149,
        "Operation": "fork",
        "Timestamp": "1557746193358.000000",
        "TenantClass": 0,
        "Source": "DataXceiver.java:1257",
        "ThreadID": 36633,
        "ThreadName": "",
        "EventID": "086354B2884CEEF4",
        "BaggageBytes": "[[248 5] [240 0] [0 58 64 192 88 65 236 111 151] [240 1] [0 204 181 205 116 229 110 216 73] [240 3] [0 2]]",
        "ProcessID": 2319
      },
      {
        "Cycles": 0,
        "Agent": "Execution-Sleep",
        "ProcessName": "Read",
        "TaskID": "3A40C05841EC6F97",
        "ParentEventID": [
          "2FEB4CF8D0EF61B2"
        ],
        "Label": "waited",
        "Title": "X-Trace Task",
        "Host": "pinky19.mpi-sws.org",
        "Duration": "221405",
        "HRT": 26962553418077984,
        "Operation": "waited",
        "Timestamp": "1557746193358.037598",
        "TenantClass": 0,
        "Source": "SocketIOWithTimeout.java:335",
        "ThreadID": 1,
        "ThreadName": "",
        "EventID": "7C9D9BC33AAE961D",
        "ProcessID": 36430
      },
      {
        "Cycles": 0,
        "Agent": "edu.brown.cs.systems.xtrace.logging.XTraceInit",
        "ProcessName": "Data",
        "TaskID": "3A40C05841EC6F97",
        "ParentEventID": [
          "7D79D21B3C6F6711"
        ],
        "Label": "Thread.setName: DataXceiver for client DFSClient_NONMAPREDUCE_778905418_1 at /139.19.171.63:43130 [Sending block BP-1633380353-139.19.171.63-1554193446451:blk_1073755195_14371]",
        "Title": "X-Trace Task",
        "Host": "pinky19.mpi-sws.org",
        "HRT": 26962553417940675,
        "Timestamp": "1557746193357.927490",
        "TenantClass": 0,
        "Source": "DataXceiver.java:168",
        "ThreadID": 36633,
        "ThreadName": "",
        "EventID": "CCB5CD74E56ED849",
        "BaggageBytes": "[[248 5] [240 0] [0 58 64 192 88 65 236 111 151] [240 1] [0 125 121 210 27 60 111 103 17] [240 3] [0 2]]",
        "ProcessID": 2319
      },
      {
        "Cycles": 0,
        "Agent": "edu.brown.cs.systems.xtrace.logging.BaggageWrappers",
        "ProcessName": "Data",
        "TaskID": "3A40C05841EC6F97",
        "ParentEventID": [
          "086354B2884CEEF4"
        ],
        "Label": "Forking current baggage with Baggage.fork()",
        "Title": "X-Trace Task",
        "Host": "pinky19.mpi-sws.org",
        "HRT": 26962553418077977,
        "Operation": "fork",
        "Timestamp": "1557746193358.064941",
        "TenantClass": 0,
        "Source": "PacketHeader.java:95",
        "ThreadID": 36633,
        "ThreadName": "",
        "EventID": "63C41B91FCBBE943",
        "BaggageBytes": "[[248 5] [240 0] [0 58 64 192 88 65 236 111 151] [240 1] [0 8 99 84 178 136 76 238 244] [240 3] [0 2]]",
        "ProcessID": 2319
      },
      {
        "Cycles": 0,
        "Agent": "Execution-Sleep",
        "ProcessName": "Data",
        "TaskID": "3A40C05841EC6F97",
        "ParentEventID": [
          "63C41B91FCBBE943"
        ],
        "Label": "waited",
        "Title": "X-Trace Task",
        "Host": "pinky19.mpi-sws.org",
        "Duration": "4140",
        "HRT": 26962553418137424,
        "Operation": "waited",
        "Timestamp": "1557746193358.124268",
        "TenantClass": 0,
        "Source": "SocketIOWithTimeout.java:335",
        "ThreadID": 36633,
        "ThreadName": "",
        "EventID": "271ECB71E84AF7AC",
        "BaggageBytes": "[[248 5] [240 0] [0 58 64 192 88 65 236 111 151] [240 1] [0 99 196 27 145 252 187 233 67] [240 3] [0 2]]",
        "ProcessID": 2319
      },
      {
        "Cycles": 0,
        "Agent": "edu.brown.cs.systems.xtrace.logging.BaggageWrappers",
        "ProcessName": "Read",
        "TaskID": "3A40C05841EC6F97",
        "ParentEventID": [
          "7C9D9BC33AAE961D",
          "086354B2884CEEF4"
        ],
        "Label": "Merged current baggage with other baggage",
        "Title": "X-Trace Task",
        "Host": "pinky19.mpi-sws.org",
        "HRT": 26962553418173228,
        "Operation": "join",
        "Timestamp": "1557746193358.132812",
        "TenantClass": 0,
        "Source": "RemoteBlockReader2.java:429",
        "ThreadID": 1,
        "ThreadName": "",
        "EventID": "E0855326E701437C",
        "ProcessID": 36430
      },
      {
        "Cycles": 0,
        "Agent": "edu.brown.cs.systems.xtrace.logging.BaggageWrappers",
        "ProcessName": "Data",
        "TaskID": "3A40C05841EC6F97",
        "ParentEventID": [
          "271ECB71E84AF7AC"
        ],
        "Label": "Forking current baggage with Baggage.fork()",
        "Title": "X-Trace Task",
        "Host": "pinky19.mpi-sws.org",
        "HRT": 26962553418198004,
        "Operation": "fork",
        "Timestamp": "1557746193358.184814",
        "TenantClass": 0,
        "Source": "PacketHeader.java:95",
        "ThreadID": 36633,
        "ThreadName": "",
        "EventID": "83986E8994CEAA4B",
        "BaggageBytes": "[[248 5] [240 0] [0 58 64 192 88 65 236 111 151] [240 1] [0 39 30 203 113 232 74 247 172] [240 3] [0 2]]",
        "ProcessID": 2319
      },
      {
        "Cycles": 0,
        "Agent": "edu.brown.cs.systems.xtrace.logging.BaggageWrappers",
        "ProcessName": "Read",
        "TaskID": "3A40C05841EC6F97",
        "ParentEventID": [
          "36B86638C955F75D",
          "83986E8994CEAA4B"
        ],
        "Label": "Merged current baggage with other baggage",
        "Title": "X-Trace Task",
        "Host": "pinky19.mpi-sws.org",
        "HRT": 26962553418360864,
        "Operation": "join",
        "Timestamp": "1557746193358.320557",
        "TenantClass": 0,
        "Source": "PacketHeader.java:168",
        "ThreadID": 1,
        "ThreadName": "",
        "EventID": "F476F83834B725AA",
        "ProcessID": 36430
      },
      {
        "Cycles": 0,
        "Agent": "edu.brown.cs.systems.xtrace.logging.BaggageWrappers",
        "ProcessName": "Read",
        "TaskID": "3A40C05841EC6F97",
        "ParentEventID": [
          "63C41B91FCBBE943",
          "E0855326E701437C"
        ],
        "Label": "Merged current baggage with other baggage",
        "Title": "X-Trace Task",
        "Host": "pinky19.mpi-sws.org",
        "HRT": 26962553418281483,
        "Operation": "join",
        "Timestamp": "1557746193358.241211",
        "TenantClass": 0,
        "Source": "PacketHeader.java:168",
        "ThreadID": 1,
        "ThreadName": "",
        "EventID": "36B86638C955F75D",
        "ProcessID": 36430
      },
      {
        "Cycles": 0,
        "Agent": "edu.brown.cs.systems.xtrace.logging.BaggageWrappers",
        "ProcessName": "Read",
        "TaskID": "3A40C05841EC6F97",
        "ParentEventID": [
          "F476F83834B725AA"
        ],
        "Label": "Forking current baggage with Baggage.fork()",
        "Title": "X-Trace Task",
        "Host": "pinky19.mpi-sws.org",
        "HRT": 26962553418376123,
        "Operation": "fork",
        "Timestamp": "1557746193358.335693",
        "TenantClass": 0,
        "Source": "RemoteBlockReader2.java:361",
        "ThreadID": 1,
        "ThreadName": "",
        "EventID": "0D5836E130F1FFDA",
        "ProcessID": 36430
      },
      {
        "Cycles": 0,
        "Agent": "edu.brown.cs.systems.xtrace.logging.BaggageWrappers",
        "ProcessName": "Data",
        "TaskID": "3A40C05841EC6F97",
        "ParentEventID": [
          "0D5836E130F1FFDA",
          "358DDEDE9BC7F6B0"
        ],
        "Label": "Merged current baggage with other baggage",
        "Title": "X-Trace Task",
        "Host": "pinky19.mpi-sws.org",
        "HRT": 26962553418481782,
        "Operation": "join",
        "Timestamp": "1557746193358.468750",
        "TenantClass": 0,
        "Source": "DataXceiver.java:574",
        "ThreadID": 36633,
        "ThreadName": "",
        "EventID": "AFF3A2C8670B5DC8",
        "BaggageBytes": "[[248 5] [240 0] [0 58 64 192 88 65 236 111 151] [240 1] [0 13 88 54 225 48 241 255 218] [0 53 141 222 222 155 199 246 176] [240 3] [0 2]]",
        "ProcessID": 2319
      },
      {
        "Cycles": 0,
        "Agent": "Execution-Sleep",
        "ProcessName": "Data",
        "TaskID": "3A40C05841EC6F97",
        "ParentEventID": [
          "83986E8994CEAA4B"
        ],
        "Label": "waited",
        "Title": "X-Trace Task",
        "Host": "pinky19.mpi-sws.org",
        "Duration": "152336",
        "HRT": 26962553418430125,
        "Operation": "waited",
        "Timestamp": "1557746193358.416992",
        "TenantClass": 0,
        "Source": "SocketIOWithTimeout.java:335",
        "ThreadID": 36633,
        "ThreadName": "",
        "EventID": "358DDEDE9BC7F6B0",
        "BaggageBytes": "[[248 5] [240 0] [0 58 64 192 88 65 236 111 151] [240 1] [0 131 152 110 137 148 206 170 75] [240 3] [0 2]]",
        "ProcessID": 2319
      },
      {
        "Cycles": 0,
        "Agent": "Execution-CPU",
        "ProcessName": "Data",
        "TaskID": "3A40C05841EC6F97",
        "ParentEventID": [
          "AFF3A2C8670B5DC8"
        ],
        "Label": "unset",
        "Title": "X-Trace Task",
        "Host": "pinky19.mpi-sws.org",
        "Duration": "570954",
        "HRT": 26962553418500918,
        "Operation": "unset",
        "Timestamp": "1557746193358.487793",
        "TenantClass": 0,
        "Source": "DataXceiver.java:261",
        "ThreadID": 36633,
        "ThreadName": "",
        "EventID": "6900B73CBBD6B2F7",
        "BaggageBytes": "[[248 5] [240 0] [0 58 64 192 88 65 236 111 151] [240 1] [0 175 243 162 200 103 11 93 200] [240 3] [0 2]]",
        "ProcessID": 2319
      },
      {
        "Cycles": 0,
        "Agent": "edu.brown.cs.systems.retro.benchmarks.hdfs_client.Reader",
        "ProcessName": "Read",
        "TaskID": "3A40C05841EC6F97",
        "ParentEventID": [
          "0"
        ],
        "Label": "Reading file",
        "Title": "X-Trace Task",
        "Host": "pinky19.mpi-sws.org",
        "HRT": 26962553416849322,
        "Timestamp": "1557746193356.808838",
        "TenantClass": 0,
        "ThreadID": 1,
        "ThreadName": "",
        "EventID": "3BD17E6467D7AB06",
        "ProcessID": 36430,
        "Tag": [
          "reader_10kb",
          "Read Size: 10240"
        ]
      }
    ]
  }
]