[
  {
    "id": "4C28B7874352D205",
    "reports": [
      {
        "Cycles": 0,
        "Agent": "edu.brown.cs.systems.retro.benchmarks.hdfs_client.Reader",
        "ProcessName": "Read",
        "TaskID": "4C28B7874352D205",
        "ParentEventID": [
          "0"
        ],
        "Label": "Reading file",
        "Title": "X-Trace Task",
        "Host": "pinky19.mpi-sws.org",
        "HRT": 25489061361640350,
        "Timestamp": "1556272701301.981445",
        "TenantClass": 0,
        "ThreadID": 1,
        "ThreadName": "",
        "EventID": "3D4EE650474325D5",
        "ProcessID": 6356,
        "Tag": [
          "reader_1mb",
          "Read Size: 1048576"
        ]
      },
      {
        "Cycles": 0,
        "Agent": "Execution-CPU",
        "ProcessName": "Read",
        "TaskID": "4C28B7874352D205",
        "ParentEventID": [
          "68321F8B857362F5"
        ],
        "Label": "unset",
        "Title": "X-Trace Task",
        "Host": "pinky19.mpi-sws.org",
        "Duration": "33504109",
        "HRT": 25489061361698637,
        "Operation": "unset",
        "Timestamp": "1556272701302.039551",
        "TenantClass": 0,
        "Source": "Client.java:1027",
        "ThreadID": 1,
        "ThreadName": "",
        "EventID": "2570C5D7A3FF6E89",
        "ProcessID": 6356
      },
      {
        "Cycles": 0,
        "Agent": "org.apache.hadoop.ipc.ProtobufRpcEngine",
        "ProcessName": "Read",
        "TaskID": "4C28B7874352D205",
        "ParentEventID": [
          "498CE156DDDB5ECA"
        ],
        "Label": "Invoking org.apache.hadoop.hdfs.protocol.ClientProtocol.getBlockLocations",
        "Title": "X-Trace Task",
        "Host": "pinky19.mpi-sws.org",
        "HRT": 25489061361683657,
        "Timestamp": "1556272701302.024658",
        "TenantClass": 0,
        "Source": "ProtobufRpcEngine.java:228",
        "ThreadID": 1,
        "ThreadName": "",
        "EventID": "68321F8B857362F5",
        "ProcessID": 6356
      },
      {
        "Cycles": 0,
        "Agent": "Execution-CPU",
        "ProcessName": "Read",
        "TaskID": "4C28B7874352D205",
        "ParentEventID": [
          "2570C5D7A3FF6E89"
        ],
        "Label": "set",
        "Title": "X-Trace Task",
        "Host": "pinky19.mpi-sws.org",
        "HRT": 25489061361742978,
        "Operation": "set",
        "Timestamp": "1556272701302.083984",
        "TenantClass": 0,
        "Source": "Client.java:1032",
        "ThreadID": 41,
        "ThreadName": "",
        "EventID": "562169F9DEF3DD5F",
        "ProcessID": 6356
      },
      {
        "Cycles": 0,
        "Agent": "Execution-CPU",
        "ProcessName": "Read",
        "TaskID": "4C28B7874352D205",
        "ParentEventID": [
          "0346FB0039FE05D1"
        ],
        "Label": "unset",
        "Title": "X-Trace Task",
        "Host": "pinky19.mpi-sws.org",
        "Duration": "61215",
        "HRT": 25489061361821588,
        "Operation": "unset",
        "Timestamp": "1556272701302.162598",
        "TenantClass": 0,
        "Source": "Client.java:1062",
        "ThreadID": 41,
        "ThreadName": "",
        "EventID": "1C3968DD59AE8170",
        "ProcessID": 6356
      },
      {
        "Cycles": 0,
        "Agent": "Execution-CPU",
        "ProcessName": "Read",
        "TaskID": "4C28B7874352D205",
        "ParentEventID": [
          "1C3968DD59AE8170"
        ],
        "Label": "set",
        "Title": "X-Trace Task",
        "Host": "pinky19.mpi-sws.org",
        "HRT": 25489061361840576,
        "Operation": "set",
        "Timestamp": "1556272701302.181641",
        "TenantClass": 0,
        "Source": "Client.java:1104",
        "ThreadID": 1,
        "ThreadName": "",
        "EventID": "4D0CA12989542760",
        "ProcessID": 6356
      },
      {
        "Cycles": 0,
        "Agent": "Execution-CPU",
        "ProcessName": "Name",
        "TaskID": "4C28B7874352D205",
        "ParentEventID": [
          "0346FB0039FE05D1"
        ],
        "Label": "set",
        "Title": "X-Trace Task",
        "Host": "pinky19.mpi-sws.org",
        "HRT": 25489061361891015,
        "Operation": "set",
        "Timestamp": "1556272701302.237305",
        "TenantClass": 0,
        "Source": "Server.java:1840",
        "ThreadID": 48,
        "ThreadName": "",
        "EventID": "89619BEF781FE33C",
        "BaggageBytes": "[[248 5] [240 0] [0 76 40 183 135 67 82 210 5] [240 1] [0 3 70 251 0 57 254 5 209] [240 3] [0 2]]",
        "ProcessID": 2171
      },
      {
        "Cycles": 0,
        "Agent": "edu.brown.cs.systems.xtrace.logging.BaggageWrappers",
        "ProcessName": "Name",
        "TaskID": "4C28B7874352D205",
        "ParentEventID": [
          "89619BEF781FE33C"
        ],
        "Label": "Forking current baggage with Baggage.fork()",
        "Title": "X-Trace Task",
        "Host": "pinky19.mpi-sws.org",
        "HRT": 25489061361922600,
        "Operation": "fork",
        "Timestamp": "1556272701302.268799",
        "TenantClass": 0,
        "Source": "Server.java:550",
        "ThreadID": 48,
        "ThreadName": "",
        "EventID": "EE793E0165F0C7CA",
        "BaggageBytes": "[[248 5] [240 0] [0 76 40 183 135 67 82 210 5] [240 1] [0 137 97 155 239 120 31 227 60] [240 3] [0 2]]",
        "ProcessID": 2171
      },
      {
        "Cycles": 0,
        "Agent": "edu.brown.cs.systems.retro.benchmarks.hdfs_client.Reader",
        "ProcessName": "Read",
        "TaskID": "4C28B7874352D205",
        "ParentEventID": [
          "3D4EE650474325D5"
        ],
        "Label": "Reading file",
        "Title": "X-Trace Task",
        "Host": "pinky19.mpi-sws.org",
        "HRT": 25489061361655396,
        "Timestamp": "1556272701301.996338",
        "TenantClass": 0,
        "ThreadID": 1,
        "ThreadName": "",
        "EventID": "498CE156DDDB5ECA",
        "ProcessID": 6356
      },
      {
        "Cycles": 0,
        "Agent": "Execution-CPU",
        "ProcessName": "Name",
        "TaskID": "4C28B7874352D205",
        "ParentEventID": [
          "EE793E0165F0C7CA"
        ],
        "Label": "unset",
        "Title": "X-Trace Task",
        "Host": "pinky19.mpi-sws.org",
        "Duration": "24232",
        "HRT": 25489061361943203,
        "Operation": "unset",
        "Timestamp": "1556272701302.289551",
        "TenantClass": 0,
        "Source": "Server.java:1828",
        "ThreadID": 48,
        "ThreadName": "",
        "EventID": "438EDEB71AEBB78B",
        "BaggageBytes": "[[248 5] [240 0] [0 76 40 183 135 67 82 210 5] [240 1] [0 238 121 62 1 101 240 199 202] [240 3] [0 2]]",
        "ProcessID": 2171
      },
      {
        "Cycles": 0,
        "Agent": "edu.brown.cs.systems.xtrace.logging.BaggageWrappers",
        "ProcessName": "Read",
        "TaskID": "4C28B7874352D205",
        "ParentEventID": [
          "562169F9DEF3DD5F"
        ],
        "Label": "Forking current baggage with Baggage.fork()",
        "Title": "X-Trace Task",
        "Host": "pinky19.mpi-sws.org",
        "HRT": 25489061361759908,
        "Operation": "fork",
        "Timestamp": "1556272701302.100830",
        "TenantClass": 0,
        "Source": "Client.java:1043",
        "ThreadID": 41,
        "ThreadName": "",
        "EventID": "0346FB0039FE05D1",
        "ProcessID": 6356
      },
      {
        "Cycles": 0,
        "Agent": "org.apache.hadoop.ipc.Server",
        "ProcessName": "Name",
        "TaskID": "4C28B7874352D205",
        "ParentEventID": [
          "0CA5B4C677CADBCD"
        ],
        "Label": "getBlockLocations in org.apache.hadoop.hdfs.protocol.ClientProtocol",
        "Title": "X-Trace Task",
        "Host": "pinky19.mpi-sws.org",
        "HRT": 25489061361988709,
        "Timestamp": "1556272701302.334961",
        "TenantClass": 0,
        "Source": "ProtobufRpcEngine.java:601",
        "ThreadID": 59,
        "ThreadName": "",
        "EventID": "B8192C04147A5682",
        "BaggageBytes": "[[248 5] [240 0] [0 76 40 183 135 67 82 210 5] [240 1] [0 12 165 180 198 119 202 219 205] [240 3] [0 2]]",
        "ProcessID": 2171
      },
      {
        "Cycles": 0,
        "Agent": "org.apache.hadoop.hdfs.server.namenode.FSNamesystem.audit",
        "ProcessName": "Name",
        "TaskID": "4C28B7874352D205",
        "ParentEventID": [
          "B8192C04147A5682"
        ],
        "Label": "allowed=true\tugi=plascas (auth:SIMPLE)\tip=/139.19.171.63\tcmd=open\tsrc=/ds/Q8JMyDzrnwJ6Srid\tdst=null\tperm=null\tproto=rpc",
        "Title": "X-Trace Task",
        "Host": "pinky19.mpi-sws.org",
        "HRT": 25489061362043483,
        "Timestamp": "1556272701302.389648",
        "TenantClass": 0,
        "Source": "FSNamesystem.java:8313",
        "ThreadID": 59,
        "ThreadName": "",
        "EventID": "E7B744F7952F4906",
        "BaggageBytes": "[[248 5] [240 0] [0 76 40 183 135 67 82 210 5] [240 1] [0 184 25 44 4 20 122 86 130] [240 3] [0 2]]",
        "ProcessID": 2171
      },
      {
        "Cycles": 0,
        "Agent": "Execution-CPU",
        "ProcessName": "Name",
        "TaskID": "4C28B7874352D205",
        "ParentEventID": [
          "AF6977D7CA092492"
        ],
        "Label": "unset",
        "Title": "X-Trace Task",
        "Host": "pinky19.mpi-sws.org",
        "Duration": "212532",
        "HRT": 25489061362189066,
        "Operation": "unset",
        "Timestamp": "1556272701302.535400",
        "TenantClass": 0,
        "Source": "Server.java:1058",
        "ThreadID": 59,
        "ThreadName": "",
        "EventID": "37D39792302C47F2",
        "BaggageBytes": "[[248 5] [240 0] [0 76 40 183 135 67 82 210 5] [240 1] [0 175 105 119 215 202 9 36 146] [240 3] [0 2]]",
        "ProcessID": 2171
      },
      {
        "Cycles": 0,
        "Agent": "Execution-CPU",
        "ProcessName": "Read",
        "TaskID": "4C28B7874352D205",
        "ParentEventID": [
          "AF6977D7CA092492"
        ],
        "Label": "set",
        "Title": "X-Trace Task",
        "Host": "pinky19.mpi-sws.org",
        "HRT": 25489061362228192,
        "Operation": "set",
        "Timestamp": "1556272701302.569092",
        "TenantClass": 0,
        "Source": "Client.java:302",
        "ThreadID": 40,
        "ThreadName": "",
        "EventID": "8A696D1858A05564",
        "ProcessID": 6356
      },
      {
        "Cycles": 0,
        "Agent": "Execution-CPU",
        "ProcessName": "Name",
        "TaskID": "4C28B7874352D205",
        "ParentEventID": [
          "EE793E0165F0C7CA"
        ],
        "Label": "set",
        "Title": "X-Trace Task",
        "Host": "pinky19.mpi-sws.org",
        "HRT": 25489061361954577,
        "Operation": "set",
        "Timestamp": "1556272701302.300781",
        "TenantClass": 0,
        "Source": "Server.java:2071",
        "ThreadID": 59,
        "ThreadName": "",
        "EventID": "0CA5B4C677CADBCD",
        "BaggageBytes": "[[248 5] [240 0] [0 76 40 183 135 67 82 210 5] [240 1] [0 238 121 62 1 101 240 199 202] [240 3] [0 2]]",
        "ProcessID": 2171
      },
      {
        "Cycles": 0,
        "Agent": "Execution-CPU",
        "ProcessName": "Read",
        "TaskID": "4C28B7874352D205",
        "ParentEventID": [
          "8A696D1858A05564"
        ],
        "Label": "unset",
        "Title": "X-Trace Task",
        "Host": "pinky19.mpi-sws.org",
        "Duration": "4466",
        "HRT": 25489061362244958,
        "Operation": "unset",
        "Timestamp": "1556272701302.585938",
        "TenantClass": 0,
        "Source": "Client.java:1168",
        "ThreadID": 40,
        "ThreadName": "",
        "EventID": "A8483D187CCF3FD6",
        "ProcessID": 6356
      },
      {
        "Cycles": 0,
        "Agent": "edu.brown.cs.systems.xtrace.logging.BaggageWrappers",
        "ProcessName": "Read",
        "TaskID": "4C28B7874352D205",
        "ParentEventID": [
          "A8483D187CCF3FD6",
          "2DFF08CF6B1CAE2C"
        ],
        "Label": "Merged current baggage with other baggage",
        "Title": "X-Trace Task",
        "Host": "pinky19.mpi-sws.org",
        "HRT": 25489061362282869,
        "Operation": "join",
        "Timestamp": "1556272701302.623779",
        "TenantClass": 0,
        "Source": "Client.java:1545",
        "ThreadID": 1,
        "ThreadName": "",
        "EventID": "228DAE3B82AE18AC",
        "ProcessID": 6356
      },
      {
        "Cycles": 0,
        "Agent": "Execution-Sleep",
        "ProcessName": "Read",
        "TaskID": "4C28B7874352D205",
        "ParentEventID": [
          "4D0CA12989542760"
        ],
        "Label": "waited",
        "Title": "X-Trace Task",
        "Host": "pinky19.mpi-sws.org",
        "Duration": "419903",
        "HRT": 25489061362268738,
        "Operation": "waited",
        "Timestamp": "1556272701302.609619",
        "TenantClass": 0,
        "Source": "Client.java:1537",
        "ThreadID": 1,
        "ThreadName": "",
        "EventID": "2DFF08CF6B1CAE2C",
        "ProcessID": 6356
      },
      {
        "Cycles": 0,
        "Agent": "org.apache.hadoop.ipc.ProtobufRpcEngine",
        "ProcessName": "Read",
        "TaskID": "4C28B7874352D205",
        "ParentEventID": [
          "228DAE3B82AE18AC"
        ],
        "Label": "org.apache.hadoop.hdfs.protocol.ClientProtocol.getBlockLocations completed",
        "Title": "X-Trace Task",
        "Host": "pinky19.mpi-sws.org",
        "HRT": 25489061362314313,
        "Timestamp": "1556272701302.655273",
        "TenantClass": 0,
        "Source": "ProtobufRpcEngine.java:275",
        "ThreadID": 1,
        "ThreadName": "",
        "EventID": "E4E4B94CA14E5D83",
        "ProcessID": 6356
      },
      {
        "Cycles": 0,
        "Agent": "edu.brown.cs.systems.xtrace.logging.BaggageWrappers",
        "ProcessName": "Read",
        "TaskID": "4C28B7874352D205",
        "ParentEventID": [
          "0E54C53298E98663"
        ],
        "Label": "Forking current baggage with Baggage.fork()",
        "Title": "X-Trace Task",
        "Host": "pinky19.mpi-sws.org",
        "HRT": 25489061362437946,
        "Operation": "fork",
        "Timestamp": "1556272701302.779053",
        "TenantClass": 0,
        "Source": "DataTransferProtoUtil.java:94",
        "ThreadID": 1,
        "ThreadName": "",
        "EventID": "1506CB2750552D42",
        "ProcessID": 6356
      },
      {
        "Cycles": 0,
        "Agent": "edu.brown.cs.systems.xtrace.logging.BaggageWrappers",
        "ProcessName": "Name",
        "TaskID": "4C28B7874352D205",
        "ParentEventID": [
          "E7B744F7952F4906"
        ],
        "Label": "Forking current baggage with Baggage.fork()",
        "Title": "X-Trace Task",
        "Host": "pinky19.mpi-sws.org",
        "HRT": 25489061362086389,
        "Operation": "fork",
        "Timestamp": "1556272701302.432617",
        "TenantClass": 0,
        "Source": "Server.java:2398",
        "ThreadID": 59,
        "ThreadName": "",
        "EventID": "AF6977D7CA092492",
        "BaggageBytes": "[[248 5] [240 0] [0 76 40 183 135 67 82 210 5] [240 1] [0 231 183 68 247 149 47 73 6] [240 3] [0 2]]",
        "ProcessID": 2171
      },
      {
        "Cycles": 0,
        "Agent": "Execution-CPU",
        "ProcessName": "Data",
        "TaskID": "4C28B7874352D205",
        "ParentEventID": [
          "1506CB2750552D42"
        ],
        "Label": "set",
        "Title": "X-Trace Task",
        "Host": "pinky19.mpi-sws.org",
        "HRT": 25489061362640646,
        "Operation": "set",
        "Timestamp": "1556272701302.990967",
        "TenantClass": 0,
        "Source": "Receiver.java:117",
        "ThreadID": 8617,
        "ThreadName": "",
        "EventID": "232B81FED8B5811B",
        "BaggageBytes": "[[248 5] [240 0] [0 76 40 183 135 67 82 210 5] [240 1] [0 21 6 203 39 80 85 45 66] [240 3] [0 2]]",
        "ProcessID": 2319
      },
      {
        "Cycles": 0,
        "Agent": "edu.brown.cs.systems.xtrace.logging.BaggageWrappers",
        "ProcessName": "Data",
        "TaskID": "4C28B7874352D205",
        "ParentEventID": [
          "1EAE5B33E07C05DB"
        ],
        "Label": "Forking current baggage with Baggage.fork()",
        "Title": "X-Trace Task",
        "Host": "pinky19.mpi-sws.org",
        "HRT": 25489061362826670,
        "Operation": "fork",
        "Timestamp": "1556272701303.177002",
        "TenantClass": 0,
        "Source": "DataXceiver.java:1257",
        "ThreadID": 8617,
        "ThreadName": "",
        "EventID": "A40E0590581FFFC4",
        "BaggageBytes": "[[248 5] [240 0] [0 76 40 183 135 67 82 210 5] [240 1] [0 30 174 91 51 224 124 5 219] [240 3] [0 2]]",
        "ProcessID": 2319
      },
      {
        "Cycles": 0,
        "Agent": "edu.brown.cs.systems.xtrace.logging.XTraceInit",
        "ProcessName": "Data",
        "TaskID": "4C28B7874352D205",
        "ParentEventID": [
          "232B81FED8B5811B"
        ],
        "Label": "Thread.setName: DataXceiver for client DFSClient_NONMAPREDUCE_614514224_1 at /139.19.171.63:54648 [Sending block BP-1633380353-139.19.171.63-1554193446451:blk_1073755899_15075]",
        "Title": "X-Trace Task",
        "Host": "pinky19.mpi-sws.org",
        "HRT": 25489061362711546,
        "Timestamp": "1556272701303.061768",
        "TenantClass": 0,
        "Source": "DataXceiver.java:168",
        "ThreadID": 8617,
        "ThreadName": "",
        "EventID": "1EAE5B33E07C05DB",
        "BaggageBytes": "[[248 5] [240 0] [0 76 40 183 135 67 82 210 5] [240 1] [0 35 43 129 254 216 181 129 27] [240 3] [0 2]]",
        "ProcessID": 2319
      },
      {
        "Cycles": 0,
        "Agent": "edu.brown.cs.systems.xtrace.logging.BaggageWrappers",
        "ProcessName": "Data",
        "TaskID": "4C28B7874352D205",
        "ParentEventID": [
          "A40E0590581FFFC4"
        ],
        "Label": "Forking current baggage with Baggage.fork()",
        "Title": "X-Trace Task",
        "Host": "pinky19.mpi-sws.org",
        "HRT": 25489061362906880,
        "Operation": "fork",
        "Timestamp": "1556272701303.257080",
        "TenantClass": 0,
        "Source": "PacketHeader.java:95",
        "ThreadID": 8617,
        "ThreadName": "",
        "EventID": "C907946A23DC8051",
        "BaggageBytes": "[[248 5] [240 0] [0 76 40 183 135 67 82 210 5] [240 1] [0 164 14 5 144 88 31 255 196] [240 3] [0 2]]",
        "ProcessID": 2319
      },
      {
        "Cycles": 0,
        "Agent": "Execution-Sleep",
        "ProcessName": "Data",
        "TaskID": "4C28B7874352D205",
        "ParentEventID": [
          "C907946A23DC8051"
        ],
        "Label": "waited",
        "Title": "X-Trace Task",
        "Host": "pinky19.mpi-sws.org",
        "Duration": "6161",
        "HRT": 25489061362981145,
        "Operation": "waited",
        "Timestamp": "1556272701303.331299",
        "TenantClass": 0,
        "Source": "SocketIOWithTimeout.java:335",
        "ThreadID": 8617,
        "ThreadName": "",
        "EventID": "CA6247FD0CB8B4E2",
        "BaggageBytes": "[[248 5] [240 0] [0 76 40 183 135 67 82 210 5] [240 1] [0 201 7 148 106 35 220 128 81] [240 3] [0 2]]",
        "ProcessID": 2319
      },
      {
        "Cycles": 0,
        "Agent": "Execution-Sleep",
        "ProcessName": "Read",
        "TaskID": "4C28B7874352D205",
        "ParentEventID": [
          "E4E4B94CA14E5D83"
        ],
        "Label": "waited",
        "Title": "X-Trace Task",
        "Host": "pinky19.mpi-sws.org",
        "Duration": "4448",
        "HRT": 25489061362402464,
        "Operation": "waited",
        "Timestamp": "1556272701302.743408",
        "TenantClass": 0,
        "Source": "SocketIOWithTimeout.java:335",
        "ThreadID": 1,
        "ThreadName": "",
        "EventID": "0E54C53298E98663",
        "ProcessID": 6356
      },
      {
        "Cycles": 0,
        "Agent": "edu.brown.cs.systems.xtrace.logging.BaggageWrappers",
        "ProcessName": "Read",
        "TaskID": "4C28B7874352D205",
        "ParentEventID": [
          "89C43E91339D4600",
          "A40E0590581FFFC4"
        ],
        "Label": "Merged current baggage with other baggage",
        "Title": "X-Trace Task",
        "Host": "pinky19.mpi-sws.org",
        "HRT": 25489061362997498,
        "Operation": "join",
        "Timestamp": "1556272701303.338379",
        "TenantClass": 0,
        "Source": "RemoteBlockReader2.java:429",
        "ThreadID": 1,
        "ThreadName": "",
        "EventID": "BCDFDCA2476F3BF3",
        "ProcessID": 6356
      },
      {
        "Cycles": 0,
        "Agent": "edu.brown.cs.systems.xtrace.logging.BaggageWrappers",
        "ProcessName": "Read",
        "TaskID": "4C28B7874352D205",
        "ParentEventID": [
          "C907946A23DC8051",
          "BCDFDCA2476F3BF3"
        ],
        "Label": "Merged current baggage with other baggage",
        "Title": "X-Trace Task",
        "Host": "pinky19.mpi-sws.org",
        "HRT": 25489061363089271,
        "Operation": "join",
        "Timestamp": "1556272701303.430176",
        "TenantClass": 0,
        "Source": "PacketHeader.java:168",
        "ThreadID": 1,
        "ThreadName": "",
        "EventID": "FAEB25E3701CBDB7",
        "ProcessID": 6356
      },
      {
        "Cycles": 0,
        "Agent": "Execution-Sleep",
        "ProcessName": "Read",
        "TaskID": "4C28B7874352D205",
        "ParentEventID": [
          "1506CB2750552D42"
        ],
        "Label": "waited",
        "Title": "X-Trace Task",
        "Host": "pinky19.mpi-sws.org",
        "Duration": "394960",
        "HRT": 25489061362914347,
        "Operation": "waited",
        "Timestamp": "1556272701303.255371",
        "TenantClass": 0,
        "Source": "SocketIOWithTimeout.java:335",
        "ThreadID": 1,
        "ThreadName": "",
        "EventID": "89C43E91339D4600",
        "ProcessID": 6356
      },
      {
        "Cycles": 0,
        "Agent": "edu.brown.cs.systems.xtrace.logging.BaggageWrappers",
        "ProcessName": "Read",
        "TaskID": "4C28B7874352D205",
        "ParentEventID": [
          "5054376516ADA578",
          "FAEB25E3701CBDB7"
        ],
        "Label": "Merged current baggage with other baggage",
        "Title": "X-Trace Task",
        "Host": "pinky19.mpi-sws.org",
        "HRT": 25489061363193138,
        "Operation": "join",
        "Timestamp": "1556272701303.534180",
        "TenantClass": 0,
        "Source": "PacketHeader.java:168",
        "ThreadID": 1,
        "ThreadName": "",
        "EventID": "9660A25166830EA5",
        "ProcessID": 6356
      },
      {
        "Cycles": 0,
        "Agent": "Execution-Sleep",
        "ProcessName": "Data",
        "TaskID": "4C28B7874352D205",
        "ParentEventID": [
          "5054376516ADA578"
        ],
        "Label": "waited",
        "Title": "X-Trace Task",
        "Host": "pinky19.mpi-sws.org",
        "Duration": "84503",
        "HRT": 25489061363244745,
        "Operation": "waited",
        "Timestamp": "1556272701303.594971",
        "TenantClass": 0,
        "Source": "SocketIOWithTimeout.java:335",
        "ThreadID": 8617,
        "ThreadName": "",
        "EventID": "7E0BF1E8D100D388",
        "BaggageBytes": "[[248 5] [240 0] [0 76 40 183 135 67 82 210 5] [240 1] [0 80 84 55 101 22 173 165 120] [240 3] [0 2]]",
        "ProcessID": 2319
      },
      {
        "Cycles": 0,
        "Agent": "edu.brown.cs.systems.xtrace.logging.BaggageWrappers",
        "ProcessName": "Data",
        "TaskID": "4C28B7874352D205",
        "ParentEventID": [
          "CA6247FD0CB8B4E2"
        ],
        "Label": "Forking current baggage with Baggage.fork()",
        "Title": "X-Trace Task",
        "Host": "pinky19.mpi-sws.org",
        "HRT": 25489061363068685,
        "Operation": "fork",
        "Timestamp": "1556272701303.418945",
        "TenantClass": 0,
        "Source": "PacketHeader.java:95",
        "ThreadID": 8617,
        "ThreadName": "",
        "EventID": "5054376516ADA578",
        "BaggageBytes": "[[248 5] [240 0] [0 76 40 183 135 67 82 210 5] [240 1] [0 202 98 71 253 12 184 180 226] [240 3] [0 2]]",
        "ProcessID": 2319
      },
      {
        "Cycles": 0,
        "Agent": "edu.brown.cs.systems.xtrace.logging.BaggageWrappers",
        "ProcessName": "Read",
        "TaskID": "4C28B7874352D205",
        "ParentEventID": [
          "7BFEE4F0F7C694E5"
        ],
        "Label": "Forking current baggage with Baggage.fork()",
        "Title": "X-Trace Task",
        "Host": "pinky19.mpi-sws.org",
        "HRT": 25489061363261780,
        "Operation": "fork",
        "Timestamp": "1556272701303.602783",
        "TenantClass": 0,
        "Source": "DataTransferProtoUtil.java:94",
        "ThreadID": 1,
        "ThreadName": "",
        "EventID": "727CD20276586BFE",
        "ProcessID": 6356
      },
      {
        "Cycles": 0,
        "Agent": "Execution-CPU",
        "ProcessName": "Data",
        "TaskID": "4C28B7874352D205",
        "ParentEventID": [
          "D46C672F22EF9368"
        ],
        "Label": "unset",
        "Title": "X-Trace Task",
        "Host": "pinky19.mpi-sws.org",
        "Duration": "636192",
        "HRT": 25489061363323637,
        "Operation": "unset",
        "Timestamp": "1556272701303.673828",
        "TenantClass": 0,
        "Source": "DataXceiver.java:261",
        "ThreadID": 8617,
        "ThreadName": "",
        "EventID": "B98D524E9BA11225",
        "BaggageBytes": "[[248 5] [240 0] [0 76 40 183 135 67 82 210 5] [240 1] [0 212 108 103 47 34 239 147 104] [240 3] [0 2]]",
        "ProcessID": 2319
      },
      {
        "Cycles": 0,
        "Agent": "edu.brown.cs.systems.xtrace.logging.BaggageWrappers",
        "ProcessName": "Read",
        "TaskID": "4C28B7874352D205",
        "ParentEventID": [
          "9660A25166830EA5"
        ],
        "Label": "Forking current baggage with Baggage.fork()",
        "Title": "X-Trace Task",
        "Host": "pinky19.mpi-sws.org",
        "HRT": 25489061363201693,
        "Operation": "fork",
        "Timestamp": "1556272701303.542725",
        "TenantClass": 0,
        "Source": "RemoteBlockReader2.java:361",
        "ThreadID": 1,
        "ThreadName": "",
        "EventID": "7BFEE4F0F7C694E5",
        "ProcessID": 6356
      },
      {
        "Cycles": 0,
        "Agent": "Execution-CPU",
        "ProcessName": "Data",
        "TaskID": "4C28B7874352D205",
        "ParentEventID": [
          "727CD20276586BFE"
        ],
        "Label": "set",
        "Title": "X-Trace Task",
        "Host": "pinky19.mpi-sws.org",
        "HRT": 25489061363374138,
        "Operation": "set",
        "Timestamp": "1556272701303.724365",
        "TenantClass": 0,
        "Source": "Receiver.java:117",
        "ThreadID": 8617,
        "ThreadName": "",
        "EventID": "E751C9E306B102C6",
        "BaggageBytes": "[[248 5] [240 0] [0 76 40 183 135 67 82 210 5] [240 1] [0 114 124 210 2 118 88 107 254] [240 3] [0 2]]",
        "ProcessID": 2319
      },
      {
        "Cycles": 0,
        "Agent": "edu.brown.cs.systems.xtrace.logging.BaggageWrappers",
        "ProcessName": "Data",
        "TaskID": "4C28B7874352D205",
        "ParentEventID": [
          "13E6078186C1393E"
        ],
        "Label": "Forking current baggage with Baggage.fork()",
        "Title": "X-Trace Task",
        "Host": "pinky19.mpi-sws.org",
        "HRT": 25489061363458831,
        "Operation": "fork",
        "Timestamp": "1556272701303.809082",
        "TenantClass": 0,
        "Source": "DataXceiver.java:1257",
        "ThreadID": 8617,
        "ThreadName": "",
        "EventID": "FD9D034B560BD6A1",
        "BaggageBytes": "[[248 5] [240 0] [0 76 40 183 135 67 82 210 5] [240 1] [0 19 230 7 129 134 193 57 62] [240 3] [0 2]]",
        "ProcessID": 2319
      },
      {
        "Cycles": 0,
        "Agent": "edu.brown.cs.systems.xtrace.logging.BaggageWrappers",
        "ProcessName": "Data",
        "TaskID": "4C28B7874352D205",
        "ParentEventID": [
          "FD9D034B560BD6A1"
        ],
        "Label": "Forking current baggage with Baggage.fork()",
        "Title": "X-Trace Task",
        "Host": "pinky19.mpi-sws.org",
        "HRT": 25489061363515739,
        "Operation": "fork",
        "Timestamp": "1556272701303.865967",
        "TenantClass": 0,
        "Source": "PacketHeader.java:95",
        "ThreadID": 8617,
        "ThreadName": "",
        "EventID": "71C4B46DFDBD695D",
        "BaggageBytes": "[[248 5] [240 0] [0 76 40 183 135 67 82 210 5] [240 1] [0 253 157 3 75 86 11 214 161] [240 3] [0 2]]",
        "ProcessID": 2319
      },
      {
        "Cycles": 0,
        "Agent": "Execution-Sleep",
        "ProcessName": "Read",
        "TaskID": "4C28B7874352D205",
        "ParentEventID": [
          "727CD20276586BFE"
        ],
        "Label": "waited",
        "Title": "X-Trace Task",
        "Host": "pinky19.mpi-sws.org",
        "Duration": "181866",
        "HRT": 25489061363513669,
        "Operation": "waited",
        "Timestamp": "1556272701303.854736",
        "TenantClass": 0,
        "Source": "SocketIOWithTimeout.java:335",
        "ThreadID": 1,
        "ThreadName": "",
        "EventID": "4ED483431F655743",
        "ProcessID": 6356
      },
      {
        "Cycles": 0,
        "Agent": "edu.brown.cs.systems.xtrace.logging.BaggageWrappers",
        "ProcessName": "Data",
        "TaskID": "4C28B7874352D205",
        "ParentEventID": [
          "7E0BF1E8D100D388",
          "7BFEE4F0F7C694E5"
        ],
        "Label": "Merged current baggage with other baggage",
        "Title": "X-Trace Task",
        "Host": "pinky19.mpi-sws.org",
        "HRT": 25489061363298946,
        "Operation": "join",
        "Timestamp": "1556272701303.649170",
        "TenantClass": 0,
        "Source": "DataXceiver.java:574",
        "ThreadID": 8617,
        "ThreadName": "",
        "EventID": "D46C672F22EF9368",
        "BaggageBytes": "[[248 5] [240 0] [0 76 40 183 135 67 82 210 5] [240 1] [0 123 254 228 240 247 198 148 229] [0 126 11 241 232 209 0 211 136] [240 3] [0 2]]",
        "ProcessID": 2319
      },
      {
        "Cycles": 0,
        "Agent": "edu.brown.cs.systems.xtrace.logging.BaggageWrappers",
        "ProcessName": "Read",
        "TaskID": "4C28B7874352D205",
        "ParentEventID": [
          "4ED483431F655743",
          "FD9D034B560BD6A1"
        ],
        "Label": "Merged current baggage with other baggage",
        "Title": "X-Trace Task",
        "Host": "pinky19.mpi-sws.org",
        "HRT": 25489061363574864,
        "Operation": "join",
        "Timestamp": "1556272701303.915771",
        "TenantClass": 0,
        "Source": "RemoteBlockReader2.java:429",
        "ThreadID": 1,
        "ThreadName": "",
        "EventID": "F3E157DA911B5496",
        "ProcessID": 6356
      },
      {
        "Cycles": 0,
        "Agent": "edu.brown.cs.systems.xtrace.logging.BaggageWrappers",
        "ProcessName": "Data",
        "TaskID": "4C28B7874352D205",
        "ParentEventID": [
          "D675B5CA1ABA557E"
        ],
        "Label": "Forking current baggage with Baggage.fork()",
        "Title": "X-Trace Task",
        "Host": "pinky19.mpi-sws.org",
        "HRT": 25489061363635777,
        "Operation": "fork",
        "Timestamp": "1556272701303.986084",
        "TenantClass": 0,
        "Source": "PacketHeader.java:95",
        "ThreadID": 8617,
        "ThreadName": "",
        "EventID": "FFC846237D154C49",
        "BaggageBytes": "[[248 5] [240 0] [0 76 40 183 135 67 82 210 5] [240 1] [0 214 117 181 202 26 186 85 126] [240 3] [0 2]]",
        "ProcessID": 2319
      },
      {
        "Cycles": 0,
        "Agent": "edu.brown.cs.systems.xtrace.logging.BaggageWrappers",
        "ProcessName": "Read",
        "TaskID": "4C28B7874352D205",
        "ParentEventID": [
          "F3E157DA911B5496",
          "71C4B46DFDBD695D"
        ],
        "Label": "Merged current baggage with other baggage",
        "Title": "X-Trace Task",
        "Host": "pinky19.mpi-sws.org",
        "HRT": 25489061363656985,
        "Operation": "join",
        "Timestamp": "1556272701303.998047",
        "TenantClass": 0,
        "Source": "PacketHeader.java:168",
        "ThreadID": 1,
        "ThreadName": "",
        "EventID": "CD2FD9E6121A9758",
        "ProcessID": 6356
      },
      {
        "Cycles": 0,
        "Agent": "Execution-Sleep",
        "ProcessName": "Data",
        "TaskID": "4C28B7874352D205",
        "ParentEventID": [
          "71C4B46DFDBD695D"
        ],
        "Label": "waited",
        "Title": "X-Trace Task",
        "Host": "pinky19.mpi-sws.org",
        "Duration": "3691",
        "HRT": 25489061363570265,
        "Operation": "waited",
        "Timestamp": "1556272701303.920654",
        "TenantClass": 0,
        "Source": "SocketIOWithTimeout.java:335",
        "ThreadID": 8617,
        "ThreadName": "",
        "EventID": "D675B5CA1ABA557E",
        "BaggageBytes": "[[248 5] [240 0] [0 76 40 183 135 67 82 210 5] [240 1] [0 113 196 180 109 253 189 105 93] [240 3] [0 2]]",
        "ProcessID": 2319
      },
      {
        "Cycles": 0,
        "Agent": "Execution-Sleep",
        "ProcessName": "Data",
        "TaskID": "4C28B7874352D205",
        "ParentEventID": [
          "FFC846237D154C49"
        ],
        "Label": "waited",
        "Title": "X-Trace Task",
        "Host": "pinky19.mpi-sws.org",
        "Duration": "3333",
        "HRT": 25489061363688783,
        "Operation": "waited",
        "Timestamp": "1556272701304.039062",
        "TenantClass": 0,
        "Source": "SocketIOWithTimeout.java:335",
        "ThreadID": 8617,
        "ThreadName": "",
        "EventID": "8E8F2D7BE89E5FB1",
        "BaggageBytes": "[[248 5] [240 0] [0 76 40 183 135 67 82 210 5] [240 1] [0 255 200 70 35 125 21 76 73] [240 3] [0 2]]",
        "ProcessID": 2319
      },
      {
        "Cycles": 0,
        "Agent": "edu.brown.cs.systems.xtrace.logging.BaggageWrappers",
        "ProcessName": "Read",
        "TaskID": "4C28B7874352D205",
        "ParentEventID": [
          "FFC846237D154C49",
          "CD2FD9E6121A9758"
        ],
        "Label": "Merged current baggage with other baggage",
        "Title": "X-Trace Task",
        "Host": "pinky19.mpi-sws.org",
        "HRT": 25489061363774778,
        "Operation": "join",
        "Timestamp": "1556272701304.115723",
        "TenantClass": 0,
        "Source": "PacketHeader.java:168",
        "ThreadID": 1,
        "ThreadName": "",
        "EventID": "70F639BF67A5AC82",
        "ProcessID": 6356
      },
      {
        "Cycles": 0,
        "Agent": "edu.brown.cs.systems.xtrace.logging.XTraceInit",
        "ProcessName": "Data",
        "TaskID": "4C28B7874352D205",
        "ParentEventID": [
          "E751C9E306B102C6"
        ],
        "Label": "Thread.setName: DataXceiver for client DFSClient_NONMAPREDUCE_614514224_1 at /139.19.171.63:54648 [Sending block BP-1633380353-139.19.171.63-1554193446451:blk_1073755899_15075]",
        "Title": "X-Trace Task",
        "Host": "pinky19.mpi-sws.org",
        "HRT": 25489061363400684,
        "Timestamp": "1556272701303.750977",
        "TenantClass": 0,
        "Source": "DataXceiver.java:168",
        "ThreadID": 8617,
        "ThreadName": "",
        "EventID": "13E6078186C1393E",
        "BaggageBytes": "[[248 5] [240 0] [0 76 40 183 135 67 82 210 5] [240 1] [0 231 81 201 227 6 177 2 198] [240 3] [0 2]]",
        "ProcessID": 2319
      },
      {
        "Cycles": 0,
        "Agent": "Execution-Sleep",
        "ProcessName": "Data",
        "TaskID": "4C28B7874352D205",
        "ParentEventID": [
          "58518D93B580A576"
        ],
        "Label": "waited",
        "Title": "X-Trace Task",
        "Host": "pinky19.mpi-sws.org",
        "Duration": "3179",
        "HRT": 25489061363806191,
        "Operation": "waited",
        "Timestamp": "1556272701304.156494",
        "TenantClass": 0,
        "Source": "SocketIOWithTimeout.java:335",
        "ThreadID": 8617,
        "ThreadName": "",
        "EventID": "CCA2199ACA5536EE",
        "BaggageBytes": "[[248 5] [240 0] [0 76 40 183 135 67 82 210 5] [240 1] [0 88 81 141 147 181 128 165 118] [240 3] [0 2]]",
        "ProcessID": 2319
      },
      {
        "Cycles": 0,
        "Agent": "edu.brown.cs.systems.xtrace.logging.BaggageWrappers",
        "ProcessName": "Read",
        "TaskID": "4C28B7874352D205",
        "ParentEventID": [
          "58518D93B580A576",
          "70F639BF67A5AC82"
        ],
        "Label": "Merged current baggage with other baggage",
        "Title": "X-Trace Task",
        "Host": "pinky19.mpi-sws.org",
        "HRT": 25489061363915638,
        "Operation": "join",
        "Timestamp": "1556272701304.256592",
        "TenantClass": 0,
        "Source": "PacketHeader.java:168",
        "ThreadID": 1,
        "ThreadName": "",
        "EventID": "C3EBBF6EC4B5442F",
        "ProcessID": 6356
      },
      {
        "Cycles": 0,
        "Agent": "edu.brown.cs.systems.xtrace.logging.BaggageWrappers",
        "ProcessName": "Data",
        "TaskID": "4C28B7874352D205",
        "ParentEventID": [
          "8E8F2D7BE89E5FB1"
        ],
        "Label": "Forking current baggage with Baggage.fork()",
        "Title": "X-Trace Task",
        "Host": "pinky19.mpi-sws.org",
        "HRT": 25489061363754505,
        "Operation": "fork",
        "Timestamp": "1556272701304.104736",
        "TenantClass": 0,
        "Source": "PacketHeader.java:95",
        "ThreadID": 8617,
        "ThreadName": "",
        "EventID": "58518D93B580A576",
        "BaggageBytes": "[[248 5] [240 0] [0 76 40 183 135 67 82 210 5] [240 1] [0 142 143 45 123 232 158 95 177] [240 3] [0 2]]",
        "ProcessID": 2319
      },
      {
        "Cycles": 0,
        "Agent": "Execution-Sleep",
        "ProcessName": "Data",
        "TaskID": "4C28B7874352D205",
        "ParentEventID": [
          "582E319B41D7F5BE"
        ],
        "Label": "waited",
        "Title": "X-Trace Task",
        "Host": "pinky19.mpi-sws.org",
        "Duration": "3726",
        "HRT": 25489061363920907,
        "Operation": "waited",
        "Timestamp": "1556272701304.271240",
        "TenantClass": 0,
        "Source": "SocketIOWithTimeout.java:335",
        "ThreadID": 8617,
        "ThreadName": "",
        "EventID": "3A7DF823E787AB1F",
        "BaggageBytes": "[[248 5] [240 0] [0 76 40 183 135 67 82 210 5] [240 1] [0 88 46 49 155 65 215 245 190] [240 3] [0 2]]",
        "ProcessID": 2319
      },
      {
        "Cycles": 0,
        "Agent": "edu.brown.cs.systems.xtrace.logging.BaggageWrappers",
        "ProcessName": "Read",
        "TaskID": "4C28B7874352D205",
        "ParentEventID": [
          "582E319B41D7F5BE",
          "C3EBBF6EC4B5442F"
        ],
        "Label": "Merged current baggage with other baggage",
        "Title": "X-Trace Task",
        "Host": "pinky19.mpi-sws.org",
        "HRT": 25489061364035492,
        "Operation": "join",
        "Timestamp": "1556272701304.376465",
        "TenantClass": 0,
        "Source": "PacketHeader.java:168",
        "ThreadID": 1,
        "ThreadName": "",
        "EventID": "3A90CCF522C16A2E",
        "ProcessID": 6356
      },
      {
        "Cycles": 0,
        "Agent": "edu.brown.cs.systems.xtrace.logging.BaggageWrappers",
        "ProcessName": "Data",
        "TaskID": "4C28B7874352D205",
        "ParentEventID": [
          "CCA2199ACA5536EE"
        ],
        "Label": "Forking current baggage with Baggage.fork()",
        "Title": "X-Trace Task",
        "Host": "pinky19.mpi-sws.org",
        "HRT": 25489061363867193,
        "Operation": "fork",
        "Timestamp": "1556272701304.217529",
        "TenantClass": 0,
        "Source": "PacketHeader.java:95",
        "ThreadID": 8617,
        "ThreadName": "",
        "EventID": "582E319B41D7F5BE",
        "BaggageBytes": "[[248 5] [240 0] [0 76 40 183 135 67 82 210 5] [240 1] [0 204 162 25 154 202 85 54 238] [240 3] [0 2]]",
        "ProcessID": 2319
      },
      {
        "Cycles": 0,
        "Agent": "Execution-Sleep",
        "ProcessName": "Data",
        "TaskID": "4C28B7874352D205",
        "ParentEventID": [
          "22723D3EDF372651"
        ],
        "Label": "waited",
        "Title": "X-Trace Task",
        "Host": "pinky19.mpi-sws.org",
        "Duration": "3119",
        "HRT": 25489061364035317,
        "Operation": "waited",
        "Timestamp": "1556272701304.385498",
        "TenantClass": 0,
        "Source": "SocketIOWithTimeout.java:335",
        "ThreadID": 8617,
        "ThreadName": "",
        "EventID": "C25317B9914FC077",
        "BaggageBytes": "[[248 5] [240 0] [0 76 40 183 135 67 82 210 5] [240 1] [0 34 114 61 62 223 55 38 81] [240 3] [0 2]]",
        "ProcessID": 2319
      },
      {
        "Cycles": 0,
        "Agent": "edu.brown.cs.systems.xtrace.logging.BaggageWrappers",
        "ProcessName": "Data",
        "TaskID": "4C28B7874352D205",
        "ParentEventID": [
          "C25317B9914FC077"
        ],
        "Label": "Forking current baggage with Baggage.fork()",
        "Title": "X-Trace Task",
        "Host": "pinky19.mpi-sws.org",
        "HRT": 25489061364096250,
        "Operation": "fork",
        "Timestamp": "1556272701304.446533",
        "TenantClass": 0,
        "Source": "PacketHeader.java:95",
        "ThreadID": 8617,
        "ThreadName": "",
        "EventID": "2D65CE38D2AB6EEA",
        "BaggageBytes": "[[248 5] [240 0] [0 76 40 183 135 67 82 210 5] [240 1] [0 194 83 23 185 145 79 192 119] [240 3] [0 2]]",
        "ProcessID": 2319
      },
      {
        "Cycles": 0,
        "Agent": "edu.brown.cs.systems.xtrace.logging.BaggageWrappers",
        "ProcessName": "Data",
        "TaskID": "4C28B7874352D205",
        "ParentEventID": [
          "3A7DF823E787AB1F"
        ],
        "Label": "Forking current baggage with Baggage.fork()",
        "Title": "X-Trace Task",
        "Host": "pinky19.mpi-sws.org",
        "HRT": 25489061363982590,
        "Operation": "fork",
        "Timestamp": "1556272701304.332764",
        "TenantClass": 0,
        "Source": "PacketHeader.java:95",
        "ThreadID": 8617,
        "ThreadName": "",
        "EventID": "22723D3EDF372651",
        "BaggageBytes": "[[248 5] [240 0] [0 76 40 183 135 67 82 210 5] [240 1] [0 58 125 248 35 231 135 171 31] [240 3] [0 2]]",
        "ProcessID": 2319
      },
      {
        "Cycles": 0,
        "Agent": "edu.brown.cs.systems.xtrace.logging.BaggageWrappers",
        "ProcessName": "Data",
        "TaskID": "4C28B7874352D205",
        "ParentEventID": [
          "668053C8A50A22C6"
        ],
        "Label": "Forking current baggage with Baggage.fork()",
        "Title": "X-Trace Task",
        "Host": "pinky19.mpi-sws.org",
        "HRT": 25489061364207866,
        "Operation": "fork",
        "Timestamp": "1556272701304.558105",
        "TenantClass": 0,
        "Source": "PacketHeader.java:95",
        "ThreadID": 8617,
        "ThreadName": "",
        "EventID": "ACC0A7B3EF1CEB43",
        "BaggageBytes": "[[248 5] [240 0] [0 76 40 183 135 67 82 210 5] [240 1] [0 102 128 83 200 165 10 34 198] [240 3] [0 2]]",
        "ProcessID": 2319
      },
      {
        "Cycles": 0,
        "Agent": "Execution-Sleep",
        "ProcessName": "Data",
        "TaskID": "4C28B7874352D205",
        "ParentEventID": [
          "2D65CE38D2AB6EEA"
        ],
        "Label": "waited",
        "Title": "X-Trace Task",
        "Host": "pinky19.mpi-sws.org",
        "Duration": "3440",
        "HRT": 25489061364146306,
        "Operation": "waited",
        "Timestamp": "1556272701304.496582",
        "TenantClass": 0,
        "Source": "SocketIOWithTimeout.java:335",
        "ThreadID": 8617,
        "ThreadName": "",
        "EventID": "668053C8A50A22C6",
        "BaggageBytes": "[[248 5] [240 0] [0 76 40 183 135 67 82 210 5] [240 1] [0 45 101 206 56 210 171 110 234] [240 3] [0 2]]",
        "ProcessID": 2319
      },
      {
        "Cycles": 0,
        "Agent": "Execution-Sleep",
        "ProcessName": "Data",
        "TaskID": "4C28B7874352D205",
        "ParentEventID": [
          "ACC0A7B3EF1CEB43"
        ],
        "Label": "waited",
        "Title": "X-Trace Task",
        "Host": "pinky19.mpi-sws.org",
        "Duration": "3195",
        "HRT": 25489061364258547,
        "Operation": "waited",
        "Timestamp": "1556272701304.608887",
        "TenantClass": 0,
        "Source": "SocketIOWithTimeout.java:335",
        "ThreadID": 8617,
        "ThreadName": "",
        "EventID": "013DEEECB47AFA0E",
        "BaggageBytes": "[[248 5] [240 0] [0 76 40 183 135 67 82 210 5] [240 1] [0 172 192 167 179 239 28 235 67] [240 3] [0 2]]",
        "ProcessID": 2319
      },
      {
        "Cycles": 0,
        "Agent": "edu.brown.cs.systems.xtrace.logging.BaggageWrappers",
        "ProcessName": "Data",
        "TaskID": "4C28B7874352D205",
        "ParentEventID": [
          "013DEEECB47AFA0E"
        ],
        "Label": "Forking current baggage with Baggage.fork()",
        "Title": "X-Trace Task",
        "Host": "pinky19.mpi-sws.org",
        "HRT": 25489061364320185,
        "Operation": "fork",
        "Timestamp": "1556272701304.670410",
        "TenantClass": 0,
        "Source": "PacketHeader.java:95",
        "ThreadID": 8617,
        "ThreadName": "",
        "EventID": "10C5AD55443793CB",
        "BaggageBytes": "[[248 5] [240 0] [0 76 40 183 135 67 82 210 5] [240 1] [0 1 61 238 236 180 122 250 14] [240 3] [0 2]]",
        "ProcessID": 2319
      },
      {
        "Cycles": 0,
        "Agent": "edu.brown.cs.systems.xtrace.logging.BaggageWrappers",
        "ProcessName": "Read",
        "TaskID": "4C28B7874352D205",
        "ParentEventID": [
          "3A90CCF522C16A2E",
          "22723D3EDF372651"
        ],
        "Label": "Merged current baggage with other baggage",
        "Title": "X-Trace Task",
        "Host": "pinky19.mpi-sws.org",
        "HRT": 25489061364154769,
        "Operation": "join",
        "Timestamp": "1556272701304.495850",
        "TenantClass": 0,
        "Source": "PacketHeader.java:168",
        "ThreadID": 1,
        "ThreadName": "",
        "EventID": "D5AA703F8F2B264A",
        "ProcessID": 6356
      },
      {
        "Cycles": 0,
        "Agent": "Execution-Sleep",
        "ProcessName": "Data",
        "TaskID": "4C28B7874352D205",
        "ParentEventID": [
          "10C5AD55443793CB"
        ],
        "Label": "waited",
        "Title": "X-Trace Task",
        "Host": "pinky19.mpi-sws.org",
        "Duration": "3119",
        "HRT": 25489061364377396,
        "Operation": "waited",
        "Timestamp": "1556272701304.727783",
        "TenantClass": 0,
        "Source": "SocketIOWithTimeout.java:335",
        "ThreadID": 8617,
        "ThreadName": "",
        "EventID": "6B312F94B092F457",
        "BaggageBytes": "[[248 5] [240 0] [0 76 40 183 135 67 82 210 5] [240 1] [0 16 197 173 85 68 55 147 203] [240 3] [0 2]]",
        "ProcessID": 2319
      },
      {
        "Cycles": 0,
        "Agent": "edu.brown.cs.systems.xtrace.logging.BaggageWrappers",
        "ProcessName": "Data",
        "TaskID": "4C28B7874352D205",
        "ParentEventID": [
          "6B312F94B092F457"
        ],
        "Label": "Forking current baggage with Baggage.fork()",
        "Title": "X-Trace Task",
        "Host": "pinky19.mpi-sws.org",
        "HRT": 25489061364453343,
        "Operation": "fork",
        "Timestamp": "1556272701304.803711",
        "TenantClass": 0,
        "Source": "PacketHeader.java:95",
        "ThreadID": 8617,
        "ThreadName": "",
        "EventID": "AA6C8A799B1E8D95",
        "BaggageBytes": "[[248 5] [240 0] [0 76 40 183 135 67 82 210 5] [240 1] [0 107 49 47 148 176 146 244 87] [240 3] [0 2]]",
        "ProcessID": 2319
      },
      {
        "Cycles": 0,
        "Agent": "edu.brown.cs.systems.xtrace.logging.BaggageWrappers",
        "ProcessName": "Read",
        "TaskID": "4C28B7874352D205",
        "ParentEventID": [
          "2D65CE38D2AB6EEA",
          "D5AA703F8F2B264A"
        ],
        "Label": "Merged current baggage with other baggage",
        "Title": "X-Trace Task",
        "Host": "pinky19.mpi-sws.org",
        "HRT": 25489061364293714,
        "Operation": "join",
        "Timestamp": "1556272701304.634766",
        "TenantClass": 0,
        "Source": "PacketHeader.java:168",
        "ThreadID": 1,
        "ThreadName": "",
        "EventID": "E3E1220A805E5E6F",
        "ProcessID": 6356
      },
      {
        "Cycles": 0,
        "Agent": "Execution-Sleep",
        "ProcessName": "Data",
        "TaskID": "4C28B7874352D205",
        "ParentEventID": [
          "AA6C8A799B1E8D95"
        ],
        "Label": "waited",
        "Title": "X-Trace Task",
        "Host": "pinky19.mpi-sws.org",
        "Duration": "3114",
        "HRT": 25489061364507822,
        "Operation": "waited",
        "Timestamp": "1556272701304.858154",
        "TenantClass": 0,
        "Source": "SocketIOWithTimeout.java:335",
        "ThreadID": 8617,
        "ThreadName": "",
        "EventID": "FA8AA2E29B9A98BF",
        "BaggageBytes": "[[248 5] [240 0] [0 76 40 183 135 67 82 210 5] [240 1] [0 170 108 138 121 155 30 141 149] [240 3] [0 2]]",
        "ProcessID": 2319
      },
      {
        "Cycles": 0,
        "Agent": "edu.brown.cs.systems.xtrace.logging.BaggageWrappers",
        "ProcessName": "Data",
        "TaskID": "4C28B7874352D205",
        "ParentEventID": [
          "FA8AA2E29B9A98BF"
        ],
        "Label": "Forking current baggage with Baggage.fork()",
        "Title": "X-Trace Task",
        "Host": "pinky19.mpi-sws.org",
        "HRT": 25489061364569952,
        "Operation": "fork",
        "Timestamp": "1556272701304.920166",
        "TenantClass": 0,
        "Source": "PacketHeader.java:95",
        "ThreadID": 8617,
        "ThreadName": "",
        "EventID": "62E809C572F00592",
        "BaggageBytes": "[[248 5] [240 0] [0 76 40 183 135 67 82 210 5] [240 1] [0 250 138 162 226 155 154 152 191] [240 3] [0 2]]",
        "ProcessID": 2319
      },
      {
        "Cycles": 0,
        "Agent": "edu.brown.cs.systems.xtrace.logging.BaggageWrappers",
        "ProcessName": "Read",
        "TaskID": "4C28B7874352D205",
        "ParentEventID": [
          "06EDB70958F8B7D6",
          "10C5AD55443793CB"
        ],
        "Label": "Merged current baggage with other baggage",
        "Title": "X-Trace Task",
        "Host": "pinky19.mpi-sws.org",
        "HRT": 25489061364547833,
        "Operation": "join",
        "Timestamp": "1556272701304.888916",
        "TenantClass": 0,
        "Source": "PacketHeader.java:168",
        "ThreadID": 1,
        "ThreadName": "",
        "EventID": "AB6FCAF868D3E9D7",
        "ProcessID": 6356
      },
      {
        "Cycles": 0,
        "Agent": "Execution-Sleep",
        "ProcessName": "Data",
        "TaskID": "4C28B7874352D205",
        "ParentEventID": [
          "62E809C572F00592"
        ],
        "Label": "waited",
        "Title": "X-Trace Task",
        "Host": "pinky19.mpi-sws.org",
        "Duration": "3009",
        "HRT": 25489061364622559,
        "Operation": "waited",
        "Timestamp": "1556272701304.972900",
        "TenantClass": 0,
        "Source": "SocketIOWithTimeout.java:335",
        "ThreadID": 8617,
        "ThreadName": "",
        "EventID": "AA0B29D6055737D4",
        "BaggageBytes": "[[248 5] [240 0] [0 76 40 183 135 67 82 210 5] [240 1] [0 98 232 9 197 114 240 5 146] [240 3] [0 2]]",
        "ProcessID": 2319
      },
      {
        "Cycles": 0,
        "Agent": "edu.brown.cs.systems.xtrace.logging.BaggageWrappers",
        "ProcessName": "Data",
        "TaskID": "4C28B7874352D205",
        "ParentEventID": [
          "AA0B29D6055737D4"
        ],
        "Label": "Forking current baggage with Baggage.fork()",
        "Title": "X-Trace Task",
        "Host": "pinky19.mpi-sws.org",
        "HRT": 25489061364683000,
        "Operation": "fork",
        "Timestamp": "1556272701305.033203",
        "TenantClass": 0,
        "Source": "PacketHeader.java:95",
        "ThreadID": 8617,
        "ThreadName": "",
        "EventID": "2CBBE0DA8CCF0B02",
        "BaggageBytes": "[[248 5] [240 0] [0 76 40 183 135 67 82 210 5] [240 1] [0 170 11 41 214 5 87 55 212] [240 3] [0 2]]",
        "ProcessID": 2319
      },
      {
        "Cycles": 0,
        "Agent": "edu.brown.cs.systems.xtrace.logging.BaggageWrappers",
        "ProcessName": "Read",
        "TaskID": "4C28B7874352D205",
        "ParentEventID": [
          "E3E1220A805E5E6F",
          "ACC0A7B3EF1CEB43"
        ],
        "Label": "Merged current baggage with other baggage",
        "Title": "X-Trace Task",
        "Host": "pinky19.mpi-sws.org",
        "HRT": 25489061364412000,
        "Operation": "join",
        "Timestamp": "1556272701304.752930",
        "TenantClass": 0,
        "Source": "PacketHeader.java:168",
        "ThreadID": 1,
        "ThreadName": "",
        "EventID": "06EDB70958F8B7D6",
        "ProcessID": 6356
      },
      {
        "Cycles": 0,
        "Agent": "Execution-Sleep",
        "ProcessName": "Data",
        "TaskID": "4C28B7874352D205",
        "ParentEventID": [
          "2CBBE0DA8CCF0B02"
        ],
        "Label": "waited",
        "Title": "X-Trace Task",
        "Host": "pinky19.mpi-sws.org",
        "Duration": "2953",
        "HRT": 25489061364736430,
        "Operation": "waited",
        "Timestamp": "1556272701305.086670",
        "TenantClass": 0,
        "Source": "SocketIOWithTimeout.java:335",
        "ThreadID": 8617,
        "ThreadName": "",
        "EventID": "8E6A34AB591E0D25",
        "BaggageBytes": "[[248 5] [240 0] [0 76 40 183 135 67 82 210 5] [240 1] [0 44 187 224 218 140 207 11 2] [240 3] [0 2]]",
        "ProcessID": 2319
      },
      {
        "Cycles": 0,
        "Agent": "edu.brown.cs.systems.xtrace.logging.BaggageWrappers",
        "ProcessName": "Data",
        "TaskID": "4C28B7874352D205",
        "ParentEventID": [
          "8E6A34AB591E0D25"
        ],
        "Label": "Forking current baggage with Baggage.fork()",
        "Title": "X-Trace Task",
        "Host": "pinky19.mpi-sws.org",
        "HRT": 25489061364796774,
        "Operation": "fork",
        "Timestamp": "1556272701305.146973",
        "TenantClass": 0,
        "Source": "PacketHeader.java:95",
        "ThreadID": 8617,
        "ThreadName": "",
        "EventID": "BE7CF468588C1D27",
        "BaggageBytes": "[[248 5] [240 0] [0 76 40 183 135 67 82 210 5] [240 1] [0 142 106 52 171 89 30 13 37] [240 3] [0 2]]",
        "ProcessID": 2319
      },
      {
        "Cycles": 0,
        "Agent": "edu.brown.cs.systems.xtrace.logging.BaggageWrappers",
        "ProcessName": "Read",
        "TaskID": "4C28B7874352D205",
        "ParentEventID": [
          "AB6FCAF868D3E9D7",
          "AA6C8A799B1E8D95"
        ],
        "Label": "Merged current baggage with other baggage",
        "Title": "X-Trace Task",
        "Host": "pinky19.mpi-sws.org",
        "HRT": 25489061364666117,
        "Operation": "join",
        "Timestamp": "1556272701305.007080",
        "TenantClass": 0,
        "Source": "PacketHeader.java:168",
        "ThreadID": 1,
        "ThreadName": "",
        "EventID": "556A999171A9CC1F",
        "ProcessID": 6356
      },
      {
        "Cycles": 0,
        "Agent": "Execution-Sleep",
        "ProcessName": "Data",
        "TaskID": "4C28B7874352D205",
        "ParentEventID": [
          "BE7CF468588C1D27"
        ],
        "Label": "waited",
        "Title": "X-Trace Task",
        "Host": "pinky19.mpi-sws.org",
        "Duration": "2916",
        "HRT": 25489061364847733,
        "Operation": "waited",
        "Timestamp": "1556272701305.197998",
        "TenantClass": 0,
        "Source": "SocketIOWithTimeout.java:335",
        "ThreadID": 8617,
        "ThreadName": "",
        "EventID": "4359D07EB7FF6616",
        "BaggageBytes": "[[248 5] [240 0] [0 76 40 183 135 67 82 210 5] [240 1] [0 190 124 244 104 88 140 29 39] [240 3] [0 2]]",
        "ProcessID": 2319
      },
      {
        "Cycles": 0,
        "Agent": "Execution-Sleep",
        "ProcessName": "Data",
        "TaskID": "4C28B7874352D205",
        "ParentEventID": [
          "DF835865BF5C603C"
        ],
        "Label": "waited",
        "Title": "X-Trace Task",
        "Host": "pinky19.mpi-sws.org",
        "Duration": "2964",
        "HRT": 25489061364960848,
        "Operation": "waited",
        "Timestamp": "1556272701305.311035",
        "TenantClass": 0,
        "Source": "SocketIOWithTimeout.java:335",
        "ThreadID": 8617,
        "ThreadName": "",
        "EventID": "3E0B6B38B17CE1F4",
        "BaggageBytes": "[[248 5] [240 0] [0 76 40 183 135 67 82 210 5] [240 1] [0 223 131 88 101 191 92 96 60] [240 3] [0 2]]",
        "ProcessID": 2319
      },
      {
        "Cycles": 0,
        "Agent": "edu.brown.cs.systems.xtrace.logging.BaggageWrappers",
        "ProcessName": "Data",
        "TaskID": "4C28B7874352D205",
        "ParentEventID": [
          "4359D07EB7FF6616"
        ],
        "Label": "Forking current baggage with Baggage.fork()",
        "Title": "X-Trace Task",
        "Host": "pinky19.mpi-sws.org",
        "HRT": 25489061364910355,
        "Operation": "fork",
        "Timestamp": "1556272701305.260742",
        "TenantClass": 0,
        "Source": "PacketHeader.java:95",
        "ThreadID": 8617,
        "ThreadName": "",
        "EventID": "DF835865BF5C603C",
        "BaggageBytes": "[[248 5] [240 0] [0 76 40 183 135 67 82 210 5] [240 1] [0 67 89 208 126 183 255 102 22] [240 3] [0 2]]",
        "ProcessID": 2319
      },
      {
        "Cycles": 0,
        "Agent": "edu.brown.cs.systems.xtrace.logging.BaggageWrappers",
        "ProcessName": "Read",
        "TaskID": "4C28B7874352D205",
        "ParentEventID": [
          "2CBBE0DA8CCF0B02",
          "6AAF5F8070F8334B"
        ],
        "Label": "Merged current baggage with other baggage",
        "Title": "X-Trace Task",
        "Host": "pinky19.mpi-sws.org",
        "HRT": 25489061364955015,
        "Operation": "join",
        "Timestamp": "1556272701305.295898",
        "TenantClass": 0,
        "Source": "PacketHeader.java:168",
        "ThreadID": 1,
        "ThreadName": "",
        "EventID": "9F648DB65C00BA45",
        "ProcessID": 6356
      },
      {
        "Cycles": 0,
        "Agent": "Execution-Sleep",
        "ProcessName": "Data",
        "TaskID": "4C28B7874352D205",
        "ParentEventID": [
          "3585909F1C9AADA4"
        ],
        "Label": "waited",
        "Title": "X-Trace Task",
        "Host": "pinky19.mpi-sws.org",
        "Duration": "3014",
        "HRT": 25489061365071700,
        "Operation": "waited",
        "Timestamp": "1556272701305.421875",
        "TenantClass": 0,
        "Source": "SocketIOWithTimeout.java:335",
        "ThreadID": 8617,
        "ThreadName": "",
        "EventID": "33E271A678DB1F49",
        "BaggageBytes": "[[248 5] [240 0] [0 76 40 183 135 67 82 210 5] [240 1] [0 53 133 144 159 28 154 173 164] [240 3] [0 2]]",
        "ProcessID": 2319
      },
      {
        "Cycles": 0,
        "Agent": "edu.brown.cs.systems.xtrace.logging.BaggageWrappers",
        "ProcessName": "Read",
        "TaskID": "4C28B7874352D205",
        "ParentEventID": [
          "556A999171A9CC1F",
          "62E809C572F00592"
        ],
        "Label": "Merged current baggage with other baggage",
        "Title": "X-Trace Task",
        "Host": "pinky19.mpi-sws.org",
        "HRT": 25489061364782802,
        "Operation": "join",
        "Timestamp": "1556272701305.123779",
        "TenantClass": 0,
        "Source": "PacketHeader.java:168",
        "ThreadID": 1,
        "ThreadName": "",
        "EventID": "6AAF5F8070F8334B",
        "ProcessID": 6356
      },
      {
        "Cycles": 0,
        "Agent": "edu.brown.cs.systems.xtrace.logging.BaggageWrappers",
        "ProcessName": "Data",
        "TaskID": "4C28B7874352D205",
        "ParentEventID": [
          "3E0B6B38B17CE1F4"
        ],
        "Label": "Forking current baggage with Baggage.fork()",
        "Title": "X-Trace Task",
        "Host": "pinky19.mpi-sws.org",
        "HRT": 25489061365021763,
        "Operation": "fork",
        "Timestamp": "1556272701305.372070",
        "TenantClass": 0,
        "Source": "PacketHeader.java:95",
        "ThreadID": 8617,
        "ThreadName": "",
        "EventID": "3585909F1C9AADA4",
        "BaggageBytes": "[[248 5] [240 0] [0 76 40 183 135 67 82 210 5] [240 1] [0 62 11 107 56 177 124 225 244] [240 3] [0 2]]",
        "ProcessID": 2319
      },
      {
        "Cycles": 0,
        "Agent": "edu.brown.cs.systems.xtrace.logging.BaggageWrappers",
        "ProcessName": "Read",
        "TaskID": "4C28B7874352D205",
        "ParentEventID": [
          "9F648DB65C00BA45",
          "BE7CF468588C1D27"
        ],
        "Label": "Merged current baggage with other baggage",
        "Title": "X-Trace Task",
        "Host": "pinky19.mpi-sws.org",
        "HRT": 25489061365077304,
        "Operation": "join",
        "Timestamp": "1556272701305.418213",
        "TenantClass": 0,
        "Source": "PacketHeader.java:168",
        "ThreadID": 1,
        "ThreadName": "",
        "EventID": "BBF763DC485BB3D3",
        "ProcessID": 6356
      },
      {
        "Cycles": 0,
        "Agent": "edu.brown.cs.systems.xtrace.logging.BaggageWrappers",
        "ProcessName": "Read",
        "TaskID": "4C28B7874352D205",
        "ParentEventID": [
          "DF835865BF5C603C",
          "BBF763DC485BB3D3"
        ],
        "Label": "Merged current baggage with other baggage",
        "Title": "X-Trace Task",
        "Host": "pinky19.mpi-sws.org",
        "HRT": 25489061365213877,
        "Operation": "join",
        "Timestamp": "1556272701305.554932",
        "TenantClass": 0,
        "Source": "PacketHeader.java:168",
        "ThreadID": 1,
        "ThreadName": "",
        "EventID": "D2187AB1D758FF30",
        "ProcessID": 6356
      },
      {
        "Cycles": 0,
        "Agent": "Execution-Sleep",
        "ProcessName": "Data",
        "TaskID": "4C28B7874352D205",
        "ParentEventID": [
          "FB88D5705C8CF366"
        ],
        "Label": "waited",
        "Title": "X-Trace Task",
        "Host": "pinky19.mpi-sws.org",
        "Duration": "2951",
        "HRT": 25489061365182813,
        "Operation": "waited",
        "Timestamp": "1556272701305.533203",
        "TenantClass": 0,
        "Source": "SocketIOWithTimeout.java:335",
        "ThreadID": 8617,
        "ThreadName": "",
        "EventID": "1F302BE395506A70",
        "BaggageBytes": "[[248 5] [240 0] [0 76 40 183 135 67 82 210 5] [240 1] [0 251 136 213 112 92 140 243 102] [240 3] [0 2]]",
        "ProcessID": 2319
      },
      {
        "Cycles": 0,
        "Agent": "edu.brown.cs.systems.xtrace.logging.BaggageWrappers",
        "ProcessName": "Data",
        "TaskID": "4C28B7874352D205",
        "ParentEventID": [
          "1F302BE395506A70"
        ],
        "Label": "Forking current baggage with Baggage.fork()",
        "Title": "X-Trace Task",
        "Host": "pinky19.mpi-sws.org",
        "HRT": 25489061365242501,
        "Operation": "fork",
        "Timestamp": "1556272701305.592773",
        "TenantClass": 0,
        "Source": "PacketHeader.java:95",
        "ThreadID": 8617,
        "ThreadName": "",
        "EventID": "3F0A60CD99DB96D9",
        "BaggageBytes": "[[248 5] [240 0] [0 76 40 183 135 67 82 210 5] [240 1] [0 31 48 43 227 149 80 106 112] [240 3] [0 2]]",
        "ProcessID": 2319
      },
      {
        "Cycles": 0,
        "Agent": "edu.brown.cs.systems.xtrace.logging.BaggageWrappers",
        "ProcessName": "Read",
        "TaskID": "4C28B7874352D205",
        "ParentEventID": [
          "3585909F1C9AADA4",
          "D2187AB1D758FF30"
        ],
        "Label": "Merged current baggage with other baggage",
        "Title": "X-Trace Task",
        "Host": "pinky19.mpi-sws.org",
        "HRT": 25489061365333084,
        "Operation": "join",
        "Timestamp": "1556272701305.674072",
        "TenantClass": 0,
        "Source": "PacketHeader.java:168",
        "ThreadID": 1,
        "ThreadName": "",
        "EventID": "7BF47598B8912BB1",
        "ProcessID": 6356
      },
      {
        "Cycles": 0,
        "Agent": "edu.brown.cs.systems.xtrace.logging.BaggageWrappers",
        "ProcessName": "Data",
        "TaskID": "4C28B7874352D205",
        "ParentEventID": [
          "33E271A678DB1F49"
        ],
        "Label": "Forking current baggage with Baggage.fork()",
        "Title": "X-Trace Task",
        "Host": "pinky19.mpi-sws.org",
        "HRT": 25489061365130925,
        "Operation": "fork",
        "Timestamp": "1556272701305.481201",
        "TenantClass": 0,
        "Source": "PacketHeader.java:95",
        "ThreadID": 8617,
        "ThreadName": "",
        "EventID": "FB88D5705C8CF366",
        "BaggageBytes": "[[248 5] [240 0] [0 76 40 183 135 67 82 210 5] [240 1] [0 51 226 113 166 120 219 31 73] [240 3] [0 2]]",
        "ProcessID": 2319
      },
      {
        "Cycles": 0,
        "Agent": "edu.brown.cs.systems.xtrace.logging.BaggageWrappers",
        "ProcessName": "Data",
        "TaskID": "4C28B7874352D205",
        "ParentEventID": [
          "A3A67C03B557416B"
        ],
        "Label": "Forking current baggage with Baggage.fork()",
        "Title": "X-Trace Task",
        "Host": "pinky19.mpi-sws.org",
        "HRT": 25489061365360823,
        "Operation": "fork",
        "Timestamp": "1556272701305.711182",
        "TenantClass": 0,
        "Source": "PacketHeader.java:95",
        "ThreadID": 8617,
        "ThreadName": "",
        "EventID": "5C02078D830FCE9B",
        "BaggageBytes": "[[248 5] [240 0] [0 76 40 183 135 67 82 210 5] [240 1] [0 163 166 124 3 181 87 65 107] [240 3] [0 2]]",
        "ProcessID": 2319
      },
      {
        "Cycles": 0,
        "Agent": "edu.brown.cs.systems.xtrace.logging.BaggageWrappers",
        "ProcessName": "Read",
        "TaskID": "4C28B7874352D205",
        "ParentEventID": [
          "7BF47598B8912BB1",
          "FB88D5705C8CF366"
        ],
        "Label": "Merged current baggage with other baggage",
        "Title": "X-Trace Task",
        "Host": "pinky19.mpi-sws.org",
        "HRT": 25489061365452371,
        "Operation": "join",
        "Timestamp": "1556272701305.793457",
        "TenantClass": 0,
        "Source": "PacketHeader.java:168",
        "ThreadID": 1,
        "ThreadName": "",
        "EventID": "88000A9F5B3D8AC0",
        "ProcessID": 6356
      },
      {
        "Cycles": 0,
        "Agent": "Execution-Sleep",
        "ProcessName": "Data",
        "TaskID": "4C28B7874352D205",
        "ParentEventID": [
          "3F0A60CD99DB96D9"
        ],
        "Label": "waited",
        "Title": "X-Trace Task",
        "Host": "pinky19.mpi-sws.org",
        "Duration": "3255",
        "HRT": 25489061365301615,
        "Operation": "waited",
        "Timestamp": "1556272701305.651855",
        "TenantClass": 0,
        "Source": "SocketIOWithTimeout.java:335",
        "ThreadID": 8617,
        "ThreadName": "",
        "EventID": "A3A67C03B557416B",
        "BaggageBytes": "[[248 5] [240 0] [0 76 40 183 135 67 82 210 5] [240 1] [0 63 10 96 205 153 219 150 217] [240 3] [0 2]]",
        "ProcessID": 2319
      },
      {
        "Cycles": 0,
        "Agent": "edu.brown.cs.systems.xtrace.logging.BaggageWrappers",
        "ProcessName": "Data",
        "TaskID": "4C28B7874352D205",
        "ParentEventID": [
          "4EE562EA8A84C0F3"
        ],
        "Label": "Forking current baggage with Baggage.fork()",
        "Title": "X-Trace Task",
        "Host": "pinky19.mpi-sws.org",
        "HRT": 25489061365472239,
        "Operation": "fork",
        "Timestamp": "1556272701305.822510",
        "TenantClass": 0,
        "Source": "PacketHeader.java:95",
        "ThreadID": 8617,
        "ThreadName": "",
        "EventID": "239EA2DFDD4927C7",
        "BaggageBytes": "[[248 5] [240 0] [0 76 40 183 135 67 82 210 5] [240 1] [0 78 229 98 234 138 132 192 243] [240 3] [0 2]]",
        "ProcessID": 2319
      },
      {
        "Cycles": 0,
        "Agent": "Execution-CPU",
        "ProcessName": "Data",
        "TaskID": "4C28B7874352D205",
        "ParentEventID": [
          "39616F7800B04ED0"
        ],
        "Label": "unset",
        "Title": "X-Trace Task",
        "Host": "pinky19.mpi-sws.org",
        "Duration": "2289074",
        "HRT": 25489061365682262,
        "Operation": "unset",
        "Timestamp": "1556272701306.032471",
        "TenantClass": 0,
        "Source": "DataXceiver.java:261",
        "ThreadID": 8617,
        "ThreadName": "",
        "EventID": "D8A10E1B9FA9AA66",
        "BaggageBytes": "[[248 5] [240 0] [0 76 40 183 135 67 82 210 5] [240 1] [0 57 97 111 120 0 176 78 208] [240 3] [0 2]]",
        "ProcessID": 2319
      },
      {
        "Cycles": 0,
        "Agent": "Execution-Sleep",
        "ProcessName": "Data",
        "TaskID": "4C28B7874352D205",
        "ParentEventID": [
          "5C02078D830FCE9B"
        ],
        "Label": "waited",
        "Title": "X-Trace Task",
        "Host": "pinky19.mpi-sws.org",
        "Duration": "2973",
        "HRT": 25489061365410659,
        "Operation": "waited",
        "Timestamp": "1556272701305.760986",
        "TenantClass": 0,
        "Source": "SocketIOWithTimeout.java:335",
        "ThreadID": 8617,
        "ThreadName": "",
        "EventID": "4EE562EA8A84C0F3",
        "BaggageBytes": "[[248 5] [240 0] [0 76 40 183 135 67 82 210 5] [240 1] [0 92 2 7 141 131 15 206 155] [240 3] [0 2]]",
        "ProcessID": 2319
      },
      {
        "Cycles": 0,
        "Agent": "Execution-Sleep",
        "ProcessName": "Data",
        "TaskID": "4C28B7874352D205",
        "ParentEventID": [
          "239EA2DFDD4927C7"
        ],
        "Label": "waited",
        "Title": "X-Trace Task",
        "Host": "pinky19.mpi-sws.org",
        "Duration": "2961",
        "HRT": 25489061365522273,
        "Operation": "waited",
        "Timestamp": "1556272701305.872559",
        "TenantClass": 0,
        "Source": "SocketIOWithTimeout.java:335",
        "ThreadID": 8617,
        "ThreadName": "",
        "EventID": "39616F7800B04ED0",
        "BaggageBytes": "[[248 5] [240 0] [0 76 40 183 135 67 82 210 5] [240 1] [0 35 158 162 223 221 73 39 199] [240 3] [0 2]]",
        "ProcessID": 2319
      }
    ]
  }
]