[
  {
    "id": "9DF04C90F803B2F1",
    "reports": [
      {
        "Cycles": 0,
        "Agent": "org.apache.hadoop.ipc.ProtobufRpcEngine",
        "ProcessName": "Read",
        "TaskID": "9DF04C90F803B2F1",
        "ParentEventID": [
          "D2B75D21A2E9DC3E"
        ],
        "Label": "Invoking org.apache.hadoop.hdfs.protocol.ClientProtocol.getBlockLocations",
        "Title": "X-Trace Task",
        "Host": "pinky19.mpi-sws.org",
        "HRT": 26962658226443173,
        "Timestamp": "1557746298166.434082",
        "TenantClass": 0,
        "Source": "ProtobufRpcEngine.java:228",
        "ThreadID": 1,
        "ThreadName": "",
        "EventID": "584EBCCC72A6473B",
        "ProcessID": 36430
      },
      {
        "Cycles": 0,
        "Agent": "edu.brown.cs.systems.retro.benchmarks.hdfs_client.Reader",
        "ProcessName": "Read",
        "TaskID": "9DF04C90F803B2F1",
        "ParentEventID": [
          "C8DDBF3BC3EAABBA"
        ],
        "Label": "Reading file",
        "Title": "X-Trace Task",
        "Host": "pinky19.mpi-sws.org",
        "HRT": 26962658226418562,
        "Timestamp": "1557746298166.409424",
        "TenantClass": 0,
        "ThreadID": 1,
        "ThreadName": "",
        "EventID": "D2B75D21A2E9DC3E",
        "ProcessID": 36430
      },
      {
        "Cycles": 0,
        "Agent": "Execution-CPU",
        "ProcessName": "Read",
        "TaskID": "9DF04C90F803B2F1",
        "ParentEventID": [
          "584EBCCC72A6473B"
        ],
        "Label": "unset",
        "Title": "X-Trace Task",
        "Host": "pinky19.mpi-sws.org",
        "Duration": "22078737",
        "HRT": 26962658226459980,
        "Operation": "unset",
        "Timestamp": "1557746298166.450684",
        "TenantClass": 0,
        "Source": "Client.java:1027",
        "ThreadID": 1,
        "ThreadName": "",
        "EventID": "C3A6989D023677B1",
        "ProcessID": 36430
      },
      {
        "Cycles": 0,
        "Agent": "edu.brown.cs.systems.xtrace.logging.BaggageWrappers",
        "ProcessName": "Read",
        "TaskID": "9DF04C90F803B2F1",
        "ParentEventID": [
          "8F876E99D835D5D4"
        ],
        "Label": "Forking current baggage with Baggage.fork()",
        "Title": "X-Trace Task",
        "Host": "pinky19.mpi-sws.org",
        "HRT": 26962658226525064,
        "Operation": "fork",
        "Timestamp": "1557746298166.515869",
        "TenantClass": 0,
        "Source": "Client.java:1043",
        "ThreadID": 41,
        "ThreadName": "",
        "EventID": "6F3EDAC1C2A0180C",
        "ProcessID": 36430
      },
      {
        "Cycles": 0,
        "Agent": "Execution-CPU",
        "ProcessName": "Read",
        "TaskID": "9DF04C90F803B2F1",
        "ParentEventID": [
          "C3A6989D023677B1"
        ],
        "Label": "set",
        "Title": "X-Trace Task",
        "Host": "pinky19.mpi-sws.org",
        "HRT": 26962658226506005,
        "Operation": "set",
        "Timestamp": "1557746298166.496826",
        "TenantClass": 0,
        "Source": "Client.java:1032",
        "ThreadID": 41,
        "ThreadName": "",
        "EventID": "8F876E99D835D5D4",
        "ProcessID": 36430
      },
      {
        "Cycles": 0,
        "Agent": "Execution-CPU",
        "ProcessName": "Read",
        "TaskID": "9DF04C90F803B2F1",
        "ParentEventID": [
          "6F3EDAC1C2A0180C"
        ],
        "Label": "unset",
        "Title": "X-Trace Task",
        "Host": "pinky19.mpi-sws.org",
        "Duration": "67675",
        "HRT": 26962658226591975,
        "Operation": "unset",
        "Timestamp": "1557746298166.582764",
        "TenantClass": 0,
        "Source": "Client.java:1062",
        "ThreadID": 41,
        "ThreadName": "",
        "EventID": "D00EF734D2388DA4",
        "ProcessID": 36430
      },
      {
        "Cycles": 0,
        "Agent": "Execution-CPU",
        "ProcessName": "Read",
        "TaskID": "9DF04C90F803B2F1",
        "ParentEventID": [
          "D00EF734D2388DA4"
        ],
        "Label": "set",
        "Title": "X-Trace Task",
        "Host": "pinky19.mpi-sws.org",
        "HRT": 26962658226612633,
        "Operation": "set",
        "Timestamp": "1557746298166.603516",
        "TenantClass": 0,
        "Source": "Client.java:1104",
        "ThreadID": 1,
        "ThreadName": "",
        "EventID": "F7EA72BDFF2E9D14",
        "ProcessID": 36430
      },
      {
        "Cycles": 0,
        "Agent": "Execution-CPU",
        "ProcessName": "Name",
        "TaskID": "9DF04C90F803B2F1",
        "ParentEventID": [
          "6F3EDAC1C2A0180C"
        ],
        "Label": "set",
        "Title": "X-Trace Task",
        "Host": "pinky19.mpi-sws.org",
        "HRT": 26962658226655877,
        "Operation": "set",
        "Timestamp": "1557746298166.661133",
        "TenantClass": 0,
        "Source": "Server.java:1840",
        "ThreadID": 48,
        "ThreadName": "",
        "EventID": "4372A3E59884766E",
        "BaggageBytes": "[[248 5] [240 0] [0 157 240 76 144 248 3 178 241] [240 1] [0 111 62 218 193 194 160 24 12] [240 3] [0 2]]",
        "ProcessID": 2171
      },
      {
        "Cycles": 0,
        "Agent": "Execution-CPU",
        "ProcessName": "Name",
        "TaskID": "9DF04C90F803B2F1",
        "ParentEventID": [
          "8F196AAD4856D14B"
        ],
        "Label": "unset",
        "Title": "X-Trace Task",
        "Host": "pinky19.mpi-sws.org",
        "Duration": "25373",
        "HRT": 26962658226706711,
        "Operation": "unset",
        "Timestamp": "1557746298166.711914",
        "TenantClass": 0,
        "Source": "Server.java:1828",
        "ThreadID": 48,
        "ThreadName": "",
        "EventID": "5925942E30F07A12",
        "BaggageBytes": "[[248 5] [240 0] [0 157 240 76 144 248 3 178 241] [240 1] [0 143 25 106 173 72 86 209 75] [240 3] [0 2]]",
        "ProcessID": 2171
      },
      {
        "Cycles": 0,
        "Agent": "Execution-CPU",
        "ProcessName": "Name",
        "TaskID": "9DF04C90F803B2F1",
        "ParentEventID": [
          "8F196AAD4856D14B"
        ],
        "Label": "set",
        "Title": "X-Trace Task",
        "Host": "pinky19.mpi-sws.org",
        "HRT": 26962658226743925,
        "Operation": "set",
        "Timestamp": "1557746298166.749268",
        "TenantClass": 0,
        "Source": "Server.java:2071",
        "ThreadID": 62,
        "ThreadName": "",
        "EventID": "2CBAEB4CB65BABAF",
        "BaggageBytes": "[[248 5] [240 0] [0 157 240 76 144 248 3 178 241] [240 1] [0 143 25 106 173 72 86 209 75] [240 3] [0 2]]",
        "ProcessID": 2171
      },
      {
        "Cycles": 0,
        "Agent": "org.apache.hadoop.ipc.Server",
        "ProcessName": "Name",
        "TaskID": "9DF04C90F803B2F1",
        "ParentEventID": [
          "2CBAEB4CB65BABAF"
        ],
        "Label": "getBlockLocations in org.apache.hadoop.hdfs.protocol.ClientProtocol",
        "Title": "X-Trace Task",
        "Host": "pinky19.mpi-sws.org",
        "HRT": 26962658226786254,
        "Timestamp": "1557746298166.791504",
        "TenantClass": 0,
        "Source": "ProtobufRpcEngine.java:601",
        "ThreadID": 62,
        "ThreadName": "",
        "EventID": "1F59FE32E468809A",
        "BaggageBytes": "[[248 5] [240 0] [0 157 240 76 144 248 3 178 241] [240 1] [0 44 186 235 76 182 91 171 175] [240 3] [0 2]]",
        "ProcessID": 2171
      },
      {
        "Cycles": 0,
        "Agent": "edu.brown.cs.systems.xtrace.logging.BaggageWrappers",
        "ProcessName": "Name",
        "TaskID": "9DF04C90F803B2F1",
        "ParentEventID": [
          "4372A3E59884766E"
        ],
        "Label": "Forking current baggage with Baggage.fork()",
        "Title": "X-Trace Task",
        "Host": "pinky19.mpi-sws.org",
        "HRT": 26962658226685209,
        "Operation": "fork",
        "Timestamp": "1557746298166.690430",
        "TenantClass": 0,
        "Source": "Server.java:550",
        "ThreadID": 48,
        "ThreadName": "",
        "EventID": "8F196AAD4856D14B",
        "BaggageBytes": "[[248 5] [240 0] [0 157 240 76 144 248 3 178 241] [240 1] [0 67 114 163 229 152 132 118 110] [240 3] [0 2]]",
        "ProcessID": 2171
      },
      {
        "Cycles": 0,
        "Agent": "edu.brown.cs.systems.xtrace.logging.BaggageWrappers",
        "ProcessName": "Name",
        "TaskID": "9DF04C90F803B2F1",
        "ParentEventID": [
          "C1C593916172A27F"
        ],
        "Label": "Forking current baggage with Baggage.fork()",
        "Title": "X-Trace Task",
        "Host": "pinky19.mpi-sws.org",
        "HRT": 26962658226877659,
        "Operation": "fork",
        "Timestamp": "1557746298166.882812",
        "TenantClass": 0,
        "Source": "Server.java:2398",
        "ThreadID": 62,
        "ThreadName": "",
        "EventID": "F0709BB0A15F1117",
        "BaggageBytes": "[[248 5] [240 0] [0 157 240 76 144 248 3 178 241] [240 1] [0 193 197 147 145 97 114 162 127] [240 3] [0 2]]",
        "ProcessID": 2171
      },
      {
        "Cycles": 0,
        "Agent": "org.apache.hadoop.hdfs.server.namenode.FSNamesystem.audit",
        "ProcessName": "Name",
        "TaskID": "9DF04C90F803B2F1",
        "ParentEventID": [
          "1F59FE32E468809A"
        ],
        "Label": "allowed=true\tugi=plascas (auth:SIMPLE)\tip=/139.19.171.63\tcmd=open\tsrc=/ds/JK1s20lKyWjmx25G\tdst=null\tperm=null\tproto=rpc",
        "Title": "X-Trace Task",
        "Host": "pinky19.mpi-sws.org",
        "HRT": 26962658226834028,
        "Timestamp": "1557746298166.839355",
        "TenantClass": 0,
        "Source": "FSNamesystem.java:8313",
        "ThreadID": 62,
        "ThreadName": "",
        "EventID": "C1C593916172A27F",
        "BaggageBytes": "[[248 5] [240 0] [0 157 240 76 144 248 3 178 241] [240 1] [0 31 89 254 50 228 104 128 154] [240 3] [0 2]]",
        "ProcessID": 2171
      },
      {
        "Cycles": 0,
        "Agent": "Execution-CPU",
        "ProcessName": "Name",
        "TaskID": "9DF04C90F803B2F1",
        "ParentEventID": [
          "F0709BB0A15F1117"
        ],
        "Label": "unset",
        "Title": "X-Trace Task",
        "Host": "pinky19.mpi-sws.org",
        "Duration": "213869",
        "HRT": 26962658226986594,
        "Operation": "unset",
        "Timestamp": "1557746298166.991943",
        "TenantClass": 0,
        "Source": "Server.java:1058",
        "ThreadID": 62,
        "ThreadName": "",
        "EventID": "C41C6DA2F5632C7B",
        "BaggageBytes": "[[248 5] [240 0] [0 157 240 76 144 248 3 178 241] [240 1] [0 240 112 155 176 161 95 17 23] [240 3] [0 2]]",
        "ProcessID": 2171
      },
      {
        "Cycles": 0,
        "Agent": "Execution-CPU",
        "ProcessName": "Read",
        "TaskID": "9DF04C90F803B2F1",
        "ParentEventID": [
          "6EA7157C89406608"
        ],
        "Label": "unset",
        "Title": "X-Trace Task",
        "Host": "pinky19.mpi-sws.org",
        "Duration": "5651",
        "HRT": 26962658227058138,
        "Operation": "unset",
        "Timestamp": "1557746298167.048828",
        "TenantClass": 0,
        "Source": "Client.java:1168",
        "ThreadID": 37,
        "ThreadName": "",
        "EventID": "E3F0E4C0485F9796",
        "ProcessID": 36430
      },
      {
        "Cycles": 0,
        "Agent": "Execution-CPU",
        "ProcessName": "Read",
        "TaskID": "9DF04C90F803B2F1",
        "ParentEventID": [
          "F0709BB0A15F1117"
        ],
        "Label": "set",
        "Title": "X-Trace Task",
        "Host": "pinky19.mpi-sws.org",
        "HRT": 26962658227037336,
        "Operation": "set",
        "Timestamp": "1557746298167.028076",
        "TenantClass": 0,
        "Source": "Client.java:302",
        "ThreadID": 37,
        "ThreadName": "",
        "EventID": "6EA7157C89406608",
        "ProcessID": 36430
      },
      {
        "Cycles": 0,
        "Agent": "Execution-Sleep",
        "ProcessName": "Read",
        "TaskID": "9DF04C90F803B2F1",
        "ParentEventID": [
          "F7EA72BDFF2E9D14"
        ],
        "Label": "waited",
        "Title": "X-Trace Task",
        "Host": "pinky19.mpi-sws.org",
        "Duration": "462759",
        "HRT": 26962658227087826,
        "Operation": "waited",
        "Timestamp": "1557746298167.078613",
        "TenantClass": 0,
        "Source": "Client.java:1537",
        "ThreadID": 1,
        "ThreadName": "",
        "EventID": "1B5652531C27453E",
        "ProcessID": 36430
      },
      {
        "Cycles": 0,
        "Agent": "org.apache.hadoop.ipc.ProtobufRpcEngine",
        "ProcessName": "Read",
        "TaskID": "9DF04C90F803B2F1",
        "ParentEventID": [
          "E2ECB0CAAB5E69AA"
        ],
        "Label": "org.apache.hadoop.hdfs.protocol.ClientProtocol.getBlockLocations completed",
        "Title": "X-Trace Task",
        "Host": "pinky19.mpi-sws.org",
        "HRT": 26962658227133387,
        "Timestamp": "1557746298167.124268",
        "TenantClass": 0,
        "Source": "ProtobufRpcEngine.java:275",
        "ThreadID": 1,
        "ThreadName": "",
        "EventID": "17FAD592B0D6E44A",
        "ProcessID": 36430
      },
      {
        "Cycles": 0,
        "Agent": "edu.brown.cs.systems.xtrace.logging.BaggageWrappers",
        "ProcessName": "Read",
        "TaskID": "9DF04C90F803B2F1",
        "ParentEventID": [
          "1B5652531C27453E",
          "E3F0E4C0485F9796"
        ],
        "Label": "Merged current baggage with other baggage",
        "Title": "X-Trace Task",
        "Host": "pinky19.mpi-sws.org",
        "HRT": 26962658227099442,
        "Operation": "join",
        "Timestamp": "1557746298167.090332",
        "TenantClass": 0,
        "Source": "Client.java:1545",
        "ThreadID": 1,
        "ThreadName": "",
        "EventID": "E2ECB0CAAB5E69AA",
        "ProcessID": 36430
      },
      {
        "Cycles": 0,
        "Agent": "edu.brown.cs.systems.xtrace.logging.BaggageWrappers",
        "ProcessName": "Read",
        "TaskID": "9DF04C90F803B2F1",
        "ParentEventID": [
          "17FAD592B0D6E44A"
        ],
        "Label": "Forking current baggage with Baggage.fork()",
        "Title": "X-Trace Task",
        "Host": "pinky19.mpi-sws.org",
        "HRT": 26962658227187185,
        "Operation": "fork",
        "Timestamp": "1557746298167.177979",
        "TenantClass": 0,
        "Source": "DataTransferProtoUtil.java:94",
        "ThreadID": 1,
        "ThreadName": "",
        "EventID": "57D632CD2867A73B",
        "ProcessID": 36430
      },
      {
        "Cycles": 0,
        "Agent": "Execution-CPU",
        "ProcessName": "Data",
        "TaskID": "9DF04C90F803B2F1",
        "ParentEventID": [
          "57D632CD2867A73B"
        ],
        "Label": "set",
        "Title": "X-Trace Task",
        "Host": "pinky25.mpi-sws.org",
        "HRT": 47511763469049691,
        "Operation": "set",
        "Timestamp": "1557746298167.461426",
        "TenantClass": 0,
        "Source": "Receiver.java:117",
        "ThreadID": 14040,
        "ThreadName": "",
        "EventID": "414DD3CA87EDD4CA",
        "BaggageBytes": "[[248 5] [240 0] [0 157 240 76 144 248 3 178 241] [240 1] [0 87 214 50 205 40 103 167 59] [240 3] [0 2]]",
        "ProcessID": 28198
      },
      {
        "Cycles": 0,
        "Agent": "edu.brown.cs.systems.xtrace.logging.BaggageWrappers",
        "ProcessName": "Data",
        "TaskID": "9DF04C90F803B2F1",
        "ParentEventID": [
          "20F545DB558ACDA0"
        ],
        "Label": "Forking current baggage with Baggage.fork()",
        "Title": "X-Trace Task",
        "Host": "pinky25.mpi-sws.org",
        "HRT": 47511763469319012,
        "Operation": "fork",
        "Timestamp": "1557746298167.730713",
        "TenantClass": 0,
        "Source": "DataXceiver.java:1257",
        "ThreadID": 14040,
        "ThreadName": "",
        "EventID": "3DE2D5AF5E751926",
        "BaggageBytes": "[[248 5] [240 0] [0 157 240 76 144 248 3 178 241] [240 1] [0 32 245 69 219 85 138 205 160] [240 3] [0 2]]",
        "ProcessID": 28198
      },
      {
        "Cycles": 0,
        "Agent": "edu.brown.cs.systems.xtrace.logging.XTraceInit",
        "ProcessName": "Data",
        "TaskID": "9DF04C90F803B2F1",
        "ParentEventID": [
          "414DD3CA87EDD4CA"
        ],
        "Label": "Thread.setName: DataXceiver for client DFSClient_NONMAPREDUCE_778905418_1 at /139.19.171.63:41180 [Sending block BP-1633380353-139.19.171.63-1554193446451:blk_1073763723_22899]",
        "Title": "X-Trace Task",
        "Host": "pinky25.mpi-sws.org",
        "HRT": 47511763469147382,
        "Timestamp": "1557746298167.559082",
        "TenantClass": 0,
        "Source": "DataXceiver.java:168",
        "ThreadID": 14040,
        "ThreadName": "",
        "EventID": "20F545DB558ACDA0",
        "BaggageBytes": "[[248 5] [240 0] [0 157 240 76 144 248 3 178 241] [240 1] [0 65 77 211 202 135 237 212 202] [240 3] [0 2]]",
        "ProcessID": 28198
      },
      {
        "Cycles": 0,
        "Agent": "Execution-Sleep",
        "ProcessName": "Read",
        "TaskID": "9DF04C90F803B2F1",
        "ParentEventID": [
          "57D632CD2867A73B"
        ],
        "Label": "waited",
        "Title": "X-Trace Task",
        "Host": "pinky19.mpi-sws.org",
        "Duration": "622836",
        "HRT": 26962658227884466,
        "Operation": "waited",
        "Timestamp": "1557746298167.875244",
        "TenantClass": 0,
        "Source": "SocketIOWithTimeout.java:335",
        "ThreadID": 1,
        "ThreadName": "",
        "EventID": "5B011641E6508D1C",
        "ProcessID": 36430
      },
      {
        "Cycles": 0,
        "Agent": "edu.brown.cs.systems.xtrace.logging.BaggageWrappers",
        "ProcessName": "Read",
        "TaskID": "9DF04C90F803B2F1",
        "ParentEventID": [
          "3DE2D5AF5E751926",
          "5B011641E6508D1C"
        ],
        "Label": "Merged current baggage with other baggage",
        "Title": "X-Trace Task",
        "Host": "pinky19.mpi-sws.org",
        "HRT": 26962658227955130,
        "Operation": "join",
        "Timestamp": "1557746298167.946045",
        "TenantClass": 0,
        "Source": "RemoteBlockReader2.java:429",
        "ThreadID": 1,
        "ThreadName": "",
        "EventID": "5C53EFF162E37AC5",
        "ProcessID": 36430
      },
      {
        "Cycles": 0,
        "Agent": "edu.brown.cs.systems.xtrace.logging.BaggageWrappers",
        "ProcessName": "Data",
        "TaskID": "9DF04C90F803B2F1",
        "ParentEventID": [
          "3DE2D5AF5E751926"
        ],
        "Label": "Forking current baggage with Baggage.fork()",
        "Title": "X-Trace Task",
        "Host": "pinky25.mpi-sws.org",
        "HRT": 47511763469496542,
        "Operation": "fork",
        "Timestamp": "1557746298167.908203",
        "TenantClass": 0,
        "Source": "PacketHeader.java:95",
        "ThreadID": 14040,
        "ThreadName": "",
        "EventID": "13936F91A2772994",
        "BaggageBytes": "[[248 5] [240 0] [0 157 240 76 144 248 3 178 241] [240 1] [0 61 226 213 175 94 117 25 38] [240 3] [0 2]]",
        "ProcessID": 28198
      },
      {
        "Cycles": 0,
        "Agent": "Execution-Sleep",
        "ProcessName": "Data",
        "TaskID": "9DF04C90F803B2F1",
        "ParentEventID": [
          "13936F91A2772994"
        ],
        "Label": "waited",
        "Title": "X-Trace Task",
        "Host": "pinky25.mpi-sws.org",
        "Duration": "6661",
        "HRT": 47511763469594624,
        "Operation": "waited",
        "Timestamp": "1557746298168.006348",
        "TenantClass": 0,
        "Source": "SocketIOWithTimeout.java:335",
        "ThreadID": 14040,
        "ThreadName": "",
        "EventID": "5108EB04F76B3B7B",
        "BaggageBytes": "[[248 5] [240 0] [0 157 240 76 144 248 3 178 241] [240 1] [0 19 147 111 145 162 119 41 148] [240 3] [0 2]]",
        "ProcessID": 28198
      },
      {
        "Cycles": 0,
        "Agent": "Execution-Sleep",
        "ProcessName": "Read",
        "TaskID": "9DF04C90F803B2F1",
        "ParentEventID": [
          "5C53EFF162E37AC5"
        ],
        "Label": "waited",
        "Title": "X-Trace Task",
        "Host": "pinky19.mpi-sws.org",
        "Duration": "288741",
        "HRT": 26962658228320008,
        "Operation": "waited",
        "Timestamp": "1557746298168.310791",
        "TenantClass": 0,
        "Source": "SocketIOWithTimeout.java:335",
        "ThreadID": 1,
        "ThreadName": "",
        "EventID": "1DD8DA03B0F016F2",
        "ProcessID": 36430
      },
      {
        "Cycles": 0,
        "Agent": "edu.brown.cs.systems.xtrace.logging.BaggageWrappers",
        "ProcessName": "Data",
        "TaskID": "9DF04C90F803B2F1",
        "ParentEventID": [
          "5108EB04F76B3B7B"
        ],
        "Label": "Forking current baggage with Baggage.fork()",
        "Title": "X-Trace Task",
        "Host": "pinky25.mpi-sws.org",
        "HRT": 47511763469746991,
        "Operation": "fork",
        "Timestamp": "1557746298168.158691",
        "TenantClass": 0,
        "Source": "PacketHeader.java:95",
        "ThreadID": 14040,
        "ThreadName": "",
        "EventID": "6B6322A08A788371",
        "BaggageBytes": "[[248 5] [240 0] [0 157 240 76 144 248 3 178 241] [240 1] [0 81 8 235 4 247 107 59 123] [240 3] [0 2]]",
        "ProcessID": 28198
      },
      {
        "Cycles": 0,
        "Agent": "edu.brown.cs.systems.xtrace.logging.BaggageWrappers",
        "ProcessName": "Read",
        "TaskID": "9DF04C90F803B2F1",
        "ParentEventID": [
          "1DD8DA03B0F016F2",
          "13936F91A2772994"
        ],
        "Label": "Merged current baggage with other baggage",
        "Title": "X-Trace Task",
        "Host": "pinky19.mpi-sws.org",
        "HRT": 26962658228384492,
        "Operation": "join",
        "Timestamp": "1557746298168.375244",
        "TenantClass": 0,
        "Source": "PacketHeader.java:168",
        "ThreadID": 1,
        "ThreadName": "",
        "EventID": "1C31E5308C3B1260",
        "ProcessID": 36430
      },
      {
        "Cycles": 0,
        "Agent": "edu.brown.cs.systems.xtrace.logging.BaggageWrappers",
        "ProcessName": "Read",
        "TaskID": "9DF04C90F803B2F1",
        "ParentEventID": [
          "917637CFB3B7C4FB"
        ],
        "Label": "Forking current baggage with Baggage.fork()",
        "Title": "X-Trace Task",
        "Host": "pinky19.mpi-sws.org",
        "HRT": 26962658228448995,
        "Operation": "fork",
        "Timestamp": "1557746298168.439697",
        "TenantClass": 0,
        "Source": "RemoteBlockReader2.java:361",
        "ThreadID": 1,
        "ThreadName": "",
        "EventID": "7BE6AB2DC82958FE",
        "ProcessID": 36430
      },
      {
        "Cycles": 0,
        "Agent": "edu.brown.cs.systems.xtrace.logging.BaggageWrappers",
        "ProcessName": "Read",
        "TaskID": "9DF04C90F803B2F1",
        "ParentEventID": [
          "1C31E5308C3B1260",
          "6B6322A08A788371"
        ],
        "Label": "Merged current baggage with other baggage",
        "Title": "X-Trace Task",
        "Host": "pinky19.mpi-sws.org",
        "HRT": 26962658228439983,
        "Operation": "join",
        "Timestamp": "1557746298168.430908",
        "TenantClass": 0,
        "Source": "PacketHeader.java:168",
        "ThreadID": 1,
        "ThreadName": "",
        "EventID": "917637CFB3B7C4FB",
        "ProcessID": 36430
      },
      {
        "Cycles": 0,
        "Agent": "Execution-Sleep",
        "ProcessName": "Data",
        "TaskID": "9DF04C90F803B2F1",
        "ParentEventID": [
          "6B6322A08A788371"
        ],
        "Label": "waited",
        "Title": "X-Trace Task",
        "Host": "pinky25.mpi-sws.org",
        "Duration": "226770",
        "HRT": 47511763470120528,
        "Operation": "waited",
        "Timestamp": "1557746298168.532227",
        "TenantClass": 0,
        "Source": "SocketIOWithTimeout.java:335",
        "ThreadID": 14040,
        "ThreadName": "",
        "EventID": "BB75A4B2B89F987F",
        "BaggageBytes": "[[248 5] [240 0] [0 157 240 76 144 248 3 178 241] [240 1] [0 107 99 34 160 138 120 131 113] [240 3] [0 2]]",
        "ProcessID": 28198
      },
      {
        "Cycles": 0,
        "Agent": "edu.brown.cs.systems.xtrace.logging.BaggageWrappers",
        "ProcessName": "Data",
        "TaskID": "9DF04C90F803B2F1",
        "ParentEventID": [
          "BB75A4B2B89F987F",
          "7BE6AB2DC82958FE"
        ],
        "Label": "Merged current baggage with other baggage",
        "Title": "X-Trace Task",
        "Host": "pinky25.mpi-sws.org",
        "HRT": 47511763470243637,
        "Operation": "join",
        "Timestamp": "1557746298168.655273",
        "TenantClass": 0,
        "Source": "DataXceiver.java:574",
        "ThreadID": 14040,
        "ThreadName": "",
        "EventID": "D44F41BA1D067D60",
        "BaggageBytes": "[[248 5] [240 0] [0 157 240 76 144 248 3 178 241] [240 1] [0 187 117 164 178 184 159 152 127] [0 123 230 171 45 200 41 88 254] [240 3] [0 2]]",
        "ProcessID": 28198
      },
      {
        "Cycles": 0,
        "Agent": "Execution-CPU",
        "ProcessName": "Data",
        "TaskID": "9DF04C90F803B2F1",
        "ParentEventID": [
          "D44F41BA1D067D60"
        ],
        "Label": "unset",
        "Title": "X-Trace Task",
        "Host": "pinky25.mpi-sws.org",
        "Duration": "1161489",
        "HRT": 47511763470285477,
        "Operation": "unset",
        "Timestamp": "1557746298168.697266",
        "TenantClass": 0,
        "Source": "DataXceiver.java:261",
        "ThreadID": 14040,
        "ThreadName": "",
        "EventID": "1000662ED7F0CDD3",
        "BaggageBytes": "[[248 5] [240 0] [0 157 240 76 144 248 3 178 241] [240 1] [0 212 79 65 186 29 6 125 96] [240 3] [0 2]]",
        "ProcessID": 28198
      },
      {
        "Cycles": 0,
        "Agent": "edu.brown.cs.systems.retro.benchmarks.hdfs_client.Reader",
        "ProcessName": "Read",
        "TaskID": "9DF04C90F803B2F1",
        "ParentEventID": [
          "0"
        ],
        "Label": "Reading file",
        "Title": "X-Trace Task",
        "Host": "pinky19.mpi-sws.org",
        "HRT": 26962658226403615,
        "Timestamp": "1557746298166.394531",
        "TenantClass": 0,
        "ThreadID": 1,
        "ThreadName": "",
        "EventID": "C8DDBF3BC3EAABBA",
        "ProcessID": 36430,
        "Tag": [
          "reader_10kb",
          "Read Size: 10240"
        ]
      }
    ]
  }
]