[
  {
    "id": "DEBAB79B8B19C562",
    "reports": [
      {
        "Cycles": 0,
        "Agent": "org.apache.hadoop.ipc.ProtobufRpcEngine",
        "ProcessName": "Read",
        "TaskID": "DEBAB79B8B19C562",
        "ParentEventID": [
          "86EA6E65CBEA5244"
        ],
        "Label": "Invoking org.apache.hadoop.hdfs.protocol.ClientProtocol.getBlockLocations",
        "Title": "X-Trace Task",
        "Host": "pinky19.mpi-sws.org",
        "HRT": 26962633538131304,
        "Timestamp": "1557746273478.301514",
        "TenantClass": 0,
        "Source": "ProtobufRpcEngine.java:228",
        "ThreadID": 1,
        "ThreadName": "",
        "EventID": "7208FC4E123BCF62",
        "ProcessID": 36430
      },
      {
        "Cycles": 0,
        "Agent": "edu.brown.cs.systems.retro.benchmarks.hdfs_client.Reader",
        "ProcessName": "Read",
        "TaskID": "DEBAB79B8B19C562",
        "ParentEventID": [
          "7176AA02D48F04E0"
        ],
        "Label": "Reading file",
        "Title": "X-Trace Task",
        "Host": "pinky19.mpi-sws.org",
        "HRT": 26962633538089000,
        "Timestamp": "1557746273478.259033",
        "TenantClass": 0,
        "ThreadID": 1,
        "ThreadName": "",
        "EventID": "86EA6E65CBEA5244",
        "ProcessID": 36430
      },
      {
        "Cycles": 0,
        "Agent": "Execution-CPU",
        "ProcessName": "Read",
        "TaskID": "DEBAB79B8B19C562",
        "ParentEventID": [
          "C0137876D1FE1A4C"
        ],
        "Label": "set",
        "Title": "X-Trace Task",
        "Host": "pinky19.mpi-sws.org",
        "HRT": 26962633538193790,
        "Operation": "set",
        "Timestamp": "1557746273478.364014",
        "TenantClass": 0,
        "Source": "Client.java:1032",
        "ThreadID": 41,
        "ThreadName": "",
        "EventID": "4CC2F26883D0B3FB",
        "ProcessID": 36430
      },
      {
        "Cycles": 0,
        "Agent": "Execution-CPU",
        "ProcessName": "Read",
        "TaskID": "DEBAB79B8B19C562",
        "ParentEventID": [
          "7208FC4E123BCF62"
        ],
        "Label": "unset",
        "Title": "X-Trace Task",
        "Host": "pinky19.mpi-sws.org",
        "Duration": "22325070",
        "HRT": 26962633538152567,
        "Operation": "unset",
        "Timestamp": "1557746273478.322754",
        "TenantClass": 0,
        "Source": "Client.java:1027",
        "ThreadID": 1,
        "ThreadName": "",
        "EventID": "C0137876D1FE1A4C",
        "ProcessID": 36430
      },
      {
        "Cycles": 0,
        "Agent": "edu.brown.cs.systems.xtrace.logging.BaggageWrappers",
        "ProcessName": "Read",
        "TaskID": "DEBAB79B8B19C562",
        "ParentEventID": [
          "4CC2F26883D0B3FB"
        ],
        "Label": "Forking current baggage with Baggage.fork()",
        "Title": "X-Trace Task",
        "Host": "pinky19.mpi-sws.org",
        "HRT": 26962633538215903,
        "Operation": "fork",
        "Timestamp": "1557746273478.385986",
        "TenantClass": 0,
        "Source": "Client.java:1043",
        "ThreadID": 41,
        "ThreadName": "",
        "EventID": "BE3B4D2B8DEA9CE2",
        "ProcessID": 36430
      },
      {
        "Cycles": 0,
        "Agent": "Execution-CPU",
        "ProcessName": "Read",
        "TaskID": "DEBAB79B8B19C562",
        "ParentEventID": [
          "BE3B4D2B8DEA9CE2"
        ],
        "Label": "unset",
        "Title": "X-Trace Task",
        "Host": "pinky19.mpi-sws.org",
        "Duration": "75860",
        "HRT": 26962633538290319,
        "Operation": "unset",
        "Timestamp": "1557746273478.460449",
        "TenantClass": 0,
        "Source": "Client.java:1062",
        "ThreadID": 41,
        "ThreadName": "",
        "EventID": "5A0FA59679967B62",
        "ProcessID": 36430
      },
      {
        "Cycles": 0,
        "Agent": "Execution-CPU",
        "ProcessName": "Read",
        "TaskID": "DEBAB79B8B19C562",
        "ParentEventID": [
          "5A0FA59679967B62"
        ],
        "Label": "set",
        "Title": "X-Trace Task",
        "Host": "pinky19.mpi-sws.org",
        "HRT": 26962633538316257,
        "Operation": "set",
        "Timestamp": "1557746273478.486328",
        "TenantClass": 0,
        "Source": "Client.java:1104",
        "ThreadID": 1,
        "ThreadName": "",
        "EventID": "903B6001575AC63B",
        "ProcessID": 36430
      },
      {
        "Cycles": 0,
        "Agent": "Execution-CPU",
        "ProcessName": "Name",
        "TaskID": "DEBAB79B8B19C562",
        "ParentEventID": [
          "BE3B4D2B8DEA9CE2"
        ],
        "Label": "set",
        "Title": "X-Trace Task",
        "Host": "pinky19.mpi-sws.org",
        "HRT": 26962633538336099,
        "Operation": "set",
        "Timestamp": "1557746273478.539551",
        "TenantClass": 0,
        "Source": "Server.java:1840",
        "ThreadID": 48,
        "ThreadName": "",
        "EventID": "5677078993080232",
        "BaggageBytes": "[[248 5] [240 0] [0 222 186 183 155 139 25 197 98] [240 1] [0 190 59 77 43 141 234 156 226] [240 3] [0 2]]",
        "ProcessID": 2171
      },
      {
        "Cycles": 0,
        "Agent": "edu.brown.cs.systems.xtrace.logging.BaggageWrappers",
        "ProcessName": "Name",
        "TaskID": "DEBAB79B8B19C562",
        "ParentEventID": [
          "5677078993080232"
        ],
        "Label": "Forking current baggage with Baggage.fork()",
        "Title": "X-Trace Task",
        "Host": "pinky19.mpi-sws.org",
        "HRT": 26962633538358123,
        "Operation": "fork",
        "Timestamp": "1557746273478.561523",
        "TenantClass": 0,
        "Source": "Server.java:550",
        "ThreadID": 48,
        "ThreadName": "",
        "EventID": "C3DC076CEAA67A5E",
        "BaggageBytes": "[[248 5] [240 0] [0 222 186 183 155 139 25 197 98] [240 1] [0 86 119 7 137 147 8 2 50] [240 3] [0 2]]",
        "ProcessID": 2171
      },
      {
        "Cycles": 0,
        "Agent": "Execution-CPU",
        "ProcessName": "Name",
        "TaskID": "DEBAB79B8B19C562",
        "ParentEventID": [
          "C3DC076CEAA67A5E"
        ],
        "Label": "set",
        "Title": "X-Trace Task",
        "Host": "pinky19.mpi-sws.org",
        "HRT": 26962633538383426,
        "Operation": "set",
        "Timestamp": "1557746273478.586670",
        "TenantClass": 0,
        "Source": "Server.java:2071",
        "ThreadID": 57,
        "ThreadName": "",
        "EventID": "9CC2C2163FB0DB0D",
        "BaggageBytes": "[[248 5] [240 0] [0 222 186 183 155 139 25 197 98] [240 1] [0 195 220 7 108 234 166 122 94] [240 3] [0 2]]",
        "ProcessID": 2171
      },
      {
        "Cycles": 0,
        "Agent": "org.apache.hadoop.ipc.Server",
        "ProcessName": "Name",
        "TaskID": "DEBAB79B8B19C562",
        "ParentEventID": [
          "9CC2C2163FB0DB0D"
        ],
        "Label": "getBlockLocations in org.apache.hadoop.hdfs.protocol.ClientProtocol",
        "Title": "X-Trace Task",
        "Host": "pinky19.mpi-sws.org",
        "HRT": 26962633538421537,
        "Timestamp": "1557746273478.625000",
        "TenantClass": 0,
        "Source": "ProtobufRpcEngine.java:601",
        "ThreadID": 57,
        "ThreadName": "",
        "EventID": "DB0F7D2150EED3D9",
        "BaggageBytes": "[[248 5] [240 0] [0 222 186 183 155 139 25 197 98] [240 1] [0 156 194 194 22 63 176 219 13] [240 3] [0 2]]",
        "ProcessID": 2171
      },
      {
        "Cycles": 0,
        "Agent": "org.apache.hadoop.hdfs.server.namenode.FSNamesystem.audit",
        "ProcessName": "Name",
        "TaskID": "DEBAB79B8B19C562",
        "ParentEventID": [
          "DB0F7D2150EED3D9"
        ],
        "Label": "allowed=true\tugi=plascas (auth:SIMPLE)\tip=/139.19.171.63\tcmd=open\tsrc=/ds/V5GyEo5P7lmrV1Bm\tdst=null\tperm=null\tproto=rpc",
        "Title": "X-Trace Task",
        "Host": "pinky19.mpi-sws.org",
        "HRT": 26962633538466840,
        "Timestamp": "1557746273478.670166",
        "TenantClass": 0,
        "Source": "FSNamesystem.java:8313",
        "ThreadID": 57,
        "ThreadName": "",
        "EventID": "A4DFDED61F483B2A",
        "BaggageBytes": "[[248 5] [240 0] [0 222 186 183 155 139 25 197 98] [240 1] [0 219 15 125 33 80 238 211 217] [240 3] [0 2]]",
        "ProcessID": 2171
      },
      {
        "Cycles": 0,
        "Agent": "Execution-CPU",
        "ProcessName": "Name",
        "TaskID": "DEBAB79B8B19C562",
        "ParentEventID": [
          "C3DC076CEAA67A5E"
        ],
        "Label": "unset",
        "Title": "X-Trace Task",
        "Host": "pinky19.mpi-sws.org",
        "Duration": "20037",
        "HRT": 26962633538375505,
        "Operation": "unset",
        "Timestamp": "1557746273478.578857",
        "TenantClass": 0,
        "Source": "Server.java:1828",
        "ThreadID": 48,
        "ThreadName": "",
        "EventID": "17A9AA38953D29F7",
        "BaggageBytes": "[[248 5] [240 0] [0 222 186 183 155 139 25 197 98] [240 1] [0 195 220 7 108 234 166 122 94] [240 3] [0 2]]",
        "ProcessID": 2171
      },
      {
        "Cycles": 0,
        "Agent": "edu.brown.cs.systems.xtrace.logging.BaggageWrappers",
        "ProcessName": "Name",
        "TaskID": "DEBAB79B8B19C562",
        "ParentEventID": [
          "A4DFDED61F483B2A"
        ],
        "Label": "Forking current baggage with Baggage.fork()",
        "Title": "X-Trace Task",
        "Host": "pinky19.mpi-sws.org",
        "HRT": 26962633538511350,
        "Operation": "fork",
        "Timestamp": "1557746273478.714600",
        "TenantClass": 0,
        "Source": "Server.java:2398",
        "ThreadID": 57,
        "ThreadName": "",
        "EventID": "1C098D634E26C074",
        "BaggageBytes": "[[248 5] [240 0] [0 222 186 183 155 139 25 197 98] [240 1] [0 164 223 222 214 31 72 59 42] [240 3] [0 2]]",
        "ProcessID": 2171
      },
      {
        "Cycles": 0,
        "Agent": "Execution-CPU",
        "ProcessName": "Read",
        "TaskID": "DEBAB79B8B19C562",
        "ParentEventID": [
          "1C098D634E26C074"
        ],
        "Label": "set",
        "Title": "X-Trace Task",
        "Host": "pinky19.mpi-sws.org",
        "HRT": 26962633538698077,
        "Operation": "set",
        "Timestamp": "1557746273478.868164",
        "TenantClass": 0,
        "Source": "Client.java:302",
        "ThreadID": 37,
        "ThreadName": "",
        "EventID": "7FDDD06A34379D65",
        "ProcessID": 36430
      },
      {
        "Cycles": 0,
        "Agent": "Execution-CPU",
        "ProcessName": "Name",
        "TaskID": "DEBAB79B8B19C562",
        "ParentEventID": [
          "1C098D634E26C074"
        ],
        "Label": "unset",
        "Title": "X-Trace Task",
        "Host": "pinky19.mpi-sws.org",
        "Duration": "203864",
        "HRT": 26962633538614117,
        "Operation": "unset",
        "Timestamp": "1557746273478.817383",
        "TenantClass": 0,
        "Source": "Server.java:1058",
        "ThreadID": 57,
        "ThreadName": "",
        "EventID": "928276DBF3E22148",
        "BaggageBytes": "[[248 5] [240 0] [0 222 186 183 155 139 25 197 98] [240 1] [0 28 9 141 99 78 38 192 116] [240 3] [0 2]]",
        "ProcessID": 2171
      },
      {
        "Cycles": 0,
        "Agent": "Execution-CPU",
        "ProcessName": "Read",
        "TaskID": "DEBAB79B8B19C562",
        "ParentEventID": [
          "7FDDD06A34379D65"
        ],
        "Label": "unset",
        "Title": "X-Trace Task",
        "Host": "pinky19.mpi-sws.org",
        "Duration": "10453",
        "HRT": 26962633538729907,
        "Operation": "unset",
        "Timestamp": "1557746273478.900146",
        "TenantClass": 0,
        "Source": "Client.java:1168",
        "ThreadID": 37,
        "ThreadName": "",
        "EventID": "13AF7B46A4F945FE",
        "ProcessID": 36430
      },
      {
        "Cycles": 0,
        "Agent": "Execution-Sleep",
        "ProcessName": "Read",
        "TaskID": "DEBAB79B8B19C562",
        "ParentEventID": [
          "903B6001575AC63B"
        ],
        "Label": "waited",
        "Title": "X-Trace Task",
        "Host": "pinky19.mpi-sws.org",
        "Duration": "427321",
        "HRT": 26962633538757072,
        "Operation": "waited",
        "Timestamp": "1557746273478.927246",
        "TenantClass": 0,
        "Source": "Client.java:1537",
        "ThreadID": 1,
        "ThreadName": "",
        "EventID": "216E0A9C48C0322E",
        "ProcessID": 36430
      },
      {
        "Cycles": 0,
        "Agent": "org.apache.hadoop.ipc.ProtobufRpcEngine",
        "ProcessName": "Read",
        "TaskID": "DEBAB79B8B19C562",
        "ParentEventID": [
          "DE62921359572C2A"
        ],
        "Label": "org.apache.hadoop.hdfs.protocol.ClientProtocol.getBlockLocations completed",
        "Title": "X-Trace Task",
        "Host": "pinky19.mpi-sws.org",
        "HRT": 26962633538823242,
        "Timestamp": "1557746273478.993408",
        "TenantClass": 0,
        "Source": "ProtobufRpcEngine.java:275",
        "ThreadID": 1,
        "ThreadName": "",
        "EventID": "68A86E2052D533C7",
        "ProcessID": 36430
      },
      {
        "Cycles": 0,
        "Agent": "edu.brown.cs.systems.xtrace.logging.BaggageWrappers",
        "ProcessName": "Read",
        "TaskID": "DEBAB79B8B19C562",
        "ParentEventID": [
          "68A86E2052D533C7"
        ],
        "Label": "Forking current baggage with Baggage.fork()",
        "Title": "X-Trace Task",
        "Host": "pinky19.mpi-sws.org",
        "HRT": 26962633538893914,
        "Operation": "fork",
        "Timestamp": "1557746273479.063965",
        "TenantClass": 0,
        "Source": "DataTransferProtoUtil.java:94",
        "ThreadID": 1,
        "ThreadName": "",
        "EventID": "A2623D7965A4F036",
        "ProcessID": 36430
      },
      {
        "Cycles": 0,
        "Agent": "edu.brown.cs.systems.xtrace.logging.BaggageWrappers",
        "ProcessName": "Read",
        "TaskID": "DEBAB79B8B19C562",
        "ParentEventID": [
          "216E0A9C48C0322E",
          "13AF7B46A4F945FE"
        ],
        "Label": "Merged current baggage with other baggage",
        "Title": "X-Trace Task",
        "Host": "pinky19.mpi-sws.org",
        "HRT": 26962633538773633,
        "Operation": "join",
        "Timestamp": "1557746273478.943848",
        "TenantClass": 0,
        "Source": "Client.java:1545",
        "ThreadID": 1,
        "ThreadName": "",
        "EventID": "DE62921359572C2A",
        "ProcessID": 36430
      },
      {
        "Cycles": 0,
        "Agent": "Execution-CPU",
        "ProcessName": "Data",
        "TaskID": "DEBAB79B8B19C562",
        "ParentEventID": [
          "A2623D7965A4F036"
        ],
        "Label": "set",
        "Title": "X-Trace Task",
        "Host": "pinky19.mpi-sws.org",
        "HRT": 26962633539008138,
        "Operation": "set",
        "Timestamp": "1557746273479.172607",
        "TenantClass": 0,
        "Source": "Receiver.java:117",
        "ThreadID": 36633,
        "ThreadName": "",
        "EventID": "E1411CFFBB429DF9",
        "BaggageBytes": "[[248 5] [240 0] [0 222 186 183 155 139 25 197 98] [240 1] [0 162 98 61 121 101 164 240 54] [240 3] [0 2]]",
        "ProcessID": 2319
      },
      {
        "Cycles": 0,
        "Agent": "edu.brown.cs.systems.xtrace.logging.BaggageWrappers",
        "ProcessName": "Data",
        "TaskID": "DEBAB79B8B19C562",
        "ParentEventID": [
          "97CC5E903DF09592"
        ],
        "Label": "Forking current baggage with Baggage.fork()",
        "Title": "X-Trace Task",
        "Host": "pinky19.mpi-sws.org",
        "HRT": 26962633539120849,
        "Operation": "fork",
        "Timestamp": "1557746273479.285156",
        "TenantClass": 0,
        "Source": "DataXceiver.java:1257",
        "ThreadID": 36633,
        "ThreadName": "",
        "EventID": "06498F76DE4B6F85",
        "BaggageBytes": "[[248 5] [240 0] [0 222 186 183 155 139 25 197 98] [240 1] [0 151 204 94 144 61 240 149 146] [240 3] [0 2]]",
        "ProcessID": 2319
      },
      {
        "Cycles": 0,
        "Agent": "edu.brown.cs.systems.xtrace.logging.XTraceInit",
        "ProcessName": "Data",
        "TaskID": "DEBAB79B8B19C562",
        "ParentEventID": [
          "E1411CFFBB429DF9"
        ],
        "Label": "Thread.setName: DataXceiver for client DFSClient_NONMAPREDUCE_778905418_1 at /139.19.171.63:43130 [Sending block BP-1633380353-139.19.171.63-1554193446451:blk_1073763547_22723]",
        "Title": "X-Trace Task",
        "Host": "pinky19.mpi-sws.org",
        "HRT": 26962633539042172,
        "Timestamp": "1557746273479.206543",
        "TenantClass": 0,
        "Source": "DataXceiver.java:168",
        "ThreadID": 36633,
        "ThreadName": "",
        "EventID": "97CC5E903DF09592",
        "BaggageBytes": "[[248 5] [240 0] [0 222 186 183 155 139 25 197 98] [240 1] [0 225 65 28 255 187 66 157 249] [240 3] [0 2]]",
        "ProcessID": 2319
      },
      {
        "Cycles": 0,
        "Agent": "Execution-Sleep",
        "ProcessName": "Read",
        "TaskID": "DEBAB79B8B19C562",
        "ParentEventID": [
          "A2623D7965A4F036"
        ],
        "Label": "waited",
        "Title": "X-Trace Task",
        "Host": "pinky19.mpi-sws.org",
        "Duration": "201136",
        "HRT": 26962633539180872,
        "Operation": "waited",
        "Timestamp": "1557746273479.351074",
        "TenantClass": 0,
        "Source": "SocketIOWithTimeout.java:335",
        "ThreadID": 1,
        "ThreadName": "",
        "EventID": "987EF972EA5FD3DF",
        "ProcessID": 36430
      },
      {
        "Cycles": 0,
        "Agent": "edu.brown.cs.systems.xtrace.logging.BaggageWrappers",
        "ProcessName": "Data",
        "TaskID": "DEBAB79B8B19C562",
        "ParentEventID": [
          "06498F76DE4B6F85"
        ],
        "Label": "Forking current baggage with Baggage.fork()",
        "Title": "X-Trace Task",
        "Host": "pinky19.mpi-sws.org",
        "HRT": 26962633539185859,
        "Operation": "fork",
        "Timestamp": "1557746273479.350342",
        "TenantClass": 0,
        "Source": "PacketHeader.java:95",
        "ThreadID": 36633,
        "ThreadName": "",
        "EventID": "E39837A898F8902D",
        "BaggageBytes": "[[248 5] [240 0] [0 222 186 183 155 139 25 197 98] [240 1] [0 6 73 143 118 222 75 111 133] [240 3] [0 2]]",
        "ProcessID": 2319
      },
      {
        "Cycles": 0,
        "Agent": "edu.brown.cs.systems.xtrace.logging.BaggageWrappers",
        "ProcessName": "Read",
        "TaskID": "DEBAB79B8B19C562",
        "ParentEventID": [
          "987EF972EA5FD3DF",
          "06498F76DE4B6F85"
        ],
        "Label": "Merged current baggage with other baggage",
        "Title": "X-Trace Task",
        "Host": "pinky19.mpi-sws.org",
        "HRT": 26962633539248895,
        "Operation": "join",
        "Timestamp": "1557746273479.418945",
        "TenantClass": 0,
        "Source": "RemoteBlockReader2.java:429",
        "ThreadID": 1,
        "ThreadName": "",
        "EventID": "BFB058FA37D24679",
        "ProcessID": 36430
      },
      {
        "Cycles": 0,
        "Agent": "edu.brown.cs.systems.xtrace.logging.BaggageWrappers",
        "ProcessName": "Data",
        "TaskID": "DEBAB79B8B19C562",
        "ParentEventID": [
          "4E7019FAFA4E6A70"
        ],
        "Label": "Forking current baggage with Baggage.fork()",
        "Title": "X-Trace Task",
        "Host": "pinky19.mpi-sws.org",
        "HRT": 26962633539319959,
        "Operation": "fork",
        "Timestamp": "1557746273479.484375",
        "TenantClass": 0,
        "Source": "PacketHeader.java:95",
        "ThreadID": 36633,
        "ThreadName": "",
        "EventID": "613B4E5D641B3CFF",
        "BaggageBytes": "[[248 5] [240 0] [0 222 186 183 155 139 25 197 98] [240 1] [0 78 112 25 250 250 78 106 112] [240 3] [0 2]]",
        "ProcessID": 2319
      },
      {
        "Cycles": 0,
        "Agent": "Execution-Sleep",
        "ProcessName": "Data",
        "TaskID": "DEBAB79B8B19C562",
        "ParentEventID": [
          "E39837A898F8902D"
        ],
        "Label": "waited",
        "Title": "X-Trace Task",
        "Host": "pinky19.mpi-sws.org",
        "Duration": "4120",
        "HRT": 26962633539253401,
        "Operation": "waited",
        "Timestamp": "1557746273479.417725",
        "TenantClass": 0,
        "Source": "SocketIOWithTimeout.java:335",
        "ThreadID": 36633,
        "ThreadName": "",
        "EventID": "4E7019FAFA4E6A70",
        "BaggageBytes": "[[248 5] [240 0] [0 222 186 183 155 139 25 197 98] [240 1] [0 227 152 55 168 152 248 144 45] [240 3] [0 2]]",
        "ProcessID": 2319
      },
      {
        "Cycles": 0,
        "Agent": "edu.brown.cs.systems.xtrace.logging.BaggageWrappers",
        "ProcessName": "Read",
        "TaskID": "DEBAB79B8B19C562",
        "ParentEventID": [
          "BFB058FA37D24679",
          "E39837A898F8902D"
        ],
        "Label": "Merged current baggage with other baggage",
        "Title": "X-Trace Task",
        "Host": "pinky19.mpi-sws.org",
        "HRT": 26962633539341591,
        "Operation": "join",
        "Timestamp": "1557746273479.511719",
        "TenantClass": 0,
        "Source": "PacketHeader.java:168",
        "ThreadID": 1,
        "ThreadName": "",
        "EventID": "FA6343386271E9CD",
        "ProcessID": 36430
      },
      {
        "Cycles": 0,
        "Agent": "edu.brown.cs.systems.xtrace.logging.BaggageWrappers",
        "ProcessName": "Read",
        "TaskID": "DEBAB79B8B19C562",
        "ParentEventID": [
          "613B4E5D641B3CFF",
          "FA6343386271E9CD"
        ],
        "Label": "Merged current baggage with other baggage",
        "Title": "X-Trace Task",
        "Host": "pinky19.mpi-sws.org",
        "HRT": 26962633539404736,
        "Operation": "join",
        "Timestamp": "1557746273479.574951",
        "TenantClass": 0,
        "Source": "PacketHeader.java:168",
        "ThreadID": 1,
        "ThreadName": "",
        "EventID": "AA0D723A040B67CC",
        "ProcessID": 36430
      },
      {
        "Cycles": 0,
        "Agent": "Execution-Sleep",
        "ProcessName": "Data",
        "TaskID": "DEBAB79B8B19C562",
        "ParentEventID": [
          "613B4E5D641B3CFF"
        ],
        "Label": "waited",
        "Title": "X-Trace Task",
        "Host": "pinky19.mpi-sws.org",
        "Duration": "42250",
        "HRT": 26962633539457090,
        "Operation": "waited",
        "Timestamp": "1557746273479.621582",
        "TenantClass": 0,
        "Source": "SocketIOWithTimeout.java:335",
        "ThreadID": 36633,
        "ThreadName": "",
        "EventID": "A44D8CA44F995C89",
        "BaggageBytes": "[[248 5] [240 0] [0 222 186 183 155 139 25 197 98] [240 1] [0 97 59 78 93 100 27 60 255] [240 3] [0 2]]",
        "ProcessID": 2319
      },
      {
        "Cycles": 0,
        "Agent": "edu.brown.cs.systems.xtrace.logging.BaggageWrappers",
        "ProcessName": "Data",
        "TaskID": "DEBAB79B8B19C562",
        "ParentEventID": [
          "FA2B5303FFF4BCD5",
          "A44D8CA44F995C89"
        ],
        "Label": "Merged current baggage with other baggage",
        "Title": "X-Trace Task",
        "Host": "pinky19.mpi-sws.org",
        "HRT": 26962633539511475,
        "Operation": "join",
        "Timestamp": "1557746273479.675781",
        "TenantClass": 0,
        "Source": "DataXceiver.java:574",
        "ThreadID": 36633,
        "ThreadName": "",
        "EventID": "3C99662C42738D22",
        "BaggageBytes": "[[248 5] [240 0] [0 222 186 183 155 139 25 197 98] [240 1] [0 164 77 140 164 79 153 92 137] [0 250 43 83 3 255 244 188 213] [240 3] [0 2]]",
        "ProcessID": 2319
      },
      {
        "Cycles": 0,
        "Agent": "edu.brown.cs.systems.xtrace.logging.BaggageWrappers",
        "ProcessName": "Read",
        "TaskID": "DEBAB79B8B19C562",
        "ParentEventID": [
          "AA0D723A040B67CC"
        ],
        "Label": "Forking current baggage with Baggage.fork()",
        "Title": "X-Trace Task",
        "Host": "pinky19.mpi-sws.org",
        "HRT": 26962633539414871,
        "Operation": "fork",
        "Timestamp": "1557746273479.584961",
        "TenantClass": 0,
        "Source": "RemoteBlockReader2.java:361",
        "ThreadID": 1,
        "ThreadName": "",
        "EventID": "FA2B5303FFF4BCD5",
        "ProcessID": 36430
      },
      {
        "Cycles": 0,
        "Agent": "Execution-CPU",
        "ProcessName": "Data",
        "TaskID": "DEBAB79B8B19C562",
        "ParentEventID": [
          "3C99662C42738D22"
        ],
        "Label": "unset",
        "Title": "X-Trace Task",
        "Host": "pinky19.mpi-sws.org",
        "Duration": "504892",
        "HRT": 26962633539536931,
        "Operation": "unset",
        "Timestamp": "1557746273479.701416",
        "TenantClass": 0,
        "Source": "DataXceiver.java:261",
        "ThreadID": 36633,
        "ThreadName": "",
        "EventID": "C0C1971BCDD7AA63",
        "BaggageBytes": "[[248 5] [240 0] [0 222 186 183 155 139 25 197 98] [240 1] [0 60 153 102 44 66 115 141 34] [240 3] [0 2]]",
        "ProcessID": 2319
      },
      {
        "Cycles": 0,
        "Agent": "edu.brown.cs.systems.retro.benchmarks.hdfs_client.Reader",
        "ProcessName": "Read",
        "TaskID": "DEBAB79B8B19C562",
        "ParentEventID": [
          "0"
        ],
        "Label": "Reading file",
        "Title": "X-Trace Task",
        "Host": "pinky19.mpi-sws.org",
        "HRT": 26962633538073185,
        "Timestamp": "1557746273478.243408",
        "TenantClass": 0,
        "ThreadID": 1,
        "ThreadName": "",
        "EventID": "7176AA02D48F04E0",
        "ProcessID": 36430,
        "Tag": [
          "reader_10kb",
          "Read Size: 10240"
        ]
      }
    ]
  }
]