[
  {
    "id": "14D29DB2F9F1920F",
    "reports": [
      {
        "Cycles": 0,
        "Agent": "Execution-CPU",
        "ProcessName": "Read",
        "TaskID": "14D29DB2F9F1920F",
        "ParentEventID": [
          "CCE7DE890C18C614"
        ],
        "Label": "unset",
        "Title": "X-Trace Task",
        "Host": "pinky19.mpi-sws.org",
        "Duration": "34308904",
        "HRT": 25489053180454729,
        "Operation": "unset",
        "Timestamp": "1556272693121.076904",
        "TenantClass": 0,
        "Source": "Client.java:1027",
        "ThreadID": 1,
        "ThreadName": "",
        "EventID": "DA9062E047FD05BB",
        "ProcessID": 6356
      },
      {
        "Cycles": 0,
        "Agent": "org.apache.hadoop.ipc.ProtobufRpcEngine",
        "ProcessName": "Read",
        "TaskID": "14D29DB2F9F1920F",
        "ParentEventID": [
          "B81248C4D4671FAC"
        ],
        "Label": "Invoking org.apache.hadoop.hdfs.protocol.ClientProtocol.getBlockLocations",
        "Title": "X-Trace Task",
        "Host": "pinky19.mpi-sws.org",
        "HRT": 25489053180438767,
        "Timestamp": "1556272693121.060791",
        "TenantClass": 0,
        "Source": "ProtobufRpcEngine.java:228",
        "ThreadID": 1,
        "ThreadName": "",
        "EventID": "CCE7DE890C18C614",
        "ProcessID": 6356
      },
      {
        "Cycles": 0,
        "Agent": "Execution-CPU",
        "ProcessName": "Read",
        "TaskID": "14D29DB2F9F1920F",
        "ParentEventID": [
          "DA9062E047FD05BB"
        ],
        "Label": "set",
        "Title": "X-Trace Task",
        "Host": "pinky19.mpi-sws.org",
        "HRT": 25489053180476444,
        "Operation": "set",
        "Timestamp": "1556272693121.098633",
        "TenantClass": 0,
        "Source": "Client.java:1032",
        "ThreadID": 41,
        "ThreadName": "",
        "EventID": "0DCE35C5F2C315FD",
        "ProcessID": 6356
      },
      {
        "Cycles": 0,
        "Agent": "Execution-CPU",
        "ProcessName": "Read",
        "TaskID": "14D29DB2F9F1920F",
        "ParentEventID": [
          "8D18809EC2316642"
        ],
        "Label": "unset",
        "Title": "X-Trace Task",
        "Host": "pinky19.mpi-sws.org",
        "Duration": "54185",
        "HRT": 25489053180540339,
        "Operation": "unset",
        "Timestamp": "1556272693121.162598",
        "TenantClass": 0,
        "Source": "Client.java:1062",
        "ThreadID": 41,
        "ThreadName": "",
        "EventID": "9C7490D0DE50840A",
        "ProcessID": 6356
      },
      {
        "Cycles": 0,
        "Agent": "edu.brown.cs.systems.xtrace.logging.BaggageWrappers",
        "ProcessName": "Read",
        "TaskID": "14D29DB2F9F1920F",
        "ParentEventID": [
          "0DCE35C5F2C315FD"
        ],
        "Label": "Forking current baggage with Baggage.fork()",
        "Title": "X-Trace Task",
        "Host": "pinky19.mpi-sws.org",
        "HRT": 25489053180487782,
        "Operation": "fork",
        "Timestamp": "1556272693121.109863",
        "TenantClass": 0,
        "Source": "Client.java:1043",
        "ThreadID": 41,
        "ThreadName": "",
        "EventID": "8D18809EC2316642",
        "ProcessID": 6356
      },
      {
        "Cycles": 0,
        "Agent": "Execution-CPU",
        "ProcessName": "Read",
        "TaskID": "14D29DB2F9F1920F",
        "ParentEventID": [
          "9C7490D0DE50840A"
        ],
        "Label": "set",
        "Title": "X-Trace Task",
        "Host": "pinky19.mpi-sws.org",
        "HRT": 25489053180558176,
        "Operation": "set",
        "Timestamp": "1556272693121.180420",
        "TenantClass": 0,
        "Source": "Client.java:1104",
        "ThreadID": 1,
        "ThreadName": "",
        "EventID": "360215DB12AB916D",
        "ProcessID": 6356
      },
      {
        "Cycles": 0,
        "Agent": "Execution-CPU",
        "ProcessName": "Name",
        "TaskID": "14D29DB2F9F1920F",
        "ParentEventID": [
          "8D18809EC2316642"
        ],
        "Label": "set",
        "Title": "X-Trace Task",
        "Host": "pinky19.mpi-sws.org",
        "HRT": 25489053180604461,
        "Operation": "set",
        "Timestamp": "1556272693121.256592",
        "TenantClass": 0,
        "Source": "Server.java:1840",
        "ThreadID": 48,
        "ThreadName": "",
        "EventID": "E5BAC4FBFAA12DB6",
        "BaggageBytes": "[[248 5] [240 0] [0 20 210 157 178 249 241 146 15] [240 1] [0 141 24 128 158 194 49 102 66] [240 3] [0 2]]",
        "ProcessID": 2171
      },
      {
        "Cycles": 0,
        "Agent": "edu.brown.cs.systems.retro.benchmarks.hdfs_client.Reader",
        "ProcessName": "Read",
        "TaskID": "14D29DB2F9F1920F",
        "ParentEventID": [
          "1521FEF50F8DE6F2"
        ],
        "Label": "Reading file",
        "Title": "X-Trace Task",
        "Host": "pinky19.mpi-sws.org",
        "HRT": 25489053180416228,
        "Timestamp": "1556272693121.038330",
        "TenantClass": 0,
        "ThreadID": 1,
        "ThreadName": "",
        "EventID": "B81248C4D4671FAC",
        "ProcessID": 6356
      },
      {
        "Cycles": 0,
        "Agent": "edu.brown.cs.systems.xtrace.logging.BaggageWrappers",
        "ProcessName": "Name",
        "TaskID": "14D29DB2F9F1920F",
        "ParentEventID": [
          "E5BAC4FBFAA12DB6"
        ],
        "Label": "Forking current baggage with Baggage.fork()",
        "Title": "X-Trace Task",
        "Host": "pinky19.mpi-sws.org",
        "HRT": 25489053180633251,
        "Operation": "fork",
        "Timestamp": "1556272693121.285400",
        "TenantClass": 0,
        "Source": "Server.java:550",
        "ThreadID": 48,
        "ThreadName": "",
        "EventID": "B10C7A41531B6F27",
        "BaggageBytes": "[[248 5] [240 0] [0 20 210 157 178 249 241 146 15] [240 1] [0 229 186 196 251 250 161 45 182] [240 3] [0 2]]",
        "ProcessID": 2171
      },
      {
        "Cycles": 0,
        "Agent": "Execution-CPU",
        "ProcessName": "Name",
        "TaskID": "14D29DB2F9F1920F",
        "ParentEventID": [
          "B10C7A41531B6F27"
        ],
        "Label": "unset",
        "Title": "X-Trace Task",
        "Host": "pinky19.mpi-sws.org",
        "Duration": "24899",
        "HRT": 25489053180654855,
        "Operation": "unset",
        "Timestamp": "1556272693121.306885",
        "TenantClass": 0,
        "Source": "Server.java:1828",
        "ThreadID": 48,
        "ThreadName": "",
        "EventID": "FF7AD3D3F41B6AFF",
        "BaggageBytes": "[[248 5] [240 0] [0 20 210 157 178 249 241 146 15] [240 1] [0 177 12 122 65 83 27 111 39] [240 3] [0 2]]",
        "ProcessID": 2171
      },
      {
        "Cycles": 0,
        "Agent": "Execution-CPU",
        "ProcessName": "Name",
        "TaskID": "14D29DB2F9F1920F",
        "ParentEventID": [
          "B10C7A41531B6F27"
        ],
        "Label": "set",
        "Title": "X-Trace Task",
        "Host": "pinky19.mpi-sws.org",
        "HRT": 25489053180668014,
        "Operation": "set",
        "Timestamp": "1556272693121.320068",
        "TenantClass": 0,
        "Source": "Server.java:2071",
        "ThreadID": 57,
        "ThreadName": "",
        "EventID": "1117DF2B73F2BAC0",
        "BaggageBytes": "[[248 5] [240 0] [0 20 210 157 178 249 241 146 15] [240 1] [0 177 12 122 65 83 27 111 39] [240 3] [0 2]]",
        "ProcessID": 2171
      },
      {
        "Cycles": 0,
        "Agent": "org.apache.hadoop.ipc.Server",
        "ProcessName": "Name",
        "TaskID": "14D29DB2F9F1920F",
        "ParentEventID": [
          "1117DF2B73F2BAC0"
        ],
        "Label": "getBlockLocations in org.apache.hadoop.hdfs.protocol.ClientProtocol",
        "Title": "X-Trace Task",
        "Host": "pinky19.mpi-sws.org",
        "HRT": 25489053180719475,
        "Timestamp": "1556272693121.371582",
        "TenantClass": 0,
        "Source": "ProtobufRpcEngine.java:601",
        "ThreadID": 57,
        "ThreadName": "",
        "EventID": "7E4A31D6BE000A9B",
        "BaggageBytes": "[[248 5] [240 0] [0 20 210 157 178 249 241 146 15] [240 1] [0 17 23 223 43 115 242 186 192] [240 3] [0 2]]",
        "ProcessID": 2171
      },
      {
        "Cycles": 0,
        "Agent": "edu.brown.cs.systems.xtrace.logging.BaggageWrappers",
        "ProcessName": "Name",
        "TaskID": "14D29DB2F9F1920F",
        "ParentEventID": [
          "ACC2BEBE45B90F25"
        ],
        "Label": "Forking current baggage with Baggage.fork()",
        "Title": "X-Trace Task",
        "Host": "pinky19.mpi-sws.org",
        "HRT": 25489053180832652,
        "Operation": "fork",
        "Timestamp": "1556272693121.484619",
        "TenantClass": 0,
        "Source": "Server.java:2398",
        "ThreadID": 57,
        "ThreadName": "",
        "EventID": "912195678C256A4E",
        "BaggageBytes": "[[248 5] [240 0] [0 20 210 157 178 249 241 146 15] [240 1] [0 172 194 190 190 69 185 15 37] [240 3] [0 2]]",
        "ProcessID": 2171
      },
      {
        "Cycles": 0,
        "Agent": "org.apache.hadoop.hdfs.server.namenode.FSNamesystem.audit",
        "ProcessName": "Name",
        "TaskID": "14D29DB2F9F1920F",
        "ParentEventID": [
          "7E4A31D6BE000A9B"
        ],
        "Label": "allowed=true\tugi=plascas (auth:SIMPLE)\tip=/139.19.171.63\tcmd=open\tsrc=/ds/UrNorK9ADsrslGXY\tdst=null\tperm=null\tproto=rpc",
        "Title": "X-Trace Task",
        "Host": "pinky19.mpi-sws.org",
        "HRT": 25489053180781362,
        "Timestamp": "1556272693121.433350",
        "TenantClass": 0,
        "Source": "FSNamesystem.java:8313",
        "ThreadID": 57,
        "ThreadName": "",
        "EventID": "ACC2BEBE45B90F25",
        "BaggageBytes": "[[248 5] [240 0] [0 20 210 157 178 249 241 146 15] [240 1] [0 126 74 49 214 190 0 10 155] [240 3] [0 2]]",
        "ProcessID": 2171
      },
      {
        "Cycles": 0,
        "Agent": "Execution-CPU",
        "ProcessName": "Name",
        "TaskID": "14D29DB2F9F1920F",
        "ParentEventID": [
          "912195678C256A4E"
        ],
        "Label": "unset",
        "Title": "X-Trace Task",
        "Host": "pinky19.mpi-sws.org",
        "Duration": "252405",
        "HRT": 25489053180953734,
        "Operation": "unset",
        "Timestamp": "1556272693121.605713",
        "TenantClass": 0,
        "Source": "Server.java:1058",
        "ThreadID": 57,
        "ThreadName": "",
        "EventID": "73DD4C4179E41258",
        "BaggageBytes": "[[248 5] [240 0] [0 20 210 157 178 249 241 146 15] [240 1] [0 145 33 149 103 140 37 106 78] [240 3] [0 2]]",
        "ProcessID": 2171
      },
      {
        "Cycles": 0,
        "Agent": "Execution-CPU",
        "ProcessName": "Read",
        "TaskID": "14D29DB2F9F1920F",
        "ParentEventID": [
          "912195678C256A4E"
        ],
        "Label": "set",
        "Title": "X-Trace Task",
        "Host": "pinky19.mpi-sws.org",
        "HRT": 25489053181008937,
        "Operation": "set",
        "Timestamp": "1556272693121.631104",
        "TenantClass": 0,
        "Source": "Client.java:302",
        "ThreadID": 40,
        "ThreadName": "",
        "EventID": "DE296606AFEE3435",
        "ProcessID": 6356
      },
      {
        "Cycles": 0,
        "Agent": "Execution-Sleep",
        "ProcessName": "Read",
        "TaskID": "14D29DB2F9F1920F",
        "ParentEventID": [
          "360215DB12AB916D"
        ],
        "Label": "waited",
        "Title": "X-Trace Task",
        "Host": "pinky19.mpi-sws.org",
        "Duration": "484093",
        "HRT": 25489053181049229,
        "Operation": "waited",
        "Timestamp": "1556272693121.671387",
        "TenantClass": 0,
        "Source": "Client.java:1537",
        "ThreadID": 1,
        "ThreadName": "",
        "EventID": "05D5DB1CF7E40963",
        "ProcessID": 6356
      },
      {
        "Cycles": 0,
        "Agent": "Execution-CPU",
        "ProcessName": "Read",
        "TaskID": "14D29DB2F9F1920F",
        "ParentEventID": [
          "DE296606AFEE3435"
        ],
        "Label": "unset",
        "Title": "X-Trace Task",
        "Host": "pinky19.mpi-sws.org",
        "Duration": "5244",
        "HRT": 25489053181031771,
        "Operation": "unset",
        "Timestamp": "1556272693121.653809",
        "TenantClass": 0,
        "Source": "Client.java:1168",
        "ThreadID": 40,
        "ThreadName": "",
        "EventID": "F1E0C52BC36E78C5",
        "ProcessID": 6356
      },
      {
        "Cycles": 0,
        "Agent": "edu.brown.cs.systems.xtrace.logging.BaggageWrappers",
        "ProcessName": "Read",
        "TaskID": "14D29DB2F9F1920F",
        "ParentEventID": [
          "F1E0C52BC36E78C5",
          "05D5DB1CF7E40963"
        ],
        "Label": "Merged current baggage with other baggage",
        "Title": "X-Trace Task",
        "Host": "pinky19.mpi-sws.org",
        "HRT": 25489053181063120,
        "Operation": "join",
        "Timestamp": "1556272693121.685303",
        "TenantClass": 0,
        "Source": "Client.java:1545",
        "ThreadID": 1,
        "ThreadName": "",
        "EventID": "736BA3AEA5E2A1A1",
        "ProcessID": 6356
      },
      {
        "Cycles": 0,
        "Agent": "org.apache.hadoop.ipc.ProtobufRpcEngine",
        "ProcessName": "Read",
        "TaskID": "14D29DB2F9F1920F",
        "ParentEventID": [
          "736BA3AEA5E2A1A1"
        ],
        "Label": "org.apache.hadoop.hdfs.protocol.ClientProtocol.getBlockLocations completed",
        "Title": "X-Trace Task",
        "Host": "pinky19.mpi-sws.org",
        "HRT": 25489053181093371,
        "Timestamp": "1556272693121.715576",
        "TenantClass": 0,
        "Source": "ProtobufRpcEngine.java:275",
        "ThreadID": 1,
        "ThreadName": "",
        "EventID": "2BFE3886ADA19EFA",
        "ProcessID": 6356
      },
      {
        "Cycles": 0,
        "Agent": "Execution-Sleep",
        "ProcessName": "Read",
        "TaskID": "14D29DB2F9F1920F",
        "ParentEventID": [
          "2BFE3886ADA19EFA"
        ],
        "Label": "waited",
        "Title": "X-Trace Task",
        "Host": "pinky19.mpi-sws.org",
        "Duration": "4337",
        "HRT": 25489053181199816,
        "Operation": "waited",
        "Timestamp": "1556272693121.822021",
        "TenantClass": 0,
        "Source": "SocketIOWithTimeout.java:335",
        "ThreadID": 1,
        "ThreadName": "",
        "EventID": "75AE750979684ADC",
        "ProcessID": 6356
      },
      {
        "Cycles": 0,
        "Agent": "Execution-CPU",
        "ProcessName": "Data",
        "TaskID": "14D29DB2F9F1920F",
        "ParentEventID": [
          "62CBAF1CEAA8C7B6"
        ],
        "Label": "set",
        "Title": "X-Trace Task",
        "Host": "pinky19.mpi-sws.org",
        "HRT": 25489053181358508,
        "Operation": "set",
        "Timestamp": "1556272693121.993164",
        "TenantClass": 0,
        "Source": "Receiver.java:117",
        "ThreadID": 8561,
        "ThreadName": "",
        "EventID": "0D3A1E9523912785",
        "BaggageBytes": "[[248 5] [240 0] [0 20 210 157 178 249 241 146 15] [240 1] [0 98 203 175 28 234 168 199 182] [240 3] [0 2]]",
        "ProcessID": 2319
      },
      {
        "Cycles": 0,
        "Agent": "edu.brown.cs.systems.xtrace.logging.BaggageWrappers",
        "ProcessName": "Read",
        "TaskID": "14D29DB2F9F1920F",
        "ParentEventID": [
          "75AE750979684ADC"
        ],
        "Label": "Forking current baggage with Baggage.fork()",
        "Title": "X-Trace Task",
        "Host": "pinky19.mpi-sws.org",
        "HRT": 25489053181233120,
        "Operation": "fork",
        "Timestamp": "1556272693121.855225",
        "TenantClass": 0,
        "Source": "DataTransferProtoUtil.java:94",
        "ThreadID": 1,
        "ThreadName": "",
        "EventID": "62CBAF1CEAA8C7B6",
        "ProcessID": 6356
      },
      {
        "Cycles": 0,
        "Agent": "edu.brown.cs.systems.xtrace.logging.XTraceInit",
        "ProcessName": "Data",
        "TaskID": "14D29DB2F9F1920F",
        "ParentEventID": [
          "0D3A1E9523912785"
        ],
        "Label": "Thread.setName: DataXceiver for client DFSClient_NONMAPREDUCE_614514224_1 at /139.19.171.63:54140 [Sending block BP-1633380353-139.19.171.63-1554193446451:blk_1073758755_17931]",
        "Title": "X-Trace Task",
        "Host": "pinky19.mpi-sws.org",
        "HRT": 25489053181398351,
        "Timestamp": "1556272693122.032959",
        "TenantClass": 0,
        "Source": "DataXceiver.java:168",
        "ThreadID": 8561,
        "ThreadName": "",
        "EventID": "390C5A3571663C3E",
        "BaggageBytes": "[[248 5] [240 0] [0 20 210 157 178 249 241 146 15] [240 1] [0 13 58 30 149 35 145 39 133] [240 3] [0 2]]",
        "ProcessID": 2319
      },
      {
        "Cycles": 0,
        "Agent": "edu.brown.cs.systems.xtrace.logging.BaggageWrappers",
        "ProcessName": "Data",
        "TaskID": "14D29DB2F9F1920F",
        "ParentEventID": [
          "6E6DEF92CC9E2697"
        ],
        "Label": "Forking current baggage with Baggage.fork()",
        "Title": "X-Trace Task",
        "Host": "pinky19.mpi-sws.org",
        "HRT": 25489053181562154,
        "Operation": "fork",
        "Timestamp": "1556272693122.196777",
        "TenantClass": 0,
        "Source": "PacketHeader.java:95",
        "ThreadID": 8561,
        "ThreadName": "",
        "EventID": "ABD86C6ACAC192A7",
        "BaggageBytes": "[[248 5] [240 0] [0 20 210 157 178 249 241 146 15] [240 1] [0 110 109 239 146 204 158 38 151] [240 3] [0 2]]",
        "ProcessID": 2319
      },
      {
        "Cycles": 0,
        "Agent": "Execution-Sleep",
        "ProcessName": "Read",
        "TaskID": "14D29DB2F9F1920F",
        "ParentEventID": [
          "62CBAF1CEAA8C7B6"
        ],
        "Label": "waited",
        "Title": "X-Trace Task",
        "Host": "pinky19.mpi-sws.org",
        "Duration": "265170",
        "HRT": 25489053181581337,
        "Operation": "waited",
        "Timestamp": "1556272693122.203369",
        "TenantClass": 0,
        "Source": "SocketIOWithTimeout.java:335",
        "ThreadID": 1,
        "ThreadName": "",
        "EventID": "C34423AC5DF9B9C8",
        "ProcessID": 6356
      },
      {
        "Cycles": 0,
        "Agent": "edu.brown.cs.systems.xtrace.logging.BaggageWrappers",
        "ProcessName": "Data",
        "TaskID": "14D29DB2F9F1920F",
        "ParentEventID": [
          "390C5A3571663C3E"
        ],
        "Label": "Forking current baggage with Baggage.fork()",
        "Title": "X-Trace Task",
        "Host": "pinky19.mpi-sws.org",
        "HRT": 25489053181483943,
        "Operation": "fork",
        "Timestamp": "1556272693122.118652",
        "TenantClass": 0,
        "Source": "DataXceiver.java:1257",
        "ThreadID": 8561,
        "ThreadName": "",
        "EventID": "6E6DEF92CC9E2697",
        "BaggageBytes": "[[248 5] [240 0] [0 20 210 157 178 249 241 146 15] [240 1] [0 57 12 90 53 113 102 60 62] [240 3] [0 2]]",
        "ProcessID": 2319
      },
      {
        "Cycles": 0,
        "Agent": "Execution-Sleep",
        "ProcessName": "Data",
        "TaskID": "14D29DB2F9F1920F",
        "ParentEventID": [
          "ABD86C6ACAC192A7"
        ],
        "Label": "waited",
        "Title": "X-Trace Task",
        "Host": "pinky19.mpi-sws.org",
        "Duration": "5205",
        "HRT": 25489053181636133,
        "Operation": "waited",
        "Timestamp": "1556272693122.270752",
        "TenantClass": 0,
        "Source": "SocketIOWithTimeout.java:335",
        "ThreadID": 8561,
        "ThreadName": "",
        "EventID": "C167BB726452C280",
        "BaggageBytes": "[[248 5] [240 0] [0 20 210 157 178 249 241 146 15] [240 1] [0 171 216 108 106 202 193 146 167] [240 3] [0 2]]",
        "ProcessID": 2319
      },
      {
        "Cycles": 0,
        "Agent": "edu.brown.cs.systems.xtrace.logging.BaggageWrappers",
        "ProcessName": "Read",
        "TaskID": "14D29DB2F9F1920F",
        "ParentEventID": [
          "C34423AC5DF9B9C8",
          "6E6DEF92CC9E2697"
        ],
        "Label": "Merged current baggage with other baggage",
        "Title": "X-Trace Task",
        "Host": "pinky19.mpi-sws.org",
        "HRT": 25489053181677912,
        "Operation": "join",
        "Timestamp": "1556272693122.300049",
        "TenantClass": 0,
        "Source": "RemoteBlockReader2.java:429",
        "ThreadID": 1,
        "ThreadName": "",
        "EventID": "DF3A53FBB1A0A5BD",
        "ProcessID": 6356
      },
      {
        "Cycles": 0,
        "Agent": "edu.brown.cs.systems.xtrace.logging.BaggageWrappers",
        "ProcessName": "Data",
        "TaskID": "14D29DB2F9F1920F",
        "ParentEventID": [
          "C167BB726452C280"
        ],
        "Label": "Forking current baggage with Baggage.fork()",
        "Title": "X-Trace Task",
        "Host": "pinky19.mpi-sws.org",
        "HRT": 25489053181720211,
        "Operation": "fork",
        "Timestamp": "1556272693122.354980",
        "TenantClass": 0,
        "Source": "PacketHeader.java:95",
        "ThreadID": 8561,
        "ThreadName": "",
        "EventID": "C7570D8460C5A151",
        "BaggageBytes": "[[248 5] [240 0] [0 20 210 157 178 249 241 146 15] [240 1] [0 193 103 187 114 100 82 194 128] [240 3] [0 2]]",
        "ProcessID": 2319
      },
      {
        "Cycles": 0,
        "Agent": "edu.brown.cs.systems.xtrace.logging.BaggageWrappers",
        "ProcessName": "Read",
        "TaskID": "14D29DB2F9F1920F",
        "ParentEventID": [
          "C7570D8460C5A151",
          "AB89F9595170E261"
        ],
        "Label": "Merged current baggage with other baggage",
        "Title": "X-Trace Task",
        "Host": "pinky19.mpi-sws.org",
        "HRT": 25489053181885371,
        "Operation": "join",
        "Timestamp": "1556272693122.507568",
        "TenantClass": 0,
        "Source": "PacketHeader.java:168",
        "ThreadID": 1,
        "ThreadName": "",
        "EventID": "0CD076A9ABF9AFF0",
        "ProcessID": 6356
      },
      {
        "Cycles": 0,
        "Agent": "edu.brown.cs.systems.xtrace.logging.BaggageWrappers",
        "ProcessName": "Read",
        "TaskID": "14D29DB2F9F1920F",
        "ParentEventID": [
          "DF3A53FBB1A0A5BD",
          "ABD86C6ACAC192A7"
        ],
        "Label": "Merged current baggage with other baggage",
        "Title": "X-Trace Task",
        "Host": "pinky19.mpi-sws.org",
        "HRT": 25489053181771266,
        "Operation": "join",
        "Timestamp": "1556272693122.393311",
        "TenantClass": 0,
        "Source": "PacketHeader.java:168",
        "ThreadID": 1,
        "ThreadName": "",
        "EventID": "AB89F9595170E261",
        "ProcessID": 6356
      },
      {
        "Cycles": 0,
        "Agent": "edu.brown.cs.systems.xtrace.logging.BaggageWrappers",
        "ProcessName": "Read",
        "TaskID": "14D29DB2F9F1920F",
        "ParentEventID": [
          "0CD076A9ABF9AFF0"
        ],
        "Label": "Forking current baggage with Baggage.fork()",
        "Title": "X-Trace Task",
        "Host": "pinky19.mpi-sws.org",
        "HRT": 25489053181894955,
        "Operation": "fork",
        "Timestamp": "1556272693122.517090",
        "TenantClass": 0,
        "Source": "RemoteBlockReader2.java:361",
        "ThreadID": 1,
        "ThreadName": "",
        "EventID": "DFAF5BE56F82DEC5",
        "ProcessID": 6356
      },
      {
        "Cycles": 0,
        "Agent": "edu.brown.cs.systems.xtrace.logging.BaggageWrappers",
        "ProcessName": "Read",
        "TaskID": "14D29DB2F9F1920F",
        "ParentEventID": [
          "DFAF5BE56F82DEC5"
        ],
        "Label": "Forking current baggage with Baggage.fork()",
        "Title": "X-Trace Task",
        "Host": "pinky19.mpi-sws.org",
        "HRT": 25489053181967173,
        "Operation": "fork",
        "Timestamp": "1556272693122.589355",
        "TenantClass": 0,
        "Source": "DataTransferProtoUtil.java:94",
        "ThreadID": 1,
        "ThreadName": "",
        "EventID": "6FF2B57C963C3883",
        "ProcessID": 6356
      },
      {
        "Cycles": 0,
        "Agent": "Execution-Sleep",
        "ProcessName": "Data",
        "TaskID": "14D29DB2F9F1920F",
        "ParentEventID": [
          "C7570D8460C5A151"
        ],
        "Label": "waited",
        "Title": "X-Trace Task",
        "Host": "pinky19.mpi-sws.org",
        "Duration": "131558",
        "HRT": 25489053181943764,
        "Operation": "waited",
        "Timestamp": "1556272693122.578369",
        "TenantClass": 0,
        "Source": "SocketIOWithTimeout.java:335",
        "ThreadID": 8561,
        "ThreadName": "",
        "EventID": "0C948E81B58B301D",
        "BaggageBytes": "[[248 5] [240 0] [0 20 210 157 178 249 241 146 15] [240 1] [0 199 87 13 132 96 197 161 81] [240 3] [0 2]]",
        "ProcessID": 2319
      },
      {
        "Cycles": 0,
        "Agent": "edu.brown.cs.systems.xtrace.logging.BaggageWrappers",
        "ProcessName": "Data",
        "TaskID": "14D29DB2F9F1920F",
        "ParentEventID": [
          "DFAF5BE56F82DEC5",
          "0C948E81B58B301D"
        ],
        "Label": "Merged current baggage with other baggage",
        "Title": "X-Trace Task",
        "Host": "pinky19.mpi-sws.org",
        "HRT": 25489053182001632,
        "Operation": "join",
        "Timestamp": "1556272693122.636230",
        "TenantClass": 0,
        "Source": "DataXceiver.java:574",
        "ThreadID": 8561,
        "ThreadName": "",
        "EventID": "BB02E92B126C2F47",
        "BaggageBytes": "[[248 5] [240 0] [0 20 210 157 178 249 241 146 15] [240 1] [0 223 175 91 229 111 130 222 197] [0 12 148 142 129 181 139 48 29] [240 3] [0 2]]",
        "ProcessID": 2319
      },
      {
        "Cycles": 0,
        "Agent": "Execution-CPU",
        "ProcessName": "Data",
        "TaskID": "14D29DB2F9F1920F",
        "ParentEventID": [
          "BB02E92B126C2F47"
        ],
        "Label": "unset",
        "Title": "X-Trace Task",
        "Host": "pinky19.mpi-sws.org",
        "Duration": "638719",
        "HRT": 25489053182024110,
        "Operation": "unset",
        "Timestamp": "1556272693122.658691",
        "TenantClass": 0,
        "Source": "DataXceiver.java:261",
        "ThreadID": 8561,
        "ThreadName": "",
        "EventID": "C17B0FADAFA40D77",
        "BaggageBytes": "[[248 5] [240 0] [0 20 210 157 178 249 241 146 15] [240 1] [0 187 2 233 43 18 108 47 71] [240 3] [0 2]]",
        "ProcessID": 2319
      },
      {
        "Cycles": 0,
        "Agent": "Execution-CPU",
        "ProcessName": "Data",
        "TaskID": "14D29DB2F9F1920F",
        "ParentEventID": [
          "6FF2B57C963C3883"
        ],
        "Label": "set",
        "Title": "X-Trace Task",
        "Host": "pinky19.mpi-sws.org",
        "HRT": 25489053182078443,
        "Operation": "set",
        "Timestamp": "1556272693122.713135",
        "TenantClass": 0,
        "Source": "Receiver.java:117",
        "ThreadID": 8561,
        "ThreadName": "",
        "EventID": "12B91AD1FD6DEBA6",
        "BaggageBytes": "[[248 5] [240 0] [0 20 210 157 178 249 241 146 15] [240 1] [0 111 242 181 124 150 60 56 131] [240 3] [0 2]]",
        "ProcessID": 2319
      },
      {
        "Cycles": 0,
        "Agent": "edu.brown.cs.systems.xtrace.logging.BaggageWrappers",
        "ProcessName": "Data",
        "TaskID": "14D29DB2F9F1920F",
        "ParentEventID": [
          "F4F767DE320FBF58"
        ],
        "Label": "Forking current baggage with Baggage.fork()",
        "Title": "X-Trace Task",
        "Host": "pinky19.mpi-sws.org",
        "HRT": 25489053182174992,
        "Operation": "fork",
        "Timestamp": "1556272693122.809570",
        "TenantClass": 0,
        "Source": "DataXceiver.java:1257",
        "ThreadID": 8561,
        "ThreadName": "",
        "EventID": "33D4FDB0FBAD974C",
        "BaggageBytes": "[[248 5] [240 0] [0 20 210 157 178 249 241 146 15] [240 1] [0 244 247 103 222 50 15 191 88] [240 3] [0 2]]",
        "ProcessID": 2319
      },
      {
        "Cycles": 0,
        "Agent": "edu.brown.cs.systems.xtrace.logging.XTraceInit",
        "ProcessName": "Data",
        "TaskID": "14D29DB2F9F1920F",
        "ParentEventID": [
          "12B91AD1FD6DEBA6"
        ],
        "Label": "Thread.setName: DataXceiver for client DFSClient_NONMAPREDUCE_614514224_1 at /139.19.171.63:54140 [Sending block BP-1633380353-139.19.171.63-1554193446451:blk_1073758755_17931]",
        "Title": "X-Trace Task",
        "Host": "pinky19.mpi-sws.org",
        "HRT": 25489053182108008,
        "Timestamp": "1556272693122.742676",
        "TenantClass": 0,
        "Source": "DataXceiver.java:168",
        "ThreadID": 8561,
        "ThreadName": "",
        "EventID": "F4F767DE320FBF58",
        "BaggageBytes": "[[248 5] [240 0] [0 20 210 157 178 249 241 146 15] [240 1] [0 18 185 26 209 253 109 235 166] [240 3] [0 2]]",
        "ProcessID": 2319
      },
      {
        "Cycles": 0,
        "Agent": "edu.brown.cs.systems.xtrace.logging.BaggageWrappers",
        "ProcessName": "Data",
        "TaskID": "14D29DB2F9F1920F",
        "ParentEventID": [
          "33D4FDB0FBAD974C"
        ],
        "Label": "Forking current baggage with Baggage.fork()",
        "Title": "X-Trace Task",
        "Host": "pinky19.mpi-sws.org",
        "HRT": 25489053182248447,
        "Operation": "fork",
        "Timestamp": "1556272693122.883057",
        "TenantClass": 0,
        "Source": "PacketHeader.java:95",
        "ThreadID": 8561,
        "ThreadName": "",
        "EventID": "9743BB9CE06B9421",
        "BaggageBytes": "[[248 5] [240 0] [0 20 210 157 178 249 241 146 15] [240 1] [0 51 212 253 176 251 173 151 76] [240 3] [0 2]]",
        "ProcessID": 2319
      },
      {
        "Cycles": 0,
        "Agent": "edu.brown.cs.systems.xtrace.logging.BaggageWrappers",
        "ProcessName": "Read",
        "TaskID": "14D29DB2F9F1920F",
        "ParentEventID": [
          "33D4FDB0FBAD974C",
          "857E123EF6B6E9E3"
        ],
        "Label": "Merged current baggage with other baggage",
        "Title": "X-Trace Task",
        "Host": "pinky19.mpi-sws.org",
        "HRT": 25489053182306428,
        "Operation": "join",
        "Timestamp": "1556272693122.928467",
        "TenantClass": 0,
        "Source": "RemoteBlockReader2.java:429",
        "ThreadID": 1,
        "ThreadName": "",
        "EventID": "DE3A743B82A048CF",
        "ProcessID": 6356
      },
      {
        "Cycles": 0,
        "Agent": "Execution-Sleep",
        "ProcessName": "Read",
        "TaskID": "14D29DB2F9F1920F",
        "ParentEventID": [
          "6FF2B57C963C3883"
        ],
        "Label": "waited",
        "Title": "X-Trace Task",
        "Host": "pinky19.mpi-sws.org",
        "Duration": "202696",
        "HRT": 25489053182246709,
        "Operation": "waited",
        "Timestamp": "1556272693122.868896",
        "TenantClass": 0,
        "Source": "SocketIOWithTimeout.java:335",
        "ThreadID": 1,
        "ThreadName": "",
        "EventID": "857E123EF6B6E9E3",
        "ProcessID": 6356
      },
      {
        "Cycles": 0,
        "Agent": "Execution-Sleep",
        "ProcessName": "Data",
        "TaskID": "14D29DB2F9F1920F",
        "ParentEventID": [
          "9743BB9CE06B9421"
        ],
        "Label": "waited",
        "Title": "X-Trace Task",
        "Host": "pinky19.mpi-sws.org",
        "Duration": "3976",
        "HRT": 25489053182303766,
        "Operation": "waited",
        "Timestamp": "1556272693122.938477",
        "TenantClass": 0,
        "Source": "SocketIOWithTimeout.java:335",
        "ThreadID": 8561,
        "ThreadName": "",
        "EventID": "9AEA790C92BF95CE",
        "BaggageBytes": "[[248 5] [240 0] [0 20 210 157 178 249 241 146 15] [240 1] [0 151 67 187 156 224 107 148 33] [240 3] [0 2]]",
        "ProcessID": 2319
      },
      {
        "Cycles": 0,
        "Agent": "edu.brown.cs.systems.xtrace.logging.BaggageWrappers",
        "ProcessName": "Data",
        "TaskID": "14D29DB2F9F1920F",
        "ParentEventID": [
          "9AEA790C92BF95CE"
        ],
        "Label": "Forking current baggage with Baggage.fork()",
        "Title": "X-Trace Task",
        "Host": "pinky19.mpi-sws.org",
        "HRT": 25489053182368211,
        "Operation": "fork",
        "Timestamp": "1556272693123.002930",
        "TenantClass": 0,
        "Source": "PacketHeader.java:95",
        "ThreadID": 8561,
        "ThreadName": "",
        "EventID": "75DC1AFB9843BFDA",
        "BaggageBytes": "[[248 5] [240 0] [0 20 210 157 178 249 241 146 15] [240 1] [0 154 234 121 12 146 191 149 206] [240 3] [0 2]]",
        "ProcessID": 2319
      },
      {
        "Cycles": 0,
        "Agent": "edu.brown.cs.systems.xtrace.logging.BaggageWrappers",
        "ProcessName": "Read",
        "TaskID": "14D29DB2F9F1920F",
        "ParentEventID": [
          "DE3A743B82A048CF",
          "9743BB9CE06B9421"
        ],
        "Label": "Merged current baggage with other baggage",
        "Title": "X-Trace Task",
        "Host": "pinky19.mpi-sws.org",
        "HRT": 25489053182391204,
        "Operation": "join",
        "Timestamp": "1556272693123.013428",
        "TenantClass": 0,
        "Source": "PacketHeader.java:168",
        "ThreadID": 1,
        "ThreadName": "",
        "EventID": "80F355B006C5D173",
        "ProcessID": 6356
      },
      {
        "Cycles": 0,
        "Agent": "edu.brown.cs.systems.xtrace.logging.BaggageWrappers",
        "ProcessName": "Data",
        "TaskID": "14D29DB2F9F1920F",
        "ParentEventID": [
          "CF224CBC80A519AF"
        ],
        "Label": "Forking current baggage with Baggage.fork()",
        "Title": "X-Trace Task",
        "Host": "pinky19.mpi-sws.org",
        "HRT": 25489053182486362,
        "Operation": "fork",
        "Timestamp": "1556272693123.121094",
        "TenantClass": 0,
        "Source": "PacketHeader.java:95",
        "ThreadID": 8561,
        "ThreadName": "",
        "EventID": "28D70BB49D12858B",
        "BaggageBytes": "[[248 5] [240 0] [0 20 210 157 178 249 241 146 15] [240 1] [0 207 34 76 188 128 165 25 175] [240 3] [0 2]]",
        "ProcessID": 2319
      },
      {
        "Cycles": 0,
        "Agent": "Execution-Sleep",
        "ProcessName": "Data",
        "TaskID": "14D29DB2F9F1920F",
        "ParentEventID": [
          "75DC1AFB9843BFDA"
        ],
        "Label": "waited",
        "Title": "X-Trace Task",
        "Host": "pinky19.mpi-sws.org",
        "Duration": "3515",
        "HRT": 25489053182421758,
        "Operation": "waited",
        "Timestamp": "1556272693123.056396",
        "TenantClass": 0,
        "Source": "SocketIOWithTimeout.java:335",
        "ThreadID": 8561,
        "ThreadName": "",
        "EventID": "CF224CBC80A519AF",
        "BaggageBytes": "[[248 5] [240 0] [0 20 210 157 178 249 241 146 15] [240 1] [0 117 220 26 251 152 67 191 218] [240 3] [0 2]]",
        "ProcessID": 2319
      },
      {
        "Cycles": 0,
        "Agent": "edu.brown.cs.systems.xtrace.logging.BaggageWrappers",
        "ProcessName": "Read",
        "TaskID": "14D29DB2F9F1920F",
        "ParentEventID": [
          "75DC1AFB9843BFDA",
          "80F355B006C5D173"
        ],
        "Label": "Merged current baggage with other baggage",
        "Title": "X-Trace Task",
        "Host": "pinky19.mpi-sws.org",
        "HRT": 25489053182508610,
        "Operation": "join",
        "Timestamp": "1556272693123.130859",
        "TenantClass": 0,
        "Source": "PacketHeader.java:168",
        "ThreadID": 1,
        "ThreadName": "",
        "EventID": "F26A9905F426E666",
        "ProcessID": 6356
      },
      {
        "Cycles": 0,
        "Agent": "edu.brown.cs.systems.xtrace.logging.BaggageWrappers",
        "ProcessName": "Data",
        "TaskID": "14D29DB2F9F1920F",
        "ParentEventID": [
          "4E7021E94E915FCF"
        ],
        "Label": "Forking current baggage with Baggage.fork()",
        "Title": "X-Trace Task",
        "Host": "pinky19.mpi-sws.org",
        "HRT": 25489053182599676,
        "Operation": "fork",
        "Timestamp": "1556272693123.234375",
        "TenantClass": 0,
        "Source": "PacketHeader.java:95",
        "ThreadID": 8561,
        "ThreadName": "",
        "EventID": "2B3A11925AF821C9",
        "BaggageBytes": "[[248 5] [240 0] [0 20 210 157 178 249 241 146 15] [240 1] [0 78 112 33 233 78 145 95 207] [240 3] [0 2]]",
        "ProcessID": 2319
      },
      {
        "Cycles": 0,
        "Agent": "Execution-Sleep",
        "ProcessName": "Data",
        "TaskID": "14D29DB2F9F1920F",
        "ParentEventID": [
          "28D70BB49D12858B"
        ],
        "Label": "waited",
        "Title": "X-Trace Task",
        "Host": "pinky19.mpi-sws.org",
        "Duration": "3190",
        "HRT": 25489053182538790,
        "Operation": "waited",
        "Timestamp": "1556272693123.173340",
        "TenantClass": 0,
        "Source": "SocketIOWithTimeout.java:335",
        "ThreadID": 8561,
        "ThreadName": "",
        "EventID": "4E7021E94E915FCF",
        "BaggageBytes": "[[248 5] [240 0] [0 20 210 157 178 249 241 146 15] [240 1] [0 40 215 11 180 157 18 133 139] [240 3] [0 2]]",
        "ProcessID": 2319
      },
      {
        "Cycles": 0,
        "Agent": "edu.brown.cs.systems.xtrace.logging.BaggageWrappers",
        "ProcessName": "Read",
        "TaskID": "14D29DB2F9F1920F",
        "ParentEventID": [
          "F26A9905F426E666",
          "28D70BB49D12858B"
        ],
        "Label": "Merged current baggage with other baggage",
        "Title": "X-Trace Task",
        "Host": "pinky19.mpi-sws.org",
        "HRT": 25489053182623084,
        "Operation": "join",
        "Timestamp": "1556272693123.245117",
        "TenantClass": 0,
        "Source": "PacketHeader.java:168",
        "ThreadID": 1,
        "ThreadName": "",
        "EventID": "B8823364B22A1325",
        "ProcessID": 6356
      },
      {
        "Cycles": 0,
        "Agent": "edu.brown.cs.systems.xtrace.logging.BaggageWrappers",
        "ProcessName": "Data",
        "TaskID": "14D29DB2F9F1920F",
        "ParentEventID": [
          "4B1264156502AE21"
        ],
        "Label": "Forking current baggage with Baggage.fork()",
        "Title": "X-Trace Task",
        "Host": "pinky19.mpi-sws.org",
        "HRT": 25489053182714530,
        "Operation": "fork",
        "Timestamp": "1556272693123.349121",
        "TenantClass": 0,
        "Source": "PacketHeader.java:95",
        "ThreadID": 8561,
        "ThreadName": "",
        "EventID": "C463D90EB26E4A93",
        "BaggageBytes": "[[248 5] [240 0] [0 20 210 157 178 249 241 146 15] [240 1] [0 75 18 100 21 101 2 174 33] [240 3] [0 2]]",
        "ProcessID": 2319
      },
      {
        "Cycles": 0,
        "Agent": "Execution-Sleep",
        "ProcessName": "Data",
        "TaskID": "14D29DB2F9F1920F",
        "ParentEventID": [
          "2B3A11925AF821C9"
        ],
        "Label": "waited",
        "Title": "X-Trace Task",
        "Host": "pinky19.mpi-sws.org",
        "Duration": "3193",
        "HRT": 25489053182653613,
        "Operation": "waited",
        "Timestamp": "1556272693123.288330",
        "TenantClass": 0,
        "Source": "SocketIOWithTimeout.java:335",
        "ThreadID": 8561,
        "ThreadName": "",
        "EventID": "4B1264156502AE21",
        "BaggageBytes": "[[248 5] [240 0] [0 20 210 157 178 249 241 146 15] [240 1] [0 43 58 17 146 90 248 33 201] [240 3] [0 2]]",
        "ProcessID": 2319
      },
      {
        "Cycles": 0,
        "Agent": "Execution-Sleep",
        "ProcessName": "Data",
        "TaskID": "14D29DB2F9F1920F",
        "ParentEventID": [
          "C463D90EB26E4A93"
        ],
        "Label": "waited",
        "Title": "X-Trace Task",
        "Host": "pinky19.mpi-sws.org",
        "Duration": "3137",
        "HRT": 25489053182767836,
        "Operation": "waited",
        "Timestamp": "1556272693123.402588",
        "TenantClass": 0,
        "Source": "SocketIOWithTimeout.java:335",
        "ThreadID": 8561,
        "ThreadName": "",
        "EventID": "DB48265D1AE009A1",
        "BaggageBytes": "[[248 5] [240 0] [0 20 210 157 178 249 241 146 15] [240 1] [0 196 99 217 14 178 110 74 147] [240 3] [0 2]]",
        "ProcessID": 2319
      },
      {
        "Cycles": 0,
        "Agent": "edu.brown.cs.systems.xtrace.logging.BaggageWrappers",
        "ProcessName": "Read",
        "TaskID": "14D29DB2F9F1920F",
        "ParentEventID": [
          "2B3A11925AF821C9",
          "B8823364B22A1325"
        ],
        "Label": "Merged current baggage with other baggage",
        "Title": "X-Trace Task",
        "Host": "pinky19.mpi-sws.org",
        "HRT": 25489053182737833,
        "Operation": "join",
        "Timestamp": "1556272693123.359863",
        "TenantClass": 0,
        "Source": "PacketHeader.java:168",
        "ThreadID": 1,
        "ThreadName": "",
        "EventID": "04F8B372375A1567",
        "ProcessID": 6356
      },
      {
        "Cycles": 0,
        "Agent": "edu.brown.cs.systems.xtrace.logging.BaggageWrappers",
        "ProcessName": "Data",
        "TaskID": "14D29DB2F9F1920F",
        "ParentEventID": [
          "DB48265D1AE009A1"
        ],
        "Label": "Forking current baggage with Baggage.fork()",
        "Title": "X-Trace Task",
        "Host": "pinky19.mpi-sws.org",
        "HRT": 25489053182827181,
        "Operation": "fork",
        "Timestamp": "1556272693123.461914",
        "TenantClass": 0,
        "Source": "PacketHeader.java:95",
        "ThreadID": 8561,
        "ThreadName": "",
        "EventID": "7E1BE83E2013585E",
        "BaggageBytes": "[[248 5] [240 0] [0 20 210 157 178 249 241 146 15] [240 1] [0 219 72 38 93 26 224 9 161] [240 3] [0 2]]",
        "ProcessID": 2319
      },
      {
        "Cycles": 0,
        "Agent": "Execution-Sleep",
        "ProcessName": "Data",
        "TaskID": "14D29DB2F9F1920F",
        "ParentEventID": [
          "7E1BE83E2013585E"
        ],
        "Label": "waited",
        "Title": "X-Trace Task",
        "Host": "pinky19.mpi-sws.org",
        "Duration": "3337",
        "HRT": 25489053182880045,
        "Operation": "waited",
        "Timestamp": "1556272693123.514648",
        "TenantClass": 0,
        "Source": "SocketIOWithTimeout.java:335",
        "ThreadID": 8561,
        "ThreadName": "",
        "EventID": "A82999016EE7D784",
        "BaggageBytes": "[[248 5] [240 0] [0 20 210 157 178 249 241 146 15] [240 1] [0 126 27 232 62 32 19 88 94] [240 3] [0 2]]",
        "ProcessID": 2319
      },
      {
        "Cycles": 0,
        "Agent": "edu.brown.cs.systems.xtrace.logging.BaggageWrappers",
        "ProcessName": "Read",
        "TaskID": "14D29DB2F9F1920F",
        "ParentEventID": [
          "04F8B372375A1567",
          "C463D90EB26E4A93"
        ],
        "Label": "Merged current baggage with other baggage",
        "Title": "X-Trace Task",
        "Host": "pinky19.mpi-sws.org",
        "HRT": 25489053182853349,
        "Operation": "join",
        "Timestamp": "1556272693123.475586",
        "TenantClass": 0,
        "Source": "PacketHeader.java:168",
        "ThreadID": 1,
        "ThreadName": "",
        "EventID": "5E5C0229D478191C",
        "ProcessID": 6356
      },
      {
        "Cycles": 0,
        "Agent": "edu.brown.cs.systems.xtrace.logging.BaggageWrappers",
        "ProcessName": "Data",
        "TaskID": "14D29DB2F9F1920F",
        "ParentEventID": [
          "A82999016EE7D784"
        ],
        "Label": "Forking current baggage with Baggage.fork()",
        "Title": "X-Trace Task",
        "Host": "pinky19.mpi-sws.org",
        "HRT": 25489053182938903,
        "Operation": "fork",
        "Timestamp": "1556272693123.573486",
        "TenantClass": 0,
        "Source": "PacketHeader.java:95",
        "ThreadID": 8561,
        "ThreadName": "",
        "EventID": "3171F9EA20D66C6D",
        "BaggageBytes": "[[248 5] [240 0] [0 20 210 157 178 249 241 146 15] [240 1] [0 168 41 153 1 110 231 215 132] [240 3] [0 2]]",
        "ProcessID": 2319
      },
      {
        "Cycles": 0,
        "Agent": "edu.brown.cs.systems.xtrace.logging.BaggageWrappers",
        "ProcessName": "Read",
        "TaskID": "14D29DB2F9F1920F",
        "ParentEventID": [
          "7E1BE83E2013585E",
          "5E5C0229D478191C"
        ],
        "Label": "Merged current baggage with other baggage",
        "Title": "X-Trace Task",
        "Host": "pinky19.mpi-sws.org",
        "HRT": 25489053182967391,
        "Operation": "join",
        "Timestamp": "1556272693123.589600",
        "TenantClass": 0,
        "Source": "PacketHeader.java:168",
        "ThreadID": 1,
        "ThreadName": "",
        "EventID": "08DEF1F6FA5A2C14",
        "ProcessID": 6356
      },
      {
        "Cycles": 0,
        "Agent": "Execution-Sleep",
        "ProcessName": "Data",
        "TaskID": "14D29DB2F9F1920F",
        "ParentEventID": [
          "3171F9EA20D66C6D"
        ],
        "Label": "waited",
        "Title": "X-Trace Task",
        "Host": "pinky19.mpi-sws.org",
        "Duration": "3250",
        "HRT": 25489053182990473,
        "Operation": "waited",
        "Timestamp": "1556272693123.625244",
        "TenantClass": 0,
        "Source": "SocketIOWithTimeout.java:335",
        "ThreadID": 8561,
        "ThreadName": "",
        "EventID": "6C53D32446CADDB0",
        "BaggageBytes": "[[248 5] [240 0] [0 20 210 157 178 249 241 146 15] [240 1] [0 49 113 249 234 32 214 108 109] [240 3] [0 2]]",
        "ProcessID": 2319
      },
      {
        "Cycles": 0,
        "Agent": "edu.brown.cs.systems.xtrace.logging.BaggageWrappers",
        "ProcessName": "Read",
        "TaskID": "14D29DB2F9F1920F",
        "ParentEventID": [
          "08DEF1F6FA5A2C14",
          "3171F9EA20D66C6D"
        ],
        "Label": "Merged current baggage with other baggage",
        "Title": "X-Trace Task",
        "Host": "pinky19.mpi-sws.org",
        "HRT": 25489053183081111,
        "Operation": "join",
        "Timestamp": "1556272693123.703369",
        "TenantClass": 0,
        "Source": "PacketHeader.java:168",
        "ThreadID": 1,
        "ThreadName": "",
        "EventID": "0BA3F0785C99499D",
        "ProcessID": 6356
      },
      {
        "Cycles": 0,
        "Agent": "edu.brown.cs.systems.xtrace.logging.BaggageWrappers",
        "ProcessName": "Data",
        "TaskID": "14D29DB2F9F1920F",
        "ParentEventID": [
          "6C53D32446CADDB0"
        ],
        "Label": "Forking current baggage with Baggage.fork()",
        "Title": "X-Trace Task",
        "Host": "pinky19.mpi-sws.org",
        "HRT": 25489053183051413,
        "Operation": "fork",
        "Timestamp": "1556272693123.686035",
        "TenantClass": 0,
        "Source": "PacketHeader.java:95",
        "ThreadID": 8561,
        "ThreadName": "",
        "EventID": "2A9566FEDD8F2866",
        "BaggageBytes": "[[248 5] [240 0] [0 20 210 157 178 249 241 146 15] [240 1] [0 108 83 211 36 70 202 221 176] [240 3] [0 2]]",
        "ProcessID": 2319
      },
      {
        "Cycles": 0,
        "Agent": "Execution-Sleep",
        "ProcessName": "Data",
        "TaskID": "14D29DB2F9F1920F",
        "ParentEventID": [
          "2A9566FEDD8F2866"
        ],
        "Label": "waited",
        "Title": "X-Trace Task",
        "Host": "pinky19.mpi-sws.org",
        "Duration": "3048",
        "HRT": 25489053183109477,
        "Operation": "waited",
        "Timestamp": "1556272693123.744141",
        "TenantClass": 0,
        "Source": "SocketIOWithTimeout.java:335",
        "ThreadID": 8561,
        "ThreadName": "",
        "EventID": "E6E0F4CFA512566E",
        "BaggageBytes": "[[248 5] [240 0] [0 20 210 157 178 249 241 146 15] [240 1] [0 42 149 102 254 221 143 40 102] [240 3] [0 2]]",
        "ProcessID": 2319
      },
      {
        "Cycles": 0,
        "Agent": "edu.brown.cs.systems.xtrace.logging.BaggageWrappers",
        "ProcessName": "Read",
        "TaskID": "14D29DB2F9F1920F",
        "ParentEventID": [
          "2A9566FEDD8F2866",
          "0BA3F0785C99499D"
        ],
        "Label": "Merged current baggage with other baggage",
        "Title": "X-Trace Task",
        "Host": "pinky19.mpi-sws.org",
        "HRT": 25489053183194213,
        "Operation": "join",
        "Timestamp": "1556272693123.816406",
        "TenantClass": 0,
        "Source": "PacketHeader.java:168",
        "ThreadID": 1,
        "ThreadName": "",
        "EventID": "C8CD898D81344BA1",
        "ProcessID": 6356
      },
      {
        "Cycles": 0,
        "Agent": "Execution-Sleep",
        "ProcessName": "Data",
        "TaskID": "14D29DB2F9F1920F",
        "ParentEventID": [
          "136F422836A0CB22"
        ],
        "Label": "waited",
        "Title": "X-Trace Task",
        "Host": "pinky19.mpi-sws.org",
        "Duration": "3043",
        "HRT": 25489053183221248,
        "Operation": "waited",
        "Timestamp": "1556272693123.855957",
        "TenantClass": 0,
        "Source": "SocketIOWithTimeout.java:335",
        "ThreadID": 8561,
        "ThreadName": "",
        "EventID": "C731E53CADA70B5D",
        "BaggageBytes": "[[248 5] [240 0] [0 20 210 157 178 249 241 146 15] [240 1] [0 19 111 66 40 54 160 203 34] [240 3] [0 2]]",
        "ProcessID": 2319
      },
      {
        "Cycles": 0,
        "Agent": "edu.brown.cs.systems.xtrace.logging.BaggageWrappers",
        "ProcessName": "Data",
        "TaskID": "14D29DB2F9F1920F",
        "ParentEventID": [
          "E6E0F4CFA512566E"
        ],
        "Label": "Forking current baggage with Baggage.fork()",
        "Title": "X-Trace Task",
        "Host": "pinky19.mpi-sws.org",
        "HRT": 25489053183170018,
        "Operation": "fork",
        "Timestamp": "1556272693123.804688",
        "TenantClass": 0,
        "Source": "PacketHeader.java:95",
        "ThreadID": 8561,
        "ThreadName": "",
        "EventID": "136F422836A0CB22",
        "BaggageBytes": "[[248 5] [240 0] [0 20 210 157 178 249 241 146 15] [240 1] [0 230 224 244 207 165 18 86 110] [240 3] [0 2]]",
        "ProcessID": 2319
      },
      {
        "Cycles": 0,
        "Agent": "edu.brown.cs.systems.xtrace.logging.BaggageWrappers",
        "ProcessName": "Data",
        "TaskID": "14D29DB2F9F1920F",
        "ParentEventID": [
          "C731E53CADA70B5D"
        ],
        "Label": "Forking current baggage with Baggage.fork()",
        "Title": "X-Trace Task",
        "Host": "pinky19.mpi-sws.org",
        "HRT": 25489053183279392,
        "Operation": "fork",
        "Timestamp": "1556272693123.914062",
        "TenantClass": 0,
        "Source": "PacketHeader.java:95",
        "ThreadID": 8561,
        "ThreadName": "",
        "EventID": "B45009B991F1C6C4",
        "BaggageBytes": "[[248 5] [240 0] [0 20 210 157 178 249 241 146 15] [240 1] [0 199 49 229 60 173 167 11 93] [240 3] [0 2]]",
        "ProcessID": 2319
      },
      {
        "Cycles": 0,
        "Agent": "edu.brown.cs.systems.xtrace.logging.BaggageWrappers",
        "ProcessName": "Read",
        "TaskID": "14D29DB2F9F1920F",
        "ParentEventID": [
          "136F422836A0CB22",
          "C8CD898D81344BA1"
        ],
        "Label": "Merged current baggage with other baggage",
        "Title": "X-Trace Task",
        "Host": "pinky19.mpi-sws.org",
        "HRT": 25489053183308159,
        "Operation": "join",
        "Timestamp": "1556272693123.930420",
        "TenantClass": 0,
        "Source": "PacketHeader.java:168",
        "ThreadID": 1,
        "ThreadName": "",
        "EventID": "F53EEEB0847BDE03",
        "ProcessID": 6356
      },
      {
        "Cycles": 0,
        "Agent": "Execution-Sleep",
        "ProcessName": "Data",
        "TaskID": "14D29DB2F9F1920F",
        "ParentEventID": [
          "B45009B991F1C6C4"
        ],
        "Label": "waited",
        "Title": "X-Trace Task",
        "Host": "pinky19.mpi-sws.org",
        "Duration": "3342",
        "HRT": 25489053183332241,
        "Operation": "waited",
        "Timestamp": "1556272693123.966797",
        "TenantClass": 0,
        "Source": "SocketIOWithTimeout.java:335",
        "ThreadID": 8561,
        "ThreadName": "",
        "EventID": "829F315323BAABA9",
        "BaggageBytes": "[[248 5] [240 0] [0 20 210 157 178 249 241 146 15] [240 1] [0 180 80 9 185 145 241 198 196] [240 3] [0 2]]",
        "ProcessID": 2319
      },
      {
        "Cycles": 0,
        "Agent": "edu.brown.cs.systems.xtrace.logging.BaggageWrappers",
        "ProcessName": "Data",
        "TaskID": "14D29DB2F9F1920F",
        "ParentEventID": [
          "829F315323BAABA9"
        ],
        "Label": "Forking current baggage with Baggage.fork()",
        "Title": "X-Trace Task",
        "Host": "pinky19.mpi-sws.org",
        "HRT": 25489053183390708,
        "Operation": "fork",
        "Timestamp": "1556272693124.025391",
        "TenantClass": 0,
        "Source": "PacketHeader.java:95",
        "ThreadID": 8561,
        "ThreadName": "",
        "EventID": "C3AC13CF807E240C",
        "BaggageBytes": "[[248 5] [240 0] [0 20 210 157 178 249 241 146 15] [240 1] [0 130 159 49 83 35 186 171 169] [240 3] [0 2]]",
        "ProcessID": 2319
      },
      {
        "Cycles": 0,
        "Agent": "edu.brown.cs.systems.xtrace.logging.BaggageWrappers",
        "ProcessName": "Read",
        "TaskID": "14D29DB2F9F1920F",
        "ParentEventID": [
          "B45009B991F1C6C4",
          "F53EEEB0847BDE03"
        ],
        "Label": "Merged current baggage with other baggage",
        "Title": "X-Trace Task",
        "Host": "pinky19.mpi-sws.org",
        "HRT": 25489053183422672,
        "Operation": "join",
        "Timestamp": "1556272693124.044922",
        "TenantClass": 0,
        "Source": "PacketHeader.java:168",
        "ThreadID": 1,
        "ThreadName": "",
        "EventID": "5918739486E7124E",
        "ProcessID": 6356
      },
      {
        "Cycles": 0,
        "Agent": "edu.brown.cs.systems.xtrace.logging.BaggageWrappers",
        "ProcessName": "Data",
        "TaskID": "14D29DB2F9F1920F",
        "ParentEventID": [
          "C27ACE6C5A33D17D"
        ],
        "Label": "Forking current baggage with Baggage.fork()",
        "Title": "X-Trace Task",
        "Host": "pinky19.mpi-sws.org",
        "HRT": 25489053183501737,
        "Operation": "fork",
        "Timestamp": "1556272693124.136475",
        "TenantClass": 0,
        "Source": "PacketHeader.java:95",
        "ThreadID": 8561,
        "ThreadName": "",
        "EventID": "EFF018B62E5C46ED",
        "BaggageBytes": "[[248 5] [240 0] [0 20 210 157 178 249 241 146 15] [240 1] [0 194 122 206 108 90 51 209 125] [240 3] [0 2]]",
        "ProcessID": 2319
      },
      {
        "Cycles": 0,
        "Agent": "Execution-Sleep",
        "ProcessName": "Data",
        "TaskID": "14D29DB2F9F1920F",
        "ParentEventID": [
          "C3AC13CF807E240C"
        ],
        "Label": "waited",
        "Title": "X-Trace Task",
        "Host": "pinky19.mpi-sws.org",
        "Duration": "3293",
        "HRT": 25489053183444150,
        "Operation": "waited",
        "Timestamp": "1556272693124.078857",
        "TenantClass": 0,
        "Source": "SocketIOWithTimeout.java:335",
        "ThreadID": 8561,
        "ThreadName": "",
        "EventID": "C27ACE6C5A33D17D",
        "BaggageBytes": "[[248 5] [240 0] [0 20 210 157 178 249 241 146 15] [240 1] [0 195 172 19 207 128 126 36 12] [240 3] [0 2]]",
        "ProcessID": 2319
      },
      {
        "Cycles": 0,
        "Agent": "edu.brown.cs.systems.xtrace.logging.BaggageWrappers",
        "ProcessName": "Read",
        "TaskID": "14D29DB2F9F1920F",
        "ParentEventID": [
          "5918739486E7124E",
          "C3AC13CF807E240C"
        ],
        "Label": "Merged current baggage with other baggage",
        "Title": "X-Trace Task",
        "Host": "pinky19.mpi-sws.org",
        "HRT": 25489053183536168,
        "Operation": "join",
        "Timestamp": "1556272693124.158203",
        "TenantClass": 0,
        "Source": "PacketHeader.java:168",
        "ThreadID": 1,
        "ThreadName": "",
        "EventID": "754179A92274B4F6",
        "ProcessID": 6356
      },
      {
        "Cycles": 0,
        "Agent": "edu.brown.cs.systems.xtrace.logging.BaggageWrappers",
        "ProcessName": "Data",
        "TaskID": "14D29DB2F9F1920F",
        "ParentEventID": [
          "EF24C55D1CD06AB5"
        ],
        "Label": "Forking current baggage with Baggage.fork()",
        "Title": "X-Trace Task",
        "Host": "pinky19.mpi-sws.org",
        "HRT": 25489053183611500,
        "Operation": "fork",
        "Timestamp": "1556272693124.246094",
        "TenantClass": 0,
        "Source": "PacketHeader.java:95",
        "ThreadID": 8561,
        "ThreadName": "",
        "EventID": "AB297F8A2D70E85C",
        "BaggageBytes": "[[248 5] [240 0] [0 20 210 157 178 249 241 146 15] [240 1] [0 239 36 197 93 28 208 106 181] [240 3] [0 2]]",
        "ProcessID": 2319
      },
      {
        "Cycles": 0,
        "Agent": "Execution-Sleep",
        "ProcessName": "Data",
        "TaskID": "14D29DB2F9F1920F",
        "ParentEventID": [
          "EFF018B62E5C46ED"
        ],
        "Label": "waited",
        "Title": "X-Trace Task",
        "Host": "pinky19.mpi-sws.org",
        "Duration": "3057",
        "HRT": 25489053183552949,
        "Operation": "waited",
        "Timestamp": "1556272693124.187500",
        "TenantClass": 0,
        "Source": "SocketIOWithTimeout.java:335",
        "ThreadID": 8561,
        "ThreadName": "",
        "EventID": "EF24C55D1CD06AB5",
        "BaggageBytes": "[[248 5] [240 0] [0 20 210 157 178 249 241 146 15] [240 1] [0 239 240 24 182 46 92 70 237] [240 3] [0 2]]",
        "ProcessID": 2319
      },
      {
        "Cycles": 0,
        "Agent": "edu.brown.cs.systems.xtrace.logging.BaggageWrappers",
        "ProcessName": "Read",
        "TaskID": "14D29DB2F9F1920F",
        "ParentEventID": [
          "754179A92274B4F6",
          "EFF018B62E5C46ED"
        ],
        "Label": "Merged current baggage with other baggage",
        "Title": "X-Trace Task",
        "Host": "pinky19.mpi-sws.org",
        "HRT": 25489053183650514,
        "Operation": "join",
        "Timestamp": "1556272693124.272705",
        "TenantClass": 0,
        "Source": "PacketHeader.java:168",
        "ThreadID": 1,
        "ThreadName": "",
        "EventID": "8128A5F5D437DAB7",
        "ProcessID": 6356
      },
      {
        "Cycles": 0,
        "Agent": "Execution-Sleep",
        "ProcessName": "Data",
        "TaskID": "14D29DB2F9F1920F",
        "ParentEventID": [
          "AB297F8A2D70E85C"
        ],
        "Label": "waited",
        "Title": "X-Trace Task",
        "Host": "pinky19.mpi-sws.org",
        "Duration": "3195",
        "HRT": 25489053183662190,
        "Operation": "waited",
        "Timestamp": "1556272693124.296875",
        "TenantClass": 0,
        "Source": "SocketIOWithTimeout.java:335",
        "ThreadID": 8561,
        "ThreadName": "",
        "EventID": "589109B59B3978D8",
        "BaggageBytes": "[[248 5] [240 0] [0 20 210 157 178 249 241 146 15] [240 1] [0 171 41 127 138 45 112 232 92] [240 3] [0 2]]",
        "ProcessID": 2319
      },
      {
        "Cycles": 0,
        "Agent": "edu.brown.cs.systems.xtrace.logging.BaggageWrappers",
        "ProcessName": "Data",
        "TaskID": "14D29DB2F9F1920F",
        "ParentEventID": [
          "589109B59B3978D8"
        ],
        "Label": "Forking current baggage with Baggage.fork()",
        "Title": "X-Trace Task",
        "Host": "pinky19.mpi-sws.org",
        "HRT": 25489053183721706,
        "Operation": "fork",
        "Timestamp": "1556272693124.356445",
        "TenantClass": 0,
        "Source": "PacketHeader.java:95",
        "ThreadID": 8561,
        "ThreadName": "",
        "EventID": "8DD451203188596A",
        "BaggageBytes": "[[248 5] [240 0] [0 20 210 157 178 249 241 146 15] [240 1] [0 88 145 9 181 155 57 120 216] [240 3] [0 2]]",
        "ProcessID": 2319
      },
      {
        "Cycles": 0,
        "Agent": "Execution-Sleep",
        "ProcessName": "Data",
        "TaskID": "14D29DB2F9F1920F",
        "ParentEventID": [
          "8DD451203188596A"
        ],
        "Label": "waited",
        "Title": "X-Trace Task",
        "Host": "pinky19.mpi-sws.org",
        "Duration": "3032",
        "HRT": 25489053183773722,
        "Operation": "waited",
        "Timestamp": "1556272693124.408447",
        "TenantClass": 0,
        "Source": "SocketIOWithTimeout.java:335",
        "ThreadID": 8561,
        "ThreadName": "",
        "EventID": "2DBD0148C37E5C45",
        "BaggageBytes": "[[248 5] [240 0] [0 20 210 157 178 249 241 146 15] [240 1] [0 141 212 81 32 49 136 89 106] [240 3] [0 2]]",
        "ProcessID": 2319
      },
      {
        "Cycles": 0,
        "Agent": "edu.brown.cs.systems.xtrace.logging.BaggageWrappers",
        "ProcessName": "Read",
        "TaskID": "14D29DB2F9F1920F",
        "ParentEventID": [
          "AB297F8A2D70E85C",
          "8128A5F5D437DAB7"
        ],
        "Label": "Merged current baggage with other baggage",
        "Title": "X-Trace Task",
        "Host": "pinky19.mpi-sws.org",
        "HRT": 25489053183764681,
        "Operation": "join",
        "Timestamp": "1556272693124.386719",
        "TenantClass": 0,
        "Source": "PacketHeader.java:168",
        "ThreadID": 1,
        "ThreadName": "",
        "EventID": "14110967AAAF93DC",
        "ProcessID": 6356
      },
      {
        "Cycles": 0,
        "Agent": "edu.brown.cs.systems.xtrace.logging.BaggageWrappers",
        "ProcessName": "Data",
        "TaskID": "14D29DB2F9F1920F",
        "ParentEventID": [
          "2DBD0148C37E5C45"
        ],
        "Label": "Forking current baggage with Baggage.fork()",
        "Title": "X-Trace Task",
        "Host": "pinky19.mpi-sws.org",
        "HRT": 25489053183832355,
        "Operation": "fork",
        "Timestamp": "1556272693124.467041",
        "TenantClass": 0,
        "Source": "PacketHeader.java:95",
        "ThreadID": 8561,
        "ThreadName": "",
        "EventID": "0EDAF525C1586394",
        "BaggageBytes": "[[248 5] [240 0] [0 20 210 157 178 249 241 146 15] [240 1] [0 45 189 1 72 195 126 92 69] [240 3] [0 2]]",
        "ProcessID": 2319
      },
      {
        "Cycles": 0,
        "Agent": "Execution-Sleep",
        "ProcessName": "Data",
        "TaskID": "14D29DB2F9F1920F",
        "ParentEventID": [
          "0EDAF525C1586394"
        ],
        "Label": "waited",
        "Title": "X-Trace Task",
        "Host": "pinky19.mpi-sws.org",
        "Duration": "3035",
        "HRT": 25489053183885437,
        "Operation": "waited",
        "Timestamp": "1556272693124.520020",
        "TenantClass": 0,
        "Source": "SocketIOWithTimeout.java:335",
        "ThreadID": 8561,
        "ThreadName": "",
        "EventID": "2F777FE91E1D1EAB",
        "BaggageBytes": "[[248 5] [240 0] [0 20 210 157 178 249 241 146 15] [240 1] [0 14 218 245 37 193 88 99 148] [240 3] [0 2]]",
        "ProcessID": 2319
      },
      {
        "Cycles": 0,
        "Agent": "edu.brown.cs.systems.xtrace.logging.BaggageWrappers",
        "ProcessName": "Read",
        "TaskID": "14D29DB2F9F1920F",
        "ParentEventID": [
          "8DD451203188596A",
          "14110967AAAF93DC"
        ],
        "Label": "Merged current baggage with other baggage",
        "Title": "X-Trace Task",
        "Host": "pinky19.mpi-sws.org",
        "HRT": 25489053183880362,
        "Operation": "join",
        "Timestamp": "1556272693124.502441",
        "TenantClass": 0,
        "Source": "PacketHeader.java:168",
        "ThreadID": 1,
        "ThreadName": "",
        "EventID": "2206298854CC1C6A",
        "ProcessID": 6356
      },
      {
        "Cycles": 0,
        "Agent": "edu.brown.cs.systems.xtrace.logging.BaggageWrappers",
        "ProcessName": "Data",
        "TaskID": "14D29DB2F9F1920F",
        "ParentEventID": [
          "2F777FE91E1D1EAB"
        ],
        "Label": "Forking current baggage with Baggage.fork()",
        "Title": "X-Trace Task",
        "Host": "pinky19.mpi-sws.org",
        "HRT": 25489053183942251,
        "Operation": "fork",
        "Timestamp": "1556272693124.576904",
        "TenantClass": 0,
        "Source": "PacketHeader.java:95",
        "ThreadID": 8561,
        "ThreadName": "",
        "EventID": "E0F21D88444F5A5A",
        "BaggageBytes": "[[248 5] [240 0] [0 20 210 157 178 249 241 146 15] [240 1] [0 47 119 127 233 30 29 30 171] [240 3] [0 2]]",
        "ProcessID": 2319
      },
      {
        "Cycles": 0,
        "Agent": "edu.brown.cs.systems.xtrace.logging.BaggageWrappers",
        "ProcessName": "Read",
        "TaskID": "14D29DB2F9F1920F",
        "ParentEventID": [
          "0EDAF525C1586394",
          "2206298854CC1C6A"
        ],
        "Label": "Merged current baggage with other baggage",
        "Title": "X-Trace Task",
        "Host": "pinky19.mpi-sws.org",
        "HRT": 25489053183994945,
        "Operation": "join",
        "Timestamp": "1556272693124.617188",
        "TenantClass": 0,
        "Source": "PacketHeader.java:168",
        "ThreadID": 1,
        "ThreadName": "",
        "EventID": "B167282D1BDD8B8E",
        "ProcessID": 6356
      },
      {
        "Cycles": 0,
        "Agent": "Execution-Sleep",
        "ProcessName": "Data",
        "TaskID": "14D29DB2F9F1920F",
        "ParentEventID": [
          "E0F21D88444F5A5A"
        ],
        "Label": "waited",
        "Title": "X-Trace Task",
        "Host": "pinky19.mpi-sws.org",
        "Duration": "3039",
        "HRT": 25489053184000695,
        "Operation": "waited",
        "Timestamp": "1556272693124.635254",
        "TenantClass": 0,
        "Source": "SocketIOWithTimeout.java:335",
        "ThreadID": 8561,
        "ThreadName": "",
        "EventID": "27C63B73362070BE",
        "BaggageBytes": "[[248 5] [240 0] [0 20 210 157 178 249 241 146 15] [240 1] [0 224 242 29 136 68 79 90 90] [240 3] [0 2]]",
        "ProcessID": 2319
      },
      {
        "Cycles": 0,
        "Agent": "Execution-CPU",
        "ProcessName": "Data",
        "TaskID": "14D29DB2F9F1920F",
        "ParentEventID": [
          "333D8414964A320D"
        ],
        "Label": "unset",
        "Title": "X-Trace Task",
        "Host": "pinky19.mpi-sws.org",
        "Duration": "2070289",
        "HRT": 25489053184169944,
        "Operation": "unset",
        "Timestamp": "1556272693124.804688",
        "TenantClass": 0,
        "Source": "DataXceiver.java:261",
        "ThreadID": 8561,
        "ThreadName": "",
        "EventID": "4A5FFC11EB334F27",
        "BaggageBytes": "[[248 5] [240 0] [0 20 210 157 178 249 241 146 15] [240 1] [0 51 61 132 20 150 74 50 13] [240 3] [0 2]]",
        "ProcessID": 2319
      },
      {
        "Cycles": 0,
        "Agent": "edu.brown.cs.systems.xtrace.logging.BaggageWrappers",
        "ProcessName": "Data",
        "TaskID": "14D29DB2F9F1920F",
        "ParentEventID": [
          "27C63B73362070BE"
        ],
        "Label": "Forking current baggage with Baggage.fork()",
        "Title": "X-Trace Task",
        "Host": "pinky19.mpi-sws.org",
        "HRT": 25489053184058259,
        "Operation": "fork",
        "Timestamp": "1556272693124.692871",
        "TenantClass": 0,
        "Source": "PacketHeader.java:95",
        "ThreadID": 8561,
        "ThreadName": "",
        "EventID": "333D8414964A320D",
        "BaggageBytes": "[[248 5] [240 0] [0 20 210 157 178 249 241 146 15] [240 1] [0 39 198 59 115 54 32 112 190] [240 3] [0 2]]",
        "ProcessID": 2319
      },
      {
        "Cycles": 0,
        "Agent": "edu.brown.cs.systems.retro.benchmarks.hdfs_client.Reader",
        "ProcessName": "Read",
        "TaskID": "14D29DB2F9F1920F",
        "ParentEventID": [
          "0"
        ],
        "Label": "Reading file",
        "Title": "X-Trace Task",
        "Host": "pinky19.mpi-sws.org",
        "HRT": 25489053180401047,
        "Timestamp": "1556272693121.023193",
        "TenantClass": 0,
        "ThreadID": 1,
        "ThreadName": "",
        "EventID": "1521FEF50F8DE6F2",
        "ProcessID": 6356,
        "Tag": [
          "reader_1mb",
          "Read Size: 1048576"
        ]
      }
    ]
  }
]