[
  {
    "id": "E309B3934D0E45BD",
    "reports": [
      {
        "Cycles": 0,
        "Agent": "Execution-CPU",
        "ProcessName": "Read",
        "TaskID": "E309B3934D0E45BD",
        "ParentEventID": [
          "7F48D7D873150125"
        ],
        "Label": "unset",
        "Title": "X-Trace Task",
        "Host": "pinky19.mpi-sws.org",
        "Duration": "22436968",
        "HRT": 25491816608779231,
        "Operation": "unset",
        "Timestamp": "1556275456548.750000",
        "TenantClass": 0,
        "Source": "Client.java:1027",
        "ThreadID": 1,
        "ThreadName": "",
        "EventID": "0486970C84D5E1FD",
        "ProcessID": 21035
      },
      {
        "Cycles": 0,
        "Agent": "org.apache.hadoop.ipc.ProtobufRpcEngine",
        "ProcessName": "Read",
        "TaskID": "E309B3934D0E45BD",
        "ParentEventID": [
          "0F46D760B723F562"
        ],
        "Label": "Invoking org.apache.hadoop.hdfs.protocol.ClientProtocol.getBlockLocations",
        "Title": "X-Trace Task",
        "Host": "pinky19.mpi-sws.org",
        "HRT": 25491816608731273,
        "Timestamp": "1556275456548.701904",
        "TenantClass": 0,
        "Source": "ProtobufRpcEngine.java:228",
        "ThreadID": 1,
        "ThreadName": "",
        "EventID": "7F48D7D873150125",
        "ProcessID": 21035
      },
      {
        "Cycles": 0,
        "Agent": "edu.brown.cs.systems.retro.benchmarks.hdfs_client.Reader",
        "ProcessName": "Read",
        "TaskID": "E309B3934D0E45BD",
        "ParentEventID": [
          "0"
        ],
        "Label": "Reading file",
        "Title": "X-Trace Task",
        "Host": "pinky19.mpi-sws.org",
        "HRT": 25491816608582399,
        "Timestamp": "1556275456548.552979",
        "TenantClass": 0,
        "ThreadID": 1,
        "ThreadName": "",
        "EventID": "37C928A01538FA19",
        "ProcessID": 21035,
        "Tag": [
          "reader_1kb",
          "Read Size: 1024"
        ]
      },
      {
        "Cycles": 0,
        "Agent": "Execution-CPU",
        "ProcessName": "Read",
        "TaskID": "E309B3934D0E45BD",
        "ParentEventID": [
          "0486970C84D5E1FD"
        ],
        "Label": "set",
        "Title": "X-Trace Task",
        "Host": "pinky19.mpi-sws.org",
        "HRT": 25491816608819893,
        "Operation": "set",
        "Timestamp": "1556275456548.790527",
        "TenantClass": 0,
        "Source": "Client.java:1032",
        "ThreadID": 41,
        "ThreadName": "",
        "EventID": "2B6AFD1C8A589625",
        "ProcessID": 21035
      },
      {
        "Cycles": 0,
        "Agent": "edu.brown.cs.systems.retro.benchmarks.hdfs_client.Reader",
        "ProcessName": "Read",
        "TaskID": "E309B3934D0E45BD",
        "ParentEventID": [
          "37C928A01538FA19"
        ],
        "Label": "Reading file",
        "Title": "X-Trace Task",
        "Host": "pinky19.mpi-sws.org",
        "HRT": 25491816608656185,
        "Timestamp": "1556275456548.626953",
        "TenantClass": 0,
        "ThreadID": 1,
        "ThreadName": "",
        "EventID": "0F46D760B723F562",
        "ProcessID": 21035
      },
      {
        "Cycles": 0,
        "Agent": "Execution-CPU",
        "ProcessName": "Read",
        "TaskID": "E309B3934D0E45BD",
        "ParentEventID": [
          "256ED9F431124C85"
        ],
        "Label": "unset",
        "Title": "X-Trace Task",
        "Host": "pinky19.mpi-sws.org",
        "Duration": "80187",
        "HRT": 25491816608921944,
        "Operation": "unset",
        "Timestamp": "1556275456548.892578",
        "TenantClass": 0,
        "Source": "Client.java:1062",
        "ThreadID": 41,
        "ThreadName": "",
        "EventID": "0C0A9407605D8FA2",
        "ProcessID": 21035
      },
      {
        "Cycles": 0,
        "Agent": "edu.brown.cs.systems.xtrace.logging.BaggageWrappers",
        "ProcessName": "Read",
        "TaskID": "E309B3934D0E45BD",
        "ParentEventID": [
          "2B6AFD1C8A589625"
        ],
        "Label": "Forking current baggage with Baggage.fork()",
        "Title": "X-Trace Task",
        "Host": "pinky19.mpi-sws.org",
        "HRT": 25491816608842355,
        "Operation": "fork",
        "Timestamp": "1556275456548.812988",
        "TenantClass": 0,
        "Source": "Client.java:1043",
        "ThreadID": 41,
        "ThreadName": "",
        "EventID": "256ED9F431124C85",
        "ProcessID": 21035
      },
      {
        "Cycles": 0,
        "Agent": "Execution-CPU",
        "ProcessName": "Read",
        "TaskID": "E309B3934D0E45BD",
        "ParentEventID": [
          "0C0A9407605D8FA2"
        ],
        "Label": "set",
        "Title": "X-Trace Task",
        "Host": "pinky19.mpi-sws.org",
        "HRT": 25491816608948941,
        "Operation": "set",
        "Timestamp": "1556275456548.919678",
        "TenantClass": 0,
        "Source": "Client.java:1104",
        "ThreadID": 1,
        "ThreadName": "",
        "EventID": "56A646CB27B704E0",
        "ProcessID": 21035
      },
      {
        "Cycles": 0,
        "Agent": "Execution-CPU",
        "ProcessName": "Name",
        "TaskID": "E309B3934D0E45BD",
        "ParentEventID": [
          "256ED9F431124C85"
        ],
        "Label": "set",
        "Title": "X-Trace Task",
        "Host": "pinky19.mpi-sws.org",
        "HRT": 25491816608985372,
        "Operation": "set",
        "Timestamp": "1556275456548.968506",
        "TenantClass": 0,
        "Source": "Server.java:1840",
        "ThreadID": 48,
        "ThreadName": "",
        "EventID": "5093493D8C50282E",
        "BaggageBytes": "[[248 5] [240 0] [0 227 9 179 147 77 14 69 189] [240 1] [0 37 110 217 244 49 18 76 133] [240 3] [0 2]]",
        "ProcessID": 2171
      },
      {
        "Cycles": 0,
        "Agent": "edu.brown.cs.systems.xtrace.logging.BaggageWrappers",
        "ProcessName": "Name",
        "TaskID": "E309B3934D0E45BD",
        "ParentEventID": [
          "5093493D8C50282E"
        ],
        "Label": "Forking current baggage with Baggage.fork()",
        "Title": "X-Trace Task",
        "Host": "pinky19.mpi-sws.org",
        "HRT": 25491816609020396,
        "Operation": "fork",
        "Timestamp": "1556275456549.003662",
        "TenantClass": 0,
        "Source": "Server.java:550",
        "ThreadID": 48,
        "ThreadName": "",
        "EventID": "ABF9BA49E169327B",
        "BaggageBytes": "[[248 5] [240 0] [0 227 9 179 147 77 14 69 189] [240 1] [0 80 147 73 61 140 80 40 46] [240 3] [0 2]]",
        "ProcessID": 2171
      },
      {
        "Cycles": 0,
        "Agent": "Execution-CPU",
        "ProcessName": "Name",
        "TaskID": "E309B3934D0E45BD",
        "ParentEventID": [
          "ABF9BA49E169327B"
        ],
        "Label": "set",
        "Title": "X-Trace Task",
        "Host": "pinky19.mpi-sws.org",
        "HRT": 25491816609051966,
        "Operation": "set",
        "Timestamp": "1556275456549.035156",
        "TenantClass": 0,
        "Source": "Server.java:2071",
        "ThreadID": 60,
        "ThreadName": "",
        "EventID": "20E4859D8F6313FC",
        "BaggageBytes": "[[248 5] [240 0] [0 227 9 179 147 77 14 69 189] [240 1] [0 171 249 186 73 225 105 50 123] [240 3] [0 2]]",
        "ProcessID": 2171
      },
      {
        "Cycles": 0,
        "Agent": "Execution-CPU",
        "ProcessName": "Name",
        "TaskID": "E309B3934D0E45BD",
        "ParentEventID": [
          "ABF9BA49E169327B"
        ],
        "Label": "unset",
        "Title": "X-Trace Task",
        "Host": "pinky19.mpi-sws.org",
        "Duration": "27498",
        "HRT": 25491816609043875,
        "Operation": "unset",
        "Timestamp": "1556275456549.027100",
        "TenantClass": 0,
        "Source": "Server.java:1828",
        "ThreadID": 48,
        "ThreadName": "",
        "EventID": "11B31F87ACFB1FF9",
        "BaggageBytes": "[[248 5] [240 0] [0 227 9 179 147 77 14 69 189] [240 1] [0 171 249 186 73 225 105 50 123] [240 3] [0 2]]",
        "ProcessID": 2171
      },
      {
        "Cycles": 0,
        "Agent": "org.apache.hadoop.ipc.Server",
        "ProcessName": "Name",
        "TaskID": "E309B3934D0E45BD",
        "ParentEventID": [
          "20E4859D8F6313FC"
        ],
        "Label": "getBlockLocations in org.apache.hadoop.hdfs.protocol.ClientProtocol",
        "Title": "X-Trace Task",
        "Host": "pinky19.mpi-sws.org",
        "HRT": 25491816609090934,
        "Timestamp": "1556275456549.074219",
        "TenantClass": 0,
        "Source": "ProtobufRpcEngine.java:601",
        "ThreadID": 60,
        "ThreadName": "",
        "EventID": "5770089092E287BB",
        "BaggageBytes": "[[248 5] [240 0] [0 227 9 179 147 77 14 69 189] [240 1] [0 32 228 133 157 143 99 19 252] [240 3] [0 2]]",
        "ProcessID": 2171
      },
      {
        "Cycles": 0,
        "Agent": "edu.brown.cs.systems.xtrace.logging.BaggageWrappers",
        "ProcessName": "Name",
        "TaskID": "E309B3934D0E45BD",
        "ParentEventID": [
          "FBD256DB20C48824"
        ],
        "Label": "Forking current baggage with Baggage.fork()",
        "Title": "X-Trace Task",
        "Host": "pinky19.mpi-sws.org",
        "HRT": 25491816609194168,
        "Operation": "fork",
        "Timestamp": "1556275456549.177490",
        "TenantClass": 0,
        "Source": "Server.java:2398",
        "ThreadID": 60,
        "ThreadName": "",
        "EventID": "86D81974581A5B1C",
        "BaggageBytes": "[[248 5] [240 0] [0 227 9 179 147 77 14 69 189] [240 1] [0 251 210 86 219 32 196 136 36] [240 3] [0 2]]",
        "ProcessID": 2171
      },
      {
        "Cycles": 0,
        "Agent": "org.apache.hadoop.hdfs.server.namenode.FSNamesystem.audit",
        "ProcessName": "Name",
        "TaskID": "E309B3934D0E45BD",
        "ParentEventID": [
          "5770089092E287BB"
        ],
        "Label": "allowed=true\tugi=plascas (auth:SIMPLE)\tip=/139.19.171.63\tcmd=open\tsrc=/ds/m5rwG9FxpDKBBLm3\tdst=null\tperm=null\tproto=rpc",
        "Title": "X-Trace Task",
        "Host": "pinky19.mpi-sws.org",
        "HRT": 25491816609141201,
        "Timestamp": "1556275456549.124512",
        "TenantClass": 0,
        "Source": "FSNamesystem.java:8313",
        "ThreadID": 60,
        "ThreadName": "",
        "EventID": "FBD256DB20C48824",
        "BaggageBytes": "[[248 5] [240 0] [0 227 9 179 147 77 14 69 189] [240 1] [0 87 112 8 144 146 226 135 187] [240 3] [0 2]]",
        "ProcessID": 2171
      },
      {
        "Cycles": 0,
        "Agent": "Execution-CPU",
        "ProcessName": "Name",
        "TaskID": "E309B3934D0E45BD",
        "ParentEventID": [
          "86D81974581A5B1C"
        ],
        "Label": "unset",
        "Title": "X-Trace Task",
        "Host": "pinky19.mpi-sws.org",
        "Duration": "233001",
        "HRT": 25491816609311149,
        "Operation": "unset",
        "Timestamp": "1556275456549.294434",
        "TenantClass": 0,
        "Source": "Server.java:1058",
        "ThreadID": 60,
        "ThreadName": "",
        "EventID": "80325353C27BD278",
        "BaggageBytes": "[[248 5] [240 0] [0 227 9 179 147 77 14 69 189] [240 1] [0 134 216 25 116 88 26 91 28] [240 3] [0 2]]",
        "ProcessID": 2171
      },
      {
        "Cycles": 0,
        "Agent": "Execution-CPU",
        "ProcessName": "Read",
        "TaskID": "E309B3934D0E45BD",
        "ParentEventID": [
          "81A29AB3924CA7F3"
        ],
        "Label": "unset",
        "Title": "X-Trace Task",
        "Host": "pinky19.mpi-sws.org",
        "Duration": "14886",
        "HRT": 25491816609394062,
        "Operation": "unset",
        "Timestamp": "1556275456549.364746",
        "TenantClass": 0,
        "Source": "Client.java:1168",
        "ThreadID": 37,
        "ThreadName": "",
        "EventID": "FD25B706541B6374",
        "ProcessID": 21035
      },
      {
        "Cycles": 0,
        "Agent": "Execution-CPU",
        "ProcessName": "Read",
        "TaskID": "E309B3934D0E45BD",
        "ParentEventID": [
          "86D81974581A5B1C"
        ],
        "Label": "set",
        "Title": "X-Trace Task",
        "Host": "pinky19.mpi-sws.org",
        "HRT": 25491816609362235,
        "Operation": "set",
        "Timestamp": "1556275456549.333008",
        "TenantClass": 0,
        "Source": "Client.java:302",
        "ThreadID": 37,
        "ThreadName": "",
        "EventID": "81A29AB3924CA7F3",
        "ProcessID": 21035
      },
      {
        "Cycles": 0,
        "Agent": "Execution-Sleep",
        "ProcessName": "Read",
        "TaskID": "E309B3934D0E45BD",
        "ParentEventID": [
          "56A646CB27B704E0"
        ],
        "Label": "waited",
        "Title": "X-Trace Task",
        "Host": "pinky19.mpi-sws.org",
        "Duration": "477987",
        "HRT": 25491816609441459,
        "Operation": "waited",
        "Timestamp": "1556275456549.412109",
        "TenantClass": 0,
        "Source": "Client.java:1537",
        "ThreadID": 1,
        "ThreadName": "",
        "EventID": "90B84DC6D6F4A2F2",
        "ProcessID": 21035
      },
      {
        "Cycles": 0,
        "Agent": "org.apache.hadoop.ipc.ProtobufRpcEngine",
        "ProcessName": "Read",
        "TaskID": "E309B3934D0E45BD",
        "ParentEventID": [
          "6CA2FC7D7D47C7FD"
        ],
        "Label": "org.apache.hadoop.hdfs.protocol.ClientProtocol.getBlockLocations completed",
        "Title": "X-Trace Task",
        "Host": "pinky19.mpi-sws.org",
        "HRT": 25491816609535213,
        "Timestamp": "1556275456549.505859",
        "TenantClass": 0,
        "Source": "ProtobufRpcEngine.java:275",
        "ThreadID": 1,
        "ThreadName": "",
        "EventID": "C4DEA0B29C019AF3",
        "ProcessID": 21035
      },
      {
        "Cycles": 0,
        "Agent": "edu.brown.cs.systems.xtrace.logging.BaggageWrappers",
        "ProcessName": "Read",
        "TaskID": "E309B3934D0E45BD",
        "ParentEventID": [
          "90B84DC6D6F4A2F2",
          "FD25B706541B6374"
        ],
        "Label": "Merged current baggage with other baggage",
        "Title": "X-Trace Task",
        "Host": "pinky19.mpi-sws.org",
        "HRT": 25491816609472536,
        "Operation": "join",
        "Timestamp": "1556275456549.443115",
        "TenantClass": 0,
        "Source": "Client.java:1545",
        "ThreadID": 1,
        "ThreadName": "",
        "EventID": "6CA2FC7D7D47C7FD",
        "ProcessID": 21035
      },
      {
        "Cycles": 0,
        "Agent": "edu.brown.cs.systems.xtrace.logging.BaggageWrappers",
        "ProcessName": "Read",
        "TaskID": "E309B3934D0E45BD",
        "ParentEventID": [
          "C4DEA0B29C019AF3"
        ],
        "Label": "Forking current baggage with Baggage.fork()",
        "Title": "X-Trace Task",
        "Host": "pinky19.mpi-sws.org",
        "HRT": 25491816609650209,
        "Operation": "fork",
        "Timestamp": "1556275456549.620850",
        "TenantClass": 0,
        "Source": "DataTransferProtoUtil.java:94",
        "ThreadID": 1,
        "ThreadName": "",
        "EventID": "102FDD4D5625B1A0",
        "ProcessID": 21035
      },
      {
        "Cycles": 0,
        "Agent": "edu.brown.cs.systems.xtrace.logging.XTraceInit",
        "ProcessName": "Data",
        "TaskID": "E309B3934D0E45BD",
        "ParentEventID": [
          "B8DCFD6446EB2B52"
        ],
        "Label": "Thread.setName: DataXceiver for client DFSClient_NONMAPREDUCE_1377588049_1 at /139.19.171.63:36074 [Sending block BP-1633380353-139.19.171.63-1554193446451:blk_1073761091_20267]",
        "Title": "X-Trace Task",
        "Host": "pinky19.mpi-sws.org",
        "HRT": 25491816609877620,
        "Timestamp": "1556275456549.863281",
        "TenantClass": 0,
        "Source": "DataXceiver.java:168",
        "ThreadID": 9602,
        "ThreadName": "",
        "EventID": "C2E86A8A2060EE38",
        "BaggageBytes": "[[248 5] [240 0] [0 227 9 179 147 77 14 69 189] [240 1] [0 184 220 253 100 70 235 43 82] [240 3] [0 2]]",
        "ProcessID": 2319
      },
      {
        "Cycles": 0,
        "Agent": "Execution-CPU",
        "ProcessName": "Data",
        "TaskID": "E309B3934D0E45BD",
        "ParentEventID": [
          "102FDD4D5625B1A0"
        ],
        "Label": "set",
        "Title": "X-Trace Task",
        "Host": "pinky19.mpi-sws.org",
        "HRT": 25491816609835815,
        "Operation": "set",
        "Timestamp": "1556275456549.821533",
        "TenantClass": 0,
        "Source": "Receiver.java:117",
        "ThreadID": 9602,
        "ThreadName": "",
        "EventID": "B8DCFD6446EB2B52",
        "BaggageBytes": "[[248 5] [240 0] [0 227 9 179 147 77 14 69 189] [240 1] [0 16 47 221 77 86 37 177 160] [240 3] [0 2]]",
        "ProcessID": 2319
      },
      {
        "Cycles": 0,
        "Agent": "edu.brown.cs.systems.xtrace.logging.BaggageWrappers",
        "ProcessName": "Data",
        "TaskID": "E309B3934D0E45BD",
        "ParentEventID": [
          "C2E86A8A2060EE38"
        ],
        "Label": "Forking current baggage with Baggage.fork()",
        "Title": "X-Trace Task",
        "Host": "pinky19.mpi-sws.org",
        "HRT": 25491816609962062,
        "Operation": "fork",
        "Timestamp": "1556275456549.947754",
        "TenantClass": 0,
        "Source": "DataXceiver.java:1257",
        "ThreadID": 9602,
        "ThreadName": "",
        "EventID": "C869B6A1592130E1",
        "BaggageBytes": "[[248 5] [240 0] [0 227 9 179 147 77 14 69 189] [240 1] [0 194 232 106 138 32 96 238 56] [240 3] [0 2]]",
        "ProcessID": 2319
      },
      {
        "Cycles": 0,
        "Agent": "Execution-Sleep",
        "ProcessName": "Read",
        "TaskID": "E309B3934D0E45BD",
        "ParentEventID": [
          "102FDD4D5625B1A0"
        ],
        "Label": "waited",
        "Title": "X-Trace Task",
        "Host": "pinky19.mpi-sws.org",
        "Duration": "271702",
        "HRT": 25491816610060898,
        "Operation": "waited",
        "Timestamp": "1556275456550.031494",
        "TenantClass": 0,
        "Source": "SocketIOWithTimeout.java:335",
        "ThreadID": 1,
        "ThreadName": "",
        "EventID": "D5427637A227A8F2",
        "ProcessID": 21035
      },
      {
        "Cycles": 0,
        "Agent": "edu.brown.cs.systems.xtrace.logging.BaggageWrappers",
        "ProcessName": "Data",
        "TaskID": "E309B3934D0E45BD",
        "ParentEventID": [
          "C869B6A1592130E1"
        ],
        "Label": "Forking current baggage with Baggage.fork()",
        "Title": "X-Trace Task",
        "Host": "pinky19.mpi-sws.org",
        "HRT": 25491816610035665,
        "Operation": "fork",
        "Timestamp": "1556275456550.021484",
        "TenantClass": 0,
        "Source": "PacketHeader.java:95",
        "ThreadID": 9602,
        "ThreadName": "",
        "EventID": "9A37F197970DDE58",
        "BaggageBytes": "[[248 5] [240 0] [0 227 9 179 147 77 14 69 189] [240 1] [0 200 105 182 161 89 33 48 225] [240 3] [0 2]]",
        "ProcessID": 2319
      },
      {
        "Cycles": 0,
        "Agent": "Execution-Sleep",
        "ProcessName": "Data",
        "TaskID": "E309B3934D0E45BD",
        "ParentEventID": [
          "9A37F197970DDE58"
        ],
        "Label": "waited",
        "Title": "X-Trace Task",
        "Host": "pinky19.mpi-sws.org",
        "Duration": "4041",
        "HRT": 25491816610109855,
        "Operation": "waited",
        "Timestamp": "1556275456550.095459",
        "TenantClass": 0,
        "Source": "SocketIOWithTimeout.java:335",
        "ThreadID": 9602,
        "ThreadName": "",
        "EventID": "C7A4F453EBD0E9EB",
        "BaggageBytes": "[[248 5] [240 0] [0 227 9 179 147 77 14 69 189] [240 1] [0 154 55 241 151 151 13 222 88] [240 3] [0 2]]",
        "ProcessID": 2319
      },
      {
        "Cycles": 0,
        "Agent": "edu.brown.cs.systems.xtrace.logging.BaggageWrappers",
        "ProcessName": "Data",
        "TaskID": "E309B3934D0E45BD",
        "ParentEventID": [
          "C7A4F453EBD0E9EB"
        ],
        "Label": "Forking current baggage with Baggage.fork()",
        "Title": "X-Trace Task",
        "Host": "pinky19.mpi-sws.org",
        "HRT": 25491816610169475,
        "Operation": "fork",
        "Timestamp": "1556275456550.155273",
        "TenantClass": 0,
        "Source": "PacketHeader.java:95",
        "ThreadID": 9602,
        "ThreadName": "",
        "EventID": "E05A06C019B5F429",
        "BaggageBytes": "[[248 5] [240 0] [0 227 9 179 147 77 14 69 189] [240 1] [0 199 164 244 83 235 208 233 235] [240 3] [0 2]]",
        "ProcessID": 2319
      },
      {
        "Cycles": 0,
        "Agent": "edu.brown.cs.systems.xtrace.logging.BaggageWrappers",
        "ProcessName": "Read",
        "TaskID": "E309B3934D0E45BD",
        "ParentEventID": [
          "C869B6A1592130E1",
          "D5427637A227A8F2"
        ],
        "Label": "Merged current baggage with other baggage",
        "Title": "X-Trace Task",
        "Host": "pinky19.mpi-sws.org",
        "HRT": 25491816610169167,
        "Operation": "join",
        "Timestamp": "1556275456550.139893",
        "TenantClass": 0,
        "Source": "RemoteBlockReader2.java:429",
        "ThreadID": 1,
        "ThreadName": "",
        "EventID": "637269FBD910C440",
        "ProcessID": 21035
      },
      {
        "Cycles": 0,
        "Agent": "edu.brown.cs.systems.xtrace.logging.BaggageWrappers",
        "ProcessName": "Read",
        "TaskID": "E309B3934D0E45BD",
        "ParentEventID": [
          "9A37F197970DDE58",
          "637269FBD910C440"
        ],
        "Label": "Merged current baggage with other baggage",
        "Title": "X-Trace Task",
        "Host": "pinky19.mpi-sws.org",
        "HRT": 25491816610258019,
        "Operation": "join",
        "Timestamp": "1556275456550.228760",
        "TenantClass": 0,
        "Source": "PacketHeader.java:168",
        "ThreadID": 1,
        "ThreadName": "",
        "EventID": "ADA35D2D45535C0B",
        "ProcessID": 21035
      },
      {
        "Cycles": 0,
        "Agent": "edu.brown.cs.systems.xtrace.logging.BaggageWrappers",
        "ProcessName": "Read",
        "TaskID": "E309B3934D0E45BD",
        "ParentEventID": [
          "F18A11E023E24F11"
        ],
        "Label": "Forking current baggage with Baggage.fork()",
        "Title": "X-Trace Task",
        "Host": "pinky19.mpi-sws.org",
        "HRT": 25491816610330197,
        "Operation": "fork",
        "Timestamp": "1556275456550.300781",
        "TenantClass": 0,
        "Source": "RemoteBlockReader2.java:361",
        "ThreadID": 1,
        "ThreadName": "",
        "EventID": "E294D57FB825B42E",
        "ProcessID": 21035
      },
      {
        "Cycles": 0,
        "Agent": "Execution-Sleep",
        "ProcessName": "Data",
        "TaskID": "E309B3934D0E45BD",
        "ParentEventID": [
          "E05A06C019B5F429"
        ],
        "Label": "waited",
        "Title": "X-Trace Task",
        "Host": "pinky19.mpi-sws.org",
        "Duration": "135085",
        "HRT": 25491816610385253,
        "Operation": "waited",
        "Timestamp": "1556275456550.370850",
        "TenantClass": 0,
        "Source": "SocketIOWithTimeout.java:335",
        "ThreadID": 9602,
        "ThreadName": "",
        "EventID": "92F0D6F187CC86A5",
        "BaggageBytes": "[[248 5] [240 0] [0 227 9 179 147 77 14 69 189] [240 1] [0 224 90 6 192 25 181 244 41] [240 3] [0 2]]",
        "ProcessID": 2319
      },
      {
        "Cycles": 0,
        "Agent": "edu.brown.cs.systems.xtrace.logging.BaggageWrappers",
        "ProcessName": "Read",
        "TaskID": "E309B3934D0E45BD",
        "ParentEventID": [
          "ADA35D2D45535C0B",
          "E05A06C019B5F429"
        ],
        "Label": "Merged current baggage with other baggage",
        "Title": "X-Trace Task",
        "Host": "pinky19.mpi-sws.org",
        "HRT": 25491816610317581,
        "Operation": "join",
        "Timestamp": "1556275456550.288330",
        "TenantClass": 0,
        "Source": "PacketHeader.java:168",
        "ThreadID": 1,
        "ThreadName": "",
        "EventID": "F18A11E023E24F11",
        "ProcessID": 21035
      },
      {
        "Cycles": 0,
        "Agent": "edu.brown.cs.systems.xtrace.logging.BaggageWrappers",
        "ProcessName": "Data",
        "TaskID": "E309B3934D0E45BD",
        "ParentEventID": [
          "E294D57FB825B42E",
          "92F0D6F187CC86A5"
        ],
        "Label": "Merged current baggage with other baggage",
        "Title": "X-Trace Task",
        "Host": "pinky19.mpi-sws.org",
        "HRT": 25491816610448120,
        "Operation": "join",
        "Timestamp": "1556275456550.433838",
        "TenantClass": 0,
        "Source": "DataXceiver.java:574",
        "ThreadID": 9602,
        "ThreadName": "",
        "EventID": "675406F444947F1F",
        "BaggageBytes": "[[248 5] [240 0] [0 227 9 179 147 77 14 69 189] [240 1] [0 146 240 214 241 135 204 134 165] [0 226 148 213 127 184 37 180 46] [240 3] [0 2]]",
        "ProcessID": 2319
      },
      {
        "Cycles": 0,
        "Agent": "Execution-CPU",
        "ProcessName": "Data",
        "TaskID": "E309B3934D0E45BD",
        "ParentEventID": [
          "675406F444947F1F"
        ],
        "Label": "unset",
        "Title": "X-Trace Task",
        "Host": "pinky19.mpi-sws.org",
        "Duration": "603392",
        "HRT": 25491816610469342,
        "Operation": "unset",
        "Timestamp": "1556275456550.455078",
        "TenantClass": 0,
        "Source": "DataXceiver.java:261",
        "ThreadID": 9602,
        "ThreadName": "",
        "EventID": "203F73328C1189D1",
        "BaggageBytes": "[[248 5] [240 0] [0 227 9 179 147 77 14 69 189] [240 1] [0 103 84 6 244 68 148 127 31] [240 3] [0 2]]",
        "ProcessID": 2319
      }
    ]
  }
]