[
  {
    "id": "E3A2B1C386651507",
    "reports": [
      {
        "Cycles": 0,
        "Agent": "Execution-CPU",
        "ProcessName": "Read",
        "TaskID": "E3A2B1C386651507",
        "ParentEventID": [
          "D34B7E9DDC13641B"
        ],
        "Label": "unset",
        "Title": "X-Trace Task",
        "Host": "pinky19.mpi-sws.org",
        "Duration": "22224713",
        "HRT": 25491800156600214,
        "Operation": "unset",
        "Timestamp": "1556275440096.954346",
        "TenantClass": 0,
        "Source": "Client.java:1027",
        "ThreadID": 1,
        "ThreadName": "",
        "EventID": "8C152CE6DA044F74",
        "ProcessID": 21035
      },
      {
        "Cycles": 0,
        "Agent": "org.apache.hadoop.ipc.ProtobufRpcEngine",
        "ProcessName": "Read",
        "TaskID": "E3A2B1C386651507",
        "ParentEventID": [
          "E3E46B97D8B96488"
        ],
        "Label": "Invoking org.apache.hadoop.hdfs.protocol.ClientProtocol.getBlockLocations",
        "Title": "X-Trace Task",
        "Host": "pinky19.mpi-sws.org",
        "HRT": 25491800156569081,
        "Timestamp": "1556275440096.923096",
        "TenantClass": 0,
        "Source": "ProtobufRpcEngine.java:228",
        "ThreadID": 1,
        "ThreadName": "",
        "EventID": "D34B7E9DDC13641B",
        "ProcessID": 21035
      },
      {
        "Cycles": 0,
        "Agent": "edu.brown.cs.systems.retro.benchmarks.hdfs_client.Reader",
        "ProcessName": "Read",
        "TaskID": "E3A2B1C386651507",
        "ParentEventID": [
          "A70422791F07BA52"
        ],
        "Label": "Reading file",
        "Title": "X-Trace Task",
        "Host": "pinky19.mpi-sws.org",
        "HRT": 25491800156527975,
        "Timestamp": "1556275440096.882080",
        "TenantClass": 0,
        "ThreadID": 1,
        "ThreadName": "",
        "EventID": "E3E46B97D8B96488",
        "ProcessID": 21035
      },
      {
        "Cycles": 0,
        "Agent": "Execution-CPU",
        "ProcessName": "Read",
        "TaskID": "E3A2B1C386651507",
        "ParentEventID": [
          "8C152CE6DA044F74"
        ],
        "Label": "set",
        "Title": "X-Trace Task",
        "Host": "pinky19.mpi-sws.org",
        "HRT": 25491800156647295,
        "Operation": "set",
        "Timestamp": "1556275440097.001465",
        "TenantClass": 0,
        "Source": "Client.java:1032",
        "ThreadID": 41,
        "ThreadName": "",
        "EventID": "5E945AD81363B172",
        "ProcessID": 21035
      },
      {
        "Cycles": 0,
        "Agent": "edu.brown.cs.systems.xtrace.logging.BaggageWrappers",
        "ProcessName": "Read",
        "TaskID": "E3A2B1C386651507",
        "ParentEventID": [
          "5E945AD81363B172"
        ],
        "Label": "Forking current baggage with Baggage.fork()",
        "Title": "X-Trace Task",
        "Host": "pinky19.mpi-sws.org",
        "HRT": 25491800156666129,
        "Operation": "fork",
        "Timestamp": "1556275440097.020264",
        "TenantClass": 0,
        "Source": "Client.java:1043",
        "ThreadID": 41,
        "ThreadName": "",
        "EventID": "3E9E9C32D1415452",
        "ProcessID": 21035
      },
      {
        "Cycles": 0,
        "Agent": "Execution-CPU",
        "ProcessName": "Read",
        "TaskID": "E3A2B1C386651507",
        "ParentEventID": [
          "6DE68C3A5E244A9F"
        ],
        "Label": "set",
        "Title": "X-Trace Task",
        "Host": "pinky19.mpi-sws.org",
        "HRT": 25491800156754606,
        "Operation": "set",
        "Timestamp": "1556275440097.108643",
        "TenantClass": 0,
        "Source": "Client.java:1104",
        "ThreadID": 1,
        "ThreadName": "",
        "EventID": "FC57588A61EAC6DF",
        "ProcessID": 21035
      },
      {
        "Cycles": 0,
        "Agent": "Execution-CPU",
        "ProcessName": "Name",
        "TaskID": "E3A2B1C386651507",
        "ParentEventID": [
          "3E9E9C32D1415452"
        ],
        "Label": "set",
        "Title": "X-Trace Task",
        "Host": "pinky19.mpi-sws.org",
        "HRT": 25491800156782365,
        "Operation": "set",
        "Timestamp": "1556275440097.166504",
        "TenantClass": 0,
        "Source": "Server.java:1840",
        "ThreadID": 48,
        "ThreadName": "",
        "EventID": "B4EF7C6E67C47891",
        "BaggageBytes": "[[248 5] [240 0] [0 227 162 177 195 134 101 21 7] [240 1] [0 62 158 156 50 209 65 84 82] [240 3] [0 2]]",
        "ProcessID": 2171
      },
      {
        "Cycles": 0,
        "Agent": "edu.brown.cs.systems.xtrace.logging.BaggageWrappers",
        "ProcessName": "Name",
        "TaskID": "E3A2B1C386651507",
        "ParentEventID": [
          "B4EF7C6E67C47891"
        ],
        "Label": "Forking current baggage with Baggage.fork()",
        "Title": "X-Trace Task",
        "Host": "pinky19.mpi-sws.org",
        "HRT": 25491800156813056,
        "Operation": "fork",
        "Timestamp": "1556275440097.197266",
        "TenantClass": 0,
        "Source": "Server.java:550",
        "ThreadID": 48,
        "ThreadName": "",
        "EventID": "14FAEC467A1AA7FE",
        "BaggageBytes": "[[248 5] [240 0] [0 227 162 177 195 134 101 21 7] [240 1] [0 180 239 124 110 103 196 120 145] [240 3] [0 2]]",
        "ProcessID": 2171
      },
      {
        "Cycles": 0,
        "Agent": "Execution-CPU",
        "ProcessName": "Read",
        "TaskID": "E3A2B1C386651507",
        "ParentEventID": [
          "3E9E9C32D1415452"
        ],
        "Label": "unset",
        "Title": "X-Trace Task",
        "Host": "pinky19.mpi-sws.org",
        "Duration": "67119",
        "HRT": 25491800156732355,
        "Operation": "unset",
        "Timestamp": "1556275440097.086426",
        "TenantClass": 0,
        "Source": "Client.java:1062",
        "ThreadID": 41,
        "ThreadName": "",
        "EventID": "6DE68C3A5E244A9F",
        "ProcessID": 21035
      },
      {
        "Cycles": 0,
        "Agent": "Execution-CPU",
        "ProcessName": "Name",
        "TaskID": "E3A2B1C386651507",
        "ParentEventID": [
          "14FAEC467A1AA7FE"
        ],
        "Label": "unset",
        "Title": "X-Trace Task",
        "Host": "pinky19.mpi-sws.org",
        "Duration": "26050",
        "HRT": 25491800156835227,
        "Operation": "unset",
        "Timestamp": "1556275440097.219482",
        "TenantClass": 0,
        "Source": "Server.java:1828",
        "ThreadID": 48,
        "ThreadName": "",
        "EventID": "1353C1CC65604195",
        "BaggageBytes": "[[248 5] [240 0] [0 227 162 177 195 134 101 21 7] [240 1] [0 20 250 236 70 122 26 167 254] [240 3] [0 2]]",
        "ProcessID": 2171
      },
      {
        "Cycles": 0,
        "Agent": "org.apache.hadoop.ipc.Server",
        "ProcessName": "Name",
        "TaskID": "E3A2B1C386651507",
        "ParentEventID": [
          "C23D71C6673274BA"
        ],
        "Label": "getBlockLocations in org.apache.hadoop.hdfs.protocol.ClientProtocol",
        "Title": "X-Trace Task",
        "Host": "pinky19.mpi-sws.org",
        "HRT": 25491800156886122,
        "Timestamp": "1556275440097.270264",
        "TenantClass": 0,
        "Source": "ProtobufRpcEngine.java:601",
        "ThreadID": 58,
        "ThreadName": "",
        "EventID": "B8401E451A7C58EC",
        "BaggageBytes": "[[248 5] [240 0] [0 227 162 177 195 134 101 21 7] [240 1] [0 194 61 113 198 103 50 116 186] [240 3] [0 2]]",
        "ProcessID": 2171
      },
      {
        "Cycles": 0,
        "Agent": "org.apache.hadoop.hdfs.server.namenode.FSNamesystem.audit",
        "ProcessName": "Name",
        "TaskID": "E3A2B1C386651507",
        "ParentEventID": [
          "B8401E451A7C58EC"
        ],
        "Label": "allowed=true\tugi=plascas (auth:SIMPLE)\tip=/139.19.171.63\tcmd=open\tsrc=/ds/M9O4Kp6RA1fv7mhG\tdst=null\tperm=null\tproto=rpc",
        "Title": "X-Trace Task",
        "Host": "pinky19.mpi-sws.org",
        "HRT": 25491800156930516,
        "Timestamp": "1556275440097.314697",
        "TenantClass": 0,
        "Source": "FSNamesystem.java:8313",
        "ThreadID": 58,
        "ThreadName": "",
        "EventID": "90A95A5C8715A31B",
        "BaggageBytes": "[[248 5] [240 0] [0 227 162 177 195 134 101 21 7] [240 1] [0 184 64 30 69 26 124 88 236] [240 3] [0 2]]",
        "ProcessID": 2171
      },
      {
        "Cycles": 0,
        "Agent": "Execution-CPU",
        "ProcessName": "Name",
        "TaskID": "E3A2B1C386651507",
        "ParentEventID": [
          "14FAEC467A1AA7FE"
        ],
        "Label": "set",
        "Title": "X-Trace Task",
        "Host": "pinky19.mpi-sws.org",
        "HRT": 25491800156846553,
        "Operation": "set",
        "Timestamp": "1556275440097.230713",
        "TenantClass": 0,
        "Source": "Server.java:2071",
        "ThreadID": 58,
        "ThreadName": "",
        "EventID": "C23D71C6673274BA",
        "BaggageBytes": "[[248 5] [240 0] [0 227 162 177 195 134 101 21 7] [240 1] [0 20 250 236 70 122 26 167 254] [240 3] [0 2]]",
        "ProcessID": 2171
      },
      {
        "Cycles": 0,
        "Agent": "edu.brown.cs.systems.xtrace.logging.BaggageWrappers",
        "ProcessName": "Name",
        "TaskID": "E3A2B1C386651507",
        "ParentEventID": [
          "90A95A5C8715A31B"
        ],
        "Label": "Forking current baggage with Baggage.fork()",
        "Title": "X-Trace Task",
        "Host": "pinky19.mpi-sws.org",
        "HRT": 25491800156985072,
        "Operation": "fork",
        "Timestamp": "1556275440097.369141",
        "TenantClass": 0,
        "Source": "Server.java:2398",
        "ThreadID": 58,
        "ThreadName": "",
        "EventID": "DDBDA71B85FCA1B5",
        "BaggageBytes": "[[248 5] [240 0] [0 227 162 177 195 134 101 21 7] [240 1] [0 144 169 90 92 135 21 163 27] [240 3] [0 2]]",
        "ProcessID": 2171
      },
      {
        "Cycles": 0,
        "Agent": "Execution-CPU",
        "ProcessName": "Read",
        "TaskID": "E3A2B1C386651507",
        "ParentEventID": [
          "DDBDA71B85FCA1B5"
        ],
        "Label": "set",
        "Title": "X-Trace Task",
        "Host": "pinky19.mpi-sws.org",
        "HRT": 25491800157161200,
        "Operation": "set",
        "Timestamp": "1556275440097.515381",
        "TenantClass": 0,
        "Source": "Client.java:302",
        "ThreadID": 37,
        "ThreadName": "",
        "EventID": "344953DB07927412",
        "ProcessID": 21035
      },
      {
        "Cycles": 0,
        "Agent": "Execution-CPU",
        "ProcessName": "Name",
        "TaskID": "E3A2B1C386651507",
        "ParentEventID": [
          "DDBDA71B85FCA1B5"
        ],
        "Label": "unset",
        "Title": "X-Trace Task",
        "Host": "pinky19.mpi-sws.org",
        "Duration": "212650",
        "HRT": 25491800157085898,
        "Operation": "unset",
        "Timestamp": "1556275440097.469971",
        "TenantClass": 0,
        "Source": "Server.java:1058",
        "ThreadID": 58,
        "ThreadName": "",
        "EventID": "D002762F0EE2F7A1",
        "BaggageBytes": "[[248 5] [240 0] [0 227 162 177 195 134 101 21 7] [240 1] [0 221 189 167 27 133 252 161 181] [240 3] [0 2]]",
        "ProcessID": 2171
      },
      {
        "Cycles": 0,
        "Agent": "Execution-CPU",
        "ProcessName": "Read",
        "TaskID": "E3A2B1C386651507",
        "ParentEventID": [
          "344953DB07927412"
        ],
        "Label": "unset",
        "Title": "X-Trace Task",
        "Host": "pinky19.mpi-sws.org",
        "Duration": "9426",
        "HRT": 25491800157187099,
        "Operation": "unset",
        "Timestamp": "1556275440097.541260",
        "TenantClass": 0,
        "Source": "Client.java:1168",
        "ThreadID": 37,
        "ThreadName": "",
        "EventID": "65698E087945A445",
        "ProcessID": 21035
      },
      {
        "Cycles": 0,
        "Agent": "Execution-Sleep",
        "ProcessName": "Read",
        "TaskID": "E3A2B1C386651507",
        "ParentEventID": [
          "FC57588A61EAC6DF"
        ],
        "Label": "waited",
        "Title": "X-Trace Task",
        "Host": "pinky19.mpi-sws.org",
        "Duration": "441743",
        "HRT": 25491800157207556,
        "Operation": "waited",
        "Timestamp": "1556275440097.561768",
        "TenantClass": 0,
        "Source": "Client.java:1537",
        "ThreadID": 1,
        "ThreadName": "",
        "EventID": "D4A371007AE11FBB",
        "ProcessID": 21035
      },
      {
        "Cycles": 0,
        "Agent": "edu.brown.cs.systems.xtrace.logging.BaggageWrappers",
        "ProcessName": "Read",
        "TaskID": "E3A2B1C386651507",
        "ParentEventID": [
          "D4A371007AE11FBB",
          "65698E087945A445"
        ],
        "Label": "Merged current baggage with other baggage",
        "Title": "X-Trace Task",
        "Host": "pinky19.mpi-sws.org",
        "HRT": 25491800157231321,
        "Operation": "join",
        "Timestamp": "1556275440097.585449",
        "TenantClass": 0,
        "Source": "Client.java:1545",
        "ThreadID": 1,
        "ThreadName": "",
        "EventID": "3C6FCE9ED919F68B",
        "ProcessID": 21035
      },
      {
        "Cycles": 0,
        "Agent": "org.apache.hadoop.ipc.ProtobufRpcEngine",
        "ProcessName": "Read",
        "TaskID": "E3A2B1C386651507",
        "ParentEventID": [
          "3C6FCE9ED919F68B"
        ],
        "Label": "org.apache.hadoop.hdfs.protocol.ClientProtocol.getBlockLocations completed",
        "Title": "X-Trace Task",
        "Host": "pinky19.mpi-sws.org",
        "HRT": 25491800157283856,
        "Timestamp": "1556275440097.637939",
        "TenantClass": 0,
        "Source": "ProtobufRpcEngine.java:275",
        "ThreadID": 1,
        "ThreadName": "",
        "EventID": "6287B179383C3F99",
        "ProcessID": 21035
      },
      {
        "Cycles": 0,
        "Agent": "edu.brown.cs.systems.xtrace.logging.BaggageWrappers",
        "ProcessName": "Read",
        "TaskID": "E3A2B1C386651507",
        "ParentEventID": [
          "6287B179383C3F99"
        ],
        "Label": "Forking current baggage with Baggage.fork()",
        "Title": "X-Trace Task",
        "Host": "pinky19.mpi-sws.org",
        "HRT": 25491800157370109,
        "Operation": "fork",
        "Timestamp": "1556275440097.724121",
        "TenantClass": 0,
        "Source": "DataTransferProtoUtil.java:94",
        "ThreadID": 1,
        "ThreadName": "",
        "EventID": "2D803319BEC97B4F",
        "ProcessID": 21035
      },
      {
        "Cycles": 0,
        "Agent": "edu.brown.cs.systems.xtrace.logging.XTraceInit",
        "ProcessName": "Data",
        "TaskID": "E3A2B1C386651507",
        "ParentEventID": [
          "B3CF283ABC5C2174"
        ],
        "Label": "Thread.setName: DataXceiver for client DFSClient_NONMAPREDUCE_1377588049_1 at /139.19.171.63:57972 [Sending block BP-1633380353-139.19.171.63-1554193446451:blk_1073766686_25862]",
        "Title": "X-Trace Task",
        "Host": "pinky23.mpi-sws.org",
        "HRT": 10893296131843673,
        "Timestamp": "1556275440098.195557",
        "TenantClass": 0,
        "Source": "DataXceiver.java:168",
        "ThreadID": 6296,
        "ThreadName": "",
        "EventID": "9B5C1E26D0D56942",
        "BaggageBytes": "[[248 5] [240 0] [0 227 162 177 195 134 101 21 7] [240 1] [0 179 207 40 58 188 92 33 116] [240 3] [0 2]]",
        "ProcessID": 24612
      },
      {
        "Cycles": 0,
        "Agent": "edu.brown.cs.systems.xtrace.logging.BaggageWrappers",
        "ProcessName": "Data",
        "TaskID": "E3A2B1C386651507",
        "ParentEventID": [
          "9B5C1E26D0D56942"
        ],
        "Label": "Forking current baggage with Baggage.fork()",
        "Title": "X-Trace Task",
        "Host": "pinky23.mpi-sws.org",
        "HRT": 10893296132041000,
        "Operation": "fork",
        "Timestamp": "1556275440098.393066",
        "TenantClass": 0,
        "Source": "DataXceiver.java:1257",
        "ThreadID": 6296,
        "ThreadName": "",
        "EventID": "FEAACBAF7C6670D2",
        "BaggageBytes": "[[248 5] [240 0] [0 227 162 177 195 134 101 21 7] [240 1] [0 155 92 30 38 208 213 105 66] [240 3] [0 2]]",
        "ProcessID": 24612
      },
      {
        "Cycles": 0,
        "Agent": "Execution-Sleep",
        "ProcessName": "Read",
        "TaskID": "E3A2B1C386651507",
        "ParentEventID": [
          "2D803319BEC97B4F"
        ],
        "Label": "waited",
        "Title": "X-Trace Task",
        "Host": "pinky19.mpi-sws.org",
        "Duration": "710533",
        "HRT": 25491800158171633,
        "Operation": "waited",
        "Timestamp": "1556275440098.525879",
        "TenantClass": 0,
        "Source": "SocketIOWithTimeout.java:335",
        "ThreadID": 1,
        "ThreadName": "",
        "EventID": "268FA44B53162D91",
        "ProcessID": 21035
      },
      {
        "Cycles": 0,
        "Agent": "Execution-CPU",
        "ProcessName": "Data",
        "TaskID": "E3A2B1C386651507",
        "ParentEventID": [
          "2D803319BEC97B4F"
        ],
        "Label": "set",
        "Title": "X-Trace Task",
        "Host": "pinky23.mpi-sws.org",
        "HRT": 10893296131751252,
        "Operation": "set",
        "Timestamp": "1556275440098.103271",
        "TenantClass": 0,
        "Source": "Receiver.java:117",
        "ThreadID": 6296,
        "ThreadName": "",
        "EventID": "B3CF283ABC5C2174",
        "BaggageBytes": "[[248 5] [240 0] [0 227 162 177 195 134 101 21 7] [240 1] [0 45 128 51 25 190 201 123 79] [240 3] [0 2]]",
        "ProcessID": 24612
      },
      {
        "Cycles": 0,
        "Agent": "edu.brown.cs.systems.xtrace.logging.BaggageWrappers",
        "ProcessName": "Read",
        "TaskID": "E3A2B1C386651507",
        "ParentEventID": [
          "FEAACBAF7C6670D2",
          "268FA44B53162D91"
        ],
        "Label": "Merged current baggage with other baggage",
        "Title": "X-Trace Task",
        "Host": "pinky19.mpi-sws.org",
        "HRT": 25491800158259249,
        "Operation": "join",
        "Timestamp": "1556275440098.613281",
        "TenantClass": 0,
        "Source": "RemoteBlockReader2.java:429",
        "ThreadID": 1,
        "ThreadName": "",
        "EventID": "AFDA085DB69D81B3",
        "ProcessID": 21035
      },
      {
        "Cycles": 0,
        "Agent": "Execution-Sleep",
        "ProcessName": "Read",
        "TaskID": "E3A2B1C386651507",
        "ParentEventID": [
          "AFDA085DB69D81B3"
        ],
        "Label": "waited",
        "Title": "X-Trace Task",
        "Host": "pinky19.mpi-sws.org",
        "Duration": "4586",
        "HRT": 25491800158336612,
        "Operation": "waited",
        "Timestamp": "1556275440098.690674",
        "TenantClass": 0,
        "Source": "SocketIOWithTimeout.java:335",
        "ThreadID": 1,
        "ThreadName": "",
        "EventID": "C0DC528EF3433C80",
        "ProcessID": 21035
      },
      {
        "Cycles": 0,
        "Agent": "edu.brown.cs.systems.xtrace.logging.BaggageWrappers",
        "ProcessName": "Data",
        "TaskID": "E3A2B1C386651507",
        "ParentEventID": [
          "FEAACBAF7C6670D2"
        ],
        "Label": "Forking current baggage with Baggage.fork()",
        "Title": "X-Trace Task",
        "Host": "pinky23.mpi-sws.org",
        "HRT": 10893296132183526,
        "Operation": "fork",
        "Timestamp": "1556275440098.535400",
        "TenantClass": 0,
        "Source": "PacketHeader.java:95",
        "ThreadID": 6296,
        "ThreadName": "",
        "EventID": "13E85162AD381BA8",
        "BaggageBytes": "[[248 5] [240 0] [0 227 162 177 195 134 101 21 7] [240 1] [0 254 170 203 175 124 102 112 210] [240 3] [0 2]]",
        "ProcessID": 24612
      },
      {
        "Cycles": 0,
        "Agent": "Execution-Sleep",
        "ProcessName": "Data",
        "TaskID": "E3A2B1C386651507",
        "ParentEventID": [
          "13E85162AD381BA8"
        ],
        "Label": "waited",
        "Title": "X-Trace Task",
        "Host": "pinky23.mpi-sws.org",
        "Duration": "10591",
        "HRT": 10893296132353249,
        "Operation": "waited",
        "Timestamp": "1556275440098.705322",
        "TenantClass": 0,
        "Source": "SocketIOWithTimeout.java:335",
        "ThreadID": 6296,
        "ThreadName": "",
        "EventID": "76B20957BB739FC8",
        "BaggageBytes": "[[248 5] [240 0] [0 227 162 177 195 134 101 21 7] [240 1] [0 19 232 81 98 173 56 27 168] [240 3] [0 2]]",
        "ProcessID": 24612
      },
      {
        "Cycles": 0,
        "Agent": "edu.brown.cs.systems.xtrace.logging.BaggageWrappers",
        "ProcessName": "Read",
        "TaskID": "E3A2B1C386651507",
        "ParentEventID": [
          "13E85162AD381BA8",
          "D96A8CF31B403395"
        ],
        "Label": "Merged current baggage with other baggage",
        "Title": "X-Trace Task",
        "Host": "pinky19.mpi-sws.org",
        "HRT": 25491800158579836,
        "Operation": "join",
        "Timestamp": "1556275440098.934082",
        "TenantClass": 0,
        "Source": "PacketHeader.java:168",
        "ThreadID": 1,
        "ThreadName": "",
        "EventID": "FB6F22995E14C693",
        "ProcessID": 21035
      },
      {
        "Cycles": 0,
        "Agent": "Execution-Sleep",
        "ProcessName": "Read",
        "TaskID": "E3A2B1C386651507",
        "ParentEventID": [
          "C0DC528EF3433C80"
        ],
        "Label": "waited",
        "Title": "X-Trace Task",
        "Host": "pinky19.mpi-sws.org",
        "Duration": "100160",
        "HRT": 25491800158532265,
        "Operation": "waited",
        "Timestamp": "1556275440098.886475",
        "TenantClass": 0,
        "Source": "SocketIOWithTimeout.java:335",
        "ThreadID": 1,
        "ThreadName": "",
        "EventID": "D96A8CF31B403395",
        "ProcessID": 21035
      },
      {
        "Cycles": 0,
        "Agent": "edu.brown.cs.systems.xtrace.logging.BaggageWrappers",
        "ProcessName": "Data",
        "TaskID": "E3A2B1C386651507",
        "ParentEventID": [
          "76B20957BB739FC8"
        ],
        "Label": "Forking current baggage with Baggage.fork()",
        "Title": "X-Trace Task",
        "Host": "pinky23.mpi-sws.org",
        "HRT": 10893296132507281,
        "Operation": "fork",
        "Timestamp": "1556275440098.859131",
        "TenantClass": 0,
        "Source": "PacketHeader.java:95",
        "ThreadID": 6296,
        "ThreadName": "",
        "EventID": "0501B01337C4707F",
        "BaggageBytes": "[[248 5] [240 0] [0 227 162 177 195 134 101 21 7] [240 1] [0 118 178 9 87 187 115 159 200] [240 3] [0 2]]",
        "ProcessID": 24612
      },
      {
        "Cycles": 0,
        "Agent": "Execution-Sleep",
        "ProcessName": "Read",
        "TaskID": "E3A2B1C386651507",
        "ParentEventID": [
          "FB6F22995E14C693"
        ],
        "Label": "waited",
        "Title": "X-Trace Task",
        "Host": "pinky19.mpi-sws.org",
        "Duration": "40309",
        "HRT": 25491800158663050,
        "Operation": "waited",
        "Timestamp": "1556275440099.017090",
        "TenantClass": 0,
        "Source": "SocketIOWithTimeout.java:335",
        "ThreadID": 1,
        "ThreadName": "",
        "EventID": "9BA182C24FE4BE02",
        "ProcessID": 21035
      },
      {
        "Cycles": 0,
        "Agent": "edu.brown.cs.systems.xtrace.logging.BaggageWrappers",
        "ProcessName": "Read",
        "TaskID": "E3A2B1C386651507",
        "ParentEventID": [
          "0501B01337C4707F",
          "9BA182C24FE4BE02"
        ],
        "Label": "Merged current baggage with other baggage",
        "Title": "X-Trace Task",
        "Host": "pinky19.mpi-sws.org",
        "HRT": 25491800158726724,
        "Operation": "join",
        "Timestamp": "1556275440099.080811",
        "TenantClass": 0,
        "Source": "PacketHeader.java:168",
        "ThreadID": 1,
        "ThreadName": "",
        "EventID": "848B495B1DE64CD5",
        "ProcessID": 21035
      },
      {
        "Cycles": 0,
        "Agent": "Execution-Sleep",
        "ProcessName": "Data",
        "TaskID": "E3A2B1C386651507",
        "ParentEventID": [
          "0501B01337C4707F"
        ],
        "Label": "waited",
        "Title": "X-Trace Task",
        "Host": "pinky23.mpi-sws.org",
        "Duration": "102548",
        "HRT": 10893296132845044,
        "Operation": "waited",
        "Timestamp": "1556275440099.197021",
        "TenantClass": 0,
        "Source": "SocketIOWithTimeout.java:335",
        "ThreadID": 6296,
        "ThreadName": "",
        "EventID": "9D5F423644D9855A",
        "BaggageBytes": "[[248 5] [240 0] [0 227 162 177 195 134 101 21 7] [240 1] [0 5 1 176 19 55 196 112 127] [240 3] [0 2]]",
        "ProcessID": 24612
      },
      {
        "Cycles": 0,
        "Agent": "edu.brown.cs.systems.xtrace.logging.BaggageWrappers",
        "ProcessName": "Data",
        "TaskID": "E3A2B1C386651507",
        "ParentEventID": [
          "9D5F423644D9855A",
          "D956992063E50CEB"
        ],
        "Label": "Merged current baggage with other baggage",
        "Title": "X-Trace Task",
        "Host": "pinky23.mpi-sws.org",
        "HRT": 10893296132959118,
        "Operation": "join",
        "Timestamp": "1556275440099.311035",
        "TenantClass": 0,
        "Source": "DataXceiver.java:574",
        "ThreadID": 6296,
        "ThreadName": "",
        "EventID": "7819874A221D319B",
        "BaggageBytes": "[[248 5] [240 0] [0 227 162 177 195 134 101 21 7] [240 1] [0 157 95 66 54 68 217 133 90] [0 217 86 153 32 99 229 12 235] [240 3] [0 2]]",
        "ProcessID": 24612
      },
      {
        "Cycles": 0,
        "Agent": "Execution-CPU",
        "ProcessName": "Data",
        "TaskID": "E3A2B1C386651507",
        "ParentEventID": [
          "7819874A221D319B"
        ],
        "Label": "unset",
        "Title": "X-Trace Task",
        "Host": "pinky23.mpi-sws.org",
        "Duration": "1189241",
        "HRT": 10893296133005934,
        "Operation": "unset",
        "Timestamp": "1556275440099.357910",
        "TenantClass": 0,
        "Source": "DataXceiver.java:261",
        "ThreadID": 6296,
        "ThreadName": "",
        "EventID": "1C5F3C6C7752CD9F",
        "BaggageBytes": "[[248 5] [240 0] [0 227 162 177 195 134 101 21 7] [240 1] [0 120 25 135 74 34 29 49 155] [240 3] [0 2]]",
        "ProcessID": 24612
      },
      {
        "Cycles": 0,
        "Agent": "edu.brown.cs.systems.xtrace.logging.BaggageWrappers",
        "ProcessName": "Read",
        "TaskID": "E3A2B1C386651507",
        "ParentEventID": [
          "848B495B1DE64CD5"
        ],
        "Label": "Forking current baggage with Baggage.fork()",
        "Title": "X-Trace Task",
        "Host": "pinky19.mpi-sws.org",
        "HRT": 25491800158736989,
        "Operation": "fork",
        "Timestamp": "1556275440099.091064",
        "TenantClass": 0,
        "Source": "RemoteBlockReader2.java:361",
        "ThreadID": 1,
        "ThreadName": "",
        "EventID": "D956992063E50CEB",
        "ProcessID": 21035
      },
      {
        "Cycles": 0,
        "Agent": "edu.brown.cs.systems.retro.benchmarks.hdfs_client.Reader",
        "ProcessName": "Read",
        "TaskID": "E3A2B1C386651507",
        "ParentEventID": [
          "0"
        ],
        "Label": "Reading file",
        "Title": "X-Trace Task",
        "Host": "pinky19.mpi-sws.org",
        "HRT": 25491800156514945,
        "Timestamp": "1556275440096.869141",
        "TenantClass": 0,
        "ThreadID": 1,
        "ThreadName": "",
        "EventID": "A70422791F07BA52",
        "ProcessID": 21035,
        "Tag": [
          "reader_1kb",
          "Read Size: 1024"
        ]
      }
    ]
  }
]