[
  {
    "id": "133147E211931761",
    "reports": [
      {
        "Cycles": 0,
        "Agent": "Execution-CPU",
        "ProcessName": "Read",
        "TaskID": "133147E211931761",
        "ParentEventID": [
          "939A26BE2E776627"
        ],
        "Label": "unset",
        "Title": "X-Trace Task",
        "Host": "pinky19.mpi-sws.org",
        "Duration": "21276442",
        "HRT": 26962642576286450,
        "Operation": "unset",
        "Timestamp": "1557746282516.525635",
        "TenantClass": 0,
        "Source": "Client.java:1027",
        "ThreadID": 1,
        "ThreadName": "",
        "EventID": "BC1DD2E46414ABB6",
        "ProcessID": 36430
      },
      {
        "Cycles": 0,
        "Agent": "org.apache.hadoop.ipc.ProtobufRpcEngine",
        "ProcessName": "Read",
        "TaskID": "133147E211931761",
        "ParentEventID": [
          "9C7A5F18DDD68D44"
        ],
        "Label": "Invoking org.apache.hadoop.hdfs.protocol.ClientProtocol.getBlockLocations",
        "Title": "X-Trace Task",
        "Host": "pinky19.mpi-sws.org",
        "HRT": 26962642576269324,
        "Timestamp": "1557746282516.508545",
        "TenantClass": 0,
        "Source": "ProtobufRpcEngine.java:228",
        "ThreadID": 1,
        "ThreadName": "",
        "EventID": "939A26BE2E776627",
        "ProcessID": 36430
      },
      {
        "Cycles": 0,
        "Agent": "edu.brown.cs.systems.retro.benchmarks.hdfs_client.Reader",
        "ProcessName": "Read",
        "TaskID": "133147E211931761",
        "ParentEventID": [
          "E37BC86D7F80C14B"
        ],
        "Label": "Reading file",
        "Title": "X-Trace Task",
        "Host": "pinky19.mpi-sws.org",
        "HRT": 26962642576244346,
        "Timestamp": "1557746282516.483398",
        "TenantClass": 0,
        "ThreadID": 1,
        "ThreadName": "",
        "EventID": "9C7A5F18DDD68D44",
        "ProcessID": 36430
      },
      {
        "Cycles": 0,
        "Agent": "edu.brown.cs.systems.xtrace.logging.BaggageWrappers",
        "ProcessName": "Read",
        "TaskID": "133147E211931761",
        "ParentEventID": [
          "5BBE048F057C18AA"
        ],
        "Label": "Forking current baggage with Baggage.fork()",
        "Title": "X-Trace Task",
        "Host": "pinky19.mpi-sws.org",
        "HRT": 26962642576328302,
        "Operation": "fork",
        "Timestamp": "1557746282516.567383",
        "TenantClass": 0,
        "Source": "Client.java:1043",
        "ThreadID": 41,
        "ThreadName": "",
        "EventID": "6B2815A064840443",
        "ProcessID": 36430
      },
      {
        "Cycles": 0,
        "Agent": "Execution-CPU",
        "ProcessName": "Read",
        "TaskID": "133147E211931761",
        "ParentEventID": [
          "6B2815A064840443"
        ],
        "Label": "unset",
        "Title": "X-Trace Task",
        "Host": "pinky19.mpi-sws.org",
        "Duration": "59411",
        "HRT": 26962642576387432,
        "Operation": "unset",
        "Timestamp": "1557746282516.626465",
        "TenantClass": 0,
        "Source": "Client.java:1062",
        "ThreadID": 41,
        "ThreadName": "",
        "EventID": "613D59524EDD8F20",
        "ProcessID": 36430
      },
      {
        "Cycles": 0,
        "Agent": "Execution-CPU",
        "ProcessName": "Read",
        "TaskID": "133147E211931761",
        "ParentEventID": [
          "BC1DD2E46414ABB6"
        ],
        "Label": "set",
        "Title": "X-Trace Task",
        "Host": "pinky19.mpi-sws.org",
        "HRT": 26962642576312798,
        "Operation": "set",
        "Timestamp": "1557746282516.552002",
        "TenantClass": 0,
        "Source": "Client.java:1032",
        "ThreadID": 41,
        "ThreadName": "",
        "EventID": "5BBE048F057C18AA",
        "ProcessID": 36430
      },
      {
        "Cycles": 0,
        "Agent": "Execution-CPU",
        "ProcessName": "Read",
        "TaskID": "133147E211931761",
        "ParentEventID": [
          "613D59524EDD8F20"
        ],
        "Label": "set",
        "Title": "X-Trace Task",
        "Host": "pinky19.mpi-sws.org",
        "HRT": 26962642576408484,
        "Operation": "set",
        "Timestamp": "1557746282516.647705",
        "TenantClass": 0,
        "Source": "Client.java:1104",
        "ThreadID": 1,
        "ThreadName": "",
        "EventID": "9AB587A48EC5D1A8",
        "ProcessID": 36430
      },
      {
        "Cycles": 0,
        "Agent": "edu.brown.cs.systems.xtrace.logging.BaggageWrappers",
        "ProcessName": "Name",
        "TaskID": "133147E211931761",
        "ParentEventID": [
          "4CA7DDB3EF7DD7DE"
        ],
        "Label": "Forking current baggage with Baggage.fork()",
        "Title": "X-Trace Task",
        "Host": "pinky19.mpi-sws.org",
        "HRT": 26962642576459034,
        "Operation": "fork",
        "Timestamp": "1557746282516.717773",
        "TenantClass": 0,
        "Source": "Server.java:550",
        "ThreadID": 48,
        "ThreadName": "",
        "EventID": "00585D89139DF5C5",
        "BaggageBytes": "[[248 5] [240 0] [0 19 49 71 226 17 147 23 97] [240 1] [0 76 167 221 179 239 125 215 222] [240 3] [0 2]]",
        "ProcessID": 2171
      },
      {
        "Cycles": 0,
        "Agent": "Execution-CPU",
        "ProcessName": "Name",
        "TaskID": "133147E211931761",
        "ParentEventID": [
          "00585D89139DF5C5"
        ],
        "Label": "unset",
        "Title": "X-Trace Task",
        "Host": "pinky19.mpi-sws.org",
        "Duration": "21125",
        "HRT": 26962642576477066,
        "Operation": "unset",
        "Timestamp": "1557746282516.735596",
        "TenantClass": 0,
        "Source": "Server.java:1828",
        "ThreadID": 48,
        "ThreadName": "",
        "EventID": "7A08BC4FE2EF0F1E",
        "BaggageBytes": "[[248 5] [240 0] [0 19 49 71 226 17 147 23 97] [240 1] [0 0 88 93 137 19 157 245 197] [240 3] [0 2]]",
        "ProcessID": 2171
      },
      {
        "Cycles": 0,
        "Agent": "Execution-CPU",
        "ProcessName": "Name",
        "TaskID": "133147E211931761",
        "ParentEventID": [
          "6B2815A064840443"
        ],
        "Label": "set",
        "Title": "X-Trace Task",
        "Host": "pinky19.mpi-sws.org",
        "HRT": 26962642576435232,
        "Operation": "set",
        "Timestamp": "1557746282516.693848",
        "TenantClass": 0,
        "Source": "Server.java:1840",
        "ThreadID": 48,
        "ThreadName": "",
        "EventID": "4CA7DDB3EF7DD7DE",
        "BaggageBytes": "[[248 5] [240 0] [0 19 49 71 226 17 147 23 97] [240 1] [0 107 40 21 160 100 132 4 67] [240 3] [0 2]]",
        "ProcessID": 2171
      },
      {
        "Cycles": 0,
        "Agent": "Execution-CPU",
        "ProcessName": "Name",
        "TaskID": "133147E211931761",
        "ParentEventID": [
          "00585D89139DF5C5"
        ],
        "Label": "set",
        "Title": "X-Trace Task",
        "Host": "pinky19.mpi-sws.org",
        "HRT": 26962642576483015,
        "Operation": "set",
        "Timestamp": "1557746282516.741699",
        "TenantClass": 0,
        "Source": "Server.java:2071",
        "ThreadID": 55,
        "ThreadName": "",
        "EventID": "1FFDC683A2CE0D50",
        "BaggageBytes": "[[248 5] [240 0] [0 19 49 71 226 17 147 23 97] [240 1] [0 0 88 93 137 19 157 245 197] [240 3] [0 2]]",
        "ProcessID": 2171
      },
      {
        "Cycles": 0,
        "Agent": "org.apache.hadoop.ipc.Server",
        "ProcessName": "Name",
        "TaskID": "133147E211931761",
        "ParentEventID": [
          "1FFDC683A2CE0D50"
        ],
        "Label": "getBlockLocations in org.apache.hadoop.hdfs.protocol.ClientProtocol",
        "Title": "X-Trace Task",
        "Host": "pinky19.mpi-sws.org",
        "HRT": 26962642576509679,
        "Timestamp": "1557746282516.768311",
        "TenantClass": 0,
        "Source": "ProtobufRpcEngine.java:601",
        "ThreadID": 55,
        "ThreadName": "",
        "EventID": "8BD8910C6D4061CA",
        "BaggageBytes": "[[248 5] [240 0] [0 19 49 71 226 17 147 23 97] [240 1] [0 31 253 198 131 162 206 13 80] [240 3] [0 2]]",
        "ProcessID": 2171
      },
      {
        "Cycles": 0,
        "Agent": "edu.brown.cs.systems.xtrace.logging.BaggageWrappers",
        "ProcessName": "Name",
        "TaskID": "133147E211931761",
        "ParentEventID": [
          "C355AE307A5B0D0C"
        ],
        "Label": "Forking current baggage with Baggage.fork()",
        "Title": "X-Trace Task",
        "Host": "pinky19.mpi-sws.org",
        "HRT": 26962642576589340,
        "Operation": "fork",
        "Timestamp": "1557746282516.847900",
        "TenantClass": 0,
        "Source": "Server.java:2398",
        "ThreadID": 55,
        "ThreadName": "",
        "EventID": "6A475F5BD59710BC",
        "BaggageBytes": "[[248 5] [240 0] [0 19 49 71 226 17 147 23 97] [240 1] [0 195 85 174 48 122 91 13 12] [240 3] [0 2]]",
        "ProcessID": 2171
      },
      {
        "Cycles": 0,
        "Agent": "org.apache.hadoop.hdfs.server.namenode.FSNamesystem.audit",
        "ProcessName": "Name",
        "TaskID": "133147E211931761",
        "ParentEventID": [
          "8BD8910C6D4061CA"
        ],
        "Label": "allowed=true\tugi=plascas (auth:SIMPLE)\tip=/139.19.171.63\tcmd=open\tsrc=/ds/L1BBHVq7CI0vDYEb\tdst=null\tperm=null\tproto=rpc",
        "Title": "X-Trace Task",
        "Host": "pinky19.mpi-sws.org",
        "HRT": 26962642576549955,
        "Timestamp": "1557746282516.808594",
        "TenantClass": 0,
        "Source": "FSNamesystem.java:8313",
        "ThreadID": 55,
        "ThreadName": "",
        "EventID": "C355AE307A5B0D0C",
        "BaggageBytes": "[[248 5] [240 0] [0 19 49 71 226 17 147 23 97] [240 1] [0 139 216 145 12 109 64 97 202] [240 3] [0 2]]",
        "ProcessID": 2171
      },
      {
        "Cycles": 0,
        "Agent": "Execution-CPU",
        "ProcessName": "Name",
        "TaskID": "133147E211931761",
        "ParentEventID": [
          "6A475F5BD59710BC"
        ],
        "Label": "unset",
        "Title": "X-Trace Task",
        "Host": "pinky19.mpi-sws.org",
        "Duration": "190910",
        "HRT": 26962642576691159,
        "Operation": "unset",
        "Timestamp": "1557746282516.949707",
        "TenantClass": 0,
        "Source": "Server.java:1058",
        "ThreadID": 55,
        "ThreadName": "",
        "EventID": "3E01A29DA094A56B",
        "BaggageBytes": "[[248 5] [240 0] [0 19 49 71 226 17 147 23 97] [240 1] [0 106 71 95 91 213 151 16 188] [240 3] [0 2]]",
        "ProcessID": 2171
      },
      {
        "Cycles": 0,
        "Agent": "Execution-CPU",
        "ProcessName": "Read",
        "TaskID": "133147E211931761",
        "ParentEventID": [
          "DFFAB2A7A89DB24E"
        ],
        "Label": "unset",
        "Title": "X-Trace Task",
        "Host": "pinky19.mpi-sws.org",
        "Duration": "4986",
        "HRT": 26962642576755731,
        "Operation": "unset",
        "Timestamp": "1557746282516.994873",
        "TenantClass": 0,
        "Source": "Client.java:1168",
        "ThreadID": 37,
        "ThreadName": "",
        "EventID": "ECE21003610BB471",
        "ProcessID": 36430
      },
      {
        "Cycles": 0,
        "Agent": "Execution-CPU",
        "ProcessName": "Read",
        "TaskID": "133147E211931761",
        "ParentEventID": [
          "6A475F5BD59710BC"
        ],
        "Label": "set",
        "Title": "X-Trace Task",
        "Host": "pinky19.mpi-sws.org",
        "HRT": 26962642576735005,
        "Operation": "set",
        "Timestamp": "1557746282516.974121",
        "TenantClass": 0,
        "Source": "Client.java:302",
        "ThreadID": 37,
        "ThreadName": "",
        "EventID": "DFFAB2A7A89DB24E",
        "ProcessID": 36430
      },
      {
        "Cycles": 0,
        "Agent": "Execution-Sleep",
        "ProcessName": "Read",
        "TaskID": "133147E211931761",
        "ParentEventID": [
          "9AB587A48EC5D1A8"
        ],
        "Label": "waited",
        "Title": "X-Trace Task",
        "Host": "pinky19.mpi-sws.org",
        "Duration": "358339",
        "HRT": 26962642576775861,
        "Operation": "waited",
        "Timestamp": "1557746282517.014893",
        "TenantClass": 0,
        "Source": "Client.java:1537",
        "ThreadID": 1,
        "ThreadName": "",
        "EventID": "3421DE3811CA64B2",
        "ProcessID": 36430
      },
      {
        "Cycles": 0,
        "Agent": "edu.brown.cs.systems.xtrace.logging.BaggageWrappers",
        "ProcessName": "Read",
        "TaskID": "133147E211931761",
        "ParentEventID": [
          "3421DE3811CA64B2",
          "ECE21003610BB471"
        ],
        "Label": "Merged current baggage with other baggage",
        "Title": "X-Trace Task",
        "Host": "pinky19.mpi-sws.org",
        "HRT": 26962642576812010,
        "Operation": "join",
        "Timestamp": "1557746282517.051270",
        "TenantClass": 0,
        "Source": "Client.java:1545",
        "ThreadID": 1,
        "ThreadName": "",
        "EventID": "D14D0C6DA2CA15E4",
        "ProcessID": 36430
      },
      {
        "Cycles": 0,
        "Agent": "org.apache.hadoop.ipc.ProtobufRpcEngine",
        "ProcessName": "Read",
        "TaskID": "133147E211931761",
        "ParentEventID": [
          "D14D0C6DA2CA15E4"
        ],
        "Label": "org.apache.hadoop.hdfs.protocol.ClientProtocol.getBlockLocations completed",
        "Title": "X-Trace Task",
        "Host": "pinky19.mpi-sws.org",
        "HRT": 26962642576869191,
        "Timestamp": "1557746282517.108398",
        "TenantClass": 0,
        "Source": "ProtobufRpcEngine.java:275",
        "ThreadID": 1,
        "ThreadName": "",
        "EventID": "3F24DCC19B04FA0E",
        "ProcessID": 36430
      },
      {
        "Cycles": 0,
        "Agent": "edu.brown.cs.systems.xtrace.logging.BaggageWrappers",
        "ProcessName": "Read",
        "TaskID": "133147E211931761",
        "ParentEventID": [
          "3F24DCC19B04FA0E"
        ],
        "Label": "Forking current baggage with Baggage.fork()",
        "Title": "X-Trace Task",
        "Host": "pinky19.mpi-sws.org",
        "HRT": 26962642576946161,
        "Operation": "fork",
        "Timestamp": "1557746282517.185303",
        "TenantClass": 0,
        "Source": "DataTransferProtoUtil.java:94",
        "ThreadID": 1,
        "ThreadName": "",
        "EventID": "09D7CC75B873551D",
        "ProcessID": 36430
      },
      {
        "Cycles": 0,
        "Agent": "edu.brown.cs.systems.xtrace.logging.XTraceInit",
        "ProcessName": "Data",
        "TaskID": "133147E211931761",
        "ParentEventID": [
          "85DEA8D39ABC4215"
        ],
        "Label": "Thread.setName: DataXceiver for client DFSClient_NONMAPREDUCE_778905418_1 at /139.19.171.63:39908 [Sending block BP-1633380353-139.19.171.63-1554193446451:blk_1073757659_16835]",
        "Title": "X-Trace Task",
        "Host": "pinky20.mpi-sws.org",
        "HRT": 6565846936333102,
        "Timestamp": "1557746282517.659668",
        "TenantClass": 0,
        "Source": "DataXceiver.java:168",
        "ThreadID": 14317,
        "ThreadName": "",
        "EventID": "1F3F8F0F8A948FA9",
        "BaggageBytes": "[[248 5] [240 0] [0 19 49 71 226 17 147 23 97] [240 1] [0 133 222 168 211 154 188 66 21] [240 3] [0 2]]",
        "ProcessID": 13111
      },
      {
        "Cycles": 0,
        "Agent": "Execution-CPU",
        "ProcessName": "Data",
        "TaskID": "133147E211931761",
        "ParentEventID": [
          "09D7CC75B873551D"
        ],
        "Label": "set",
        "Title": "X-Trace Task",
        "Host": "pinky20.mpi-sws.org",
        "HRT": 6565846936232358,
        "Operation": "set",
        "Timestamp": "1557746282517.558838",
        "TenantClass": 0,
        "Source": "Receiver.java:117",
        "ThreadID": 14317,
        "ThreadName": "",
        "EventID": "85DEA8D39ABC4215",
        "BaggageBytes": "[[248 5] [240 0] [0 19 49 71 226 17 147 23 97] [240 1] [0 9 215 204 117 184 115 85 29] [240 3] [0 2]]",
        "ProcessID": 13111
      },
      {
        "Cycles": 0,
        "Agent": "edu.brown.cs.systems.retro.benchmarks.hdfs_client.Reader",
        "ProcessName": "Read",
        "TaskID": "133147E211931761",
        "ParentEventID": [
          "0"
        ],
        "Label": "Reading file",
        "Title": "X-Trace Task",
        "Host": "pinky19.mpi-sws.org",
        "HRT": 26962642576229810,
        "Timestamp": "1557746282516.468994",
        "TenantClass": 0,
        "ThreadID": 1,
        "ThreadName": "",
        "EventID": "E37BC86D7F80C14B",
        "ProcessID": 36430,
        "Tag": [
          "reader_10kb",
          "Read Size: 10240"
        ]
      },
      {
        "Cycles": 0,
        "Agent": "edu.brown.cs.systems.xtrace.logging.BaggageWrappers",
        "ProcessName": "Data",
        "TaskID": "133147E211931761",
        "ParentEventID": [
          "1F3F8F0F8A948FA9"
        ],
        "Label": "Forking current baggage with Baggage.fork()",
        "Title": "X-Trace Task",
        "Host": "pinky20.mpi-sws.org",
        "HRT": 6565846948050720,
        "Operation": "fork",
        "Timestamp": "1557746282529.377197",
        "TenantClass": 0,
        "Source": "DataXceiver.java:1257",
        "ThreadID": 14317,
        "ThreadName": "",
        "EventID": "DFF5C343F5BBD51C",
        "BaggageBytes": "[[248 5] [240 0] [0 19 49 71 226 17 147 23 97] [240 1] [0 31 63 143 15 138 148 143 169] [240 3] [0 2]]",
        "ProcessID": 13111
      },
      {
        "Cycles": 0,
        "Agent": "edu.brown.cs.systems.xtrace.logging.BaggageWrappers",
        "ProcessName": "Data",
        "TaskID": "133147E211931761",
        "ParentEventID": [
          "DFF5C343F5BBD51C"
        ],
        "Label": "Forking current baggage with Baggage.fork()",
        "Title": "X-Trace Task",
        "Host": "pinky20.mpi-sws.org",
        "HRT": 6565846948124010,
        "Operation": "fork",
        "Timestamp": "1557746282529.450439",
        "TenantClass": 0,
        "Source": "PacketHeader.java:95",
        "ThreadID": 14317,
        "ThreadName": "",
        "EventID": "D3143DD1C8D331A4",
        "BaggageBytes": "[[248 5] [240 0] [0 19 49 71 226 17 147 23 97] [240 1] [0 223 245 195 67 245 187 213 28] [240 3] [0 2]]",
        "ProcessID": 13111
      },
      {
        "Cycles": 0,
        "Agent": "Execution-Sleep",
        "ProcessName": "Read",
        "TaskID": "133147E211931761",
        "ParentEventID": [
          "09D7CC75B873551D"
        ],
        "Label": "waited",
        "Title": "X-Trace Task",
        "Host": "pinky19.mpi-sws.org",
        "Duration": "12186844",
        "HRT": 26962642589211045,
        "Operation": "waited",
        "Timestamp": "1557746282529.450195",
        "TenantClass": 0,
        "Source": "SocketIOWithTimeout.java:335",
        "ThreadID": 1,
        "ThreadName": "",
        "EventID": "0E2C72734B8B2327",
        "ProcessID": 36430
      },
      {
        "Cycles": 0,
        "Agent": "Execution-Sleep",
        "ProcessName": "Data",
        "TaskID": "133147E211931761",
        "ParentEventID": [
          "D3143DD1C8D331A4"
        ],
        "Label": "waited",
        "Title": "X-Trace Task",
        "Host": "pinky20.mpi-sws.org",
        "Duration": "4873",
        "HRT": 6565846948197684,
        "Operation": "waited",
        "Timestamp": "1557746282529.524170",
        "TenantClass": 0,
        "Source": "SocketIOWithTimeout.java:335",
        "ThreadID": 14317,
        "ThreadName": "",
        "EventID": "5C6E2DEAD0032B63",
        "BaggageBytes": "[[248 5] [240 0] [0 19 49 71 226 17 147 23 97] [240 1] [0 211 20 61 209 200 211 49 164] [240 3] [0 2]]",
        "ProcessID": 13111
      },
      {
        "Cycles": 0,
        "Agent": "edu.brown.cs.systems.xtrace.logging.BaggageWrappers",
        "ProcessName": "Read",
        "TaskID": "133147E211931761",
        "ParentEventID": [
          "DFF5C343F5BBD51C",
          "0E2C72734B8B2327"
        ],
        "Label": "Merged current baggage with other baggage",
        "Title": "X-Trace Task",
        "Host": "pinky19.mpi-sws.org",
        "HRT": 26962642589310427,
        "Operation": "join",
        "Timestamp": "1557746282529.549561",
        "TenantClass": 0,
        "Source": "RemoteBlockReader2.java:429",
        "ThreadID": 1,
        "ThreadName": "",
        "EventID": "83F40BFA26D6227A",
        "ProcessID": 36430
      },
      {
        "Cycles": 0,
        "Agent": "edu.brown.cs.systems.xtrace.logging.BaggageWrappers",
        "ProcessName": "Data",
        "TaskID": "133147E211931761",
        "ParentEventID": [
          "5C6E2DEAD0032B63"
        ],
        "Label": "Forking current baggage with Baggage.fork()",
        "Title": "X-Trace Task",
        "Host": "pinky20.mpi-sws.org",
        "HRT": 6565846950725461,
        "Operation": "fork",
        "Timestamp": "1557746282532.052002",
        "TenantClass": 0,
        "Source": "PacketHeader.java:95",
        "ThreadID": 14317,
        "ThreadName": "",
        "EventID": "4EB6D28603BA5754",
        "BaggageBytes": "[[248 5] [240 0] [0 19 49 71 226 17 147 23 97] [240 1] [0 92 110 45 234 208 3 43 99] [240 3] [0 2]]",
        "ProcessID": 13111
      },
      {
        "Cycles": 0,
        "Agent": "Execution-Sleep",
        "ProcessName": "Read",
        "TaskID": "133147E211931761",
        "ParentEventID": [
          "83F40BFA26D6227A"
        ],
        "Label": "waited",
        "Title": "X-Trace Task",
        "Host": "pinky19.mpi-sws.org",
        "Duration": "2520315",
        "HRT": 26962642591915949,
        "Operation": "waited",
        "Timestamp": "1557746282532.155029",
        "TenantClass": 0,
        "Source": "SocketIOWithTimeout.java:335",
        "ThreadID": 1,
        "ThreadName": "",
        "EventID": "8790E87A47FC51CA",
        "ProcessID": 36430
      },
      {
        "Cycles": 0,
        "Agent": "edu.brown.cs.systems.xtrace.logging.BaggageWrappers",
        "ProcessName": "Read",
        "TaskID": "133147E211931761",
        "ParentEventID": [
          "8790E87A47FC51CA",
          "D3143DD1C8D331A4"
        ],
        "Label": "Merged current baggage with other baggage",
        "Title": "X-Trace Task",
        "Host": "pinky19.mpi-sws.org",
        "HRT": 26962642591980503,
        "Operation": "join",
        "Timestamp": "1557746282532.219727",
        "TenantClass": 0,
        "Source": "PacketHeader.java:168",
        "ThreadID": 1,
        "ThreadName": "",
        "EventID": "DE3B20DD817BAD38",
        "ProcessID": 36430
      },
      {
        "Cycles": 0,
        "Agent": "edu.brown.cs.systems.xtrace.logging.BaggageWrappers",
        "ProcessName": "Read",
        "TaskID": "133147E211931761",
        "ParentEventID": [
          "4EB6D28603BA5754",
          "DE3B20DD817BAD38"
        ],
        "Label": "Merged current baggage with other baggage",
        "Title": "X-Trace Task",
        "Host": "pinky19.mpi-sws.org",
        "HRT": 26962642592035445,
        "Operation": "join",
        "Timestamp": "1557746282532.274658",
        "TenantClass": 0,
        "Source": "PacketHeader.java:168",
        "ThreadID": 1,
        "ThreadName": "",
        "EventID": "D124D3DAB242D90F",
        "ProcessID": 36430
      },
      {
        "Cycles": 0,
        "Agent": "edu.brown.cs.systems.xtrace.logging.BaggageWrappers",
        "ProcessName": "Read",
        "TaskID": "133147E211931761",
        "ParentEventID": [
          "D124D3DAB242D90F"
        ],
        "Label": "Forking current baggage with Baggage.fork()",
        "Title": "X-Trace Task",
        "Host": "pinky19.mpi-sws.org",
        "HRT": 26962642592044278,
        "Operation": "fork",
        "Timestamp": "1557746282532.283447",
        "TenantClass": 0,
        "Source": "RemoteBlockReader2.java:361",
        "ThreadID": 1,
        "ThreadName": "",
        "EventID": "E85DCFFB4608875E",
        "ProcessID": 36430
      },
      {
        "Cycles": 0,
        "Agent": "Execution-Sleep",
        "ProcessName": "Data",
        "TaskID": "133147E211931761",
        "ParentEventID": [
          "4EB6D28603BA5754"
        ],
        "Label": "waited",
        "Title": "X-Trace Task",
        "Host": "pinky20.mpi-sws.org",
        "Duration": "250005",
        "HRT": 6565846951076039,
        "Operation": "waited",
        "Timestamp": "1557746282532.402588",
        "TenantClass": 0,
        "Source": "SocketIOWithTimeout.java:335",
        "ThreadID": 14317,
        "ThreadName": "",
        "EventID": "994704F1A2FB48BD",
        "BaggageBytes": "[[248 5] [240 0] [0 19 49 71 226 17 147 23 97] [240 1] [0 78 182 210 134 3 186 87 84] [240 3] [0 2]]",
        "ProcessID": 13111
      },
      {
        "Cycles": 0,
        "Agent": "edu.brown.cs.systems.xtrace.logging.BaggageWrappers",
        "ProcessName": "Data",
        "TaskID": "133147E211931761",
        "ParentEventID": [
          "E85DCFFB4608875E",
          "994704F1A2FB48BD"
        ],
        "Label": "Merged current baggage with other baggage",
        "Title": "X-Trace Task",
        "Host": "pinky20.mpi-sws.org",
        "HRT": 6565846951129246,
        "Operation": "join",
        "Timestamp": "1557746282532.455811",
        "TenantClass": 0,
        "Source": "DataXceiver.java:574",
        "ThreadID": 14317,
        "ThreadName": "",
        "EventID": "7228E8732F1A5B7C",
        "BaggageBytes": "[[248 5] [240 0] [0 19 49 71 226 17 147 23 97] [240 1] [0 153 71 4 241 162 251 72 189] [0 232 93 207 251 70 8 135 94] [240 3] [0 2]]",
        "ProcessID": 13111
      },
      {
        "Cycles": 0,
        "Agent": "Execution-CPU",
        "ProcessName": "Data",
        "TaskID": "133147E211931761",
        "ParentEventID": [
          "7228E8732F1A5B7C"
        ],
        "Label": "unset",
        "Title": "X-Trace Task",
        "Host": "pinky20.mpi-sws.org",
        "Duration": "14842821",
        "HRT": 6565846951146085,
        "Operation": "unset",
        "Timestamp": "1557746282532.472656",
        "TenantClass": 0,
        "Source": "DataXceiver.java:261",
        "ThreadID": 14317,
        "ThreadName": "",
        "EventID": "6DBB249910C891AB",
        "BaggageBytes": "[[248 5] [240 0] [0 19 49 71 226 17 147 23 97] [240 1] [0 114 40 232 115 47 26 91 124] [240 3] [0 2]]",
        "ProcessID": 13111
      }
    ]
  }
]