[
  {
    "id": "8827A5C947BEC3C7",
    "reports": [
      {
        "Cycles": 0,
        "Agent": "org.apache.hadoop.ipc.ProtobufRpcEngine",
        "ProcessName": "Read",
        "TaskID": "8827A5C947BEC3C7",
        "ParentEventID": [
          "73FAAB1E70BFFA6A"
        ],
        "Label": "Invoking org.apache.hadoop.hdfs.protocol.ClientProtocol.getBlockLocations",
        "Title": "X-Trace Task",
        "Host": "pinky19.mpi-sws.org",
        "HRT": 26962622400081240,
        "Timestamp": "1557746262340.201660",
        "TenantClass": 0,
        "Source": "ProtobufRpcEngine.java:228",
        "ThreadID": 1,
        "ThreadName": "",
        "EventID": "ED785D41E9B2A32E",
        "ProcessID": 36430
      },
      {
        "Cycles": 0,
        "Agent": "Execution-CPU",
        "ProcessName": "Read",
        "TaskID": "8827A5C947BEC3C7",
        "ParentEventID": [
          "D2E1EF342E39B4CE"
        ],
        "Label": "set",
        "Title": "X-Trace Task",
        "Host": "pinky19.mpi-sws.org",
        "HRT": 26962622400146361,
        "Operation": "set",
        "Timestamp": "1557746262340.266602",
        "TenantClass": 0,
        "Source": "Client.java:1032",
        "ThreadID": 41,
        "ThreadName": "",
        "EventID": "ED251BE692E93B8F",
        "ProcessID": 36430
      },
      {
        "Cycles": 0,
        "Agent": "edu.brown.cs.systems.retro.benchmarks.hdfs_client.Reader",
        "ProcessName": "Read",
        "TaskID": "8827A5C947BEC3C7",
        "ParentEventID": [
          "273CB194C430EC28"
        ],
        "Label": "Reading file",
        "Title": "X-Trace Task",
        "Host": "pinky19.mpi-sws.org",
        "HRT": 26962622400056922,
        "Timestamp": "1557746262340.177246",
        "TenantClass": 0,
        "ThreadID": 1,
        "ThreadName": "",
        "EventID": "73FAAB1E70BFFA6A",
        "ProcessID": 36430
      },
      {
        "Cycles": 0,
        "Agent": "Execution-CPU",
        "ProcessName": "Read",
        "TaskID": "8827A5C947BEC3C7",
        "ParentEventID": [
          "ED785D41E9B2A32E"
        ],
        "Label": "unset",
        "Title": "X-Trace Task",
        "Host": "pinky19.mpi-sws.org",
        "Duration": "21873868",
        "HRT": 26962622400097914,
        "Operation": "unset",
        "Timestamp": "1557746262340.218262",
        "TenantClass": 0,
        "Source": "Client.java:1027",
        "ThreadID": 1,
        "ThreadName": "",
        "EventID": "D2E1EF342E39B4CE",
        "ProcessID": 36430
      },
      {
        "Cycles": 0,
        "Agent": "edu.brown.cs.systems.xtrace.logging.BaggageWrappers",
        "ProcessName": "Read",
        "TaskID": "8827A5C947BEC3C7",
        "ParentEventID": [
          "ED251BE692E93B8F"
        ],
        "Label": "Forking current baggage with Baggage.fork()",
        "Title": "X-Trace Task",
        "Host": "pinky19.mpi-sws.org",
        "HRT": 26962622400164182,
        "Operation": "fork",
        "Timestamp": "1557746262340.284424",
        "TenantClass": 0,
        "Source": "Client.java:1043",
        "ThreadID": 41,
        "ThreadName": "",
        "EventID": "842A310DEDCE7E52",
        "ProcessID": 36430
      },
      {
        "Cycles": 0,
        "Agent": "Execution-CPU",
        "ProcessName": "Read",
        "TaskID": "8827A5C947BEC3C7",
        "ParentEventID": [
          "842A310DEDCE7E52"
        ],
        "Label": "unset",
        "Title": "X-Trace Task",
        "Host": "pinky19.mpi-sws.org",
        "Duration": "60845",
        "HRT": 26962622400225674,
        "Operation": "unset",
        "Timestamp": "1557746262340.345947",
        "TenantClass": 0,
        "Source": "Client.java:1062",
        "ThreadID": 41,
        "ThreadName": "",
        "EventID": "4C76BC3B22AF2B8A",
        "ProcessID": 36430
      },
      {
        "Cycles": 0,
        "Agent": "Execution-CPU",
        "ProcessName": "Read",
        "TaskID": "8827A5C947BEC3C7",
        "ParentEventID": [
          "4C76BC3B22AF2B8A"
        ],
        "Label": "set",
        "Title": "X-Trace Task",
        "Host": "pinky19.mpi-sws.org",
        "HRT": 26962622400248985,
        "Operation": "set",
        "Timestamp": "1557746262340.369385",
        "TenantClass": 0,
        "Source": "Client.java:1104",
        "ThreadID": 1,
        "ThreadName": "",
        "EventID": "07D5C3E77170D4C7",
        "ProcessID": 36430
      },
      {
        "Cycles": 0,
        "Agent": "Execution-CPU",
        "ProcessName": "Name",
        "TaskID": "8827A5C947BEC3C7",
        "ParentEventID": [
          "842A310DEDCE7E52"
        ],
        "Label": "set",
        "Title": "X-Trace Task",
        "Host": "pinky19.mpi-sws.org",
        "HRT": 26962622400275311,
        "Operation": "set",
        "Timestamp": "1557746262340.422119",
        "TenantClass": 0,
        "Source": "Server.java:1840",
        "ThreadID": 48,
        "ThreadName": "",
        "EventID": "C8830BAC0E2F285C",
        "BaggageBytes": "[[248 5] [240 0] [0 136 39 165 201 71 190 195 199] [240 1] [0 132 42 49 13 237 206 126 82] [240 3] [0 2]]",
        "ProcessID": 2171
      },
      {
        "Cycles": 0,
        "Agent": "Execution-CPU",
        "ProcessName": "Name",
        "TaskID": "8827A5C947BEC3C7",
        "ParentEventID": [
          "95D68DC653E39260"
        ],
        "Label": "unset",
        "Title": "X-Trace Task",
        "Host": "pinky19.mpi-sws.org",
        "Duration": "24534",
        "HRT": 26962622400324725,
        "Operation": "unset",
        "Timestamp": "1557746262340.471436",
        "TenantClass": 0,
        "Source": "Server.java:1828",
        "ThreadID": 48,
        "ThreadName": "",
        "EventID": "BB2605A698D992D9",
        "BaggageBytes": "[[248 5] [240 0] [0 136 39 165 201 71 190 195 199] [240 1] [0 149 214 141 198 83 227 146 96] [240 3] [0 2]]",
        "ProcessID": 2171
      },
      {
        "Cycles": 0,
        "Agent": "edu.brown.cs.systems.xtrace.logging.BaggageWrappers",
        "ProcessName": "Name",
        "TaskID": "8827A5C947BEC3C7",
        "ParentEventID": [
          "C8830BAC0E2F285C"
        ],
        "Label": "Forking current baggage with Baggage.fork()",
        "Title": "X-Trace Task",
        "Host": "pinky19.mpi-sws.org",
        "HRT": 26962622400303901,
        "Operation": "fork",
        "Timestamp": "1557746262340.450684",
        "TenantClass": 0,
        "Source": "Server.java:550",
        "ThreadID": 48,
        "ThreadName": "",
        "EventID": "95D68DC653E39260",
        "BaggageBytes": "[[248 5] [240 0] [0 136 39 165 201 71 190 195 199] [240 1] [0 200 131 11 172 14 47 40 92] [240 3] [0 2]]",
        "ProcessID": 2171
      },
      {
        "Cycles": 0,
        "Agent": "Execution-CPU",
        "ProcessName": "Name",
        "TaskID": "8827A5C947BEC3C7",
        "ParentEventID": [
          "95D68DC653E39260"
        ],
        "Label": "set",
        "Title": "X-Trace Task",
        "Host": "pinky19.mpi-sws.org",
        "HRT": 26962622400331477,
        "Operation": "set",
        "Timestamp": "1557746262340.478271",
        "TenantClass": 0,
        "Source": "Server.java:2071",
        "ThreadID": 57,
        "ThreadName": "",
        "EventID": "30861BC61C9736B8",
        "BaggageBytes": "[[248 5] [240 0] [0 136 39 165 201 71 190 195 199] [240 1] [0 149 214 141 198 83 227 146 96] [240 3] [0 2]]",
        "ProcessID": 2171
      },
      {
        "Cycles": 0,
        "Agent": "org.apache.hadoop.ipc.Server",
        "ProcessName": "Name",
        "TaskID": "8827A5C947BEC3C7",
        "ParentEventID": [
          "30861BC61C9736B8"
        ],
        "Label": "getBlockLocations in org.apache.hadoop.hdfs.protocol.ClientProtocol",
        "Title": "X-Trace Task",
        "Host": "pinky19.mpi-sws.org",
        "HRT": 26962622400366064,
        "Timestamp": "1557746262340.512695",
        "TenantClass": 0,
        "Source": "ProtobufRpcEngine.java:601",
        "ThreadID": 57,
        "ThreadName": "",
        "EventID": "D88188CD356B6975",
        "BaggageBytes": "[[248 5] [240 0] [0 136 39 165 201 71 190 195 199] [240 1] [0 48 134 27 198 28 151 54 184] [240 3] [0 2]]",
        "ProcessID": 2171
      },
      {
        "Cycles": 0,
        "Agent": "edu.brown.cs.systems.xtrace.logging.BaggageWrappers",
        "ProcessName": "Name",
        "TaskID": "8827A5C947BEC3C7",
        "ParentEventID": [
          "28D32DB36DFD2406"
        ],
        "Label": "Forking current baggage with Baggage.fork()",
        "Title": "X-Trace Task",
        "Host": "pinky19.mpi-sws.org",
        "HRT": 26962622400487678,
        "Operation": "fork",
        "Timestamp": "1557746262340.634521",
        "TenantClass": 0,
        "Source": "Server.java:2398",
        "ThreadID": 57,
        "ThreadName": "",
        "EventID": "E046CCD3334742A5",
        "BaggageBytes": "[[248 5] [240 0] [0 136 39 165 201 71 190 195 199] [240 1] [0 40 211 45 179 109 253 36 6] [240 3] [0 2]]",
        "ProcessID": 2171
      },
      {
        "Cycles": 0,
        "Agent": "org.apache.hadoop.hdfs.server.namenode.FSNamesystem.audit",
        "ProcessName": "Name",
        "TaskID": "8827A5C947BEC3C7",
        "ParentEventID": [
          "D88188CD356B6975"
        ],
        "Label": "allowed=true\tugi=plascas (auth:SIMPLE)\tip=/139.19.171.63\tcmd=open\tsrc=/ds/qxxe6kvQBsBUq7kO\tdst=null\tperm=null\tproto=rpc",
        "Title": "X-Trace Task",
        "Host": "pinky19.mpi-sws.org",
        "HRT": 26962622400431978,
        "Timestamp": "1557746262340.578613",
        "TenantClass": 0,
        "Source": "FSNamesystem.java:8313",
        "ThreadID": 57,
        "ThreadName": "",
        "EventID": "28D32DB36DFD2406",
        "BaggageBytes": "[[248 5] [240 0] [0 136 39 165 201 71 190 195 199] [240 1] [0 216 129 136 205 53 107 105 117] [240 3] [0 2]]",
        "ProcessID": 2171
      },
      {
        "Cycles": 0,
        "Agent": "Execution-CPU",
        "ProcessName": "Name",
        "TaskID": "8827A5C947BEC3C7",
        "ParentEventID": [
          "E046CCD3334742A5"
        ],
        "Label": "unset",
        "Title": "X-Trace Task",
        "Host": "pinky19.mpi-sws.org",
        "Duration": "256403",
        "HRT": 26962622400609664,
        "Operation": "unset",
        "Timestamp": "1557746262340.756348",
        "TenantClass": 0,
        "Source": "Server.java:1058",
        "ThreadID": 57,
        "ThreadName": "",
        "EventID": "5B1C29C0518919FB",
        "BaggageBytes": "[[248 5] [240 0] [0 136 39 165 201 71 190 195 199] [240 1] [0 224 70 204 211 51 71 66 165] [240 3] [0 2]]",
        "ProcessID": 2171
      },
      {
        "Cycles": 0,
        "Agent": "Execution-CPU",
        "ProcessName": "Read",
        "TaskID": "8827A5C947BEC3C7",
        "ParentEventID": [
          "449D53611E79A718"
        ],
        "Label": "unset",
        "Title": "X-Trace Task",
        "Host": "pinky19.mpi-sws.org",
        "Duration": "4704",
        "HRT": 26962622400668797,
        "Operation": "unset",
        "Timestamp": "1557746262340.789062",
        "TenantClass": 0,
        "Source": "Client.java:1168",
        "ThreadID": 37,
        "ThreadName": "",
        "EventID": "8D984BF36A0C390E",
        "ProcessID": 36430
      },
      {
        "Cycles": 0,
        "Agent": "Execution-Sleep",
        "ProcessName": "Read",
        "TaskID": "8827A5C947BEC3C7",
        "ParentEventID": [
          "07D5C3E77170D4C7"
        ],
        "Label": "waited",
        "Title": "X-Trace Task",
        "Host": "pinky19.mpi-sws.org",
        "Duration": "418320",
        "HRT": 26962622400684778,
        "Operation": "waited",
        "Timestamp": "1557746262340.805176",
        "TenantClass": 0,
        "Source": "Client.java:1537",
        "ThreadID": 1,
        "ThreadName": "",
        "EventID": "6FE4AAC5C5D6DB2C",
        "ProcessID": 36430
      },
      {
        "Cycles": 0,
        "Agent": "edu.brown.cs.systems.xtrace.logging.BaggageWrappers",
        "ProcessName": "Read",
        "TaskID": "8827A5C947BEC3C7",
        "ParentEventID": [
          "8D984BF36A0C390E",
          "6FE4AAC5C5D6DB2C"
        ],
        "Label": "Merged current baggage with other baggage",
        "Title": "X-Trace Task",
        "Host": "pinky19.mpi-sws.org",
        "HRT": 26962622400696453,
        "Operation": "join",
        "Timestamp": "1557746262340.816895",
        "TenantClass": 0,
        "Source": "Client.java:1545",
        "ThreadID": 1,
        "ThreadName": "",
        "EventID": "79851249921C25FF",
        "ProcessID": 36430
      },
      {
        "Cycles": 0,
        "Agent": "org.apache.hadoop.ipc.ProtobufRpcEngine",
        "ProcessName": "Read",
        "TaskID": "8827A5C947BEC3C7",
        "ParentEventID": [
          "79851249921C25FF"
        ],
        "Label": "org.apache.hadoop.hdfs.protocol.ClientProtocol.getBlockLocations completed",
        "Title": "X-Trace Task",
        "Host": "pinky19.mpi-sws.org",
        "HRT": 26962622400731567,
        "Timestamp": "1557746262340.851807",
        "TenantClass": 0,
        "Source": "ProtobufRpcEngine.java:275",
        "ThreadID": 1,
        "ThreadName": "",
        "EventID": "0FFC372CC57E193B",
        "ProcessID": 36430
      },
      {
        "Cycles": 0,
        "Agent": "Execution-CPU",
        "ProcessName": "Read",
        "TaskID": "8827A5C947BEC3C7",
        "ParentEventID": [
          "E046CCD3334742A5"
        ],
        "Label": "set",
        "Title": "X-Trace Task",
        "Host": "pinky19.mpi-sws.org",
        "HRT": 26962622400651641,
        "Operation": "set",
        "Timestamp": "1557746262340.771973",
        "TenantClass": 0,
        "Source": "Client.java:302",
        "ThreadID": 37,
        "ThreadName": "",
        "EventID": "449D53611E79A718",
        "ProcessID": 36430
      },
      {
        "Cycles": 0,
        "Agent": "edu.brown.cs.systems.xtrace.logging.BaggageWrappers",
        "ProcessName": "Read",
        "TaskID": "8827A5C947BEC3C7",
        "ParentEventID": [
          "0FFC372CC57E193B"
        ],
        "Label": "Forking current baggage with Baggage.fork()",
        "Title": "X-Trace Task",
        "Host": "pinky19.mpi-sws.org",
        "HRT": 26962622400794505,
        "Operation": "fork",
        "Timestamp": "1557746262340.914795",
        "TenantClass": 0,
        "Source": "DataTransferProtoUtil.java:94",
        "ThreadID": 1,
        "ThreadName": "",
        "EventID": "BEBA2420E281118C",
        "ProcessID": 36430
      },
      {
        "Cycles": 0,
        "Agent": "Execution-CPU",
        "ProcessName": "Data",
        "TaskID": "8827A5C947BEC3C7",
        "ParentEventID": [
          "BEBA2420E281118C"
        ],
        "Label": "set",
        "Title": "X-Trace Task",
        "Host": "pinky21.mpi-sws.org",
        "HRT": 10808932107250171,
        "Operation": "set",
        "Timestamp": "1557746262341.101562",
        "TenantClass": 0,
        "Source": "Receiver.java:117",
        "ThreadID": 14875,
        "ThreadName": "",
        "EventID": "0FBAC643EF6A5CCE",
        "BaggageBytes": "[[248 5] [240 0] [0 136 39 165 201 71 190 195 199] [240 1] [0 190 186 36 32 226 129 17 140] [240 3] [0 2]]",
        "ProcessID": 20775
      },
      {
        "Cycles": 0,
        "Agent": "edu.brown.cs.systems.xtrace.logging.XTraceInit",
        "ProcessName": "Data",
        "TaskID": "8827A5C947BEC3C7",
        "ParentEventID": [
          "0FBAC643EF6A5CCE"
        ],
        "Label": "Thread.setName: DataXceiver for client DFSClient_NONMAPREDUCE_778905418_1 at /139.19.171.63:35320 [Sending block BP-1633380353-139.19.171.63-1554193446451:blk_1073761027_20203]",
        "Title": "X-Trace Task",
        "Host": "pinky21.mpi-sws.org",
        "HRT": 10808932107287526,
        "Timestamp": "1557746262341.138916",
        "TenantClass": 0,
        "Source": "DataXceiver.java:168",
        "ThreadID": 14875,
        "ThreadName": "",
        "EventID": "3F7B1E073A48B227",
        "BaggageBytes": "[[248 5] [240 0] [0 136 39 165 201 71 190 195 199] [240 1] [0 15 186 198 67 239 106 92 206] [240 3] [0 2]]",
        "ProcessID": 20775
      },
      {
        "Cycles": 0,
        "Agent": "edu.brown.cs.systems.xtrace.logging.BaggageWrappers",
        "ProcessName": "Data",
        "TaskID": "8827A5C947BEC3C7",
        "ParentEventID": [
          "3F7B1E073A48B227"
        ],
        "Label": "Forking current baggage with Baggage.fork()",
        "Title": "X-Trace Task",
        "Host": "pinky21.mpi-sws.org",
        "HRT": 10808932107365018,
        "Operation": "fork",
        "Timestamp": "1557746262341.216309",
        "TenantClass": 0,
        "Source": "DataXceiver.java:1257",
        "ThreadID": 14875,
        "ThreadName": "",
        "EventID": "51EF2A3F14C5B3FC",
        "BaggageBytes": "[[248 5] [240 0] [0 136 39 165 201 71 190 195 199] [240 1] [0 63 123 30 7 58 72 178 39] [240 3] [0 2]]",
        "ProcessID": 20775
      },
      {
        "Cycles": 0,
        "Agent": "edu.brown.cs.systems.xtrace.logging.BaggageWrappers",
        "ProcessName": "Data",
        "TaskID": "8827A5C947BEC3C7",
        "ParentEventID": [
          "51EF2A3F14C5B3FC"
        ],
        "Label": "Forking current baggage with Baggage.fork()",
        "Title": "X-Trace Task",
        "Host": "pinky21.mpi-sws.org",
        "HRT": 10808932107436133,
        "Operation": "fork",
        "Timestamp": "1557746262341.287354",
        "TenantClass": 0,
        "Source": "PacketHeader.java:95",
        "ThreadID": 14875,
        "ThreadName": "",
        "EventID": "3B8A14B53F4A802E",
        "BaggageBytes": "[[248 5] [240 0] [0 136 39 165 201 71 190 195 199] [240 1] [0 81 239 42 63 20 197 179 252] [240 3] [0 2]]",
        "ProcessID": 20775
      },
      {
        "Cycles": 0,
        "Agent": "edu.brown.cs.systems.xtrace.logging.BaggageWrappers",
        "ProcessName": "Read",
        "TaskID": "8827A5C947BEC3C7",
        "ParentEventID": [
          "51EF2A3F14C5B3FC",
          "30DEED06F238B6FD"
        ],
        "Label": "Merged current baggage with other baggage",
        "Title": "X-Trace Task",
        "Host": "pinky19.mpi-sws.org",
        "HRT": 26962622401219766,
        "Operation": "join",
        "Timestamp": "1557746262341.340088",
        "TenantClass": 0,
        "Source": "RemoteBlockReader2.java:429",
        "ThreadID": 1,
        "ThreadName": "",
        "EventID": "EE41B13A0E41DC25",
        "ProcessID": 36430
      },
      {
        "Cycles": 0,
        "Agent": "Execution-Sleep",
        "ProcessName": "Read",
        "TaskID": "8827A5C947BEC3C7",
        "ParentEventID": [
          "BEBA2420E281118C"
        ],
        "Label": "waited",
        "Title": "X-Trace Task",
        "Host": "pinky19.mpi-sws.org",
        "Duration": "283174",
        "HRT": 26962622401159518,
        "Operation": "waited",
        "Timestamp": "1557746262341.279785",
        "TenantClass": 0,
        "Source": "SocketIOWithTimeout.java:335",
        "ThreadID": 1,
        "ThreadName": "",
        "EventID": "30DEED06F238B6FD",
        "ProcessID": 36430
      },
      {
        "Cycles": 0,
        "Agent": "Execution-Sleep",
        "ProcessName": "Data",
        "TaskID": "8827A5C947BEC3C7",
        "ParentEventID": [
          "3B8A14B53F4A802E"
        ],
        "Label": "waited",
        "Title": "X-Trace Task",
        "Host": "pinky21.mpi-sws.org",
        "Duration": "5833",
        "HRT": 10808932107499454,
        "Operation": "waited",
        "Timestamp": "1557746262341.350830",
        "TenantClass": 0,
        "Source": "SocketIOWithTimeout.java:335",
        "ThreadID": 14875,
        "ThreadName": "",
        "EventID": "0D5D9D41BC410E8B",
        "BaggageBytes": "[[248 5] [240 0] [0 136 39 165 201 71 190 195 199] [240 1] [0 59 138 20 181 63 74 128 46] [240 3] [0 2]]",
        "ProcessID": 20775
      },
      {
        "Cycles": 0,
        "Agent": "edu.brown.cs.systems.xtrace.logging.BaggageWrappers",
        "ProcessName": "Data",
        "TaskID": "8827A5C947BEC3C7",
        "ParentEventID": [
          "0D5D9D41BC410E8B"
        ],
        "Label": "Forking current baggage with Baggage.fork()",
        "Title": "X-Trace Task",
        "Host": "pinky21.mpi-sws.org",
        "HRT": 10808932107565652,
        "Operation": "fork",
        "Timestamp": "1557746262341.416992",
        "TenantClass": 0,
        "Source": "PacketHeader.java:95",
        "ThreadID": 14875,
        "ThreadName": "",
        "EventID": "91430F496A198844",
        "BaggageBytes": "[[248 5] [240 0] [0 136 39 165 201 71 190 195 199] [240 1] [0 13 93 157 65 188 65 14 139] [240 3] [0 2]]",
        "ProcessID": 20775
      },
      {
        "Cycles": 0,
        "Agent": "Execution-Sleep",
        "ProcessName": "Read",
        "TaskID": "8827A5C947BEC3C7",
        "ParentEventID": [
          "EE41B13A0E41DC25"
        ],
        "Label": "waited",
        "Title": "X-Trace Task",
        "Host": "pinky19.mpi-sws.org",
        "Duration": "115953",
        "HRT": 26962622401415498,
        "Operation": "waited",
        "Timestamp": "1557746262341.535889",
        "TenantClass": 0,
        "Source": "SocketIOWithTimeout.java:335",
        "ThreadID": 1,
        "ThreadName": "",
        "EventID": "8C738606AF12A675",
        "ProcessID": 36430
      },
      {
        "Cycles": 0,
        "Agent": "edu.brown.cs.systems.xtrace.logging.BaggageWrappers",
        "ProcessName": "Read",
        "TaskID": "8827A5C947BEC3C7",
        "ParentEventID": [
          "3B8A14B53F4A802E",
          "8C738606AF12A675"
        ],
        "Label": "Merged current baggage with other baggage",
        "Title": "X-Trace Task",
        "Host": "pinky19.mpi-sws.org",
        "HRT": 26962622401467839,
        "Operation": "join",
        "Timestamp": "1557746262341.588135",
        "TenantClass": 0,
        "Source": "PacketHeader.java:168",
        "ThreadID": 1,
        "ThreadName": "",
        "EventID": "FE065D9D23EA525E",
        "ProcessID": 36430
      },
      {
        "Cycles": 0,
        "Agent": "edu.brown.cs.systems.xtrace.logging.BaggageWrappers",
        "ProcessName": "Read",
        "TaskID": "8827A5C947BEC3C7",
        "ParentEventID": [
          "E3730BF5BBAE0A2F"
        ],
        "Label": "Forking current baggage with Baggage.fork()",
        "Title": "X-Trace Task",
        "Host": "pinky19.mpi-sws.org",
        "HRT": 26962622401529660,
        "Operation": "fork",
        "Timestamp": "1557746262341.649902",
        "TenantClass": 0,
        "Source": "RemoteBlockReader2.java:361",
        "ThreadID": 1,
        "ThreadName": "",
        "EventID": "E04E7A87DB1DA4CF",
        "ProcessID": 36430
      },
      {
        "Cycles": 0,
        "Agent": "edu.brown.cs.systems.xtrace.logging.BaggageWrappers",
        "ProcessName": "Read",
        "TaskID": "8827A5C947BEC3C7",
        "ParentEventID": [
          "91430F496A198844",
          "FE065D9D23EA525E"
        ],
        "Label": "Merged current baggage with other baggage",
        "Title": "X-Trace Task",
        "Host": "pinky19.mpi-sws.org",
        "HRT": 26962622401520993,
        "Operation": "join",
        "Timestamp": "1557746262341.641357",
        "TenantClass": 0,
        "Source": "PacketHeader.java:168",
        "ThreadID": 1,
        "ThreadName": "",
        "EventID": "E3730BF5BBAE0A2F",
        "ProcessID": 36430
      },
      {
        "Cycles": 0,
        "Agent": "Execution-Sleep",
        "ProcessName": "Data",
        "TaskID": "8827A5C947BEC3C7",
        "ParentEventID": [
          "91430F496A198844"
        ],
        "Label": "waited",
        "Title": "X-Trace Task",
        "Host": "pinky21.mpi-sws.org",
        "Duration": "216786",
        "HRT": 10808932107872931,
        "Operation": "waited",
        "Timestamp": "1557746262341.724121",
        "TenantClass": 0,
        "Source": "SocketIOWithTimeout.java:335",
        "ThreadID": 14875,
        "ThreadName": "",
        "EventID": "AE0ADFB27CC1AA99",
        "BaggageBytes": "[[248 5] [240 0] [0 136 39 165 201 71 190 195 199] [240 1] [0 145 67 15 73 106 25 136 68] [240 3] [0 2]]",
        "ProcessID": 20775
      },
      {
        "Cycles": 0,
        "Agent": "edu.brown.cs.systems.xtrace.logging.BaggageWrappers",
        "ProcessName": "Data",
        "TaskID": "8827A5C947BEC3C7",
        "ParentEventID": [
          "E04E7A87DB1DA4CF",
          "AE0ADFB27CC1AA99"
        ],
        "Label": "Merged current baggage with other baggage",
        "Title": "X-Trace Task",
        "Host": "pinky21.mpi-sws.org",
        "HRT": 10808932107922525,
        "Operation": "join",
        "Timestamp": "1557746262341.773926",
        "TenantClass": 0,
        "Source": "DataXceiver.java:574",
        "ThreadID": 14875,
        "ThreadName": "",
        "EventID": "2BDC482B5AB2FDE4",
        "BaggageBytes": "[[248 5] [240 0] [0 136 39 165 201 71 190 195 199] [240 1] [0 174 10 223 178 124 193 170 153] [0 224 78 122 135 219 29 164 207] [240 3] [0 2]]",
        "ProcessID": 20775
      },
      {
        "Cycles": 0,
        "Agent": "Execution-CPU",
        "ProcessName": "Data",
        "TaskID": "8827A5C947BEC3C7",
        "ParentEventID": [
          "2BDC482B5AB2FDE4"
        ],
        "Label": "unset",
        "Title": "X-Trace Task",
        "Host": "pinky21.mpi-sws.org",
        "Duration": "665637",
        "HRT": 10808932107942279,
        "Operation": "unset",
        "Timestamp": "1557746262341.793701",
        "TenantClass": 0,
        "Source": "DataXceiver.java:261",
        "ThreadID": 14875,
        "ThreadName": "",
        "EventID": "4A0875B80F89F275",
        "BaggageBytes": "[[248 5] [240 0] [0 136 39 165 201 71 190 195 199] [240 1] [0 43 220 72 43 90 178 253 228] [240 3] [0 2]]",
        "ProcessID": 20775
      },
      {
        "Cycles": 0,
        "Agent": "edu.brown.cs.systems.retro.benchmarks.hdfs_client.Reader",
        "ProcessName": "Read",
        "TaskID": "8827A5C947BEC3C7",
        "ParentEventID": [
          "0"
        ],
        "Label": "Reading file",
        "Title": "X-Trace Task",
        "Host": "pinky19.mpi-sws.org",
        "HRT": 26962622400041995,
        "Timestamp": "1557746262340.162354",
        "TenantClass": 0,
        "ThreadID": 1,
        "ThreadName": "",
        "EventID": "273CB194C430EC28",
        "ProcessID": 36430,
        "Tag": [
          "reader_10kb",
          "Read Size: 10240"
        ]
      }
    ]
  }
]