[
  {
    "id": "5AAE7412FA892063",
    "reports": [
      {
        "Cycles": 0,
        "Agent": "Execution-CPU",
        "ProcessName": "Read",
        "TaskID": "5AAE7412FA892063",
        "ParentEventID": [
          "18D074D2FA7489B8"
        ],
        "Label": "unset",
        "Title": "X-Trace Task",
        "Host": "pinky19.mpi-sws.org",
        "Duration": "22037898",
        "HRT": 25491768497748410,
        "Operation": "unset",
        "Timestamp": "1556275408438.154541",
        "TenantClass": 0,
        "Source": "Client.java:1027",
        "ThreadID": 1,
        "ThreadName": "",
        "EventID": "08E39A064678EAAB",
        "ProcessID": 21035
      },
      {
        "Cycles": 0,
        "Agent": "org.apache.hadoop.ipc.ProtobufRpcEngine",
        "ProcessName": "Read",
        "TaskID": "5AAE7412FA892063",
        "ParentEventID": [
          "6D61B732563006C9"
        ],
        "Label": "Invoking org.apache.hadoop.hdfs.protocol.ClientProtocol.getBlockLocations",
        "Title": "X-Trace Task",
        "Host": "pinky19.mpi-sws.org",
        "HRT": 25491768497636119,
        "Timestamp": "1556275408438.042236",
        "TenantClass": 0,
        "Source": "ProtobufRpcEngine.java:228",
        "ThreadID": 1,
        "ThreadName": "",
        "EventID": "18D074D2FA7489B8",
        "ProcessID": 21035
      },
      {
        "Cycles": 0,
        "Agent": "edu.brown.cs.systems.retro.benchmarks.hdfs_client.Reader",
        "ProcessName": "Read",
        "TaskID": "5AAE7412FA892063",
        "ParentEventID": [
          "1C008ECE15DD1EF6"
        ],
        "Label": "Reading file",
        "Title": "X-Trace Task",
        "Host": "pinky19.mpi-sws.org",
        "HRT": 25491768497375326,
        "Timestamp": "1556275408437.781494",
        "TenantClass": 0,
        "ThreadID": 1,
        "ThreadName": "",
        "EventID": "6D61B732563006C9",
        "ProcessID": 21035
      },
      {
        "Cycles": 0,
        "Agent": "edu.brown.cs.systems.xtrace.logging.BaggageWrappers",
        "ProcessName": "Read",
        "TaskID": "5AAE7412FA892063",
        "ParentEventID": [
          "6529C530AF6BC93D"
        ],
        "Label": "Forking current baggage with Baggage.fork()",
        "Title": "X-Trace Task",
        "Host": "pinky19.mpi-sws.org",
        "HRT": 25491768497853158,
        "Operation": "fork",
        "Timestamp": "1556275408438.259277",
        "TenantClass": 0,
        "Source": "Client.java:1043",
        "ThreadID": 41,
        "ThreadName": "",
        "EventID": "7C1E3DCBB5546499",
        "ProcessID": 21035
      },
      {
        "Cycles": 0,
        "Agent": "Execution-CPU",
        "ProcessName": "Read",
        "TaskID": "5AAE7412FA892063",
        "ParentEventID": [
          "08E39A064678EAAB"
        ],
        "Label": "set",
        "Title": "X-Trace Task",
        "Host": "pinky19.mpi-sws.org",
        "HRT": 25491768497825894,
        "Operation": "set",
        "Timestamp": "1556275408438.231934",
        "TenantClass": 0,
        "Source": "Client.java:1032",
        "ThreadID": 41,
        "ThreadName": "",
        "EventID": "6529C530AF6BC93D",
        "ProcessID": 21035
      },
      {
        "Cycles": 0,
        "Agent": "Execution-CPU",
        "ProcessName": "Read",
        "TaskID": "5AAE7412FA892063",
        "ParentEventID": [
          "7C1E3DCBB5546499"
        ],
        "Label": "unset",
        "Title": "X-Trace Task",
        "Host": "pinky19.mpi-sws.org",
        "Duration": "128020",
        "HRT": 25491768497975884,
        "Operation": "unset",
        "Timestamp": "1556275408438.382080",
        "TenantClass": 0,
        "Source": "Client.java:1062",
        "ThreadID": 41,
        "ThreadName": "",
        "EventID": "F155FD9783EE81C7",
        "ProcessID": 21035
      },
      {
        "Cycles": 0,
        "Agent": "Execution-CPU",
        "ProcessName": "Read",
        "TaskID": "5AAE7412FA892063",
        "ParentEventID": [
          "F155FD9783EE81C7"
        ],
        "Label": "set",
        "Title": "X-Trace Task",
        "Host": "pinky19.mpi-sws.org",
        "HRT": 25491768498011896,
        "Operation": "set",
        "Timestamp": "1556275408438.417969",
        "TenantClass": 0,
        "Source": "Client.java:1104",
        "ThreadID": 1,
        "ThreadName": "",
        "EventID": "7BD070A0CFA6EEF7",
        "ProcessID": 21035
      },
      {
        "Cycles": 0,
        "Agent": "edu.brown.cs.systems.xtrace.logging.BaggageWrappers",
        "ProcessName": "Name",
        "TaskID": "5AAE7412FA892063",
        "ParentEventID": [
          "3912D250337D8D2A"
        ],
        "Label": "Forking current baggage with Baggage.fork()",
        "Title": "X-Trace Task",
        "Host": "pinky19.mpi-sws.org",
        "HRT": 25491768498144460,
        "Operation": "fork",
        "Timestamp": "1556275408438.548584",
        "TenantClass": 0,
        "Source": "Server.java:550",
        "ThreadID": 48,
        "ThreadName": "",
        "EventID": "6D3926C9DA5AAB49",
        "BaggageBytes": "[[248 5] [240 0] [0 90 174 116 18 250 137 32 99] [240 1] [0 57 18 210 80 51 125 141 42] [240 3] [0 2]]",
        "ProcessID": 2171
      },
      {
        "Cycles": 0,
        "Agent": "Execution-CPU",
        "ProcessName": "Name",
        "TaskID": "5AAE7412FA892063",
        "ParentEventID": [
          "7C1E3DCBB5546499"
        ],
        "Label": "set",
        "Title": "X-Trace Task",
        "Host": "pinky19.mpi-sws.org",
        "HRT": 25491768498082533,
        "Operation": "set",
        "Timestamp": "1556275408438.486816",
        "TenantClass": 0,
        "Source": "Server.java:1840",
        "ThreadID": 48,
        "ThreadName": "",
        "EventID": "3912D250337D8D2A",
        "BaggageBytes": "[[248 5] [240 0] [0 90 174 116 18 250 137 32 99] [240 1] [0 124 30 61 203 181 84 100 153] [240 3] [0 2]]",
        "ProcessID": 2171
      },
      {
        "Cycles": 0,
        "Agent": "Execution-CPU",
        "ProcessName": "Name",
        "TaskID": "5AAE7412FA892063",
        "ParentEventID": [
          "6D3926C9DA5AAB49"
        ],
        "Label": "unset",
        "Title": "X-Trace Task",
        "Host": "pinky19.mpi-sws.org",
        "Duration": "46100",
        "HRT": 25491768498181517,
        "Operation": "unset",
        "Timestamp": "1556275408438.585693",
        "TenantClass": 0,
        "Source": "Server.java:1828",
        "ThreadID": 48,
        "ThreadName": "",
        "EventID": "EC7BCA44CBF9F3DD",
        "BaggageBytes": "[[248 5] [240 0] [0 90 174 116 18 250 137 32 99] [240 1] [0 109 57 38 201 218 90 171 73] [240 3] [0 2]]",
        "ProcessID": 2171
      },
      {
        "Cycles": 0,
        "Agent": "Execution-CPU",
        "ProcessName": "Name",
        "TaskID": "5AAE7412FA892063",
        "ParentEventID": [
          "6D3926C9DA5AAB49"
        ],
        "Label": "set",
        "Title": "X-Trace Task",
        "Host": "pinky19.mpi-sws.org",
        "HRT": 25491768498192101,
        "Operation": "set",
        "Timestamp": "1556275408438.596191",
        "TenantClass": 0,
        "Source": "Server.java:2071",
        "ThreadID": 64,
        "ThreadName": "",
        "EventID": "DA3E891021FFA93A",
        "BaggageBytes": "[[248 5] [240 0] [0 90 174 116 18 250 137 32 99] [240 1] [0 109 57 38 201 218 90 171 73] [240 3] [0 2]]",
        "ProcessID": 2171
      },
      {
        "Cycles": 0,
        "Agent": "org.apache.hadoop.ipc.Server",
        "ProcessName": "Name",
        "TaskID": "5AAE7412FA892063",
        "ParentEventID": [
          "DA3E891021FFA93A"
        ],
        "Label": "getBlockLocations in org.apache.hadoop.hdfs.protocol.ClientProtocol",
        "Title": "X-Trace Task",
        "Host": "pinky19.mpi-sws.org",
        "HRT": 25491768498245977,
        "Timestamp": "1556275408438.650146",
        "TenantClass": 0,
        "Source": "ProtobufRpcEngine.java:601",
        "ThreadID": 64,
        "ThreadName": "",
        "EventID": "DD19483827118488",
        "BaggageBytes": "[[248 5] [240 0] [0 90 174 116 18 250 137 32 99] [240 1] [0 218 62 137 16 33 255 169 58] [240 3] [0 2]]",
        "ProcessID": 2171
      },
      {
        "Cycles": 0,
        "Agent": "org.apache.hadoop.hdfs.server.namenode.FSNamesystem.audit",
        "ProcessName": "Name",
        "TaskID": "5AAE7412FA892063",
        "ParentEventID": [
          "DD19483827118488"
        ],
        "Label": "allowed=true\tugi=plascas (auth:SIMPLE)\tip=/139.19.171.63\tcmd=open\tsrc=/ds/sXvT21lO32sRqX4T\tdst=null\tperm=null\tproto=rpc",
        "Title": "X-Trace Task",
        "Host": "pinky19.mpi-sws.org",
        "HRT": 25491768498332630,
        "Timestamp": "1556275408438.736816",
        "TenantClass": 0,
        "Source": "FSNamesystem.java:8313",
        "ThreadID": 64,
        "ThreadName": "",
        "EventID": "E702E240651EC369",
        "BaggageBytes": "[[248 5] [240 0] [0 90 174 116 18 250 137 32 99] [240 1] [0 221 25 72 56 39 17 132 136] [240 3] [0 2]]",
        "ProcessID": 2171
      },
      {
        "Cycles": 0,
        "Agent": "edu.brown.cs.systems.xtrace.logging.BaggageWrappers",
        "ProcessName": "Name",
        "TaskID": "5AAE7412FA892063",
        "ParentEventID": [
          "E702E240651EC369"
        ],
        "Label": "Forking current baggage with Baggage.fork()",
        "Title": "X-Trace Task",
        "Host": "pinky19.mpi-sws.org",
        "HRT": 25491768498402380,
        "Operation": "fork",
        "Timestamp": "1556275408438.806641",
        "TenantClass": 0,
        "Source": "Server.java:2398",
        "ThreadID": 64,
        "ThreadName": "",
        "EventID": "AE61045521221F1C",
        "BaggageBytes": "[[248 5] [240 0] [0 90 174 116 18 250 137 32 99] [240 1] [0 231 2 226 64 101 30 195 105] [240 3] [0 2]]",
        "ProcessID": 2171
      },
      {
        "Cycles": 0,
        "Agent": "Execution-CPU",
        "ProcessName": "Name",
        "TaskID": "5AAE7412FA892063",
        "ParentEventID": [
          "AE61045521221F1C"
        ],
        "Label": "unset",
        "Title": "X-Trace Task",
        "Host": "pinky19.mpi-sws.org",
        "Duration": "338578",
        "HRT": 25491768498553990,
        "Operation": "unset",
        "Timestamp": "1556275408438.958252",
        "TenantClass": 0,
        "Source": "Server.java:1058",
        "ThreadID": 64,
        "ThreadName": "",
        "EventID": "E869F72896E3BD35",
        "BaggageBytes": "[[248 5] [240 0] [0 90 174 116 18 250 137 32 99] [240 1] [0 174 97 4 85 33 34 31 28] [240 3] [0 2]]",
        "ProcessID": 2171
      },
      {
        "Cycles": 0,
        "Agent": "Execution-CPU",
        "ProcessName": "Read",
        "TaskID": "5AAE7412FA892063",
        "ParentEventID": [
          "AE61045521221F1C"
        ],
        "Label": "set",
        "Title": "X-Trace Task",
        "Host": "pinky19.mpi-sws.org",
        "HRT": 25491768498628347,
        "Operation": "set",
        "Timestamp": "1556275408439.034424",
        "TenantClass": 0,
        "Source": "Client.java:302",
        "ThreadID": 37,
        "ThreadName": "",
        "EventID": "AA725AFF64FA4C91",
        "ProcessID": 21035
      },
      {
        "Cycles": 0,
        "Agent": "Execution-CPU",
        "ProcessName": "Read",
        "TaskID": "5AAE7412FA892063",
        "ParentEventID": [
          "AA725AFF64FA4C91"
        ],
        "Label": "unset",
        "Title": "X-Trace Task",
        "Host": "pinky19.mpi-sws.org",
        "Duration": "30414",
        "HRT": 25491768498674623,
        "Operation": "unset",
        "Timestamp": "1556275408439.080811",
        "TenantClass": 0,
        "Source": "Client.java:1168",
        "ThreadID": 37,
        "ThreadName": "",
        "EventID": "0EA3716C66BC2612",
        "ProcessID": 21035
      },
      {
        "Cycles": 0,
        "Agent": "Execution-Sleep",
        "ProcessName": "Read",
        "TaskID": "5AAE7412FA892063",
        "ParentEventID": [
          "7BD070A0CFA6EEF7"
        ],
        "Label": "waited",
        "Title": "X-Trace Task",
        "Host": "pinky19.mpi-sws.org",
        "Duration": "673099",
        "HRT": 25491768498707399,
        "Operation": "waited",
        "Timestamp": "1556275408439.113525",
        "TenantClass": 0,
        "Source": "Client.java:1537",
        "ThreadID": 1,
        "ThreadName": "",
        "EventID": "EE841A306DA4C7FF",
        "ProcessID": 21035
      },
      {
        "Cycles": 0,
        "Agent": "edu.brown.cs.systems.xtrace.logging.BaggageWrappers",
        "ProcessName": "Read",
        "TaskID": "5AAE7412FA892063",
        "ParentEventID": [
          "EE841A306DA4C7FF",
          "0EA3716C66BC2612"
        ],
        "Label": "Merged current baggage with other baggage",
        "Title": "X-Trace Task",
        "Host": "pinky19.mpi-sws.org",
        "HRT": 25491768498735845,
        "Operation": "join",
        "Timestamp": "1556275408439.141846",
        "TenantClass": 0,
        "Source": "Client.java:1545",
        "ThreadID": 1,
        "ThreadName": "",
        "EventID": "F57E8DFA7D257573",
        "ProcessID": 21035
      },
      {
        "Cycles": 0,
        "Agent": "org.apache.hadoop.ipc.ProtobufRpcEngine",
        "ProcessName": "Read",
        "TaskID": "5AAE7412FA892063",
        "ParentEventID": [
          "F57E8DFA7D257573"
        ],
        "Label": "org.apache.hadoop.hdfs.protocol.ClientProtocol.getBlockLocations completed",
        "Title": "X-Trace Task",
        "Host": "pinky19.mpi-sws.org",
        "HRT": 25491768498845297,
        "Timestamp": "1556275408439.251465",
        "TenantClass": 0,
        "Source": "ProtobufRpcEngine.java:275",
        "ThreadID": 1,
        "ThreadName": "",
        "EventID": "3871BC8A70B5F716",
        "ProcessID": 21035
      },
      {
        "Cycles": 0,
        "Agent": "edu.brown.cs.systems.xtrace.logging.BaggageWrappers",
        "ProcessName": "Read",
        "TaskID": "5AAE7412FA892063",
        "ParentEventID": [
          "3871BC8A70B5F716"
        ],
        "Label": "Forking current baggage with Baggage.fork()",
        "Title": "X-Trace Task",
        "Host": "pinky19.mpi-sws.org",
        "HRT": 25491768499016546,
        "Operation": "fork",
        "Timestamp": "1556275408439.422607",
        "TenantClass": 0,
        "Source": "DataTransferProtoUtil.java:94",
        "ThreadID": 1,
        "ThreadName": "",
        "EventID": "8AF3FF6A1A45C678",
        "ProcessID": 21035
      },
      {
        "Cycles": 0,
        "Agent": "Execution-CPU",
        "ProcessName": "Data",
        "TaskID": "5AAE7412FA892063",
        "ParentEventID": [
          "8AF3FF6A1A45C678"
        ],
        "Label": "set",
        "Title": "X-Trace Task",
        "Host": "pinky19.mpi-sws.org",
        "HRT": 25491768499359018,
        "Operation": "set",
        "Timestamp": "1556275408439.726318",
        "TenantClass": 0,
        "Source": "Receiver.java:117",
        "ThreadID": 9602,
        "ThreadName": "",
        "EventID": "FD4A0525CEF6ED73",
        "BaggageBytes": "[[248 5] [240 0] [0 90 174 116 18 250 137 32 99] [240 1] [0 138 243 255 106 26 69 198 120] [240 3] [0 2]]",
        "ProcessID": 2319
      },
      {
        "Cycles": 0,
        "Agent": "edu.brown.cs.systems.xtrace.logging.XTraceInit",
        "ProcessName": "Data",
        "TaskID": "5AAE7412FA892063",
        "ParentEventID": [
          "FD4A0525CEF6ED73"
        ],
        "Label": "Thread.setName: DataXceiver for client DFSClient_NONMAPREDUCE_1377588049_1 at /139.19.171.63:36074 [Sending block BP-1633380353-139.19.171.63-1554193446451:blk_1073758235_17411]",
        "Title": "X-Trace Task",
        "Host": "pinky19.mpi-sws.org",
        "HRT": 25491768499455205,
        "Timestamp": "1556275408439.822510",
        "TenantClass": 0,
        "Source": "DataXceiver.java:168",
        "ThreadID": 9602,
        "ThreadName": "",
        "EventID": "4530F75CF13B6B77",
        "BaggageBytes": "[[248 5] [240 0] [0 90 174 116 18 250 137 32 99] [240 1] [0 253 74 5 37 206 246 237 115] [240 3] [0 2]]",
        "ProcessID": 2319
      },
      {
        "Cycles": 0,
        "Agent": "edu.brown.cs.systems.xtrace.logging.BaggageWrappers",
        "ProcessName": "Data",
        "TaskID": "5AAE7412FA892063",
        "ParentEventID": [
          "4530F75CF13B6B77"
        ],
        "Label": "Forking current baggage with Baggage.fork()",
        "Title": "X-Trace Task",
        "Host": "pinky19.mpi-sws.org",
        "HRT": 25491768499649792,
        "Operation": "fork",
        "Timestamp": "1556275408440.017090",
        "TenantClass": 0,
        "Source": "DataXceiver.java:1257",
        "ThreadID": 9602,
        "ThreadName": "",
        "EventID": "844007848A95F363",
        "BaggageBytes": "[[248 5] [240 0] [0 90 174 116 18 250 137 32 99] [240 1] [0 69 48 247 92 241 59 107 119] [240 3] [0 2]]",
        "ProcessID": 2319
      },
      {
        "Cycles": 0,
        "Agent": "Execution-Sleep",
        "ProcessName": "Read",
        "TaskID": "5AAE7412FA892063",
        "ParentEventID": [
          "8AF3FF6A1A45C678"
        ],
        "Label": "waited",
        "Title": "X-Trace Task",
        "Host": "pinky19.mpi-sws.org",
        "Duration": "627001",
        "HRT": 25491768499801843,
        "Operation": "waited",
        "Timestamp": "1556275408440.208008",
        "TenantClass": 0,
        "Source": "SocketIOWithTimeout.java:335",
        "ThreadID": 1,
        "ThreadName": "",
        "EventID": "F9C55501B944A42D",
        "ProcessID": 21035
      },
      {
        "Cycles": 0,
        "Agent": "edu.brown.cs.systems.xtrace.logging.BaggageWrappers",
        "ProcessName": "Data",
        "TaskID": "5AAE7412FA892063",
        "ParentEventID": [
          "844007848A95F363"
        ],
        "Label": "Forking current baggage with Baggage.fork()",
        "Title": "X-Trace Task",
        "Host": "pinky19.mpi-sws.org",
        "HRT": 25491768499813926,
        "Operation": "fork",
        "Timestamp": "1556275408440.181152",
        "TenantClass": 0,
        "Source": "PacketHeader.java:95",
        "ThreadID": 9602,
        "ThreadName": "",
        "EventID": "AA5EAB4156A690B2",
        "BaggageBytes": "[[248 5] [240 0] [0 90 174 116 18 250 137 32 99] [240 1] [0 132 64 7 132 138 149 243 99] [240 3] [0 2]]",
        "ProcessID": 2319
      },
      {
        "Cycles": 0,
        "Agent": "edu.brown.cs.systems.xtrace.logging.BaggageWrappers",
        "ProcessName": "Read",
        "TaskID": "5AAE7412FA892063",
        "ParentEventID": [
          "F9C55501B944A42D",
          "844007848A95F363"
        ],
        "Label": "Merged current baggage with other baggage",
        "Title": "X-Trace Task",
        "Host": "pinky19.mpi-sws.org",
        "HRT": 25491768499915033,
        "Operation": "join",
        "Timestamp": "1556275408440.321045",
        "TenantClass": 0,
        "Source": "RemoteBlockReader2.java:429",
        "ThreadID": 1,
        "ThreadName": "",
        "EventID": "5C74A8C9F9D1041F",
        "ProcessID": 21035
      },
      {
        "Cycles": 0,
        "Agent": "Execution-Sleep",
        "ProcessName": "Data",
        "TaskID": "5AAE7412FA892063",
        "ParentEventID": [
          "AA5EAB4156A690B2"
        ],
        "Label": "waited",
        "Title": "X-Trace Task",
        "Host": "pinky19.mpi-sws.org",
        "Duration": "11144",
        "HRT": 25491768499966964,
        "Operation": "waited",
        "Timestamp": "1556275408440.334229",
        "TenantClass": 0,
        "Source": "SocketIOWithTimeout.java:335",
        "ThreadID": 9602,
        "ThreadName": "",
        "EventID": "E485FAC5F1717031",
        "BaggageBytes": "[[248 5] [240 0] [0 90 174 116 18 250 137 32 99] [240 1] [0 170 94 171 65 86 166 144 178] [240 3] [0 2]]",
        "ProcessID": 2319
      },
      {
        "Cycles": 0,
        "Agent": "edu.brown.cs.systems.xtrace.logging.BaggageWrappers",
        "ProcessName": "Data",
        "TaskID": "5AAE7412FA892063",
        "ParentEventID": [
          "E485FAC5F1717031"
        ],
        "Label": "Forking current baggage with Baggage.fork()",
        "Title": "X-Trace Task",
        "Host": "pinky19.mpi-sws.org",
        "HRT": 25491768500122338,
        "Operation": "fork",
        "Timestamp": "1556275408440.489746",
        "TenantClass": 0,
        "Source": "PacketHeader.java:95",
        "ThreadID": 9602,
        "ThreadName": "",
        "EventID": "18B9DF69F8612354",
        "BaggageBytes": "[[248 5] [240 0] [0 90 174 116 18 250 137 32 99] [240 1] [0 228 133 250 197 241 113 112 49] [240 3] [0 2]]",
        "ProcessID": 2319
      },
      {
        "Cycles": 0,
        "Agent": "Execution-Sleep",
        "ProcessName": "Read",
        "TaskID": "5AAE7412FA892063",
        "ParentEventID": [
          "5C74A8C9F9D1041F"
        ],
        "Label": "waited",
        "Title": "X-Trace Task",
        "Host": "pinky19.mpi-sws.org",
        "Duration": "90830",
        "HRT": 25491768500171608,
        "Operation": "waited",
        "Timestamp": "1556275408440.577637",
        "TenantClass": 0,
        "Source": "SocketIOWithTimeout.java:335",
        "ThreadID": 1,
        "ThreadName": "",
        "EventID": "43D8216980A9BAE4",
        "ProcessID": 21035
      },
      {
        "Cycles": 0,
        "Agent": "edu.brown.cs.systems.xtrace.logging.BaggageWrappers",
        "ProcessName": "Read",
        "TaskID": "5AAE7412FA892063",
        "ParentEventID": [
          "AA5EAB4156A690B2",
          "43D8216980A9BAE4"
        ],
        "Label": "Merged current baggage with other baggage",
        "Title": "X-Trace Task",
        "Host": "pinky19.mpi-sws.org",
        "HRT": 25491768500380859,
        "Operation": "join",
        "Timestamp": "1556275408440.786865",
        "TenantClass": 0,
        "Source": "PacketHeader.java:168",
        "ThreadID": 1,
        "ThreadName": "",
        "EventID": "8AAE9C01B99F8825",
        "ProcessID": 21035
      },
      {
        "Cycles": 0,
        "Agent": "edu.brown.cs.systems.xtrace.logging.BaggageWrappers",
        "ProcessName": "Read",
        "TaskID": "5AAE7412FA892063",
        "ParentEventID": [
          "18B9DF69F8612354",
          "8AAE9C01B99F8825"
        ],
        "Label": "Merged current baggage with other baggage",
        "Title": "X-Trace Task",
        "Host": "pinky19.mpi-sws.org",
        "HRT": 25491768500558123,
        "Operation": "join",
        "Timestamp": "1556275408440.964355",
        "TenantClass": 0,
        "Source": "PacketHeader.java:168",
        "ThreadID": 1,
        "ThreadName": "",
        "EventID": "2547F3F5F3FACD55",
        "ProcessID": 21035
      },
      {
        "Cycles": 0,
        "Agent": "edu.brown.cs.systems.xtrace.logging.BaggageWrappers",
        "ProcessName": "Read",
        "TaskID": "5AAE7412FA892063",
        "ParentEventID": [
          "2547F3F5F3FACD55"
        ],
        "Label": "Forking current baggage with Baggage.fork()",
        "Title": "X-Trace Task",
        "Host": "pinky19.mpi-sws.org",
        "HRT": 25491768500589667,
        "Operation": "fork",
        "Timestamp": "1556275408440.995850",
        "TenantClass": 0,
        "Source": "RemoteBlockReader2.java:361",
        "ThreadID": 1,
        "ThreadName": "",
        "EventID": "165488F065A2C54F",
        "ProcessID": 21035
      },
      {
        "Cycles": 0,
        "Agent": "Execution-Sleep",
        "ProcessName": "Data",
        "TaskID": "5AAE7412FA892063",
        "ParentEventID": [
          "18B9DF69F8612354"
        ],
        "Label": "waited",
        "Title": "X-Trace Task",
        "Host": "pinky19.mpi-sws.org",
        "Duration": "432756",
        "HRT": 25491768500779688,
        "Operation": "waited",
        "Timestamp": "1556275408441.146973",
        "TenantClass": 0,
        "Source": "SocketIOWithTimeout.java:335",
        "ThreadID": 9602,
        "ThreadName": "",
        "EventID": "A1CAD33410E186F6",
        "BaggageBytes": "[[248 5] [240 0] [0 90 174 116 18 250 137 32 99] [240 1] [0 24 185 223 105 248 97 35 84] [240 3] [0 2]]",
        "ProcessID": 2319
      },
      {
        "Cycles": 0,
        "Agent": "edu.brown.cs.systems.xtrace.logging.BaggageWrappers",
        "ProcessName": "Data",
        "TaskID": "5AAE7412FA892063",
        "ParentEventID": [
          "165488F065A2C54F",
          "A1CAD33410E186F6"
        ],
        "Label": "Merged current baggage with other baggage",
        "Title": "X-Trace Task",
        "Host": "pinky19.mpi-sws.org",
        "HRT": 25491768500934692,
        "Operation": "join",
        "Timestamp": "1556275408441.302002",
        "TenantClass": 0,
        "Source": "DataXceiver.java:574",
        "ThreadID": 9602,
        "ThreadName": "",
        "EventID": "1E6523D9FDD7F3D1",
        "BaggageBytes": "[[248 5] [240 0] [0 90 174 116 18 250 137 32 99] [240 1] [0 161 202 211 52 16 225 134 246] [0 22 84 136 240 101 162 197 79] [240 3] [0 2]]",
        "ProcessID": 2319
      },
      {
        "Cycles": 0,
        "Agent": "Execution-CPU",
        "ProcessName": "Data",
        "TaskID": "5AAE7412FA892063",
        "ParentEventID": [
          "1E6523D9FDD7F3D1"
        ],
        "Label": "unset",
        "Title": "X-Trace Task",
        "Host": "pinky19.mpi-sws.org",
        "Duration": "1558148",
        "HRT": 25491768500985112,
        "Operation": "unset",
        "Timestamp": "1556275408441.352539",
        "TenantClass": 0,
        "Source": "DataXceiver.java:261",
        "ThreadID": 9602,
        "ThreadName": "",
        "EventID": "4D6D35CA5A9FBC2F",
        "BaggageBytes": "[[248 5] [240 0] [0 90 174 116 18 250 137 32 99] [240 1] [0 30 101 35 217 253 215 243 209] [240 3] [0 2]]",
        "ProcessID": 2319
      },
      {
        "Cycles": 0,
        "Agent": "edu.brown.cs.systems.retro.benchmarks.hdfs_client.Reader",
        "ProcessName": "Read",
        "TaskID": "5AAE7412FA892063",
        "ParentEventID": [
          "0"
        ],
        "Label": "Reading file",
        "Title": "X-Trace Task",
        "Host": "pinky19.mpi-sws.org",
        "HRT": 25491768497346770,
        "Timestamp": "1556275408437.752930",
        "TenantClass": 0,
        "ThreadID": 1,
        "ThreadName": "",
        "EventID": "1C008ECE15DD1EF6",
        "ProcessID": 21035,
        "Tag": [
          "reader_1kb",
          "Read Size: 1024"
        ]
      }
    ]
  }
]