[
  {
    "id": "7E8675C464EFE130",
    "reports": [
      {
        "Cycles": 0,
        "Agent": "Execution-CPU",
        "ProcessName": "Read",
        "TaskID": "7E8675C464EFE130",
        "ParentEventID": [
          "E33300CA825D02DB"
        ],
        "Label": "unset",
        "Title": "X-Trace Task",
        "Host": "pinky19.mpi-sws.org",
        "Duration": "22715460",
        "HRT": 25491954118778994,
        "Operation": "unset",
        "Timestamp": "1556275594058.872803",
        "TenantClass": 0,
        "Source": "Client.java:1027",
        "ThreadID": 1,
        "ThreadName": "",
        "EventID": "55BEEE532D6DCA84",
        "ProcessID": 21035
      },
      {
        "Cycles": 0,
        "Agent": "org.apache.hadoop.ipc.ProtobufRpcEngine",
        "ProcessName": "Read",
        "TaskID": "7E8675C464EFE130",
        "ParentEventID": [
          "EFA14426B5778F27"
        ],
        "Label": "Invoking org.apache.hadoop.hdfs.protocol.ClientProtocol.getBlockLocations",
        "Title": "X-Trace Task",
        "Host": "pinky19.mpi-sws.org",
        "HRT": 25491954118751194,
        "Timestamp": "1556275594058.844971",
        "TenantClass": 0,
        "Source": "ProtobufRpcEngine.java:228",
        "ThreadID": 1,
        "ThreadName": "",
        "EventID": "E33300CA825D02DB",
        "ProcessID": 21035
      },
      {
        "Cycles": 0,
        "Agent": "edu.brown.cs.systems.retro.benchmarks.hdfs_client.Reader",
        "ProcessName": "Read",
        "TaskID": "7E8675C464EFE130",
        "ParentEventID": [
          "0A9D457093E1E992"
        ],
        "Label": "Reading file",
        "Title": "X-Trace Task",
        "Host": "pinky19.mpi-sws.org",
        "HRT": 25491954118703017,
        "Timestamp": "1556275594058.796875",
        "TenantClass": 0,
        "ThreadID": 1,
        "ThreadName": "",
        "EventID": "EFA14426B5778F27",
        "ProcessID": 21035
      },
      {
        "Cycles": 0,
        "Agent": "edu.brown.cs.systems.xtrace.logging.BaggageWrappers",
        "ProcessName": "Read",
        "TaskID": "7E8675C464EFE130",
        "ParentEventID": [
          "0C5C4EE0C783C6D1"
        ],
        "Label": "Forking current baggage with Baggage.fork()",
        "Title": "X-Trace Task",
        "Host": "pinky19.mpi-sws.org",
        "HRT": 25491954118860920,
        "Operation": "fork",
        "Timestamp": "1556275594058.954834",
        "TenantClass": 0,
        "Source": "Client.java:1043",
        "ThreadID": 41,
        "ThreadName": "",
        "EventID": "4F0677DCDC08381A",
        "ProcessID": 21035
      },
      {
        "Cycles": 0,
        "Agent": "Execution-CPU",
        "ProcessName": "Read",
        "TaskID": "7E8675C464EFE130",
        "ParentEventID": [
          "4F0677DCDC08381A"
        ],
        "Label": "unset",
        "Title": "X-Trace Task",
        "Host": "pinky19.mpi-sws.org",
        "Duration": "100695",
        "HRT": 25491954118955886,
        "Operation": "unset",
        "Timestamp": "1556275594059.049805",
        "TenantClass": 0,
        "Source": "Client.java:1062",
        "ThreadID": 41,
        "ThreadName": "",
        "EventID": "2EBEF4C53CEA9A84",
        "ProcessID": 21035
      },
      {
        "Cycles": 0,
        "Agent": "Execution-CPU",
        "ProcessName": "Read",
        "TaskID": "7E8675C464EFE130",
        "ParentEventID": [
          "2EBEF4C53CEA9A84"
        ],
        "Label": "set",
        "Title": "X-Trace Task",
        "Host": "pinky19.mpi-sws.org",
        "HRT": 25491954118978852,
        "Operation": "set",
        "Timestamp": "1556275594059.072754",
        "TenantClass": 0,
        "Source": "Client.java:1104",
        "ThreadID": 1,
        "ThreadName": "",
        "EventID": "A945EA9B60A6794D",
        "ProcessID": 21035
      },
      {
        "Cycles": 0,
        "Agent": "Execution-CPU",
        "ProcessName": "Name",
        "TaskID": "7E8675C464EFE130",
        "ParentEventID": [
          "4F0677DCDC08381A"
        ],
        "Label": "set",
        "Title": "X-Trace Task",
        "Host": "pinky19.mpi-sws.org",
        "HRT": 25491954119055743,
        "Operation": "set",
        "Timestamp": "1556275594059.141357",
        "TenantClass": 0,
        "Source": "Server.java:1840",
        "ThreadID": 48,
        "ThreadName": "",
        "EventID": "F118580A28CFA094",
        "BaggageBytes": "[[248 5] [240 0] [0 126 134 117 196 100 239 225 48] [240 1] [0 79 6 119 220 220 8 56 26] [240 3] [0 2]]",
        "ProcessID": 2171
      },
      {
        "Cycles": 0,
        "Agent": "Execution-CPU",
        "ProcessName": "Read",
        "TaskID": "7E8675C464EFE130",
        "ParentEventID": [
          "55BEEE532D6DCA84"
        ],
        "Label": "set",
        "Title": "X-Trace Task",
        "Host": "pinky19.mpi-sws.org",
        "HRT": 25491954118835142,
        "Operation": "set",
        "Timestamp": "1556275594058.928955",
        "TenantClass": 0,
        "Source": "Client.java:1032",
        "ThreadID": 41,
        "ThreadName": "",
        "EventID": "0C5C4EE0C783C6D1",
        "ProcessID": 21035
      },
      {
        "Cycles": 0,
        "Agent": "Execution-CPU",
        "ProcessName": "Name",
        "TaskID": "7E8675C464EFE130",
        "ParentEventID": [
          "5BAA5B9144B7F771"
        ],
        "Label": "unset",
        "Title": "X-Trace Task",
        "Host": "pinky19.mpi-sws.org",
        "Duration": "37720",
        "HRT": 25491954119145701,
        "Operation": "unset",
        "Timestamp": "1556275594059.231201",
        "TenantClass": 0,
        "Source": "Server.java:1828",
        "ThreadID": 48,
        "ThreadName": "",
        "EventID": "1DA522FF15DFF83D",
        "BaggageBytes": "[[248 5] [240 0] [0 126 134 117 196 100 239 225 48] [240 1] [0 91 170 91 145 68 183 247 113] [240 3] [0 2]]",
        "ProcessID": 2171
      },
      {
        "Cycles": 0,
        "Agent": "edu.brown.cs.systems.xtrace.logging.BaggageWrappers",
        "ProcessName": "Name",
        "TaskID": "7E8675C464EFE130",
        "ParentEventID": [
          "F118580A28CFA094"
        ],
        "Label": "Forking current baggage with Baggage.fork()",
        "Title": "X-Trace Task",
        "Host": "pinky19.mpi-sws.org",
        "HRT": 25491954119119388,
        "Operation": "fork",
        "Timestamp": "1556275594059.204834",
        "TenantClass": 0,
        "Source": "Server.java:550",
        "ThreadID": 48,
        "ThreadName": "",
        "EventID": "5BAA5B9144B7F771",
        "BaggageBytes": "[[248 5] [240 0] [0 126 134 117 196 100 239 225 48] [240 1] [0 241 24 88 10 40 207 160 148] [240 3] [0 2]]",
        "ProcessID": 2171
      },
      {
        "Cycles": 0,
        "Agent": "org.apache.hadoop.ipc.Server",
        "ProcessName": "Name",
        "TaskID": "7E8675C464EFE130",
        "ParentEventID": [
          "3D41A9D5190AA586"
        ],
        "Label": "getBlockLocations in org.apache.hadoop.hdfs.protocol.ClientProtocol",
        "Title": "X-Trace Task",
        "Host": "pinky19.mpi-sws.org",
        "HRT": 25491954119204587,
        "Timestamp": "1556275594059.290039",
        "TenantClass": 0,
        "Source": "ProtobufRpcEngine.java:601",
        "ThreadID": 64,
        "ThreadName": "",
        "EventID": "BA0108FB3D89C44F",
        "BaggageBytes": "[[248 5] [240 0] [0 126 134 117 196 100 239 225 48] [240 1] [0 61 65 169 213 25 10 165 134] [240 3] [0 2]]",
        "ProcessID": 2171
      },
      {
        "Cycles": 0,
        "Agent": "org.apache.hadoop.hdfs.server.namenode.FSNamesystem.audit",
        "ProcessName": "Name",
        "TaskID": "7E8675C464EFE130",
        "ParentEventID": [
          "BA0108FB3D89C44F"
        ],
        "Label": "allowed=true\tugi=plascas (auth:SIMPLE)\tip=/139.19.171.63\tcmd=open\tsrc=/ds/qEpBy1k5zVAZvXi9\tdst=null\tperm=null\tproto=rpc",
        "Title": "X-Trace Task",
        "Host": "pinky19.mpi-sws.org",
        "HRT": 25491954119287563,
        "Timestamp": "1556275594059.373047",
        "TenantClass": 0,
        "Source": "FSNamesystem.java:8313",
        "ThreadID": 64,
        "ThreadName": "",
        "EventID": "988FEEC07D28EA80",
        "BaggageBytes": "[[248 5] [240 0] [0 126 134 117 196 100 239 225 48] [240 1] [0 186 1 8 251 61 137 196 79] [240 3] [0 2]]",
        "ProcessID": 2171
      },
      {
        "Cycles": 0,
        "Agent": "edu.brown.cs.systems.xtrace.logging.BaggageWrappers",
        "ProcessName": "Name",
        "TaskID": "7E8675C464EFE130",
        "ParentEventID": [
          "988FEEC07D28EA80"
        ],
        "Label": "Forking current baggage with Baggage.fork()",
        "Title": "X-Trace Task",
        "Host": "pinky19.mpi-sws.org",
        "HRT": 25491954119344556,
        "Operation": "fork",
        "Timestamp": "1556275594059.430176",
        "TenantClass": 0,
        "Source": "Server.java:2398",
        "ThreadID": 64,
        "ThreadName": "",
        "EventID": "CADEE7C64F12D68C",
        "BaggageBytes": "[[248 5] [240 0] [0 126 134 117 196 100 239 225 48] [240 1] [0 152 143 238 192 125 40 234 128] [240 3] [0 2]]",
        "ProcessID": 2171
      },
      {
        "Cycles": 0,
        "Agent": "Execution-CPU",
        "ProcessName": "Name",
        "TaskID": "7E8675C464EFE130",
        "ParentEventID": [
          "5BAA5B9144B7F771"
        ],
        "Label": "set",
        "Title": "X-Trace Task",
        "Host": "pinky19.mpi-sws.org",
        "HRT": 25491954119156168,
        "Operation": "set",
        "Timestamp": "1556275594059.241699",
        "TenantClass": 0,
        "Source": "Server.java:2071",
        "ThreadID": 64,
        "ThreadName": "",
        "EventID": "3D41A9D5190AA586",
        "BaggageBytes": "[[248 5] [240 0] [0 126 134 117 196 100 239 225 48] [240 1] [0 91 170 91 145 68 183 247 113] [240 3] [0 2]]",
        "ProcessID": 2171
      },
      {
        "Cycles": 0,
        "Agent": "Execution-CPU",
        "ProcessName": "Name",
        "TaskID": "7E8675C464EFE130",
        "ParentEventID": [
          "CADEE7C64F12D68C"
        ],
        "Label": "unset",
        "Title": "X-Trace Task",
        "Host": "pinky19.mpi-sws.org",
        "Duration": "293430",
        "HRT": 25491954119467129,
        "Operation": "unset",
        "Timestamp": "1556275594059.552734",
        "TenantClass": 0,
        "Source": "Server.java:1058",
        "ThreadID": 64,
        "ThreadName": "",
        "EventID": "A56D71816A1ADFD8",
        "BaggageBytes": "[[248 5] [240 0] [0 126 134 117 196 100 239 225 48] [240 1] [0 202 222 231 198 79 18 214 140] [240 3] [0 2]]",
        "ProcessID": 2171
      },
      {
        "Cycles": 0,
        "Agent": "Execution-CPU",
        "ProcessName": "Read",
        "TaskID": "7E8675C464EFE130",
        "ParentEventID": [
          "5B58F407EFF41247"
        ],
        "Label": "unset",
        "Title": "X-Trace Task",
        "Host": "pinky19.mpi-sws.org",
        "Duration": "11808",
        "HRT": 25491954119552167,
        "Operation": "unset",
        "Timestamp": "1556275594059.645996",
        "TenantClass": 0,
        "Source": "Client.java:1168",
        "ThreadID": 37,
        "ThreadName": "",
        "EventID": "E5310EB1418A1DC4",
        "ProcessID": 21035
      },
      {
        "Cycles": 0,
        "Agent": "Execution-CPU",
        "ProcessName": "Read",
        "TaskID": "7E8675C464EFE130",
        "ParentEventID": [
          "CADEE7C64F12D68C"
        ],
        "Label": "set",
        "Title": "X-Trace Task",
        "Host": "pinky19.mpi-sws.org",
        "HRT": 25491954119523144,
        "Operation": "set",
        "Timestamp": "1556275594059.616943",
        "TenantClass": 0,
        "Source": "Client.java:302",
        "ThreadID": 37,
        "ThreadName": "",
        "EventID": "5B58F407EFF41247",
        "ProcessID": 21035
      },
      {
        "Cycles": 0,
        "Agent": "Execution-Sleep",
        "ProcessName": "Read",
        "TaskID": "7E8675C464EFE130",
        "ParentEventID": [
          "A945EA9B60A6794D"
        ],
        "Label": "waited",
        "Title": "X-Trace Task",
        "Host": "pinky19.mpi-sws.org",
        "Duration": "582188",
        "HRT": 25491954119570847,
        "Operation": "waited",
        "Timestamp": "1556275594059.664795",
        "TenantClass": 0,
        "Source": "Client.java:1537",
        "ThreadID": 1,
        "ThreadName": "",
        "EventID": "24EA2C5C16341C82",
        "ProcessID": 21035
      },
      {
        "Cycles": 0,
        "Agent": "edu.brown.cs.systems.xtrace.logging.BaggageWrappers",
        "ProcessName": "Read",
        "TaskID": "7E8675C464EFE130",
        "ParentEventID": [
          "E5310EB1418A1DC4",
          "24EA2C5C16341C82"
        ],
        "Label": "Merged current baggage with other baggage",
        "Title": "X-Trace Task",
        "Host": "pinky19.mpi-sws.org",
        "HRT": 25491954119590440,
        "Operation": "join",
        "Timestamp": "1556275594059.684326",
        "TenantClass": 0,
        "Source": "Client.java:1545",
        "ThreadID": 1,
        "ThreadName": "",
        "EventID": "B0851ECB27AF7C5C",
        "ProcessID": 21035
      },
      {
        "Cycles": 0,
        "Agent": "org.apache.hadoop.ipc.ProtobufRpcEngine",
        "ProcessName": "Read",
        "TaskID": "7E8675C464EFE130",
        "ParentEventID": [
          "B0851ECB27AF7C5C"
        ],
        "Label": "org.apache.hadoop.hdfs.protocol.ClientProtocol.getBlockLocations completed",
        "Title": "X-Trace Task",
        "Host": "pinky19.mpi-sws.org",
        "HRT": 25491954119659341,
        "Timestamp": "1556275594059.753174",
        "TenantClass": 0,
        "Source": "ProtobufRpcEngine.java:275",
        "ThreadID": 1,
        "ThreadName": "",
        "EventID": "8723F379FD5A85C6",
        "ProcessID": 21035
      },
      {
        "Cycles": 0,
        "Agent": "Execution-CPU",
        "ProcessName": "Data",
        "TaskID": "7E8675C464EFE130",
        "ParentEventID": [
          "D9FCFCA706A6A75F"
        ],
        "Label": "set",
        "Title": "X-Trace Task",
        "Host": "pinky19.mpi-sws.org",
        "HRT": 25491954120016390,
        "Operation": "set",
        "Timestamp": "1556275594060.095215",
        "TenantClass": 0,
        "Source": "Receiver.java:117",
        "ThreadID": 9602,
        "ThreadName": "",
        "EventID": "68ED865CCC079663",
        "BaggageBytes": "[[248 5] [240 0] [0 126 134 117 196 100 239 225 48] [240 1] [0 217 252 252 167 6 166 167 95] [240 3] [0 2]]",
        "ProcessID": 2319
      },
      {
        "Cycles": 0,
        "Agent": "edu.brown.cs.systems.xtrace.logging.BaggageWrappers",
        "ProcessName": "Read",
        "TaskID": "7E8675C464EFE130",
        "ParentEventID": [
          "8723F379FD5A85C6"
        ],
        "Label": "Forking current baggage with Baggage.fork()",
        "Title": "X-Trace Task",
        "Host": "pinky19.mpi-sws.org",
        "HRT": 25491954119769785,
        "Operation": "fork",
        "Timestamp": "1556275594059.863770",
        "TenantClass": 0,
        "Source": "DataTransferProtoUtil.java:94",
        "ThreadID": 1,
        "ThreadName": "",
        "EventID": "D9FCFCA706A6A75F",
        "ProcessID": 21035
      },
      {
        "Cycles": 0,
        "Agent": "edu.brown.cs.systems.xtrace.logging.XTraceInit",
        "ProcessName": "Data",
        "TaskID": "7E8675C464EFE130",
        "ParentEventID": [
          "68ED865CCC079663"
        ],
        "Label": "Thread.setName: DataXceiver for client DFSClient_NONMAPREDUCE_1377588049_1 at /139.19.171.63:36074 [Sending block BP-1633380353-139.19.171.63-1554193446451:blk_1073757571_16747]",
        "Title": "X-Trace Task",
        "Host": "pinky19.mpi-sws.org",
        "HRT": 25491954120117837,
        "Timestamp": "1556275594060.196533",
        "TenantClass": 0,
        "Source": "DataXceiver.java:168",
        "ThreadID": 9602,
        "ThreadName": "",
        "EventID": "3243C0015F4C28F1",
        "BaggageBytes": "[[248 5] [240 0] [0 126 134 117 196 100 239 225 48] [240 1] [0 104 237 134 92 204 7 150 99] [240 3] [0 2]]",
        "ProcessID": 2319
      },
      {
        "Cycles": 0,
        "Agent": "Execution-Sleep",
        "ProcessName": "Read",
        "TaskID": "7E8675C464EFE130",
        "ParentEventID": [
          "D9FCFCA706A6A75F"
        ],
        "Label": "waited",
        "Title": "X-Trace Task",
        "Host": "pinky19.mpi-sws.org",
        "Duration": "461946",
        "HRT": 25491954120347792,
        "Operation": "waited",
        "Timestamp": "1556275594060.441650",
        "TenantClass": 0,
        "Source": "SocketIOWithTimeout.java:335",
        "ThreadID": 1,
        "ThreadName": "",
        "EventID": "015FC74600392A21",
        "ProcessID": 21035
      },
      {
        "Cycles": 0,
        "Agent": "edu.brown.cs.systems.xtrace.logging.BaggageWrappers",
        "ProcessName": "Data",
        "TaskID": "7E8675C464EFE130",
        "ParentEventID": [
          "A7255BD6C943AD87"
        ],
        "Label": "Forking current baggage with Baggage.fork()",
        "Title": "X-Trace Task",
        "Host": "pinky19.mpi-sws.org",
        "HRT": 25491954120363854,
        "Operation": "fork",
        "Timestamp": "1556275594060.442627",
        "TenantClass": 0,
        "Source": "PacketHeader.java:95",
        "ThreadID": 9602,
        "ThreadName": "",
        "EventID": "A103424F06C1241B",
        "BaggageBytes": "[[248 5] [240 0] [0 126 134 117 196 100 239 225 48] [240 1] [0 167 37 91 214 201 67 173 135] [240 3] [0 2]]",
        "ProcessID": 2319
      },
      {
        "Cycles": 0,
        "Agent": "edu.brown.cs.systems.xtrace.logging.BaggageWrappers",
        "ProcessName": "Data",
        "TaskID": "7E8675C464EFE130",
        "ParentEventID": [
          "3243C0015F4C28F1"
        ],
        "Label": "Forking current baggage with Baggage.fork()",
        "Title": "X-Trace Task",
        "Host": "pinky19.mpi-sws.org",
        "HRT": 25491954120269971,
        "Operation": "fork",
        "Timestamp": "1556275594060.348633",
        "TenantClass": 0,
        "Source": "DataXceiver.java:1257",
        "ThreadID": 9602,
        "ThreadName": "",
        "EventID": "A7255BD6C943AD87",
        "BaggageBytes": "[[248 5] [240 0] [0 126 134 117 196 100 239 225 48] [240 1] [0 50 67 192 1 95 76 40 241] [240 3] [0 2]]",
        "ProcessID": 2319
      },
      {
        "Cycles": 0,
        "Agent": "edu.brown.cs.systems.xtrace.logging.BaggageWrappers",
        "ProcessName": "Read",
        "TaskID": "7E8675C464EFE130",
        "ParentEventID": [
          "A7255BD6C943AD87",
          "015FC74600392A21"
        ],
        "Label": "Merged current baggage with other baggage",
        "Title": "X-Trace Task",
        "Host": "pinky19.mpi-sws.org",
        "HRT": 25491954120449385,
        "Operation": "join",
        "Timestamp": "1556275594060.543213",
        "TenantClass": 0,
        "Source": "RemoteBlockReader2.java:429",
        "ThreadID": 1,
        "ThreadName": "",
        "EventID": "86B5A9D6698AEFF5",
        "ProcessID": 21035
      },
      {
        "Cycles": 0,
        "Agent": "Execution-Sleep",
        "ProcessName": "Data",
        "TaskID": "7E8675C464EFE130",
        "ParentEventID": [
          "A103424F06C1241B"
        ],
        "Label": "waited",
        "Title": "X-Trace Task",
        "Host": "pinky19.mpi-sws.org",
        "Duration": "5062",
        "HRT": 25491954120456670,
        "Operation": "waited",
        "Timestamp": "1556275594060.535400",
        "TenantClass": 0,
        "Source": "SocketIOWithTimeout.java:335",
        "ThreadID": 9602,
        "ThreadName": "",
        "EventID": "1D1E2335BA015733",
        "BaggageBytes": "[[248 5] [240 0] [0 126 134 117 196 100 239 225 48] [240 1] [0 161 3 66 79 6 193 36 27] [240 3] [0 2]]",
        "ProcessID": 2319
      },
      {
        "Cycles": 0,
        "Agent": "edu.brown.cs.systems.xtrace.logging.BaggageWrappers",
        "ProcessName": "Data",
        "TaskID": "7E8675C464EFE130",
        "ParentEventID": [
          "1D1E2335BA015733"
        ],
        "Label": "Forking current baggage with Baggage.fork()",
        "Title": "X-Trace Task",
        "Host": "pinky19.mpi-sws.org",
        "HRT": 25491954120537218,
        "Operation": "fork",
        "Timestamp": "1556275594060.615967",
        "TenantClass": 0,
        "Source": "PacketHeader.java:95",
        "ThreadID": 9602,
        "ThreadName": "",
        "EventID": "81DA8608A5D23E18",
        "BaggageBytes": "[[248 5] [240 0] [0 126 134 117 196 100 239 225 48] [240 1] [0 29 30 35 53 186 1 87 51] [240 3] [0 2]]",
        "ProcessID": 2319
      },
      {
        "Cycles": 0,
        "Agent": "edu.brown.cs.systems.xtrace.logging.BaggageWrappers",
        "ProcessName": "Read",
        "TaskID": "7E8675C464EFE130",
        "ParentEventID": [
          "830C7E2F9EEB67B3",
          "81DA8608A5D23E18"
        ],
        "Label": "Merged current baggage with other baggage",
        "Title": "X-Trace Task",
        "Host": "pinky19.mpi-sws.org",
        "HRT": 25491954120622258,
        "Operation": "join",
        "Timestamp": "1556275594060.716064",
        "TenantClass": 0,
        "Source": "PacketHeader.java:168",
        "ThreadID": 1,
        "ThreadName": "",
        "EventID": "E45B08C1ED2AACDA",
        "ProcessID": 21035
      },
      {
        "Cycles": 0,
        "Agent": "edu.brown.cs.systems.xtrace.logging.BaggageWrappers",
        "ProcessName": "Read",
        "TaskID": "7E8675C464EFE130",
        "ParentEventID": [
          "86B5A9D6698AEFF5",
          "A103424F06C1241B"
        ],
        "Label": "Merged current baggage with other baggage",
        "Title": "X-Trace Task",
        "Host": "pinky19.mpi-sws.org",
        "HRT": 25491954120542880,
        "Operation": "join",
        "Timestamp": "1556275594060.636719",
        "TenantClass": 0,
        "Source": "PacketHeader.java:168",
        "ThreadID": 1,
        "ThreadName": "",
        "EventID": "830C7E2F9EEB67B3",
        "ProcessID": 21035
      },
      {
        "Cycles": 0,
        "Agent": "edu.brown.cs.systems.xtrace.logging.BaggageWrappers",
        "ProcessName": "Read",
        "TaskID": "7E8675C464EFE130",
        "ParentEventID": [
          "E45B08C1ED2AACDA"
        ],
        "Label": "Forking current baggage with Baggage.fork()",
        "Title": "X-Trace Task",
        "Host": "pinky19.mpi-sws.org",
        "HRT": 25491954120637469,
        "Operation": "fork",
        "Timestamp": "1556275594060.731445",
        "TenantClass": 0,
        "Source": "RemoteBlockReader2.java:361",
        "ThreadID": 1,
        "ThreadName": "",
        "EventID": "711399DC3A69A681",
        "ProcessID": 21035
      },
      {
        "Cycles": 0,
        "Agent": "edu.brown.cs.systems.xtrace.logging.BaggageWrappers",
        "ProcessName": "Data",
        "TaskID": "7E8675C464EFE130",
        "ParentEventID": [
          "AB7AD555E8FC57E2",
          "711399DC3A69A681"
        ],
        "Label": "Merged current baggage with other baggage",
        "Title": "X-Trace Task",
        "Host": "pinky19.mpi-sws.org",
        "HRT": 25491954120752796,
        "Operation": "join",
        "Timestamp": "1556275594060.831543",
        "TenantClass": 0,
        "Source": "DataXceiver.java:574",
        "ThreadID": 9602,
        "ThreadName": "",
        "EventID": "34DBBAC9BC5367E1",
        "BaggageBytes": "[[248 5] [240 0] [0 126 134 117 196 100 239 225 48] [240 1] [0 171 122 213 85 232 252 87 226] [0 113 19 153 220 58 105 166 129] [240 3] [0 2]]",
        "ProcessID": 2319
      },
      {
        "Cycles": 0,
        "Agent": "Execution-Sleep",
        "ProcessName": "Data",
        "TaskID": "7E8675C464EFE130",
        "ParentEventID": [
          "81DA8608A5D23E18"
        ],
        "Label": "waited",
        "Title": "X-Trace Task",
        "Host": "pinky19.mpi-sws.org",
        "Duration": "51321",
        "HRT": 25491954120688977,
        "Operation": "waited",
        "Timestamp": "1556275594060.767578",
        "TenantClass": 0,
        "Source": "SocketIOWithTimeout.java:335",
        "ThreadID": 9602,
        "ThreadName": "",
        "EventID": "AB7AD555E8FC57E2",
        "BaggageBytes": "[[248 5] [240 0] [0 126 134 117 196 100 239 225 48] [240 1] [0 129 218 134 8 165 210 62 24] [240 3] [0 2]]",
        "ProcessID": 2319
      },
      {
        "Cycles": 0,
        "Agent": "Execution-CPU",
        "ProcessName": "Data",
        "TaskID": "7E8675C464EFE130",
        "ParentEventID": [
          "34DBBAC9BC5367E1"
        ],
        "Label": "unset",
        "Title": "X-Trace Task",
        "Host": "pinky19.mpi-sws.org",
        "Duration": "698338",
        "HRT": 25491954120781222,
        "Operation": "unset",
        "Timestamp": "1556275594060.859863",
        "TenantClass": 0,
        "Source": "DataXceiver.java:261",
        "ThreadID": 9602,
        "ThreadName": "",
        "EventID": "2AAA7DD9381BC322",
        "BaggageBytes": "[[248 5] [240 0] [0 126 134 117 196 100 239 225 48] [240 1] [0 52 219 186 201 188 83 103 225] [240 3] [0 2]]",
        "ProcessID": 2319
      },
      {
        "Cycles": 0,
        "Agent": "edu.brown.cs.systems.retro.benchmarks.hdfs_client.Reader",
        "ProcessName": "Read",
        "TaskID": "7E8675C464EFE130",
        "ParentEventID": [
          "0"
        ],
        "Label": "Reading file",
        "Title": "X-Trace Task",
        "Host": "pinky19.mpi-sws.org",
        "HRT": 25491954118678522,
        "Timestamp": "1556275594058.772461",
        "TenantClass": 0,
        "ThreadID": 1,
        "ThreadName": "",
        "EventID": "0A9D457093E1E992",
        "ProcessID": 21035,
        "Tag": [
          "reader_1kb",
          "Read Size: 1024"
        ]
      }
    ]
  }
]