[
  {
    "id": "C410B3ACA0C7DE8E",
    "reports": [
      {
        "Cycles": 0,
        "Agent": "org.apache.hadoop.ipc.ProtobufRpcEngine",
        "ProcessName": "Read",
        "TaskID": "C410B3ACA0C7DE8E",
        "ParentEventID": [
          "3287BBBC6830223D"
        ],
        "Label": "Invoking org.apache.hadoop.hdfs.protocol.ClientProtocol.getBlockLocations",
        "Title": "X-Trace Task",
        "Host": "pinky19.mpi-sws.org",
        "HRT": 26962508028320298,
        "Timestamp": "1557746147968.354736",
        "TenantClass": 0,
        "Source": "ProtobufRpcEngine.java:228",
        "ThreadID": 1,
        "ThreadName": "",
        "EventID": "588DD474949B3F4E",
        "ProcessID": 36430
      },
      {
        "Cycles": 0,
        "Agent": "Execution-CPU",
        "ProcessName": "Read",
        "TaskID": "C410B3ACA0C7DE8E",
        "ParentEventID": [
          "588DD474949B3F4E"
        ],
        "Label": "unset",
        "Title": "X-Trace Task",
        "Host": "pinky19.mpi-sws.org",
        "Duration": "40876982",
        "HRT": 26962508028344559,
        "Operation": "unset",
        "Timestamp": "1557746147968.378906",
        "TenantClass": 0,
        "Source": "Client.java:1027",
        "ThreadID": 1,
        "ThreadName": "",
        "EventID": "646A059782F30E1F",
        "ProcessID": 36430
      },
      {
        "Cycles": 0,
        "Agent": "edu.brown.cs.systems.retro.benchmarks.hdfs_client.Reader",
        "ProcessName": "Read",
        "TaskID": "C410B3ACA0C7DE8E",
        "ParentEventID": [
          "8C0D6428600940E9"
        ],
        "Label": "Reading file",
        "Title": "X-Trace Task",
        "Host": "pinky19.mpi-sws.org",
        "HRT": 26962508028287878,
        "Timestamp": "1557746147968.322266",
        "TenantClass": 0,
        "ThreadID": 1,
        "ThreadName": "",
        "EventID": "3287BBBC6830223D",
        "ProcessID": 36430
      },
      {
        "Cycles": 0,
        "Agent": "Execution-CPU",
        "ProcessName": "Read",
        "TaskID": "C410B3ACA0C7DE8E",
        "ParentEventID": [
          "646A059782F30E1F"
        ],
        "Label": "set",
        "Title": "X-Trace Task",
        "Host": "pinky19.mpi-sws.org",
        "HRT": 26962508028390828,
        "Operation": "set",
        "Timestamp": "1557746147968.425293",
        "TenantClass": 0,
        "Source": "Client.java:1032",
        "ThreadID": 41,
        "ThreadName": "",
        "EventID": "233B7718552F0E6F",
        "ProcessID": 36430
      },
      {
        "Cycles": 0,
        "Agent": "edu.brown.cs.systems.xtrace.logging.BaggageWrappers",
        "ProcessName": "Read",
        "TaskID": "C410B3ACA0C7DE8E",
        "ParentEventID": [
          "233B7718552F0E6F"
        ],
        "Label": "Forking current baggage with Baggage.fork()",
        "Title": "X-Trace Task",
        "Host": "pinky19.mpi-sws.org",
        "HRT": 26962508028409405,
        "Operation": "fork",
        "Timestamp": "1557746147968.443848",
        "TenantClass": 0,
        "Source": "Client.java:1043",
        "ThreadID": 41,
        "ThreadName": "",
        "EventID": "157944B578A4816E",
        "ProcessID": 36430
      },
      {
        "Cycles": 0,
        "Agent": "Execution-CPU",
        "ProcessName": "Read",
        "TaskID": "C410B3ACA0C7DE8E",
        "ParentEventID": [
          "157944B578A4816E"
        ],
        "Label": "unset",
        "Title": "X-Trace Task",
        "Host": "pinky19.mpi-sws.org",
        "Duration": "67983",
        "HRT": 26962508028476604,
        "Operation": "unset",
        "Timestamp": "1557746147968.510986",
        "TenantClass": 0,
        "Source": "Client.java:1062",
        "ThreadID": 41,
        "ThreadName": "",
        "EventID": "E126FDC548590526",
        "ProcessID": 36430
      },
      {
        "Cycles": 0,
        "Agent": "Execution-CPU",
        "ProcessName": "Name",
        "TaskID": "C410B3ACA0C7DE8E",
        "ParentEventID": [
          "157944B578A4816E"
        ],
        "Label": "set",
        "Title": "X-Trace Task",
        "Host": "pinky19.mpi-sws.org",
        "HRT": 26962508028537425,
        "Operation": "set",
        "Timestamp": "1557746147968.842773",
        "TenantClass": 0,
        "Source": "Server.java:1840",
        "ThreadID": 48,
        "ThreadName": "",
        "EventID": "2AE67144DB77F456",
        "BaggageBytes": "[[248 5] [240 0] [0 196 16 179 172 160 199 222 142] [240 1] [0 21 121 68 181 120 164 129 110] [240 3] [0 2]]",
        "ProcessID": 2171
      },
      {
        "Cycles": 0,
        "Agent": "edu.brown.cs.systems.xtrace.logging.BaggageWrappers",
        "ProcessName": "Name",
        "TaskID": "C410B3ACA0C7DE8E",
        "ParentEventID": [
          "2AE67144DB77F456"
        ],
        "Label": "Forking current baggage with Baggage.fork()",
        "Title": "X-Trace Task",
        "Host": "pinky19.mpi-sws.org",
        "HRT": 26962508028574034,
        "Operation": "fork",
        "Timestamp": "1557746147968.879150",
        "TenantClass": 0,
        "Source": "Server.java:550",
        "ThreadID": 48,
        "ThreadName": "",
        "EventID": "14696246D8E2FB02",
        "BaggageBytes": "[[248 5] [240 0] [0 196 16 179 172 160 199 222 142] [240 1] [0 42 230 113 68 219 119 244 86] [240 3] [0 2]]",
        "ProcessID": 2171
      },
      {
        "Cycles": 0,
        "Agent": "Execution-CPU",
        "ProcessName": "Name",
        "TaskID": "C410B3ACA0C7DE8E",
        "ParentEventID": [
          "14696246D8E2FB02"
        ],
        "Label": "unset",
        "Title": "X-Trace Task",
        "Host": "pinky19.mpi-sws.org",
        "Duration": "23908",
        "HRT": 26962508028594274,
        "Operation": "unset",
        "Timestamp": "1557746147968.899414",
        "TenantClass": 0,
        "Source": "Server.java:1828",
        "ThreadID": 48,
        "ThreadName": "",
        "EventID": "70417568E3314AC0",
        "BaggageBytes": "[[248 5] [240 0] [0 196 16 179 172 160 199 222 142] [240 1] [0 20 105 98 70 216 226 251 2] [240 3] [0 2]]",
        "ProcessID": 2171
      },
      {
        "Cycles": 0,
        "Agent": "Execution-CPU",
        "ProcessName": "Name",
        "TaskID": "C410B3ACA0C7DE8E",
        "ParentEventID": [
          "14696246D8E2FB02"
        ],
        "Label": "set",
        "Title": "X-Trace Task",
        "Host": "pinky19.mpi-sws.org",
        "HRT": 26962508028601232,
        "Operation": "set",
        "Timestamp": "1557746147968.906494",
        "TenantClass": 0,
        "Source": "Server.java:2071",
        "ThreadID": 55,
        "ThreadName": "",
        "EventID": "8AE0F98AA1A946CC",
        "BaggageBytes": "[[248 5] [240 0] [0 196 16 179 172 160 199 222 142] [240 1] [0 20 105 98 70 216 226 251 2] [240 3] [0 2]]",
        "ProcessID": 2171
      },
      {
        "Cycles": 0,
        "Agent": "org.apache.hadoop.ipc.Server",
        "ProcessName": "Name",
        "TaskID": "C410B3ACA0C7DE8E",
        "ParentEventID": [
          "8AE0F98AA1A946CC"
        ],
        "Label": "getBlockLocations in org.apache.hadoop.hdfs.protocol.ClientProtocol",
        "Title": "X-Trace Task",
        "Host": "pinky19.mpi-sws.org",
        "HRT": 26962508028629393,
        "Timestamp": "1557746147968.934570",
        "TenantClass": 0,
        "Source": "ProtobufRpcEngine.java:601",
        "ThreadID": 55,
        "ThreadName": "",
        "EventID": "6548FCE1A4E52E5C",
        "BaggageBytes": "[[248 5] [240 0] [0 196 16 179 172 160 199 222 142] [240 1] [0 138 224 249 138 161 169 70 204] [240 3] [0 2]]",
        "ProcessID": 2171
      },
      {
        "Cycles": 0,
        "Agent": "Execution-CPU",
        "ProcessName": "Read",
        "TaskID": "C410B3ACA0C7DE8E",
        "ParentEventID": [
          "E126FDC548590526"
        ],
        "Label": "set",
        "Title": "X-Trace Task",
        "Host": "pinky19.mpi-sws.org",
        "HRT": 26962508028498632,
        "Operation": "set",
        "Timestamp": "1557746147968.532959",
        "TenantClass": 0,
        "Source": "Client.java:1104",
        "ThreadID": 1,
        "ThreadName": "",
        "EventID": "8C46E9ED78722A27",
        "ProcessID": 36430
      },
      {
        "Cycles": 0,
        "Agent": "org.apache.hadoop.hdfs.server.namenode.FSNamesystem.audit",
        "ProcessName": "Name",
        "TaskID": "C410B3ACA0C7DE8E",
        "ParentEventID": [
          "6548FCE1A4E52E5C"
        ],
        "Label": "allowed=true\tugi=plascas (auth:SIMPLE)\tip=/139.19.171.63\tcmd=open\tsrc=/ds/clmrYG5q6LePcOYp\tdst=null\tperm=null\tproto=rpc",
        "Title": "X-Trace Task",
        "Host": "pinky19.mpi-sws.org",
        "HRT": 26962508028674954,
        "Timestamp": "1557746147968.980225",
        "TenantClass": 0,
        "Source": "FSNamesystem.java:8313",
        "ThreadID": 55,
        "ThreadName": "",
        "EventID": "21E9D1D98067B34A",
        "BaggageBytes": "[[248 5] [240 0] [0 196 16 179 172 160 199 222 142] [240 1] [0 101 72 252 225 164 229 46 92] [240 3] [0 2]]",
        "ProcessID": 2171
      },
      {
        "Cycles": 0,
        "Agent": "Execution-CPU",
        "ProcessName": "Name",
        "TaskID": "C410B3ACA0C7DE8E",
        "ParentEventID": [
          "53C674B3E91C7582"
        ],
        "Label": "unset",
        "Title": "X-Trace Task",
        "Host": "pinky19.mpi-sws.org",
        "Duration": "206287",
        "HRT": 26962508028823744,
        "Operation": "unset",
        "Timestamp": "1557746147969.128906",
        "TenantClass": 0,
        "Source": "Server.java:1058",
        "ThreadID": 55,
        "ThreadName": "",
        "EventID": "112D57045D690544",
        "BaggageBytes": "[[248 5] [240 0] [0 196 16 179 172 160 199 222 142] [240 1] [0 83 198 116 179 233 28 117 130] [240 3] [0 2]]",
        "ProcessID": 2171
      },
      {
        "Cycles": 0,
        "Agent": "edu.brown.cs.systems.xtrace.logging.BaggageWrappers",
        "ProcessName": "Name",
        "TaskID": "C410B3ACA0C7DE8E",
        "ParentEventID": [
          "21E9D1D98067B34A"
        ],
        "Label": "Forking current baggage with Baggage.fork()",
        "Title": "X-Trace Task",
        "Host": "pinky19.mpi-sws.org",
        "HRT": 26962508028716837,
        "Operation": "fork",
        "Timestamp": "1557746147969.021973",
        "TenantClass": 0,
        "Source": "Server.java:2398",
        "ThreadID": 55,
        "ThreadName": "",
        "EventID": "53C674B3E91C7582",
        "BaggageBytes": "[[248 5] [240 0] [0 196 16 179 172 160 199 222 142] [240 1] [0 33 233 209 217 128 103 179 74] [240 3] [0 2]]",
        "ProcessID": 2171
      },
      {
        "Cycles": 0,
        "Agent": "Execution-CPU",
        "ProcessName": "Read",
        "TaskID": "C410B3ACA0C7DE8E",
        "ParentEventID": [
          "53C674B3E91C7582"
        ],
        "Label": "set",
        "Title": "X-Trace Task",
        "Host": "pinky19.mpi-sws.org",
        "HRT": 26962508028873003,
        "Operation": "set",
        "Timestamp": "1557746147968.907471",
        "TenantClass": 0,
        "Source": "Client.java:302",
        "ThreadID": 37,
        "ThreadName": "",
        "EventID": "6233A865F2AEDE7A",
        "ProcessID": 36430
      },
      {
        "Cycles": 0,
        "Agent": "Execution-Sleep",
        "ProcessName": "Read",
        "TaskID": "C410B3ACA0C7DE8E",
        "ParentEventID": [
          "8C46E9ED78722A27"
        ],
        "Label": "waited",
        "Title": "X-Trace Task",
        "Host": "pinky19.mpi-sws.org",
        "Duration": "415680",
        "HRT": 26962508028922971,
        "Operation": "waited",
        "Timestamp": "1557746147968.957520",
        "TenantClass": 0,
        "Source": "Client.java:1537",
        "ThreadID": 1,
        "ThreadName": "",
        "EventID": "12ECEB2DA4656824",
        "ProcessID": 36430
      },
      {
        "Cycles": 0,
        "Agent": "Execution-CPU",
        "ProcessName": "Read",
        "TaskID": "C410B3ACA0C7DE8E",
        "ParentEventID": [
          "6233A865F2AEDE7A"
        ],
        "Label": "unset",
        "Title": "X-Trace Task",
        "Host": "pinky19.mpi-sws.org",
        "Duration": "10507",
        "HRT": 26962508028903318,
        "Operation": "unset",
        "Timestamp": "1557746147968.937744",
        "TenantClass": 0,
        "Source": "Client.java:1168",
        "ThreadID": 37,
        "ThreadName": "",
        "EventID": "CE46CE707B9D86ED",
        "ProcessID": 36430
      },
      {
        "Cycles": 0,
        "Agent": "edu.brown.cs.systems.xtrace.logging.BaggageWrappers",
        "ProcessName": "Read",
        "TaskID": "C410B3ACA0C7DE8E",
        "ParentEventID": [
          "CE46CE707B9D86ED",
          "12ECEB2DA4656824"
        ],
        "Label": "Merged current baggage with other baggage",
        "Title": "X-Trace Task",
        "Host": "pinky19.mpi-sws.org",
        "HRT": 26962508028956283,
        "Operation": "join",
        "Timestamp": "1557746147968.990723",
        "TenantClass": 0,
        "Source": "Client.java:1545",
        "ThreadID": 1,
        "ThreadName": "",
        "EventID": "D06D19F92579A32C",
        "ProcessID": 36430
      },
      {
        "Cycles": 0,
        "Agent": "edu.brown.cs.systems.xtrace.logging.BaggageWrappers",
        "ProcessName": "Read",
        "TaskID": "C410B3ACA0C7DE8E",
        "ParentEventID": [
          "FBC7E1ED1F3C154F"
        ],
        "Label": "Forking current baggage with Baggage.fork()",
        "Title": "X-Trace Task",
        "Host": "pinky19.mpi-sws.org",
        "HRT": 26962508029062429,
        "Operation": "fork",
        "Timestamp": "1557746147969.096924",
        "TenantClass": 0,
        "Source": "DataTransferProtoUtil.java:94",
        "ThreadID": 1,
        "ThreadName": "",
        "EventID": "0707D841DE45F180",
        "ProcessID": 36430
      },
      {
        "Cycles": 0,
        "Agent": "Execution-CPU",
        "ProcessName": "Data",
        "TaskID": "C410B3ACA0C7DE8E",
        "ParentEventID": [
          "0707D841DE45F180"
        ],
        "Label": "set",
        "Title": "X-Trace Task",
        "Host": "pinky25.mpi-sws.org",
        "HRT": 47511613270952409,
        "Operation": "set",
        "Timestamp": "1557746147969.260254",
        "TenantClass": 0,
        "Source": "Receiver.java:117",
        "ThreadID": 14040,
        "ThreadName": "",
        "EventID": "49F24A61C39AE6DC",
        "BaggageBytes": "[[248 5] [240 0] [0 196 16 179 172 160 199 222 142] [240 1] [0 7 7 216 65 222 69 241 128] [240 3] [0 2]]",
        "ProcessID": 28198
      },
      {
        "Cycles": 0,
        "Agent": "org.apache.hadoop.ipc.ProtobufRpcEngine",
        "ProcessName": "Read",
        "TaskID": "C410B3ACA0C7DE8E",
        "ParentEventID": [
          "D06D19F92579A32C"
        ],
        "Label": "org.apache.hadoop.hdfs.protocol.ClientProtocol.getBlockLocations completed",
        "Title": "X-Trace Task",
        "Host": "pinky19.mpi-sws.org",
        "HRT": 26962508028996746,
        "Timestamp": "1557746147969.031250",
        "TenantClass": 0,
        "Source": "ProtobufRpcEngine.java:275",
        "ThreadID": 1,
        "ThreadName": "",
        "EventID": "FBC7E1ED1F3C154F",
        "ProcessID": 36430
      },
      {
        "Cycles": 0,
        "Agent": "edu.brown.cs.systems.xtrace.logging.XTraceInit",
        "ProcessName": "Data",
        "TaskID": "C410B3ACA0C7DE8E",
        "ParentEventID": [
          "49F24A61C39AE6DC"
        ],
        "Label": "Thread.setName: DataXceiver for client DFSClient_NONMAPREDUCE_778905418_1 at /139.19.171.63:41180 [Sending block BP-1633380353-139.19.171.63-1554193446451:blk_1073767646_26822]",
        "Title": "X-Trace Task",
        "Host": "pinky25.mpi-sws.org",
        "HRT": 47511613271040852,
        "Timestamp": "1557746147969.348633",
        "TenantClass": 0,
        "Source": "DataXceiver.java:168",
        "ThreadID": 14040,
        "ThreadName": "",
        "EventID": "3DE9F208A1F5D8AE",
        "BaggageBytes": "[[248 5] [240 0] [0 196 16 179 172 160 199 222 142] [240 1] [0 73 242 74 97 195 154 230 220] [240 3] [0 2]]",
        "ProcessID": 28198
      },
      {
        "Cycles": 0,
        "Agent": "Execution-Sleep",
        "ProcessName": "Read",
        "TaskID": "C410B3ACA0C7DE8E",
        "ParentEventID": [
          "0707D841DE45F180"
        ],
        "Label": "waited",
        "Title": "X-Trace Task",
        "Host": "pinky19.mpi-sws.org",
        "Duration": "588650",
        "HRT": 26962508029743202,
        "Operation": "waited",
        "Timestamp": "1557746147969.777588",
        "TenantClass": 0,
        "Source": "SocketIOWithTimeout.java:335",
        "ThreadID": 1,
        "ThreadName": "",
        "EventID": "DCB824A55C4879A0",
        "ProcessID": 36430
      },
      {
        "Cycles": 0,
        "Agent": "edu.brown.cs.systems.xtrace.logging.BaggageWrappers",
        "ProcessName": "Data",
        "TaskID": "C410B3ACA0C7DE8E",
        "ParentEventID": [
          "3DE9F208A1F5D8AE"
        ],
        "Label": "Forking current baggage with Baggage.fork()",
        "Title": "X-Trace Task",
        "Host": "pinky25.mpi-sws.org",
        "HRT": 47511613271242592,
        "Operation": "fork",
        "Timestamp": "1557746147969.550537",
        "TenantClass": 0,
        "Source": "DataXceiver.java:1257",
        "ThreadID": 14040,
        "ThreadName": "",
        "EventID": "F928BF421B44FB1D",
        "BaggageBytes": "[[248 5] [240 0] [0 196 16 179 172 160 199 222 142] [240 1] [0 61 233 242 8 161 245 216 174] [240 3] [0 2]]",
        "ProcessID": 28198
      },
      {
        "Cycles": 0,
        "Agent": "edu.brown.cs.systems.xtrace.logging.BaggageWrappers",
        "ProcessName": "Data",
        "TaskID": "C410B3ACA0C7DE8E",
        "ParentEventID": [
          "F928BF421B44FB1D"
        ],
        "Label": "Forking current baggage with Baggage.fork()",
        "Title": "X-Trace Task",
        "Host": "pinky25.mpi-sws.org",
        "HRT": 47511613271349802,
        "Operation": "fork",
        "Timestamp": "1557746147969.657715",
        "TenantClass": 0,
        "Source": "PacketHeader.java:95",
        "ThreadID": 14040,
        "ThreadName": "",
        "EventID": "4D83DCDDCC7B3031",
        "BaggageBytes": "[[248 5] [240 0] [0 196 16 179 172 160 199 222 142] [240 1] [0 249 40 191 66 27 68 251 29] [240 3] [0 2]]",
        "ProcessID": 28198
      },
      {
        "Cycles": 0,
        "Agent": "Execution-Sleep",
        "ProcessName": "Data",
        "TaskID": "C410B3ACA0C7DE8E",
        "ParentEventID": [
          "4D83DCDDCC7B3031"
        ],
        "Label": "waited",
        "Title": "X-Trace Task",
        "Host": "pinky25.mpi-sws.org",
        "Duration": "16129",
        "HRT": 47511613271459213,
        "Operation": "waited",
        "Timestamp": "1557746147969.767090",
        "TenantClass": 0,
        "Source": "SocketIOWithTimeout.java:335",
        "ThreadID": 14040,
        "ThreadName": "",
        "EventID": "3537F11A3C1EA8FD",
        "BaggageBytes": "[[248 5] [240 0] [0 196 16 179 172 160 199 222 142] [240 1] [0 77 131 220 221 204 123 48 49] [240 3] [0 2]]",
        "ProcessID": 28198
      },
      {
        "Cycles": 0,
        "Agent": "edu.brown.cs.systems.xtrace.logging.BaggageWrappers",
        "ProcessName": "Read",
        "TaskID": "C410B3ACA0C7DE8E",
        "ParentEventID": [
          "DCB824A55C4879A0",
          "F928BF421B44FB1D"
        ],
        "Label": "Merged current baggage with other baggage",
        "Title": "X-Trace Task",
        "Host": "pinky19.mpi-sws.org",
        "HRT": 26962508029834480,
        "Operation": "join",
        "Timestamp": "1557746147969.868896",
        "TenantClass": 0,
        "Source": "RemoteBlockReader2.java:429",
        "ThreadID": 1,
        "ThreadName": "",
        "EventID": "4D97F1B9D7F1E858",
        "ProcessID": 36430
      },
      {
        "Cycles": 0,
        "Agent": "edu.brown.cs.systems.xtrace.logging.BaggageWrappers",
        "ProcessName": "Data",
        "TaskID": "C410B3ACA0C7DE8E",
        "ParentEventID": [
          "3537F11A3C1EA8FD"
        ],
        "Label": "Forking current baggage with Baggage.fork()",
        "Title": "X-Trace Task",
        "Host": "pinky25.mpi-sws.org",
        "HRT": 47511613271570488,
        "Operation": "fork",
        "Timestamp": "1557746147969.878418",
        "TenantClass": 0,
        "Source": "PacketHeader.java:95",
        "ThreadID": 14040,
        "ThreadName": "",
        "EventID": "98EF111956E2EF98",
        "BaggageBytes": "[[248 5] [240 0] [0 196 16 179 172 160 199 222 142] [240 1] [0 53 55 241 26 60 30 168 253] [240 3] [0 2]]",
        "ProcessID": 28198
      },
      {
        "Cycles": 0,
        "Agent": "edu.brown.cs.systems.xtrace.logging.BaggageWrappers",
        "ProcessName": "Read",
        "TaskID": "C410B3ACA0C7DE8E",
        "ParentEventID": [
          "4D83DCDDCC7B3031",
          "9264D15E31CFF075"
        ],
        "Label": "Merged current baggage with other baggage",
        "Title": "X-Trace Task",
        "Host": "pinky19.mpi-sws.org",
        "HRT": 26962508030133909,
        "Operation": "join",
        "Timestamp": "1557746147970.168457",
        "TenantClass": 0,
        "Source": "PacketHeader.java:168",
        "ThreadID": 1,
        "ThreadName": "",
        "EventID": "3B747B741E6B44D6",
        "ProcessID": 36430
      },
      {
        "Cycles": 0,
        "Agent": "Execution-Sleep",
        "ProcessName": "Read",
        "TaskID": "C410B3ACA0C7DE8E",
        "ParentEventID": [
          "4D97F1B9D7F1E858"
        ],
        "Label": "waited",
        "Title": "X-Trace Task",
        "Host": "pinky19.mpi-sws.org",
        "Duration": "143039",
        "HRT": 26962508030081198,
        "Operation": "waited",
        "Timestamp": "1557746147970.115723",
        "TenantClass": 0,
        "Source": "SocketIOWithTimeout.java:335",
        "ThreadID": 1,
        "ThreadName": "",
        "EventID": "9264D15E31CFF075",
        "ProcessID": 36430
      },
      {
        "Cycles": 0,
        "Agent": "edu.brown.cs.systems.xtrace.logging.BaggageWrappers",
        "ProcessName": "Read",
        "TaskID": "C410B3ACA0C7DE8E",
        "ParentEventID": [
          "98EF111956E2EF98",
          "3B747B741E6B44D6"
        ],
        "Label": "Merged current baggage with other baggage",
        "Title": "X-Trace Task",
        "Host": "pinky19.mpi-sws.org",
        "HRT": 26962508030188241,
        "Operation": "join",
        "Timestamp": "1557746147970.222656",
        "TenantClass": 0,
        "Source": "PacketHeader.java:168",
        "ThreadID": 1,
        "ThreadName": "",
        "EventID": "B9C3DF36777DF470",
        "ProcessID": 36430
      },
      {
        "Cycles": 0,
        "Agent": "Execution-Sleep",
        "ProcessName": "Data",
        "TaskID": "C410B3ACA0C7DE8E",
        "ParentEventID": [
          "98EF111956E2EF98"
        ],
        "Label": "waited",
        "Title": "X-Trace Task",
        "Host": "pinky25.mpi-sws.org",
        "Duration": "159322",
        "HRT": 47511613271866618,
        "Operation": "waited",
        "Timestamp": "1557746147970.174561",
        "TenantClass": 0,
        "Source": "SocketIOWithTimeout.java:335",
        "ThreadID": 14040,
        "ThreadName": "",
        "EventID": "5B901F89DFE6CE63",
        "BaggageBytes": "[[248 5] [240 0] [0 196 16 179 172 160 199 222 142] [240 1] [0 152 239 17 25 86 226 239 152] [240 3] [0 2]]",
        "ProcessID": 28198
      },
      {
        "Cycles": 0,
        "Agent": "edu.brown.cs.systems.xtrace.logging.BaggageWrappers",
        "ProcessName": "Read",
        "TaskID": "C410B3ACA0C7DE8E",
        "ParentEventID": [
          "B9C3DF36777DF470"
        ],
        "Label": "Forking current baggage with Baggage.fork()",
        "Title": "X-Trace Task",
        "Host": "pinky19.mpi-sws.org",
        "HRT": 26962508030197582,
        "Operation": "fork",
        "Timestamp": "1557746147970.231934",
        "TenantClass": 0,
        "Source": "RemoteBlockReader2.java:361",
        "ThreadID": 1,
        "ThreadName": "",
        "EventID": "873E926132D317F9",
        "ProcessID": 36430
      },
      {
        "Cycles": 0,
        "Agent": "edu.brown.cs.systems.xtrace.logging.BaggageWrappers",
        "ProcessName": "Data",
        "TaskID": "C410B3ACA0C7DE8E",
        "ParentEventID": [
          "5B901F89DFE6CE63",
          "873E926132D317F9"
        ],
        "Label": "Merged current baggage with other baggage",
        "Title": "X-Trace Task",
        "Host": "pinky25.mpi-sws.org",
        "HRT": 47511613271949864,
        "Operation": "join",
        "Timestamp": "1557746147970.257812",
        "TenantClass": 0,
        "Source": "DataXceiver.java:574",
        "ThreadID": 14040,
        "ThreadName": "",
        "EventID": "2D3B5FB6B3ACAA8E",
        "BaggageBytes": "[[248 5] [240 0] [0 196 16 179 172 160 199 222 142] [240 1] [0 135 62 146 97 50 211 23 249] [0 91 144 31 137 223 230 206 99] [240 3] [0 2]]",
        "ProcessID": 28198
      },
      {
        "Cycles": 0,
        "Agent": "Execution-CPU",
        "ProcessName": "Data",
        "TaskID": "C410B3ACA0C7DE8E",
        "ParentEventID": [
          "2D3B5FB6B3ACAA8E"
        ],
        "Label": "unset",
        "Title": "X-Trace Task",
        "Host": "pinky25.mpi-sws.org",
        "Duration": "981405",
        "HRT": 47511613271995295,
        "Operation": "unset",
        "Timestamp": "1557746147970.303223",
        "TenantClass": 0,
        "Source": "DataXceiver.java:261",
        "ThreadID": 14040,
        "ThreadName": "",
        "EventID": "AC3D4E6022ED2B42",
        "BaggageBytes": "[[248 5] [240 0] [0 196 16 179 172 160 199 222 142] [240 1] [0 45 59 95 182 179 172 170 142] [240 3] [0 2]]",
        "ProcessID": 28198
      },
      {
        "Cycles": 0,
        "Agent": "edu.brown.cs.systems.retro.benchmarks.hdfs_client.Reader",
        "ProcessName": "Read",
        "TaskID": "C410B3ACA0C7DE8E",
        "ParentEventID": [
          "0"
        ],
        "Label": "Reading file",
        "Title": "X-Trace Task",
        "Host": "pinky19.mpi-sws.org",
        "HRT": 26962508028271670,
        "Timestamp": "1557746147968.306152",
        "TenantClass": 0,
        "ThreadID": 1,
        "ThreadName": "",
        "EventID": "8C0D6428600940E9",
        "ProcessID": 36430,
        "Tag": [
          "reader_10kb",
          "Read Size: 10240"
        ]
      }
    ]
  }
]