[
  {
    "id": "BD737D126FE56ABC",
    "reports": [
      {
        "Cycles": 0,
        "Agent": "org.apache.hadoop.ipc.ProtobufRpcEngine",
        "ProcessName": "Read",
        "TaskID": "BD737D126FE56ABC",
        "ParentEventID": [
          "FB5F4F10B9C334FB"
        ],
        "Label": "Invoking org.apache.hadoop.hdfs.protocol.ClientProtocol.getBlockLocations",
        "Title": "X-Trace Task",
        "Host": "pinky19.mpi-sws.org",
        "HRT": 26966649642068263,
        "Timestamp": "1557750289582.260254",
        "TenantClass": 0,
        "Source": "ProtobufRpcEngine.java:228",
        "ThreadID": 1,
        "ThreadName": "",
        "EventID": "0B1BB77E5A2DA27A",
        "ProcessID": 2801
      },
      {
        "Cycles": 0,
        "Agent": "edu.brown.cs.systems.retro.benchmarks.hdfs_client.Reader",
        "ProcessName": "Read",
        "TaskID": "BD737D126FE56ABC",
        "ParentEventID": [
          "9B712E451A4692AE"
        ],
        "Label": "Reading file",
        "Title": "X-Trace Task",
        "Host": "pinky19.mpi-sws.org",
        "HRT": 26966649641996682,
        "Timestamp": "1557750289582.188477",
        "TenantClass": 0,
        "ThreadID": 1,
        "ThreadName": "",
        "EventID": "FB5F4F10B9C334FB",
        "ProcessID": 2801
      },
      {
        "Cycles": 0,
        "Agent": "Execution-CPU",
        "ProcessName": "Read",
        "TaskID": "BD737D126FE56ABC",
        "ParentEventID": [
          "0B1BB77E5A2DA27A"
        ],
        "Label": "unset",
        "Title": "X-Trace Task",
        "Host": "pinky19.mpi-sws.org",
        "Duration": "25371305",
        "HRT": 26966649642099892,
        "Operation": "unset",
        "Timestamp": "1557750289582.291748",
        "TenantClass": 0,
        "Source": "Client.java:1027",
        "ThreadID": 1,
        "ThreadName": "",
        "EventID": "C0A6BBEF79EB1796",
        "ProcessID": 2801
      },
      {
        "Cycles": 0,
        "Agent": "Execution-CPU",
        "ProcessName": "Read",
        "TaskID": "BD737D126FE56ABC",
        "ParentEventID": [
          "C0A6BBEF79EB1796"
        ],
        "Label": "set",
        "Title": "X-Trace Task",
        "Host": "pinky19.mpi-sws.org",
        "HRT": 26966649642148237,
        "Operation": "set",
        "Timestamp": "1557750289582.340088",
        "TenantClass": 0,
        "Source": "Client.java:1032",
        "ThreadID": 41,
        "ThreadName": "",
        "EventID": "6CDECBF9C126B16C",
        "ProcessID": 2801
      },
      {
        "Cycles": 0,
        "Agent": "edu.brown.cs.systems.xtrace.logging.BaggageWrappers",
        "ProcessName": "Read",
        "TaskID": "BD737D126FE56ABC",
        "ParentEventID": [
          "6CDECBF9C126B16C"
        ],
        "Label": "Forking current baggage with Baggage.fork()",
        "Title": "X-Trace Task",
        "Host": "pinky19.mpi-sws.org",
        "HRT": 26966649642174463,
        "Operation": "fork",
        "Timestamp": "1557750289582.366455",
        "TenantClass": 0,
        "Source": "Client.java:1043",
        "ThreadID": 41,
        "ThreadName": "",
        "EventID": "B7A4FAB00E974E13",
        "ProcessID": 2801
      },
      {
        "Cycles": 0,
        "Agent": "Execution-CPU",
        "ProcessName": "Read",
        "TaskID": "BD737D126FE56ABC",
        "ParentEventID": [
          "B7A4FAB00E974E13"
        ],
        "Label": "unset",
        "Title": "X-Trace Task",
        "Host": "pinky19.mpi-sws.org",
        "Duration": "82556",
        "HRT": 26966649642255539,
        "Operation": "unset",
        "Timestamp": "1557750289582.447510",
        "TenantClass": 0,
        "Source": "Client.java:1062",
        "ThreadID": 41,
        "ThreadName": "",
        "EventID": "EF87B03BE996FDB6",
        "ProcessID": 2801
      },
      {
        "Cycles": 0,
        "Agent": "Execution-CPU",
        "ProcessName": "Name",
        "TaskID": "BD737D126FE56ABC",
        "ParentEventID": [
          "B7A4FAB00E974E13"
        ],
        "Label": "set",
        "Title": "X-Trace Task",
        "Host": "pinky19.mpi-sws.org",
        "HRT": 26966649642304396,
        "Operation": "set",
        "Timestamp": "1557750289582.508301",
        "TenantClass": 0,
        "Source": "Server.java:1840",
        "ThreadID": 48,
        "ThreadName": "",
        "EventID": "6CE3F2C84D51EEB3",
        "BaggageBytes": "[[248 5] [240 0] [0 189 115 125 18 111 229 106 188] [240 1] [0 183 164 250 176 14 151 78 19] [240 3] [0 2]]",
        "ProcessID": 2171
      },
      {
        "Cycles": 0,
        "Agent": "edu.brown.cs.systems.xtrace.logging.BaggageWrappers",
        "ProcessName": "Name",
        "TaskID": "BD737D126FE56ABC",
        "ParentEventID": [
          "6CE3F2C84D51EEB3"
        ],
        "Label": "Forking current baggage with Baggage.fork()",
        "Title": "X-Trace Task",
        "Host": "pinky19.mpi-sws.org",
        "HRT": 26966649642334062,
        "Operation": "fork",
        "Timestamp": "1557750289582.537842",
        "TenantClass": 0,
        "Source": "Server.java:550",
        "ThreadID": 48,
        "ThreadName": "",
        "EventID": "617655E148376BBB",
        "BaggageBytes": "[[248 5] [240 0] [0 189 115 125 18 111 229 106 188] [240 1] [0 108 227 242 200 77 81 238 179] [240 3] [0 2]]",
        "ProcessID": 2171
      },
      {
        "Cycles": 0,
        "Agent": "Execution-CPU",
        "ProcessName": "Name",
        "TaskID": "BD737D126FE56ABC",
        "ParentEventID": [
          "617655E148376BBB"
        ],
        "Label": "unset",
        "Title": "X-Trace Task",
        "Host": "pinky19.mpi-sws.org",
        "Duration": "24216",
        "HRT": 26966649642354297,
        "Operation": "unset",
        "Timestamp": "1557750289582.558105",
        "TenantClass": 0,
        "Source": "Server.java:1828",
        "ThreadID": 48,
        "ThreadName": "",
        "EventID": "BF7DC7DA2CF88FE9",
        "BaggageBytes": "[[248 5] [240 0] [0 189 115 125 18 111 229 106 188] [240 1] [0 97 118 85 225 72 55 107 187] [240 3] [0 2]]",
        "ProcessID": 2171
      },
      {
        "Cycles": 0,
        "Agent": "Execution-CPU",
        "ProcessName": "Name",
        "TaskID": "BD737D126FE56ABC",
        "ParentEventID": [
          "617655E148376BBB"
        ],
        "Label": "set",
        "Title": "X-Trace Task",
        "Host": "pinky19.mpi-sws.org",
        "HRT": 26966649642362571,
        "Operation": "set",
        "Timestamp": "1557750289582.566406",
        "TenantClass": 0,
        "Source": "Server.java:2071",
        "ThreadID": 60,
        "ThreadName": "",
        "EventID": "3F956ECF5FD95092",
        "BaggageBytes": "[[248 5] [240 0] [0 189 115 125 18 111 229 106 188] [240 1] [0 97 118 85 225 72 55 107 187] [240 3] [0 2]]",
        "ProcessID": 2171
      },
      {
        "Cycles": 0,
        "Agent": "Execution-CPU",
        "ProcessName": "Read",
        "TaskID": "BD737D126FE56ABC",
        "ParentEventID": [
          "EF87B03BE996FDB6"
        ],
        "Label": "set",
        "Title": "X-Trace Task",
        "Host": "pinky19.mpi-sws.org",
        "HRT": 26966649642281986,
        "Operation": "set",
        "Timestamp": "1557750289582.473877",
        "TenantClass": 0,
        "Source": "Client.java:1104",
        "ThreadID": 1,
        "ThreadName": "",
        "EventID": "EE71CB070C37D3AC",
        "ProcessID": 2801
      },
      {
        "Cycles": 0,
        "Agent": "org.apache.hadoop.ipc.Server",
        "ProcessName": "Name",
        "TaskID": "BD737D126FE56ABC",
        "ParentEventID": [
          "3F956ECF5FD95092"
        ],
        "Label": "getBlockLocations in org.apache.hadoop.hdfs.protocol.ClientProtocol",
        "Title": "X-Trace Task",
        "Host": "pinky19.mpi-sws.org",
        "HRT": 26966649642400917,
        "Timestamp": "1557750289582.604736",
        "TenantClass": 0,
        "Source": "ProtobufRpcEngine.java:601",
        "ThreadID": 60,
        "ThreadName": "",
        "EventID": "7D1BE603D2BADBF5",
        "BaggageBytes": "[[248 5] [240 0] [0 189 115 125 18 111 229 106 188] [240 1] [0 63 149 110 207 95 217 80 146] [240 3] [0 2]]",
        "ProcessID": 2171
      },
      {
        "Cycles": 0,
        "Agent": "edu.brown.cs.systems.xtrace.logging.BaggageWrappers",
        "ProcessName": "Name",
        "TaskID": "BD737D126FE56ABC",
        "ParentEventID": [
          "6720058C27074ECA"
        ],
        "Label": "Forking current baggage with Baggage.fork()",
        "Title": "X-Trace Task",
        "Host": "pinky19.mpi-sws.org",
        "HRT": 26966649642491223,
        "Operation": "fork",
        "Timestamp": "1557750289582.695068",
        "TenantClass": 0,
        "Source": "Server.java:2398",
        "ThreadID": 60,
        "ThreadName": "",
        "EventID": "526713D0ED62D80B",
        "BaggageBytes": "[[248 5] [240 0] [0 189 115 125 18 111 229 106 188] [240 1] [0 103 32 5 140 39 7 78 202] [240 3] [0 2]]",
        "ProcessID": 2171
      },
      {
        "Cycles": 0,
        "Agent": "org.apache.hadoop.hdfs.server.namenode.FSNamesystem.audit",
        "ProcessName": "Name",
        "TaskID": "BD737D126FE56ABC",
        "ParentEventID": [
          "7D1BE603D2BADBF5"
        ],
        "Label": "allowed=true\tugi=plascas (auth:SIMPLE)\tip=/139.19.171.63\tcmd=open\tsrc=/ds/CdI3dcLyOtXOgFXU\tdst=null\tperm=null\tproto=rpc",
        "Title": "X-Trace Task",
        "Host": "pinky19.mpi-sws.org",
        "HRT": 26966649642448586,
        "Timestamp": "1557750289582.652588",
        "TenantClass": 0,
        "Source": "FSNamesystem.java:8313",
        "ThreadID": 60,
        "ThreadName": "",
        "EventID": "6720058C27074ECA",
        "BaggageBytes": "[[248 5] [240 0] [0 189 115 125 18 111 229 106 188] [240 1] [0 125 27 230 3 210 186 219 245] [240 3] [0 2]]",
        "ProcessID": 2171
      },
      {
        "Cycles": 0,
        "Agent": "Execution-CPU",
        "ProcessName": "Name",
        "TaskID": "BD737D126FE56ABC",
        "ParentEventID": [
          "526713D0ED62D80B"
        ],
        "Label": "unset",
        "Title": "X-Trace Task",
        "Host": "pinky19.mpi-sws.org",
        "Duration": "206170",
        "HRT": 26966649642594674,
        "Operation": "unset",
        "Timestamp": "1557750289582.798584",
        "TenantClass": 0,
        "Source": "Server.java:1058",
        "ThreadID": 60,
        "ThreadName": "",
        "EventID": "A86281AE69852272",
        "BaggageBytes": "[[248 5] [240 0] [0 189 115 125 18 111 229 106 188] [240 1] [0 82 103 19 208 237 98 216 11] [240 3] [0 2]]",
        "ProcessID": 2171
      },
      {
        "Cycles": 0,
        "Agent": "Execution-CPU",
        "ProcessName": "Read",
        "TaskID": "BD737D126FE56ABC",
        "ParentEventID": [
          "526713D0ED62D80B"
        ],
        "Label": "set",
        "Title": "X-Trace Task",
        "Host": "pinky19.mpi-sws.org",
        "HRT": 26966649642644960,
        "Operation": "set",
        "Timestamp": "1557750289582.836914",
        "TenantClass": 0,
        "Source": "Client.java:302",
        "ThreadID": 40,
        "ThreadName": "",
        "EventID": "CDE686C146E451BD",
        "ProcessID": 2801
      },
      {
        "Cycles": 0,
        "Agent": "Execution-CPU",
        "ProcessName": "Read",
        "TaskID": "BD737D126FE56ABC",
        "ParentEventID": [
          "CDE686C146E451BD"
        ],
        "Label": "unset",
        "Title": "X-Trace Task",
        "Host": "pinky19.mpi-sws.org",
        "Duration": "11241",
        "HRT": 26966649642670590,
        "Operation": "unset",
        "Timestamp": "1557750289582.862549",
        "TenantClass": 0,
        "Source": "Client.java:1168",
        "ThreadID": 40,
        "ThreadName": "",
        "EventID": "4715A9FAAA282521",
        "ProcessID": 2801
      },
      {
        "Cycles": 0,
        "Agent": "edu.brown.cs.systems.xtrace.logging.BaggageWrappers",
        "ProcessName": "Read",
        "TaskID": "BD737D126FE56ABC",
        "ParentEventID": [
          "4715A9FAAA282521",
          "6BC64F409513CC0F"
        ],
        "Label": "Merged current baggage with other baggage",
        "Title": "X-Trace Task",
        "Host": "pinky19.mpi-sws.org",
        "HRT": 26966649642719421,
        "Operation": "join",
        "Timestamp": "1557750289582.911377",
        "TenantClass": 0,
        "Source": "Client.java:1545",
        "ThreadID": 1,
        "ThreadName": "",
        "EventID": "92BA2CC84A1ECBCA",
        "ProcessID": 2801
      },
      {
        "Cycles": 0,
        "Agent": "Execution-Sleep",
        "ProcessName": "Read",
        "TaskID": "BD737D126FE56ABC",
        "ParentEventID": [
          "EE71CB070C37D3AC"
        ],
        "Label": "waited",
        "Title": "X-Trace Task",
        "Host": "pinky19.mpi-sws.org",
        "Duration": "398852",
        "HRT": 26966649642692549,
        "Operation": "waited",
        "Timestamp": "1557750289582.884521",
        "TenantClass": 0,
        "Source": "Client.java:1537",
        "ThreadID": 1,
        "ThreadName": "",
        "EventID": "6BC64F409513CC0F",
        "ProcessID": 2801
      },
      {
        "Cycles": 0,
        "Agent": "org.apache.hadoop.ipc.ProtobufRpcEngine",
        "ProcessName": "Read",
        "TaskID": "BD737D126FE56ABC",
        "ParentEventID": [
          "92BA2CC84A1ECBCA"
        ],
        "Label": "org.apache.hadoop.hdfs.protocol.ClientProtocol.getBlockLocations completed",
        "Title": "X-Trace Task",
        "Host": "pinky19.mpi-sws.org",
        "HRT": 26966649642787494,
        "Timestamp": "1557750289582.979492",
        "TenantClass": 0,
        "Source": "ProtobufRpcEngine.java:275",
        "ThreadID": 1,
        "ThreadName": "",
        "EventID": "C5CF1633F878B293",
        "ProcessID": 2801
      },
      {
        "Cycles": 0,
        "Agent": "edu.brown.cs.systems.xtrace.logging.BaggageWrappers",
        "ProcessName": "Read",
        "TaskID": "BD737D126FE56ABC",
        "ParentEventID": [
          "ECCAA6030EA205EB"
        ],
        "Label": "Forking current baggage with Baggage.fork()",
        "Title": "X-Trace Task",
        "Host": "pinky19.mpi-sws.org",
        "HRT": 26966649642949149,
        "Operation": "fork",
        "Timestamp": "1557750289583.141113",
        "TenantClass": 0,
        "Source": "DataTransferProtoUtil.java:94",
        "ThreadID": 1,
        "ThreadName": "",
        "EventID": "55DD189771A0C501",
        "ProcessID": 2801
      },
      {
        "Cycles": 0,
        "Agent": "Execution-Sleep",
        "ProcessName": "Read",
        "TaskID": "BD737D126FE56ABC",
        "ParentEventID": [
          "C5CF1633F878B293"
        ],
        "Label": "waited",
        "Title": "X-Trace Task",
        "Host": "pinky19.mpi-sws.org",
        "Duration": "4607",
        "HRT": 26966649642904350,
        "Operation": "waited",
        "Timestamp": "1557750289583.096191",
        "TenantClass": 0,
        "Source": "SocketIOWithTimeout.java:335",
        "ThreadID": 1,
        "ThreadName": "",
        "EventID": "ECCAA6030EA205EB",
        "ProcessID": 2801
      },
      {
        "Cycles": 0,
        "Agent": "edu.brown.cs.systems.xtrace.logging.XTraceInit",
        "ProcessName": "Data",
        "TaskID": "BD737D126FE56ABC",
        "ParentEventID": [
          "1F86D839DC852332"
        ],
        "Label": "Thread.setName: DataXceiver for client DFSClient_NONMAPREDUCE_310321604_1 at /139.19.171.63:51288 [Sending block BP-1633380353-139.19.171.63-1554193446451:blk_1073759835_19011]",
        "Title": "X-Trace Task",
        "Host": "pinky19.mpi-sws.org",
        "HRT": 26966649643137625,
        "Timestamp": "1557750289583.344971",
        "TenantClass": 0,
        "Source": "DataXceiver.java:168",
        "ThreadID": 37648,
        "ThreadName": "",
        "EventID": "6AE9522DCBC3D144",
        "BaggageBytes": "[[248 5] [240 0] [0 189 115 125 18 111 229 106 188] [240 1] [0 31 134 216 57 220 133 35 50] [240 3] [0 2]]",
        "ProcessID": 2319
      },
      {
        "Cycles": 0,
        "Agent": "Execution-CPU",
        "ProcessName": "Data",
        "TaskID": "BD737D126FE56ABC",
        "ParentEventID": [
          "55DD189771A0C501"
        ],
        "Label": "set",
        "Title": "X-Trace Task",
        "Host": "pinky19.mpi-sws.org",
        "HRT": 26966649643099402,
        "Operation": "set",
        "Timestamp": "1557750289583.306641",
        "TenantClass": 0,
        "Source": "Receiver.java:117",
        "ThreadID": 37648,
        "ThreadName": "",
        "EventID": "1F86D839DC852332",
        "BaggageBytes": "[[248 5] [240 0] [0 189 115 125 18 111 229 106 188] [240 1] [0 85 221 24 151 113 160 197 1] [240 3] [0 2]]",
        "ProcessID": 2319
      },
      {
        "Cycles": 0,
        "Agent": "edu.brown.cs.systems.xtrace.logging.BaggageWrappers",
        "ProcessName": "Data",
        "TaskID": "BD737D126FE56ABC",
        "ParentEventID": [
          "6AE9522DCBC3D144"
        ],
        "Label": "Forking current baggage with Baggage.fork()",
        "Title": "X-Trace Task",
        "Host": "pinky19.mpi-sws.org",
        "HRT": 26966649643219537,
        "Operation": "fork",
        "Timestamp": "1557750289583.427002",
        "TenantClass": 0,
        "Source": "DataXceiver.java:1257",
        "ThreadID": 37648,
        "ThreadName": "",
        "EventID": "8FA167D7D5931849",
        "BaggageBytes": "[[248 5] [240 0] [0 189 115 125 18 111 229 106 188] [240 1] [0 106 233 82 45 203 195 209 68] [240 3] [0 2]]",
        "ProcessID": 2319
      },
      {
        "Cycles": 0,
        "Agent": "edu.brown.cs.systems.xtrace.logging.BaggageWrappers",
        "ProcessName": "Data",
        "TaskID": "BD737D126FE56ABC",
        "ParentEventID": [
          "8FA167D7D5931849"
        ],
        "Label": "Forking current baggage with Baggage.fork()",
        "Title": "X-Trace Task",
        "Host": "pinky19.mpi-sws.org",
        "HRT": 26966649643288732,
        "Operation": "fork",
        "Timestamp": "1557750289583.496094",
        "TenantClass": 0,
        "Source": "PacketHeader.java:95",
        "ThreadID": 37648,
        "ThreadName": "",
        "EventID": "B8A4EBE00585CC74",
        "BaggageBytes": "[[248 5] [240 0] [0 189 115 125 18 111 229 106 188] [240 1] [0 143 161 103 215 213 147 24 73] [240 3] [0 2]]",
        "ProcessID": 2319
      },
      {
        "Cycles": 0,
        "Agent": "Execution-Sleep",
        "ProcessName": "Read",
        "TaskID": "BD737D126FE56ABC",
        "ParentEventID": [
          "55DD189771A0C501"
        ],
        "Label": "waited",
        "Title": "X-Trace Task",
        "Host": "pinky19.mpi-sws.org",
        "Duration": "246968",
        "HRT": 26966649643283953,
        "Operation": "waited",
        "Timestamp": "1557750289583.475830",
        "TenantClass": 0,
        "Source": "SocketIOWithTimeout.java:335",
        "ThreadID": 1,
        "ThreadName": "",
        "EventID": "039779001DAE204B",
        "ProcessID": 2801
      },
      {
        "Cycles": 0,
        "Agent": "edu.brown.cs.systems.xtrace.logging.BaggageWrappers",
        "ProcessName": "Read",
        "TaskID": "BD737D126FE56ABC",
        "ParentEventID": [
          "8FA167D7D5931849",
          "039779001DAE204B"
        ],
        "Label": "Merged current baggage with other baggage",
        "Title": "X-Trace Task",
        "Host": "pinky19.mpi-sws.org",
        "HRT": 26966649643365136,
        "Operation": "join",
        "Timestamp": "1557750289583.557129",
        "TenantClass": 0,
        "Source": "RemoteBlockReader2.java:429",
        "ThreadID": 1,
        "ThreadName": "",
        "EventID": "D4BFDFEF5A8EC294",
        "ProcessID": 2801
      },
      {
        "Cycles": 0,
        "Agent": "Execution-Sleep",
        "ProcessName": "Data",
        "TaskID": "BD737D126FE56ABC",
        "ParentEventID": [
          "B8A4EBE00585CC74"
        ],
        "Label": "waited",
        "Title": "X-Trace Task",
        "Host": "pinky19.mpi-sws.org",
        "Duration": "4860",
        "HRT": 26966649643363213,
        "Operation": "waited",
        "Timestamp": "1557750289583.570557",
        "TenantClass": 0,
        "Source": "SocketIOWithTimeout.java:335",
        "ThreadID": 37648,
        "ThreadName": "",
        "EventID": "A7F5CE11909C2F71",
        "BaggageBytes": "[[248 5] [240 0] [0 189 115 125 18 111 229 106 188] [240 1] [0 184 164 235 224 5 133 204 116] [240 3] [0 2]]",
        "ProcessID": 2319
      },
      {
        "Cycles": 0,
        "Agent": "edu.brown.cs.systems.xtrace.logging.BaggageWrappers",
        "ProcessName": "Read",
        "TaskID": "BD737D126FE56ABC",
        "ParentEventID": [
          "D4BFDFEF5A8EC294",
          "B8A4EBE00585CC74"
        ],
        "Label": "Merged current baggage with other baggage",
        "Title": "X-Trace Task",
        "Host": "pinky19.mpi-sws.org",
        "HRT": 26966649643476768,
        "Operation": "join",
        "Timestamp": "1557750289583.668701",
        "TenantClass": 0,
        "Source": "PacketHeader.java:168",
        "ThreadID": 1,
        "ThreadName": "",
        "EventID": "5850BF76FA6F5507",
        "ProcessID": 2801
      },
      {
        "Cycles": 0,
        "Agent": "edu.brown.cs.systems.xtrace.logging.BaggageWrappers",
        "ProcessName": "Read",
        "TaskID": "BD737D126FE56ABC",
        "ParentEventID": [
          "5850BF76FA6F5507",
          "B72AC2B92EBA9DDD"
        ],
        "Label": "Merged current baggage with other baggage",
        "Title": "X-Trace Task",
        "Host": "pinky19.mpi-sws.org",
        "HRT": 26966649643585661,
        "Operation": "join",
        "Timestamp": "1557750289583.777588",
        "TenantClass": 0,
        "Source": "PacketHeader.java:168",
        "ThreadID": 1,
        "ThreadName": "",
        "EventID": "B0009A8D162B16FE",
        "ProcessID": 2801
      },
      {
        "Cycles": 0,
        "Agent": "edu.brown.cs.systems.xtrace.logging.BaggageWrappers",
        "ProcessName": "Data",
        "TaskID": "BD737D126FE56ABC",
        "ParentEventID": [
          "A7F5CE11909C2F71"
        ],
        "Label": "Forking current baggage with Baggage.fork()",
        "Title": "X-Trace Task",
        "Host": "pinky19.mpi-sws.org",
        "HRT": 26966649643441678,
        "Operation": "fork",
        "Timestamp": "1557750289583.648926",
        "TenantClass": 0,
        "Source": "PacketHeader.java:95",
        "ThreadID": 37648,
        "ThreadName": "",
        "EventID": "B72AC2B92EBA9DDD",
        "BaggageBytes": "[[248 5] [240 0] [0 189 115 125 18 111 229 106 188] [240 1] [0 167 245 206 17 144 156 47 113] [240 3] [0 2]]",
        "ProcessID": 2319
      },
      {
        "Cycles": 0,
        "Agent": "edu.brown.cs.systems.xtrace.logging.BaggageWrappers",
        "ProcessName": "Read",
        "TaskID": "BD737D126FE56ABC",
        "ParentEventID": [
          "B0009A8D162B16FE"
        ],
        "Label": "Forking current baggage with Baggage.fork()",
        "Title": "X-Trace Task",
        "Host": "pinky19.mpi-sws.org",
        "HRT": 26966649643595974,
        "Operation": "fork",
        "Timestamp": "1557750289583.787842",
        "TenantClass": 0,
        "Source": "RemoteBlockReader2.java:361",
        "ThreadID": 1,
        "ThreadName": "",
        "EventID": "365325654CBA43A3",
        "ProcessID": 2801
      },
      {
        "Cycles": 0,
        "Agent": "edu.brown.cs.systems.xtrace.logging.BaggageWrappers",
        "ProcessName": "Read",
        "TaskID": "BD737D126FE56ABC",
        "ParentEventID": [
          "365325654CBA43A3"
        ],
        "Label": "Forking current baggage with Baggage.fork()",
        "Title": "X-Trace Task",
        "Host": "pinky19.mpi-sws.org",
        "HRT": 26966649643656578,
        "Operation": "fork",
        "Timestamp": "1557750289583.848389",
        "TenantClass": 0,
        "Source": "DataTransferProtoUtil.java:94",
        "ThreadID": 1,
        "ThreadName": "",
        "EventID": "3E7F3413ACDDE29C",
        "ProcessID": 2801
      },
      {
        "Cycles": 0,
        "Agent": "Execution-Sleep",
        "ProcessName": "Data",
        "TaskID": "BD737D126FE56ABC",
        "ParentEventID": [
          "B72AC2B92EBA9DDD"
        ],
        "Label": "waited",
        "Title": "X-Trace Task",
        "Host": "pinky19.mpi-sws.org",
        "Duration": "110518",
        "HRT": 26966649643637973,
        "Operation": "waited",
        "Timestamp": "1557750289583.845215",
        "TenantClass": 0,
        "Source": "SocketIOWithTimeout.java:335",
        "ThreadID": 37648,
        "ThreadName": "",
        "EventID": "6661A51C3E495C5F",
        "BaggageBytes": "[[248 5] [240 0] [0 189 115 125 18 111 229 106 188] [240 1] [0 183 42 194 185 46 186 157 221] [240 3] [0 2]]",
        "ProcessID": 2319
      },
      {
        "Cycles": 0,
        "Agent": "edu.brown.cs.systems.xtrace.logging.BaggageWrappers",
        "ProcessName": "Data",
        "TaskID": "BD737D126FE56ABC",
        "ParentEventID": [
          "6661A51C3E495C5F",
          "365325654CBA43A3"
        ],
        "Label": "Merged current baggage with other baggage",
        "Title": "X-Trace Task",
        "Host": "pinky19.mpi-sws.org",
        "HRT": 26966649643690965,
        "Operation": "join",
        "Timestamp": "1557750289583.898438",
        "TenantClass": 0,
        "Source": "DataXceiver.java:574",
        "ThreadID": 37648,
        "ThreadName": "",
        "EventID": "333E91334FCED174",
        "BaggageBytes": "[[248 5] [240 0] [0 189 115 125 18 111 229 106 188] [240 1] [0 54 83 37 101 76 186 67 163] [0 102 97 165 28 62 73 92 95] [240 3] [0 2]]",
        "ProcessID": 2319
      },
      {
        "Cycles": 0,
        "Agent": "Execution-CPU",
        "ProcessName": "Data",
        "TaskID": "BD737D126FE56ABC",
        "ParentEventID": [
          "333E91334FCED174"
        ],
        "Label": "unset",
        "Title": "X-Trace Task",
        "Host": "pinky19.mpi-sws.org",
        "Duration": "587448",
        "HRT": 26966649643713479,
        "Operation": "unset",
        "Timestamp": "1557750289583.920898",
        "TenantClass": 0,
        "Source": "DataXceiver.java:261",
        "ThreadID": 37648,
        "ThreadName": "",
        "EventID": "E8AAB10F845F142B",
        "BaggageBytes": "[[248 5] [240 0] [0 189 115 125 18 111 229 106 188] [240 1] [0 51 62 145 51 79 206 209 116] [240 3] [0 2]]",
        "ProcessID": 2319
      },
      {
        "Cycles": 0,
        "Agent": "Execution-CPU",
        "ProcessName": "Data",
        "TaskID": "BD737D126FE56ABC",
        "ParentEventID": [
          "3E7F3413ACDDE29C"
        ],
        "Label": "set",
        "Title": "X-Trace Task",
        "Host": "pinky19.mpi-sws.org",
        "HRT": 26966649643764539,
        "Operation": "set",
        "Timestamp": "1557750289583.971924",
        "TenantClass": 0,
        "Source": "Receiver.java:117",
        "ThreadID": 37648,
        "ThreadName": "",
        "EventID": "2598548ADABCE563",
        "BaggageBytes": "[[248 5] [240 0] [0 189 115 125 18 111 229 106 188] [240 1] [0 62 127 52 19 172 221 226 156] [240 3] [0 2]]",
        "ProcessID": 2319
      },
      {
        "Cycles": 0,
        "Agent": "edu.brown.cs.systems.xtrace.logging.BaggageWrappers",
        "ProcessName": "Data",
        "TaskID": "BD737D126FE56ABC",
        "ParentEventID": [
          "7C39AE3624483846"
        ],
        "Label": "Forking current baggage with Baggage.fork()",
        "Title": "X-Trace Task",
        "Host": "pinky19.mpi-sws.org",
        "HRT": 26966649643853990,
        "Operation": "fork",
        "Timestamp": "1557750289584.061279",
        "TenantClass": 0,
        "Source": "DataXceiver.java:1257",
        "ThreadID": 37648,
        "ThreadName": "",
        "EventID": "9C118EA412B5301D",
        "BaggageBytes": "[[248 5] [240 0] [0 189 115 125 18 111 229 106 188] [240 1] [0 124 57 174 54 36 72 56 70] [240 3] [0 2]]",
        "ProcessID": 2319
      },
      {
        "Cycles": 0,
        "Agent": "edu.brown.cs.systems.xtrace.logging.XTraceInit",
        "ProcessName": "Data",
        "TaskID": "BD737D126FE56ABC",
        "ParentEventID": [
          "2598548ADABCE563"
        ],
        "Label": "Thread.setName: DataXceiver for client DFSClient_NONMAPREDUCE_310321604_1 at /139.19.171.63:51288 [Sending block BP-1633380353-139.19.171.63-1554193446451:blk_1073759835_19011]",
        "Title": "X-Trace Task",
        "Host": "pinky19.mpi-sws.org",
        "HRT": 26966649643790919,
        "Timestamp": "1557750289583.998291",
        "TenantClass": 0,
        "Source": "DataXceiver.java:168",
        "ThreadID": 37648,
        "ThreadName": "",
        "EventID": "7C39AE3624483846",
        "BaggageBytes": "[[248 5] [240 0] [0 189 115 125 18 111 229 106 188] [240 1] [0 37 152 84 138 218 188 229 99] [240 3] [0 2]]",
        "ProcessID": 2319
      },
      {
        "Cycles": 0,
        "Agent": "edu.brown.cs.systems.xtrace.logging.BaggageWrappers",
        "ProcessName": "Data",
        "TaskID": "BD737D126FE56ABC",
        "ParentEventID": [
          "9C118EA412B5301D"
        ],
        "Label": "Forking current baggage with Baggage.fork()",
        "Title": "X-Trace Task",
        "Host": "pinky19.mpi-sws.org",
        "HRT": 26966649643910148,
        "Operation": "fork",
        "Timestamp": "1557750289584.117432",
        "TenantClass": 0,
        "Source": "PacketHeader.java:95",
        "ThreadID": 37648,
        "ThreadName": "",
        "EventID": "0BBD3F8565703CAC",
        "BaggageBytes": "[[248 5] [240 0] [0 189 115 125 18 111 229 106 188] [240 1] [0 156 17 142 164 18 181 48 29] [240 3] [0 2]]",
        "ProcessID": 2319
      },
      {
        "Cycles": 0,
        "Agent": "Execution-Sleep",
        "ProcessName": "Data",
        "TaskID": "BD737D126FE56ABC",
        "ParentEventID": [
          "0BBD3F8565703CAC"
        ],
        "Label": "waited",
        "Title": "X-Trace Task",
        "Host": "pinky19.mpi-sws.org",
        "Duration": "3861",
        "HRT": 26966649643969667,
        "Operation": "waited",
        "Timestamp": "1557750289584.177002",
        "TenantClass": 0,
        "Source": "SocketIOWithTimeout.java:335",
        "ThreadID": 37648,
        "ThreadName": "",
        "EventID": "504A422B141593B3",
        "BaggageBytes": "[[248 5] [240 0] [0 189 115 125 18 111 229 106 188] [240 1] [0 11 189 63 133 101 112 60 172] [240 3] [0 2]]",
        "ProcessID": 2319
      },
      {
        "Cycles": 0,
        "Agent": "Execution-Sleep",
        "ProcessName": "Read",
        "TaskID": "BD737D126FE56ABC",
        "ParentEventID": [
          "3E7F3413ACDDE29C"
        ],
        "Label": "waited",
        "Title": "X-Trace Task",
        "Host": "pinky19.mpi-sws.org",
        "Duration": "181613",
        "HRT": 26966649643912231,
        "Operation": "waited",
        "Timestamp": "1557750289584.104004",
        "TenantClass": 0,
        "Source": "SocketIOWithTimeout.java:335",
        "ThreadID": 1,
        "ThreadName": "",
        "EventID": "6C0C1F2EC40B5661",
        "ProcessID": 2801
      },
      {
        "Cycles": 0,
        "Agent": "edu.brown.cs.systems.xtrace.logging.BaggageWrappers",
        "ProcessName": "Read",
        "TaskID": "BD737D126FE56ABC",
        "ParentEventID": [
          "9C118EA412B5301D",
          "6C0C1F2EC40B5661"
        ],
        "Label": "Merged current baggage with other baggage",
        "Title": "X-Trace Task",
        "Host": "pinky19.mpi-sws.org",
        "HRT": 26966649643980175,
        "Operation": "join",
        "Timestamp": "1557750289584.172119",
        "TenantClass": 0,
        "Source": "RemoteBlockReader2.java:429",
        "ThreadID": 1,
        "ThreadName": "",
        "EventID": "1DA9F237F0C4D1EB",
        "ProcessID": 2801
      },
      {
        "Cycles": 0,
        "Agent": "edu.brown.cs.systems.xtrace.logging.BaggageWrappers",
        "ProcessName": "Read",
        "TaskID": "BD737D126FE56ABC",
        "ParentEventID": [
          "1DA9F237F0C4D1EB",
          "0BBD3F8565703CAC"
        ],
        "Label": "Merged current baggage with other baggage",
        "Title": "X-Trace Task",
        "Host": "pinky19.mpi-sws.org",
        "HRT": 26966649644050551,
        "Operation": "join",
        "Timestamp": "1557750289584.242432",
        "TenantClass": 0,
        "Source": "PacketHeader.java:168",
        "ThreadID": 1,
        "ThreadName": "",
        "EventID": "4C68DE0D6786A8D6",
        "ProcessID": 2801
      },
      {
        "Cycles": 0,
        "Agent": "edu.brown.cs.systems.xtrace.logging.BaggageWrappers",
        "ProcessName": "Data",
        "TaskID": "BD737D126FE56ABC",
        "ParentEventID": [
          "504A422B141593B3"
        ],
        "Label": "Forking current baggage with Baggage.fork()",
        "Title": "X-Trace Task",
        "Host": "pinky19.mpi-sws.org",
        "HRT": 26966649644035102,
        "Operation": "fork",
        "Timestamp": "1557750289584.242432",
        "TenantClass": 0,
        "Source": "PacketHeader.java:95",
        "ThreadID": 37648,
        "ThreadName": "",
        "EventID": "382EC16A565CFD55",
        "BaggageBytes": "[[248 5] [240 0] [0 189 115 125 18 111 229 106 188] [240 1] [0 80 74 66 43 20 21 147 179] [240 3] [0 2]]",
        "ProcessID": 2319
      },
      {
        "Cycles": 0,
        "Agent": "Execution-Sleep",
        "ProcessName": "Data",
        "TaskID": "BD737D126FE56ABC",
        "ParentEventID": [
          "382EC16A565CFD55"
        ],
        "Label": "waited",
        "Title": "X-Trace Task",
        "Host": "pinky19.mpi-sws.org",
        "Duration": "3337",
        "HRT": 26966649644088841,
        "Operation": "waited",
        "Timestamp": "1557750289584.296143",
        "TenantClass": 0,
        "Source": "SocketIOWithTimeout.java:335",
        "ThreadID": 37648,
        "ThreadName": "",
        "EventID": "F45F0CFB25D89266",
        "BaggageBytes": "[[248 5] [240 0] [0 189 115 125 18 111 229 106 188] [240 1] [0 56 46 193 106 86 92 253 85] [240 3] [0 2]]",
        "ProcessID": 2319
      },
      {
        "Cycles": 0,
        "Agent": "edu.brown.cs.systems.xtrace.logging.BaggageWrappers",
        "ProcessName": "Data",
        "TaskID": "BD737D126FE56ABC",
        "ParentEventID": [
          "F45F0CFB25D89266"
        ],
        "Label": "Forking current baggage with Baggage.fork()",
        "Title": "X-Trace Task",
        "Host": "pinky19.mpi-sws.org",
        "HRT": 26966649644152045,
        "Operation": "fork",
        "Timestamp": "1557750289584.359375",
        "TenantClass": 0,
        "Source": "PacketHeader.java:95",
        "ThreadID": 37648,
        "ThreadName": "",
        "EventID": "220B04C7518BF6F0",
        "BaggageBytes": "[[248 5] [240 0] [0 189 115 125 18 111 229 106 188] [240 1] [0 244 95 12 251 37 216 146 102] [240 3] [0 2]]",
        "ProcessID": 2319
      },
      {
        "Cycles": 0,
        "Agent": "Execution-CPU",
        "ProcessName": "Data",
        "TaskID": "BD737D126FE56ABC",
        "ParentEventID": [
          "220B04C7518BF6F0"
        ],
        "Label": "unset",
        "Title": "X-Trace Task",
        "Host": "pinky19.mpi-sws.org",
        "Duration": "480965",
        "HRT": 26966649644264032,
        "Operation": "unset",
        "Timestamp": "1557750289584.471436",
        "TenantClass": 0,
        "Source": "DataXceiver.java:261",
        "ThreadID": 37648,
        "ThreadName": "",
        "EventID": "E3FC04C0B008987C",
        "BaggageBytes": "[[248 5] [240 0] [0 189 115 125 18 111 229 106 188] [240 1] [0 34 11 4 199 81 139 246 240] [240 3] [0 2]]",
        "ProcessID": 2319
      },
      {
        "Cycles": 0,
        "Agent": "edu.brown.cs.systems.retro.benchmarks.hdfs_client.Reader",
        "ProcessName": "Read",
        "TaskID": "BD737D126FE56ABC",
        "ParentEventID": [
          "0"
        ],
        "Label": "Reading file",
        "Title": "X-Trace Task",
        "Host": "pinky19.mpi-sws.org",
        "HRT": 26966649641968970,
        "Timestamp": "1557750289582.160889",
        "TenantClass": 0,
        "ThreadID": 1,
        "ThreadName": "",
        "EventID": "9B712E451A4692AE",
        "ProcessID": 2801,
        "Tag": [
          "reader_100kb",
          "Read Size: 102400"
        ]
      }
    ]
  }
]