[
  {
    "id": "7071FC3D99154D12",
    "reports": [
      {
        "Cycles": 0,
        "Agent": "Execution-CPU",
        "ProcessName": "Read",
        "TaskID": "7071FC3D99154D12",
        "ParentEventID": [
          "422A999460177828"
        ],
        "Label": "unset",
        "Title": "X-Trace Task",
        "Host": "pinky19.mpi-sws.org",
        "Duration": "37459199",
        "HRT": 26966700812971477,
        "Operation": "unset",
        "Timestamp": "1557750340753.063232",
        "TenantClass": 0,
        "Source": "Client.java:1027",
        "ThreadID": 1,
        "ThreadName": "",
        "EventID": "39E1E6E9B858F853",
        "ProcessID": 2801
      },
      {
        "Cycles": 0,
        "Agent": "Execution-CPU",
        "ProcessName": "Read",
        "TaskID": "7071FC3D99154D12",
        "ParentEventID": [
          "39E1E6E9B858F853"
        ],
        "Label": "set",
        "Title": "X-Trace Task",
        "Host": "pinky19.mpi-sws.org",
        "HRT": 26966700813025552,
        "Operation": "set",
        "Timestamp": "1557750340753.117188",
        "TenantClass": 0,
        "Source": "Client.java:1032",
        "ThreadID": 41,
        "ThreadName": "",
        "EventID": "47B05F0AB4F97ECF",
        "ProcessID": 2801
      },
      {
        "Cycles": 0,
        "Agent": "edu.brown.cs.systems.xtrace.logging.BaggageWrappers",
        "ProcessName": "Read",
        "TaskID": "7071FC3D99154D12",
        "ParentEventID": [
          "47B05F0AB4F97ECF"
        ],
        "Label": "Forking current baggage with Baggage.fork()",
        "Title": "X-Trace Task",
        "Host": "pinky19.mpi-sws.org",
        "HRT": 26966700813052424,
        "Operation": "fork",
        "Timestamp": "1557750340753.144043",
        "TenantClass": 0,
        "Source": "Client.java:1043",
        "ThreadID": 41,
        "ThreadName": "",
        "EventID": "8B1FAF72060637AF",
        "ProcessID": 2801
      },
      {
        "Cycles": 0,
        "Agent": "Execution-CPU",
        "ProcessName": "Read",
        "TaskID": "7071FC3D99154D12",
        "ParentEventID": [
          "8B1FAF72060637AF"
        ],
        "Label": "unset",
        "Title": "X-Trace Task",
        "Host": "pinky19.mpi-sws.org",
        "Duration": "88380",
        "HRT": 26966700813140664,
        "Operation": "unset",
        "Timestamp": "1557750340753.232422",
        "TenantClass": 0,
        "Source": "Client.java:1062",
        "ThreadID": 41,
        "ThreadName": "",
        "EventID": "7FB4510973CF9795",
        "ProcessID": 2801
      },
      {
        "Cycles": 0,
        "Agent": "Execution-CPU",
        "ProcessName": "Read",
        "TaskID": "7071FC3D99154D12",
        "ParentEventID": [
          "7FB4510973CF9795"
        ],
        "Label": "set",
        "Title": "X-Trace Task",
        "Host": "pinky19.mpi-sws.org",
        "HRT": 26966700813200960,
        "Operation": "set",
        "Timestamp": "1557750340753.292725",
        "TenantClass": 0,
        "Source": "Client.java:1104",
        "ThreadID": 1,
        "ThreadName": "",
        "EventID": "7157DDAB6DBC06A2",
        "ProcessID": 2801
      },
      {
        "Cycles": 0,
        "Agent": "edu.brown.cs.systems.retro.benchmarks.hdfs_client.Reader",
        "ProcessName": "Read",
        "TaskID": "7071FC3D99154D12",
        "ParentEventID": [
          "2C0F6E7DCE24D508"
        ],
        "Label": "Reading file",
        "Title": "X-Trace Task",
        "Host": "pinky19.mpi-sws.org",
        "HRT": 26966700812929665,
        "Timestamp": "1557750340753.021240",
        "TenantClass": 0,
        "ThreadID": 1,
        "ThreadName": "",
        "EventID": "17449505DDE75806",
        "ProcessID": 2801
      },
      {
        "Cycles": 0,
        "Agent": "Execution-CPU",
        "ProcessName": "Name",
        "TaskID": "7071FC3D99154D12",
        "ParentEventID": [
          "8B1FAF72060637AF"
        ],
        "Label": "set",
        "Title": "X-Trace Task",
        "Host": "pinky19.mpi-sws.org",
        "HRT": 26966700813217283,
        "Operation": "set",
        "Timestamp": "1557750340753.338135",
        "TenantClass": 0,
        "Source": "Server.java:1840",
        "ThreadID": 48,
        "ThreadName": "",
        "EventID": "7B452341EF5DB9CF",
        "BaggageBytes": "[[248 5] [240 0] [0 112 113 252 61 153 21 77 18] [240 1] [0 139 31 175 114 6 6 55 175] [240 3] [0 2]]",
        "ProcessID": 2171
      },
      {
        "Cycles": 0,
        "Agent": "org.apache.hadoop.ipc.ProtobufRpcEngine",
        "ProcessName": "Read",
        "TaskID": "7071FC3D99154D12",
        "ParentEventID": [
          "17449505DDE75806"
        ],
        "Label": "Invoking org.apache.hadoop.hdfs.protocol.ClientProtocol.getBlockLocations",
        "Title": "X-Trace Task",
        "Host": "pinky19.mpi-sws.org",
        "HRT": 26966700812954104,
        "Timestamp": "1557750340753.045654",
        "TenantClass": 0,
        "Source": "ProtobufRpcEngine.java:228",
        "ThreadID": 1,
        "ThreadName": "",
        "EventID": "422A999460177828",
        "ProcessID": 2801
      },
      {
        "Cycles": 0,
        "Agent": "Execution-CPU",
        "ProcessName": "Name",
        "TaskID": "7071FC3D99154D12",
        "ParentEventID": [
          "132CB324F24591C5"
        ],
        "Label": "unset",
        "Title": "X-Trace Task",
        "Host": "pinky19.mpi-sws.org",
        "Duration": "41250",
        "HRT": 26966700813295113,
        "Operation": "unset",
        "Timestamp": "1557750340753.416016",
        "TenantClass": 0,
        "Source": "Server.java:1828",
        "ThreadID": 48,
        "ThreadName": "",
        "EventID": "357B9267BC776F32",
        "BaggageBytes": "[[248 5] [240 0] [0 112 113 252 61 153 21 77 18] [240 1] [0 19 44 179 36 242 69 145 197] [240 3] [0 2]]",
        "ProcessID": 2171
      },
      {
        "Cycles": 0,
        "Agent": "edu.brown.cs.systems.xtrace.logging.BaggageWrappers",
        "ProcessName": "Name",
        "TaskID": "7071FC3D99154D12",
        "ParentEventID": [
          "7B452341EF5DB9CF"
        ],
        "Label": "Forking current baggage with Baggage.fork()",
        "Title": "X-Trace Task",
        "Host": "pinky19.mpi-sws.org",
        "HRT": 26966700813264876,
        "Operation": "fork",
        "Timestamp": "1557750340753.385742",
        "TenantClass": 0,
        "Source": "Server.java:550",
        "ThreadID": 48,
        "ThreadName": "",
        "EventID": "132CB324F24591C5",
        "BaggageBytes": "[[248 5] [240 0] [0 112 113 252 61 153 21 77 18] [240 1] [0 123 69 35 65 239 93 185 207] [240 3] [0 2]]",
        "ProcessID": 2171
      },
      {
        "Cycles": 0,
        "Agent": "Execution-CPU",
        "ProcessName": "Name",
        "TaskID": "7071FC3D99154D12",
        "ParentEventID": [
          "132CB324F24591C5"
        ],
        "Label": "set",
        "Title": "X-Trace Task",
        "Host": "pinky19.mpi-sws.org",
        "HRT": 26966700813308852,
        "Operation": "set",
        "Timestamp": "1557750340753.429688",
        "TenantClass": 0,
        "Source": "Server.java:2071",
        "ThreadID": 58,
        "ThreadName": "",
        "EventID": "33078006707B8272",
        "BaggageBytes": "[[248 5] [240 0] [0 112 113 252 61 153 21 77 18] [240 1] [0 19 44 179 36 242 69 145 197] [240 3] [0 2]]",
        "ProcessID": 2171
      },
      {
        "Cycles": 0,
        "Agent": "org.apache.hadoop.hdfs.server.namenode.FSNamesystem.audit",
        "ProcessName": "Name",
        "TaskID": "7071FC3D99154D12",
        "ParentEventID": [
          "0A361ED49CD4EC0C"
        ],
        "Label": "allowed=true\tugi=plascas (auth:SIMPLE)\tip=/139.19.171.63\tcmd=open\tsrc=/ds/Vb14pAKjsXdFbPFv\tdst=null\tperm=null\tproto=rpc",
        "Title": "X-Trace Task",
        "Host": "pinky19.mpi-sws.org",
        "HRT": 26966700813444741,
        "Timestamp": "1557750340753.565674",
        "TenantClass": 0,
        "Source": "FSNamesystem.java:8313",
        "ThreadID": 58,
        "ThreadName": "",
        "EventID": "188571822BB4658A",
        "BaggageBytes": "[[248 5] [240 0] [0 112 113 252 61 153 21 77 18] [240 1] [0 10 54 30 212 156 212 236 12] [240 3] [0 2]]",
        "ProcessID": 2171
      },
      {
        "Cycles": 0,
        "Agent": "edu.brown.cs.systems.xtrace.logging.BaggageWrappers",
        "ProcessName": "Name",
        "TaskID": "7071FC3D99154D12",
        "ParentEventID": [
          "188571822BB4658A"
        ],
        "Label": "Forking current baggage with Baggage.fork()",
        "Title": "X-Trace Task",
        "Host": "pinky19.mpi-sws.org",
        "HRT": 26966700813506074,
        "Operation": "fork",
        "Timestamp": "1557750340753.626953",
        "TenantClass": 0,
        "Source": "Server.java:2398",
        "ThreadID": 58,
        "ThreadName": "",
        "EventID": "99DAD1EA2FA431DB",
        "BaggageBytes": "[[248 5] [240 0] [0 112 113 252 61 153 21 77 18] [240 1] [0 24 133 113 130 43 180 101 138] [240 3] [0 2]]",
        "ProcessID": 2171
      },
      {
        "Cycles": 0,
        "Agent": "Execution-CPU",
        "ProcessName": "Name",
        "TaskID": "7071FC3D99154D12",
        "ParentEventID": [
          "99DAD1EA2FA431DB"
        ],
        "Label": "unset",
        "Title": "X-Trace Task",
        "Host": "pinky19.mpi-sws.org",
        "Duration": "289374",
        "HRT": 26966700813646430,
        "Operation": "unset",
        "Timestamp": "1557750340753.767334",
        "TenantClass": 0,
        "Source": "Server.java:1058",
        "ThreadID": 58,
        "ThreadName": "",
        "EventID": "816BA6A3C21D41F0",
        "BaggageBytes": "[[248 5] [240 0] [0 112 113 252 61 153 21 77 18] [240 1] [0 153 218 209 234 47 164 49 219] [240 3] [0 2]]",
        "ProcessID": 2171
      },
      {
        "Cycles": 0,
        "Agent": "org.apache.hadoop.ipc.Server",
        "ProcessName": "Name",
        "TaskID": "7071FC3D99154D12",
        "ParentEventID": [
          "33078006707B8272"
        ],
        "Label": "getBlockLocations in org.apache.hadoop.hdfs.protocol.ClientProtocol",
        "Title": "X-Trace Task",
        "Host": "pinky19.mpi-sws.org",
        "HRT": 26966700813378597,
        "Timestamp": "1557750340753.499512",
        "TenantClass": 0,
        "Source": "ProtobufRpcEngine.java:601",
        "ThreadID": 58,
        "ThreadName": "",
        "EventID": "0A361ED49CD4EC0C",
        "BaggageBytes": "[[248 5] [240 0] [0 112 113 252 61 153 21 77 18] [240 1] [0 51 7 128 6 112 123 130 114] [240 3] [0 2]]",
        "ProcessID": 2171
      },
      {
        "Cycles": 0,
        "Agent": "Execution-CPU",
        "ProcessName": "Read",
        "TaskID": "7071FC3D99154D12",
        "ParentEventID": [
          "99DAD1EA2FA431DB"
        ],
        "Label": "set",
        "Title": "X-Trace Task",
        "Host": "pinky19.mpi-sws.org",
        "HRT": 26966700813729288,
        "Operation": "set",
        "Timestamp": "1557750340753.821045",
        "TenantClass": 0,
        "Source": "Client.java:302",
        "ThreadID": 40,
        "ThreadName": "",
        "EventID": "87097B72F869348F",
        "ProcessID": 2801
      },
      {
        "Cycles": 0,
        "Agent": "Execution-CPU",
        "ProcessName": "Read",
        "TaskID": "7071FC3D99154D12",
        "ParentEventID": [
          "87097B72F869348F"
        ],
        "Label": "unset",
        "Title": "X-Trace Task",
        "Host": "pinky19.mpi-sws.org",
        "Duration": "8880",
        "HRT": 26966700813755003,
        "Operation": "unset",
        "Timestamp": "1557750340753.846680",
        "TenantClass": 0,
        "Source": "Client.java:1168",
        "ThreadID": 40,
        "ThreadName": "",
        "EventID": "0986BE2ADA8C9237",
        "ProcessID": 2801
      },
      {
        "Cycles": 0,
        "Agent": "edu.brown.cs.systems.xtrace.logging.BaggageWrappers",
        "ProcessName": "Read",
        "TaskID": "7071FC3D99154D12",
        "ParentEventID": [
          "0986BE2ADA8C9237",
          "1ADA99904D90BA28"
        ],
        "Label": "Merged current baggage with other baggage",
        "Title": "X-Trace Task",
        "Host": "pinky19.mpi-sws.org",
        "HRT": 26966700813786092,
        "Operation": "join",
        "Timestamp": "1557750340753.877686",
        "TenantClass": 0,
        "Source": "Client.java:1545",
        "ThreadID": 1,
        "ThreadName": "",
        "EventID": "FB5163509AE6C0F0",
        "ProcessID": 2801
      },
      {
        "Cycles": 0,
        "Agent": "org.apache.hadoop.ipc.ProtobufRpcEngine",
        "ProcessName": "Read",
        "TaskID": "7071FC3D99154D12",
        "ParentEventID": [
          "FB5163509AE6C0F0"
        ],
        "Label": "org.apache.hadoop.hdfs.protocol.ClientProtocol.getBlockLocations completed",
        "Title": "X-Trace Task",
        "Host": "pinky19.mpi-sws.org",
        "HRT": 26966700813822243,
        "Timestamp": "1557750340753.913818",
        "TenantClass": 0,
        "Source": "ProtobufRpcEngine.java:275",
        "ThreadID": 1,
        "ThreadName": "",
        "EventID": "38DD81EC440F4738",
        "ProcessID": 2801
      },
      {
        "Cycles": 0,
        "Agent": "Execution-Sleep",
        "ProcessName": "Read",
        "TaskID": "7071FC3D99154D12",
        "ParentEventID": [
          "7157DDAB6DBC06A2"
        ],
        "Label": "waited",
        "Title": "X-Trace Task",
        "Host": "pinky19.mpi-sws.org",
        "Duration": "547827",
        "HRT": 26966700813774392,
        "Operation": "waited",
        "Timestamp": "1557750340753.865967",
        "TenantClass": 0,
        "Source": "Client.java:1537",
        "ThreadID": 1,
        "ThreadName": "",
        "EventID": "1ADA99904D90BA28",
        "ProcessID": 2801
      },
      {
        "Cycles": 0,
        "Agent": "Execution-Sleep",
        "ProcessName": "Read",
        "TaskID": "7071FC3D99154D12",
        "ParentEventID": [
          "38DD81EC440F4738"
        ],
        "Label": "waited",
        "Title": "X-Trace Task",
        "Host": "pinky19.mpi-sws.org",
        "Duration": "4578",
        "HRT": 26966700813929693,
        "Operation": "waited",
        "Timestamp": "1557750340754.021240",
        "TenantClass": 0,
        "Source": "SocketIOWithTimeout.java:335",
        "ThreadID": 1,
        "ThreadName": "",
        "EventID": "75D3CDD10E740AFA",
        "ProcessID": 2801
      },
      {
        "Cycles": 0,
        "Agent": "edu.brown.cs.systems.xtrace.logging.BaggageWrappers",
        "ProcessName": "Read",
        "TaskID": "7071FC3D99154D12",
        "ParentEventID": [
          "75D3CDD10E740AFA"
        ],
        "Label": "Forking current baggage with Baggage.fork()",
        "Title": "X-Trace Task",
        "Host": "pinky19.mpi-sws.org",
        "HRT": 26966700813980736,
        "Operation": "fork",
        "Timestamp": "1557750340754.072266",
        "TenantClass": 0,
        "Source": "DataTransferProtoUtil.java:94",
        "ThreadID": 1,
        "ThreadName": "",
        "EventID": "DEF6EC7E109C6A4E",
        "ProcessID": 2801
      },
      {
        "Cycles": 0,
        "Agent": "edu.brown.cs.systems.xtrace.logging.XTraceInit",
        "ProcessName": "Data",
        "TaskID": "7071FC3D99154D12",
        "ParentEventID": [
          "A207C6358ABF49A2"
        ],
        "Label": "Thread.setName: DataXceiver for client DFSClient_NONMAPREDUCE_310321604_1 at /139.19.171.63:55074 [Sending block BP-1633380353-139.19.171.63-1554193446451:blk_1073763539_22715]",
        "Title": "X-Trace Task",
        "Host": "pinky19.mpi-sws.org",
        "HRT": 26966700814123642,
        "Timestamp": "1557750340754.225586",
        "TenantClass": 0,
        "Source": "DataXceiver.java:168",
        "ThreadID": 38081,
        "ThreadName": "",
        "EventID": "AD8F96A6778E8C2B",
        "BaggageBytes": "[[248 5] [240 0] [0 112 113 252 61 153 21 77 18] [240 1] [0 162 7 198 53 138 191 73 162] [240 3] [0 2]]",
        "ProcessID": 2319
      },
      {
        "Cycles": 0,
        "Agent": "Execution-CPU",
        "ProcessName": "Data",
        "TaskID": "7071FC3D99154D12",
        "ParentEventID": [
          "DEF6EC7E109C6A4E"
        ],
        "Label": "set",
        "Title": "X-Trace Task",
        "Host": "pinky19.mpi-sws.org",
        "HRT": 26966700814087685,
        "Operation": "set",
        "Timestamp": "1557750340754.189697",
        "TenantClass": 0,
        "Source": "Receiver.java:117",
        "ThreadID": 38081,
        "ThreadName": "",
        "EventID": "A207C6358ABF49A2",
        "BaggageBytes": "[[248 5] [240 0] [0 112 113 252 61 153 21 77 18] [240 1] [0 222 246 236 126 16 156 106 78] [240 3] [0 2]]",
        "ProcessID": 2319
      },
      {
        "Cycles": 0,
        "Agent": "edu.brown.cs.systems.xtrace.logging.BaggageWrappers",
        "ProcessName": "Data",
        "TaskID": "7071FC3D99154D12",
        "ParentEventID": [
          "AD8F96A6778E8C2B"
        ],
        "Label": "Forking current baggage with Baggage.fork()",
        "Title": "X-Trace Task",
        "Host": "pinky19.mpi-sws.org",
        "HRT": 26966700814207224,
        "Operation": "fork",
        "Timestamp": "1557750340754.309326",
        "TenantClass": 0,
        "Source": "DataXceiver.java:1257",
        "ThreadID": 38081,
        "ThreadName": "",
        "EventID": "C83A7E0F5327B2BF",
        "BaggageBytes": "[[248 5] [240 0] [0 112 113 252 61 153 21 77 18] [240 1] [0 173 143 150 166 119 142 140 43] [240 3] [0 2]]",
        "ProcessID": 2319
      },
      {
        "Cycles": 0,
        "Agent": "Execution-Sleep",
        "ProcessName": "Read",
        "TaskID": "7071FC3D99154D12",
        "ParentEventID": [
          "DEF6EC7E109C6A4E"
        ],
        "Label": "waited",
        "Title": "X-Trace Task",
        "Host": "pinky19.mpi-sws.org",
        "Duration": "200942",
        "HRT": 26966700814266651,
        "Operation": "waited",
        "Timestamp": "1557750340754.358398",
        "TenantClass": 0,
        "Source": "SocketIOWithTimeout.java:335",
        "ThreadID": 1,
        "ThreadName": "",
        "EventID": "CD0A996ED9FF21A1",
        "ProcessID": 2801
      },
      {
        "Cycles": 0,
        "Agent": "edu.brown.cs.systems.xtrace.logging.BaggageWrappers",
        "ProcessName": "Data",
        "TaskID": "7071FC3D99154D12",
        "ParentEventID": [
          "C83A7E0F5327B2BF"
        ],
        "Label": "Forking current baggage with Baggage.fork()",
        "Title": "X-Trace Task",
        "Host": "pinky19.mpi-sws.org",
        "HRT": 26966700814274898,
        "Operation": "fork",
        "Timestamp": "1557750340754.376953",
        "TenantClass": 0,
        "Source": "PacketHeader.java:95",
        "ThreadID": 38081,
        "ThreadName": "",
        "EventID": "50F9D86F007B9D23",
        "BaggageBytes": "[[248 5] [240 0] [0 112 113 252 61 153 21 77 18] [240 1] [0 200 58 126 15 83 39 178 191] [240 3] [0 2]]",
        "ProcessID": 2319
      },
      {
        "Cycles": 0,
        "Agent": "Execution-Sleep",
        "ProcessName": "Data",
        "TaskID": "7071FC3D99154D12",
        "ParentEventID": [
          "50F9D86F007B9D23"
        ],
        "Label": "waited",
        "Title": "X-Trace Task",
        "Host": "pinky19.mpi-sws.org",
        "Duration": "4394",
        "HRT": 26966700814342043,
        "Operation": "waited",
        "Timestamp": "1557750340754.444092",
        "TenantClass": 0,
        "Source": "SocketIOWithTimeout.java:335",
        "ThreadID": 38081,
        "ThreadName": "",
        "EventID": "474CB18094AB76A0",
        "BaggageBytes": "[[248 5] [240 0] [0 112 113 252 61 153 21 77 18] [240 1] [0 80 249 216 111 0 123 157 35] [240 3] [0 2]]",
        "ProcessID": 2319
      },
      {
        "Cycles": 0,
        "Agent": "edu.brown.cs.systems.xtrace.logging.BaggageWrappers",
        "ProcessName": "Read",
        "TaskID": "7071FC3D99154D12",
        "ParentEventID": [
          "C83A7E0F5327B2BF",
          "CD0A996ED9FF21A1"
        ],
        "Label": "Merged current baggage with other baggage",
        "Title": "X-Trace Task",
        "Host": "pinky19.mpi-sws.org",
        "HRT": 26966700814330825,
        "Operation": "join",
        "Timestamp": "1557750340754.422363",
        "TenantClass": 0,
        "Source": "RemoteBlockReader2.java:429",
        "ThreadID": 1,
        "ThreadName": "",
        "EventID": "55D1F70BF3835850",
        "ProcessID": 2801
      },
      {
        "Cycles": 0,
        "Agent": "Execution-Sleep",
        "ProcessName": "Read",
        "TaskID": "7071FC3D99154D12",
        "ParentEventID": [
          "55D1F70BF3835850"
        ],
        "Label": "waited",
        "Title": "X-Trace Task",
        "Host": "pinky19.mpi-sws.org",
        "Duration": "3530",
        "HRT": 26966700814407372,
        "Operation": "waited",
        "Timestamp": "1557750340754.499023",
        "TenantClass": 0,
        "Source": "SocketIOWithTimeout.java:335",
        "ThreadID": 1,
        "ThreadName": "",
        "EventID": "F2A43209A5D91A05",
        "ProcessID": 2801
      },
      {
        "Cycles": 0,
        "Agent": "edu.brown.cs.systems.xtrace.logging.BaggageWrappers",
        "ProcessName": "Data",
        "TaskID": "7071FC3D99154D12",
        "ParentEventID": [
          "474CB18094AB76A0"
        ],
        "Label": "Forking current baggage with Baggage.fork()",
        "Title": "X-Trace Task",
        "Host": "pinky19.mpi-sws.org",
        "HRT": 26966700814422647,
        "Operation": "fork",
        "Timestamp": "1557750340754.524658",
        "TenantClass": 0,
        "Source": "PacketHeader.java:95",
        "ThreadID": 38081,
        "ThreadName": "",
        "EventID": "807A1C9A201A09D9",
        "BaggageBytes": "[[248 5] [240 0] [0 112 113 252 61 153 21 77 18] [240 1] [0 71 76 177 128 148 171 118 160] [240 3] [0 2]]",
        "ProcessID": 2319
      },
      {
        "Cycles": 0,
        "Agent": "edu.brown.cs.systems.xtrace.logging.BaggageWrappers",
        "ProcessName": "Read",
        "TaskID": "7071FC3D99154D12",
        "ParentEventID": [
          "807A1C9A201A09D9",
          "9C410BCDD74C7846"
        ],
        "Label": "Merged current baggage with other baggage",
        "Title": "X-Trace Task",
        "Host": "pinky19.mpi-sws.org",
        "HRT": 26966700814568662,
        "Operation": "join",
        "Timestamp": "1557750340754.660400",
        "TenantClass": 0,
        "Source": "PacketHeader.java:168",
        "ThreadID": 1,
        "ThreadName": "",
        "EventID": "1741D4DB505A0F0E",
        "ProcessID": 2801
      },
      {
        "Cycles": 0,
        "Agent": "edu.brown.cs.systems.xtrace.logging.BaggageWrappers",
        "ProcessName": "Read",
        "TaskID": "7071FC3D99154D12",
        "ParentEventID": [
          "1741D4DB505A0F0E"
        ],
        "Label": "Forking current baggage with Baggage.fork()",
        "Title": "X-Trace Task",
        "Host": "pinky19.mpi-sws.org",
        "HRT": 26966700814577587,
        "Operation": "fork",
        "Timestamp": "1557750340754.669189",
        "TenantClass": 0,
        "Source": "RemoteBlockReader2.java:361",
        "ThreadID": 1,
        "ThreadName": "",
        "EventID": "5E740E5159535872",
        "ProcessID": 2801
      },
      {
        "Cycles": 0,
        "Agent": "edu.brown.cs.systems.xtrace.logging.BaggageWrappers",
        "ProcessName": "Read",
        "TaskID": "7071FC3D99154D12",
        "ParentEventID": [
          "50F9D86F007B9D23",
          "F2A43209A5D91A05"
        ],
        "Label": "Merged current baggage with other baggage",
        "Title": "X-Trace Task",
        "Host": "pinky19.mpi-sws.org",
        "HRT": 26966700814464036,
        "Operation": "join",
        "Timestamp": "1557750340754.555664",
        "TenantClass": 0,
        "Source": "PacketHeader.java:168",
        "ThreadID": 1,
        "ThreadName": "",
        "EventID": "9C410BCDD74C7846",
        "ProcessID": 2801
      },
      {
        "Cycles": 0,
        "Agent": "Execution-Sleep",
        "ProcessName": "Data",
        "TaskID": "7071FC3D99154D12",
        "ParentEventID": [
          "807A1C9A201A09D9"
        ],
        "Label": "waited",
        "Title": "X-Trace Task",
        "Host": "pinky19.mpi-sws.org",
        "Duration": "106919",
        "HRT": 26966700814617991,
        "Operation": "waited",
        "Timestamp": "1557750340754.719971",
        "TenantClass": 0,
        "Source": "SocketIOWithTimeout.java:335",
        "ThreadID": 38081,
        "ThreadName": "",
        "EventID": "6E69C793D29980DF",
        "BaggageBytes": "[[248 5] [240 0] [0 112 113 252 61 153 21 77 18] [240 1] [0 128 122 28 154 32 26 9 217] [240 3] [0 2]]",
        "ProcessID": 2319
      },
      {
        "Cycles": 0,
        "Agent": "edu.brown.cs.systems.xtrace.logging.BaggageWrappers",
        "ProcessName": "Read",
        "TaskID": "7071FC3D99154D12",
        "ParentEventID": [
          "5E740E5159535872"
        ],
        "Label": "Forking current baggage with Baggage.fork()",
        "Title": "X-Trace Task",
        "Host": "pinky19.mpi-sws.org",
        "HRT": 26966700814640024,
        "Operation": "fork",
        "Timestamp": "1557750340754.731689",
        "TenantClass": 0,
        "Source": "DataTransferProtoUtil.java:94",
        "ThreadID": 1,
        "ThreadName": "",
        "EventID": "52F0E1FE46756E9C",
        "ProcessID": 2801
      },
      {
        "Cycles": 0,
        "Agent": "edu.brown.cs.systems.xtrace.logging.BaggageWrappers",
        "ProcessName": "Data",
        "TaskID": "7071FC3D99154D12",
        "ParentEventID": [
          "6E69C793D29980DF",
          "5E740E5159535872"
        ],
        "Label": "Merged current baggage with other baggage",
        "Title": "X-Trace Task",
        "Host": "pinky19.mpi-sws.org",
        "HRT": 26966700814670653,
        "Operation": "join",
        "Timestamp": "1557750340754.772705",
        "TenantClass": 0,
        "Source": "DataXceiver.java:574",
        "ThreadID": 38081,
        "ThreadName": "",
        "EventID": "E91171B1155BEC45",
        "BaggageBytes": "[[248 5] [240 0] [0 112 113 252 61 153 21 77 18] [240 1] [0 94 116 14 81 89 83 88 114] [0 110 105 199 147 210 153 128 223] [240 3] [0 2]]",
        "ProcessID": 2319
      },
      {
        "Cycles": 0,
        "Agent": "Execution-CPU",
        "ProcessName": "Data",
        "TaskID": "7071FC3D99154D12",
        "ParentEventID": [
          "52F0E1FE46756E9C"
        ],
        "Label": "set",
        "Title": "X-Trace Task",
        "Host": "pinky19.mpi-sws.org",
        "HRT": 26966700814742897,
        "Operation": "set",
        "Timestamp": "1557750340754.844971",
        "TenantClass": 0,
        "Source": "Receiver.java:117",
        "ThreadID": 38081,
        "ThreadName": "",
        "EventID": "9D96CE1F23D59258",
        "BaggageBytes": "[[248 5] [240 0] [0 112 113 252 61 153 21 77 18] [240 1] [0 82 240 225 254 70 117 110 156] [240 3] [0 2]]",
        "ProcessID": 2319
      },
      {
        "Cycles": 0,
        "Agent": "Execution-CPU",
        "ProcessName": "Data",
        "TaskID": "7071FC3D99154D12",
        "ParentEventID": [
          "E91171B1155BEC45"
        ],
        "Label": "unset",
        "Title": "X-Trace Task",
        "Host": "pinky19.mpi-sws.org",
        "Duration": "580532",
        "HRT": 26966700814692224,
        "Operation": "unset",
        "Timestamp": "1557750340754.794189",
        "TenantClass": 0,
        "Source": "DataXceiver.java:261",
        "ThreadID": 38081,
        "ThreadName": "",
        "EventID": "693B9DA5336D9D4C",
        "BaggageBytes": "[[248 5] [240 0] [0 112 113 252 61 153 21 77 18] [240 1] [0 233 17 113 177 21 91 236 69] [240 3] [0 2]]",
        "ProcessID": 2319
      },
      {
        "Cycles": 0,
        "Agent": "edu.brown.cs.systems.xtrace.logging.XTraceInit",
        "ProcessName": "Data",
        "TaskID": "7071FC3D99154D12",
        "ParentEventID": [
          "9D96CE1F23D59258"
        ],
        "Label": "Thread.setName: DataXceiver for client DFSClient_NONMAPREDUCE_310321604_1 at /139.19.171.63:55074 [Sending block BP-1633380353-139.19.171.63-1554193446451:blk_1073763539_22715]",
        "Title": "X-Trace Task",
        "Host": "pinky19.mpi-sws.org",
        "HRT": 26966700814769671,
        "Timestamp": "1557750340754.871582",
        "TenantClass": 0,
        "Source": "DataXceiver.java:168",
        "ThreadID": 38081,
        "ThreadName": "",
        "EventID": "244EEE8C416ABA48",
        "BaggageBytes": "[[248 5] [240 0] [0 112 113 252 61 153 21 77 18] [240 1] [0 157 150 206 31 35 213 146 88] [240 3] [0 2]]",
        "ProcessID": 2319
      },
      {
        "Cycles": 0,
        "Agent": "Execution-Sleep",
        "ProcessName": "Read",
        "TaskID": "7071FC3D99154D12",
        "ParentEventID": [
          "52F0E1FE46756E9C"
        ],
        "Label": "waited",
        "Title": "X-Trace Task",
        "Host": "pinky19.mpi-sws.org",
        "Duration": "177960",
        "HRT": 26966700814886695,
        "Operation": "waited",
        "Timestamp": "1557750340754.978271",
        "TenantClass": 0,
        "Source": "SocketIOWithTimeout.java:335",
        "ThreadID": 1,
        "ThreadName": "",
        "EventID": "2E69F29E6D1E60A3",
        "ProcessID": 2801
      },
      {
        "Cycles": 0,
        "Agent": "edu.brown.cs.systems.xtrace.logging.BaggageWrappers",
        "ProcessName": "Data",
        "TaskID": "7071FC3D99154D12",
        "ParentEventID": [
          "244EEE8C416ABA48"
        ],
        "Label": "Forking current baggage with Baggage.fork()",
        "Title": "X-Trace Task",
        "Host": "pinky19.mpi-sws.org",
        "HRT": 26966700814831523,
        "Operation": "fork",
        "Timestamp": "1557750340754.933594",
        "TenantClass": 0,
        "Source": "DataXceiver.java:1257",
        "ThreadID": 38081,
        "ThreadName": "",
        "EventID": "AD6CC5F08919FA73",
        "BaggageBytes": "[[248 5] [240 0] [0 112 113 252 61 153 21 77 18] [240 1] [0 36 78 238 140 65 106 186 72] [240 3] [0 2]]",
        "ProcessID": 2319
      },
      {
        "Cycles": 0,
        "Agent": "edu.brown.cs.systems.xtrace.logging.BaggageWrappers",
        "ProcessName": "Data",
        "TaskID": "7071FC3D99154D12",
        "ParentEventID": [
          "AD6CC5F08919FA73"
        ],
        "Label": "Forking current baggage with Baggage.fork()",
        "Title": "X-Trace Task",
        "Host": "pinky19.mpi-sws.org",
        "HRT": 26966700814888291,
        "Operation": "fork",
        "Timestamp": "1557750340754.990234",
        "TenantClass": 0,
        "Source": "PacketHeader.java:95",
        "ThreadID": 38081,
        "ThreadName": "",
        "EventID": "3034880165E67C52",
        "BaggageBytes": "[[248 5] [240 0] [0 112 113 252 61 153 21 77 18] [240 1] [0 173 108 197 240 137 25 250 115] [240 3] [0 2]]",
        "ProcessID": 2319
      },
      {
        "Cycles": 0,
        "Agent": "Execution-Sleep",
        "ProcessName": "Data",
        "TaskID": "7071FC3D99154D12",
        "ParentEventID": [
          "3034880165E67C52"
        ],
        "Label": "waited",
        "Title": "X-Trace Task",
        "Host": "pinky19.mpi-sws.org",
        "Duration": "3856",
        "HRT": 26966700814945339,
        "Operation": "waited",
        "Timestamp": "1557750340755.047363",
        "TenantClass": 0,
        "Source": "SocketIOWithTimeout.java:335",
        "ThreadID": 38081,
        "ThreadName": "",
        "EventID": "EEB658E069FE231C",
        "BaggageBytes": "[[248 5] [240 0] [0 112 113 252 61 153 21 77 18] [240 1] [0 48 52 136 1 101 230 124 82] [240 3] [0 2]]",
        "ProcessID": 2319
      },
      {
        "Cycles": 0,
        "Agent": "edu.brown.cs.systems.xtrace.logging.BaggageWrappers",
        "ProcessName": "Read",
        "TaskID": "7071FC3D99154D12",
        "ParentEventID": [
          "AD6CC5F08919FA73",
          "2E69F29E6D1E60A3"
        ],
        "Label": "Merged current baggage with other baggage",
        "Title": "X-Trace Task",
        "Host": "pinky19.mpi-sws.org",
        "HRT": 26966700814945464,
        "Operation": "join",
        "Timestamp": "1557750340755.037109",
        "TenantClass": 0,
        "Source": "RemoteBlockReader2.java:429",
        "ThreadID": 1,
        "ThreadName": "",
        "EventID": "39294231DF296603",
        "ProcessID": 2801
      },
      {
        "Cycles": 0,
        "Agent": "edu.brown.cs.systems.xtrace.logging.BaggageWrappers",
        "ProcessName": "Data",
        "TaskID": "7071FC3D99154D12",
        "ParentEventID": [
          "EEB658E069FE231C"
        ],
        "Label": "Forking current baggage with Baggage.fork()",
        "Title": "X-Trace Task",
        "Host": "pinky19.mpi-sws.org",
        "HRT": 26966700815010228,
        "Operation": "fork",
        "Timestamp": "1557750340755.112305",
        "TenantClass": 0,
        "Source": "PacketHeader.java:95",
        "ThreadID": 38081,
        "ThreadName": "",
        "EventID": "D2B5F23B4E81F6E2",
        "BaggageBytes": "[[248 5] [240 0] [0 112 113 252 61 153 21 77 18] [240 1] [0 238 182 88 224 105 254 35 28] [240 3] [0 2]]",
        "ProcessID": 2319
      },
      {
        "Cycles": 0,
        "Agent": "edu.brown.cs.systems.xtrace.logging.BaggageWrappers",
        "ProcessName": "Read",
        "TaskID": "7071FC3D99154D12",
        "ParentEventID": [
          "39294231DF296603",
          "3034880165E67C52"
        ],
        "Label": "Merged current baggage with other baggage",
        "Title": "X-Trace Task",
        "Host": "pinky19.mpi-sws.org",
        "HRT": 26966700815031724,
        "Operation": "join",
        "Timestamp": "1557750340755.123291",
        "TenantClass": 0,
        "Source": "PacketHeader.java:168",
        "ThreadID": 1,
        "ThreadName": "",
        "EventID": "20C2229B72CED5CA",
        "ProcessID": 2801
      },
      {
        "Cycles": 0,
        "Agent": "Execution-Sleep",
        "ProcessName": "Data",
        "TaskID": "7071FC3D99154D12",
        "ParentEventID": [
          "D2B5F23B4E81F6E2"
        ],
        "Label": "waited",
        "Title": "X-Trace Task",
        "Host": "pinky19.mpi-sws.org",
        "Duration": "3322",
        "HRT": 26966700815063559,
        "Operation": "waited",
        "Timestamp": "1557750340755.165527",
        "TenantClass": 0,
        "Source": "SocketIOWithTimeout.java:335",
        "ThreadID": 38081,
        "ThreadName": "",
        "EventID": "48FC1C8EED9521EF",
        "BaggageBytes": "[[248 5] [240 0] [0 112 113 252 61 153 21 77 18] [240 1] [0 210 181 242 59 78 129 246 226] [240 3] [0 2]]",
        "ProcessID": 2319
      },
      {
        "Cycles": 0,
        "Agent": "Execution-CPU",
        "ProcessName": "Data",
        "TaskID": "7071FC3D99154D12",
        "ParentEventID": [
          "C1BA6DD902F49E75"
        ],
        "Label": "unset",
        "Title": "X-Trace Task",
        "Host": "pinky19.mpi-sws.org",
        "Duration": "488975",
        "HRT": 26966700815251063,
        "Operation": "unset",
        "Timestamp": "1557750340755.353027",
        "TenantClass": 0,
        "Source": "DataXceiver.java:261",
        "ThreadID": 38081,
        "ThreadName": "",
        "EventID": "D483470FF26235D1",
        "BaggageBytes": "[[248 5] [240 0] [0 112 113 252 61 153 21 77 18] [240 1] [0 193 186 109 217 2 244 158 117] [240 3] [0 2]]",
        "ProcessID": 2319
      },
      {
        "Cycles": 0,
        "Agent": "edu.brown.cs.systems.xtrace.logging.BaggageWrappers",
        "ProcessName": "Data",
        "TaskID": "7071FC3D99154D12",
        "ParentEventID": [
          "48FC1C8EED9521EF"
        ],
        "Label": "Forking current baggage with Baggage.fork()",
        "Title": "X-Trace Task",
        "Host": "pinky19.mpi-sws.org",
        "HRT": 26966700815135619,
        "Operation": "fork",
        "Timestamp": "1557750340755.237549",
        "TenantClass": 0,
        "Source": "PacketHeader.java:95",
        "ThreadID": 38081,
        "ThreadName": "",
        "EventID": "C1BA6DD902F49E75",
        "BaggageBytes": "[[248 5] [240 0] [0 112 113 252 61 153 21 77 18] [240 1] [0 72 252 28 142 237 149 33 239] [240 3] [0 2]]",
        "ProcessID": 2319
      },
      {
        "Cycles": 0,
        "Agent": "edu.brown.cs.systems.retro.benchmarks.hdfs_client.Reader",
        "ProcessName": "Read",
        "TaskID": "7071FC3D99154D12",
        "ParentEventID": [
          "0"
        ],
        "Label": "Reading file",
        "Title": "X-Trace Task",
        "Host": "pinky19.mpi-sws.org",
        "HRT": 26966700812914965,
        "Timestamp": "1557750340753.006592",
        "TenantClass": 0,
        "ThreadID": 1,
        "ThreadName": "",
        "EventID": "2C0F6E7DCE24D508",
        "ProcessID": 2801,
        "Tag": [
          "reader_100kb",
          "Read Size: 102400"
        ]
      }
    ]
  }
]