[
  {
    "id": "AD2E76A8AE7F3C2B",
    "reports": [
      {
        "Cycles": 0,
        "Agent": "Execution-CPU",
        "ProcessName": "Read",
        "TaskID": "AD2E76A8AE7F3C2B",
        "ParentEventID": [
          "266A6A42CEAD76B1"
        ],
        "Label": "unset",
        "Title": "X-Trace Task",
        "Host": "pinky19.mpi-sws.org",
        "Duration": "24411367",
        "HRT": 26962416668735696,
        "Operation": "unset",
        "Timestamp": "1557746056608.968506",
        "TenantClass": 0,
        "Source": "Client.java:1027",
        "ThreadID": 1,
        "ThreadName": "",
        "EventID": "9D446D776E29B4E4",
        "ProcessID": 36430
      },
      {
        "Cycles": 0,
        "Agent": "edu.brown.cs.systems.retro.benchmarks.hdfs_client.Reader",
        "ProcessName": "Read",
        "TaskID": "AD2E76A8AE7F3C2B",
        "ParentEventID": [
          "0"
        ],
        "Label": "Reading file",
        "Title": "X-Trace Task",
        "Host": "pinky19.mpi-sws.org",
        "HRT": 26962416668226995,
        "Timestamp": "1557746056608.459961",
        "TenantClass": 0,
        "ThreadID": 1,
        "ThreadName": "",
        "EventID": "EFA73D707B550C65",
        "ProcessID": 36430,
        "Tag": [
          "reader_10kb",
          "Read Size: 10240"
        ]
      },
      {
        "Cycles": 0,
        "Agent": "org.apache.hadoop.ipc.ProtobufRpcEngine",
        "ProcessName": "Read",
        "TaskID": "AD2E76A8AE7F3C2B",
        "ParentEventID": [
          "42DCE4C9E53A8BF4"
        ],
        "Label": "Invoking org.apache.hadoop.hdfs.protocol.ClientProtocol.getBlockLocations",
        "Title": "X-Trace Task",
        "Host": "pinky19.mpi-sws.org",
        "HRT": 26962416668610437,
        "Timestamp": "1557746056608.843262",
        "TenantClass": 0,
        "Source": "ProtobufRpcEngine.java:228",
        "ThreadID": 1,
        "ThreadName": "",
        "EventID": "266A6A42CEAD76B1",
        "ProcessID": 36430
      },
      {
        "Cycles": 0,
        "Agent": "Execution-CPU",
        "ProcessName": "Read",
        "TaskID": "AD2E76A8AE7F3C2B",
        "ParentEventID": [
          "9D446D776E29B4E4"
        ],
        "Label": "set",
        "Title": "X-Trace Task",
        "Host": "pinky19.mpi-sws.org",
        "HRT": 26962416668831682,
        "Operation": "set",
        "Timestamp": "1557746056609.064697",
        "TenantClass": 0,
        "Source": "Client.java:1032",
        "ThreadID": 41,
        "ThreadName": "",
        "EventID": "3C63307F316D479F",
        "ProcessID": 36430
      },
      {
        "Cycles": 0,
        "Agent": "Execution-CPU",
        "ProcessName": "Name",
        "TaskID": "AD2E76A8AE7F3C2B",
        "ParentEventID": [
          "4D2CF31F5ECBD902"
        ],
        "Label": "set",
        "Title": "X-Trace Task",
        "Host": "pinky19.mpi-sws.org",
        "HRT": 26962416669168888,
        "Operation": "set",
        "Timestamp": "1557746056609.410889",
        "TenantClass": 0,
        "Source": "Server.java:1840",
        "ThreadID": 48,
        "ThreadName": "",
        "EventID": "D36BEF44EF45E9E8",
        "BaggageBytes": "[[248 5] [240 0] [0 173 46 118 168 174 127 60 43] [240 1] [0 77 44 243 31 94 203 217 2] [240 3] [0 2]]",
        "ProcessID": 2171
      },
      {
        "Cycles": 0,
        "Agent": "edu.brown.cs.systems.xtrace.logging.BaggageWrappers",
        "ProcessName": "Read",
        "TaskID": "AD2E76A8AE7F3C2B",
        "ParentEventID": [
          "3C63307F316D479F"
        ],
        "Label": "Forking current baggage with Baggage.fork()",
        "Title": "X-Trace Task",
        "Host": "pinky19.mpi-sws.org",
        "HRT": 26962416668929819,
        "Operation": "fork",
        "Timestamp": "1557746056609.162842",
        "TenantClass": 0,
        "Source": "Client.java:1043",
        "ThreadID": 41,
        "ThreadName": "",
        "EventID": "4D2CF31F5ECBD902",
        "ProcessID": 36430
      },
      {
        "Cycles": 0,
        "Agent": "Execution-CPU",
        "ProcessName": "Read",
        "TaskID": "AD2E76A8AE7F3C2B",
        "ParentEventID": [
          "4D2CF31F5ECBD902"
        ],
        "Label": "unset",
        "Title": "X-Trace Task",
        "Host": "pinky19.mpi-sws.org",
        "Duration": "212708",
        "HRT": 26962416669135249,
        "Operation": "unset",
        "Timestamp": "1557746056609.368164",
        "TenantClass": 0,
        "Source": "Client.java:1062",
        "ThreadID": 41,
        "ThreadName": "",
        "EventID": "1B313AC4EFB34DBB",
        "ProcessID": 36430
      },
      {
        "Cycles": 0,
        "Agent": "Execution-CPU",
        "ProcessName": "Name",
        "TaskID": "AD2E76A8AE7F3C2B",
        "ParentEventID": [
          "910239F14A9174A0"
        ],
        "Label": "unset",
        "Title": "X-Trace Task",
        "Host": "pinky19.mpi-sws.org",
        "Duration": "24958",
        "HRT": 26962416669219767,
        "Operation": "unset",
        "Timestamp": "1557746056609.461670",
        "TenantClass": 0,
        "Source": "Server.java:1828",
        "ThreadID": 48,
        "ThreadName": "",
        "EventID": "2BD7F918858F8723",
        "BaggageBytes": "[[248 5] [240 0] [0 173 46 118 168 174 127 60 43] [240 1] [0 145 2 57 241 74 145 116 160] [240 3] [0 2]]",
        "ProcessID": 2171
      },
      {
        "Cycles": 0,
        "Agent": "Execution-CPU",
        "ProcessName": "Name",
        "TaskID": "AD2E76A8AE7F3C2B",
        "ParentEventID": [
          "910239F14A9174A0"
        ],
        "Label": "set",
        "Title": "X-Trace Task",
        "Host": "pinky19.mpi-sws.org",
        "HRT": 26962416669250749,
        "Operation": "set",
        "Timestamp": "1557746056609.492676",
        "TenantClass": 0,
        "Source": "Server.java:2071",
        "ThreadID": 57,
        "ThreadName": "",
        "EventID": "6CBF57576D21BCE1",
        "BaggageBytes": "[[248 5] [240 0] [0 173 46 118 168 174 127 60 43] [240 1] [0 145 2 57 241 74 145 116 160] [240 3] [0 2]]",
        "ProcessID": 2171
      },
      {
        "Cycles": 0,
        "Agent": "edu.brown.cs.systems.retro.benchmarks.hdfs_client.Reader",
        "ProcessName": "Read",
        "TaskID": "AD2E76A8AE7F3C2B",
        "ParentEventID": [
          "EFA73D707B550C65"
        ],
        "Label": "Reading file",
        "Title": "X-Trace Task",
        "Host": "pinky19.mpi-sws.org",
        "HRT": 26962416668325037,
        "Timestamp": "1557746056608.557861",
        "TenantClass": 0,
        "ThreadID": 1,
        "ThreadName": "",
        "EventID": "42DCE4C9E53A8BF4",
        "ProcessID": 36430
      },
      {
        "Cycles": 0,
        "Agent": "Execution-CPU",
        "ProcessName": "Read",
        "TaskID": "AD2E76A8AE7F3C2B",
        "ParentEventID": [
          "1B313AC4EFB34DBB"
        ],
        "Label": "set",
        "Title": "X-Trace Task",
        "Host": "pinky19.mpi-sws.org",
        "HRT": 26962416669221415,
        "Operation": "set",
        "Timestamp": "1557746056609.454346",
        "TenantClass": 0,
        "Source": "Client.java:1104",
        "ThreadID": 1,
        "ThreadName": "",
        "EventID": "20353C9999B6B783",
        "ProcessID": 36430
      },
      {
        "Cycles": 0,
        "Agent": "edu.brown.cs.systems.xtrace.logging.BaggageWrappers",
        "ProcessName": "Name",
        "TaskID": "AD2E76A8AE7F3C2B",
        "ParentEventID": [
          "D36BEF44EF45E9E8"
        ],
        "Label": "Forking current baggage with Baggage.fork()",
        "Title": "X-Trace Task",
        "Host": "pinky19.mpi-sws.org",
        "HRT": 26962416669198929,
        "Operation": "fork",
        "Timestamp": "1557746056609.440918",
        "TenantClass": 0,
        "Source": "Server.java:550",
        "ThreadID": 48,
        "ThreadName": "",
        "EventID": "910239F14A9174A0",
        "BaggageBytes": "[[248 5] [240 0] [0 173 46 118 168 174 127 60 43] [240 1] [0 211 107 239 68 239 69 233 232] [240 3] [0 2]]",
        "ProcessID": 2171
      },
      {
        "Cycles": 0,
        "Agent": "edu.brown.cs.systems.xtrace.logging.BaggageWrappers",
        "ProcessName": "Name",
        "TaskID": "AD2E76A8AE7F3C2B",
        "ParentEventID": [
          "51230A6AB12D643D"
        ],
        "Label": "Forking current baggage with Baggage.fork()",
        "Title": "X-Trace Task",
        "Host": "pinky19.mpi-sws.org",
        "HRT": 26962416669415058,
        "Operation": "fork",
        "Timestamp": "1557746056609.656982",
        "TenantClass": 0,
        "Source": "Server.java:2398",
        "ThreadID": 57,
        "ThreadName": "",
        "EventID": "4FF7E50A9D6CB8FD",
        "BaggageBytes": "[[248 5] [240 0] [0 173 46 118 168 174 127 60 43] [240 1] [0 81 35 10 106 177 45 100 61] [240 3] [0 2]]",
        "ProcessID": 2171
      },
      {
        "Cycles": 0,
        "Agent": "org.apache.hadoop.ipc.Server",
        "ProcessName": "Name",
        "TaskID": "AD2E76A8AE7F3C2B",
        "ParentEventID": [
          "6CBF57576D21BCE1"
        ],
        "Label": "getBlockLocations in org.apache.hadoop.hdfs.protocol.ClientProtocol",
        "Title": "X-Trace Task",
        "Host": "pinky19.mpi-sws.org",
        "HRT": 26962416669291627,
        "Timestamp": "1557746056609.533691",
        "TenantClass": 0,
        "Source": "ProtobufRpcEngine.java:601",
        "ThreadID": 57,
        "ThreadName": "",
        "EventID": "27044BDC5488FB25",
        "BaggageBytes": "[[248 5] [240 0] [0 173 46 118 168 174 127 60 43] [240 1] [0 108 191 87 87 109 33 188 225] [240 3] [0 2]]",
        "ProcessID": 2171
      },
      {
        "Cycles": 0,
        "Agent": "Execution-CPU",
        "ProcessName": "Name",
        "TaskID": "AD2E76A8AE7F3C2B",
        "ParentEventID": [
          "4FF7E50A9D6CB8FD"
        ],
        "Label": "unset",
        "Title": "X-Trace Task",
        "Host": "pinky19.mpi-sws.org",
        "Duration": "250025",
        "HRT": 26962416669528885,
        "Operation": "unset",
        "Timestamp": "1557746056609.770996",
        "TenantClass": 0,
        "Source": "Server.java:1058",
        "ThreadID": 57,
        "ThreadName": "",
        "EventID": "CA8FB951243BA073",
        "BaggageBytes": "[[248 5] [240 0] [0 173 46 118 168 174 127 60 43] [240 1] [0 79 247 229 10 157 108 184 253] [240 3] [0 2]]",
        "ProcessID": 2171
      },
      {
        "Cycles": 0,
        "Agent": "Execution-CPU",
        "ProcessName": "Read",
        "TaskID": "AD2E76A8AE7F3C2B",
        "ParentEventID": [
          "16BC1432FAE07468"
        ],
        "Label": "unset",
        "Title": "X-Trace Task",
        "Host": "pinky19.mpi-sws.org",
        "Duration": "58860",
        "HRT": 26962416669780016,
        "Operation": "unset",
        "Timestamp": "1557746056610.012939",
        "TenantClass": 0,
        "Source": "Client.java:1168",
        "ThreadID": 37,
        "ThreadName": "",
        "EventID": "8A3408A26B562D27",
        "ProcessID": 36430
      },
      {
        "Cycles": 0,
        "Agent": "Execution-CPU",
        "ProcessName": "Read",
        "TaskID": "AD2E76A8AE7F3C2B",
        "ParentEventID": [
          "4FF7E50A9D6CB8FD"
        ],
        "Label": "set",
        "Title": "X-Trace Task",
        "Host": "pinky19.mpi-sws.org",
        "HRT": 26962416669671783,
        "Operation": "set",
        "Timestamp": "1557746056609.904785",
        "TenantClass": 0,
        "Source": "Client.java:302",
        "ThreadID": 37,
        "ThreadName": "",
        "EventID": "16BC1432FAE07468",
        "ProcessID": 36430
      },
      {
        "Cycles": 0,
        "Agent": "Execution-Sleep",
        "ProcessName": "Read",
        "TaskID": "AD2E76A8AE7F3C2B",
        "ParentEventID": [
          "20353C9999B6B783"
        ],
        "Label": "waited",
        "Title": "X-Trace Task",
        "Host": "pinky19.mpi-sws.org",
        "Duration": "571327",
        "HRT": 26962416669848431,
        "Operation": "waited",
        "Timestamp": "1557746056610.081299",
        "TenantClass": 0,
        "Source": "Client.java:1537",
        "ThreadID": 1,
        "ThreadName": "",
        "EventID": "CC46AAF924A754DF",
        "ProcessID": 36430
      },
      {
        "Cycles": 0,
        "Agent": "org.apache.hadoop.hdfs.server.namenode.FSNamesystem.audit",
        "ProcessName": "Name",
        "TaskID": "AD2E76A8AE7F3C2B",
        "ParentEventID": [
          "27044BDC5488FB25"
        ],
        "Label": "allowed=true\tugi=plascas (auth:SIMPLE)\tip=/139.19.171.63\tcmd=open\tsrc=/ds/0UlphuqeU3dIKt84\tdst=null\tperm=null\tproto=rpc",
        "Title": "X-Trace Task",
        "Host": "pinky19.mpi-sws.org",
        "HRT": 26962416669351333,
        "Timestamp": "1557746056609.593262",
        "TenantClass": 0,
        "Source": "FSNamesystem.java:8313",
        "ThreadID": 57,
        "ThreadName": "",
        "EventID": "51230A6AB12D643D",
        "BaggageBytes": "[[248 5] [240 0] [0 173 46 118 168 174 127 60 43] [240 1] [0 39 4 75 220 84 136 251 37] [240 3] [0 2]]",
        "ProcessID": 2171
      },
      {
        "Cycles": 0,
        "Agent": "edu.brown.cs.systems.xtrace.logging.BaggageWrappers",
        "ProcessName": "Read",
        "TaskID": "AD2E76A8AE7F3C2B",
        "ParentEventID": [
          "CC46AAF924A754DF",
          "8A3408A26B562D27"
        ],
        "Label": "Merged current baggage with other baggage",
        "Title": "X-Trace Task",
        "Host": "pinky19.mpi-sws.org",
        "HRT": 26962416669942390,
        "Operation": "join",
        "Timestamp": "1557746056610.175293",
        "TenantClass": 0,
        "Source": "Client.java:1545",
        "ThreadID": 1,
        "ThreadName": "",
        "EventID": "EED264809078D6E2",
        "ProcessID": 36430
      },
      {
        "Cycles": 0,
        "Agent": "Execution-CPU",
        "ProcessName": "Data",
        "TaskID": "AD2E76A8AE7F3C2B",
        "ParentEventID": [
          "5DE83A0C0631BABF"
        ],
        "Label": "set",
        "Title": "X-Trace Task",
        "Host": "pinky20.mpi-sws.org",
        "HRT": 6565621029996653,
        "Operation": "set",
        "Timestamp": "1557746056611.376465",
        "TenantClass": 0,
        "Source": "Receiver.java:117",
        "ThreadID": 14317,
        "ThreadName": "",
        "EventID": "BC6C306E1C24080F",
        "BaggageBytes": "[[248 5] [240 0] [0 173 46 118 168 174 127 60 43] [240 1] [0 93 232 58 12 6 49 186 191] [240 3] [0 2]]",
        "ProcessID": 13111
      },
      {
        "Cycles": 0,
        "Agent": "edu.brown.cs.systems.xtrace.logging.XTraceInit",
        "ProcessName": "Data",
        "TaskID": "AD2E76A8AE7F3C2B",
        "ParentEventID": [
          "BC6C306E1C24080F"
        ],
        "Label": "Thread.setName: DataXceiver for client DFSClient_NONMAPREDUCE_778905418_1 at /139.19.171.63:39908 [Sending block BP-1633380353-139.19.171.63-1554193446451:blk_1073758299_17475]",
        "Title": "X-Trace Task",
        "Host": "pinky20.mpi-sws.org",
        "HRT": 6565621030101260,
        "Timestamp": "1557746056611.481201",
        "TenantClass": 0,
        "Source": "DataXceiver.java:168",
        "ThreadID": 14317,
        "ThreadName": "",
        "EventID": "9E3C92C7A46A2544",
        "BaggageBytes": "[[248 5] [240 0] [0 173 46 118 168 174 127 60 43] [240 1] [0 188 108 48 110 28 36 8 15] [240 3] [0 2]]",
        "ProcessID": 13111
      },
      {
        "Cycles": 0,
        "Agent": "org.apache.hadoop.ipc.ProtobufRpcEngine",
        "ProcessName": "Read",
        "TaskID": "AD2E76A8AE7F3C2B",
        "ParentEventID": [
          "EED264809078D6E2"
        ],
        "Label": "org.apache.hadoop.hdfs.protocol.ClientProtocol.getBlockLocations completed",
        "Title": "X-Trace Task",
        "Host": "pinky19.mpi-sws.org",
        "HRT": 26962416670132415,
        "Timestamp": "1557746056610.365234",
        "TenantClass": 0,
        "Source": "ProtobufRpcEngine.java:275",
        "ThreadID": 1,
        "ThreadName": "",
        "EventID": "6D9FE82B9A955377",
        "ProcessID": 36430
      },
      {
        "Cycles": 0,
        "Agent": "edu.brown.cs.systems.xtrace.logging.BaggageWrappers",
        "ProcessName": "Read",
        "TaskID": "AD2E76A8AE7F3C2B",
        "ParentEventID": [
          "6D9FE82B9A955377"
        ],
        "Label": "Forking current baggage with Baggage.fork()",
        "Title": "X-Trace Task",
        "Host": "pinky19.mpi-sws.org",
        "HRT": 26962416670510180,
        "Operation": "fork",
        "Timestamp": "1557746056610.743164",
        "TenantClass": 0,
        "Source": "DataTransferProtoUtil.java:94",
        "ThreadID": 1,
        "ThreadName": "",
        "EventID": "5DE83A0C0631BABF",
        "ProcessID": 36430
      },
      {
        "Cycles": 0,
        "Agent": "edu.brown.cs.systems.xtrace.logging.BaggageWrappers",
        "ProcessName": "Data",
        "TaskID": "AD2E76A8AE7F3C2B",
        "ParentEventID": [
          "9E3C92C7A46A2544"
        ],
        "Label": "Forking current baggage with Baggage.fork()",
        "Title": "X-Trace Task",
        "Host": "pinky20.mpi-sws.org",
        "HRT": 6565621040887893,
        "Operation": "fork",
        "Timestamp": "1557746056622.267822",
        "TenantClass": 0,
        "Source": "DataXceiver.java:1257",
        "ThreadID": 14317,
        "ThreadName": "",
        "EventID": "55ED9AB19698011B",
        "BaggageBytes": "[[248 5] [240 0] [0 173 46 118 168 174 127 60 43] [240 1] [0 158 60 146 199 164 106 37 68] [240 3] [0 2]]",
        "ProcessID": 13111
      },
      {
        "Cycles": 0,
        "Agent": "Execution-Sleep",
        "ProcessName": "Data",
        "TaskID": "AD2E76A8AE7F3C2B",
        "ParentEventID": [
          "F09317CB39C358E7"
        ],
        "Label": "waited",
        "Title": "X-Trace Task",
        "Host": "pinky20.mpi-sws.org",
        "Duration": "4796",
        "HRT": 6565621041026404,
        "Operation": "waited",
        "Timestamp": "1557746056622.406250",
        "TenantClass": 0,
        "Source": "SocketIOWithTimeout.java:335",
        "ThreadID": 14317,
        "ThreadName": "",
        "EventID": "A682CB36A5B0AE08",
        "BaggageBytes": "[[248 5] [240 0] [0 173 46 118 168 174 127 60 43] [240 1] [0 240 147 23 203 57 195 88 231] [240 3] [0 2]]",
        "ProcessID": 13111
      },
      {
        "Cycles": 0,
        "Agent": "edu.brown.cs.systems.xtrace.logging.BaggageWrappers",
        "ProcessName": "Data",
        "TaskID": "AD2E76A8AE7F3C2B",
        "ParentEventID": [
          "55ED9AB19698011B"
        ],
        "Label": "Forking current baggage with Baggage.fork()",
        "Title": "X-Trace Task",
        "Host": "pinky20.mpi-sws.org",
        "HRT": 6565621040962945,
        "Operation": "fork",
        "Timestamp": "1557746056622.342773",
        "TenantClass": 0,
        "Source": "PacketHeader.java:95",
        "ThreadID": 14317,
        "ThreadName": "",
        "EventID": "F09317CB39C358E7",
        "BaggageBytes": "[[248 5] [240 0] [0 173 46 118 168 174 127 60 43] [240 1] [0 85 237 154 177 150 152 1 27] [240 3] [0 2]]",
        "ProcessID": 13111
      },
      {
        "Cycles": 0,
        "Agent": "edu.brown.cs.systems.xtrace.logging.BaggageWrappers",
        "ProcessName": "Data",
        "TaskID": "AD2E76A8AE7F3C2B",
        "ParentEventID": [
          "A682CB36A5B0AE08"
        ],
        "Label": "Forking current baggage with Baggage.fork()",
        "Title": "X-Trace Task",
        "Host": "pinky20.mpi-sws.org",
        "HRT": 6565621041095058,
        "Operation": "fork",
        "Timestamp": "1557746056622.474854",
        "TenantClass": 0,
        "Source": "PacketHeader.java:95",
        "ThreadID": 14317,
        "ThreadName": "",
        "EventID": "924346200BC31275",
        "BaggageBytes": "[[248 5] [240 0] [0 173 46 118 168 174 127 60 43] [240 1] [0 166 130 203 54 165 176 174 8] [240 3] [0 2]]",
        "ProcessID": 13111
      },
      {
        "Cycles": 0,
        "Agent": "Execution-Sleep",
        "ProcessName": "Read",
        "TaskID": "AD2E76A8AE7F3C2B",
        "ParentEventID": [
          "5DE83A0C0631BABF"
        ],
        "Label": "waited",
        "Title": "X-Trace Task",
        "Host": "pinky19.mpi-sws.org",
        "Duration": "11366095",
        "HRT": 26962416682170227,
        "Operation": "waited",
        "Timestamp": "1557746056622.403076",
        "TenantClass": 0,
        "Source": "SocketIOWithTimeout.java:335",
        "ThreadID": 1,
        "ThreadName": "",
        "EventID": "6C2470D99FB9CD26",
        "ProcessID": 36430
      },
      {
        "Cycles": 0,
        "Agent": "edu.brown.cs.systems.xtrace.logging.BaggageWrappers",
        "ProcessName": "Read",
        "TaskID": "AD2E76A8AE7F3C2B",
        "ParentEventID": [
          "55ED9AB19698011B",
          "6C2470D99FB9CD26"
        ],
        "Label": "Merged current baggage with other baggage",
        "Title": "X-Trace Task",
        "Host": "pinky19.mpi-sws.org",
        "HRT": 26962416682480117,
        "Operation": "join",
        "Timestamp": "1557746056622.713135",
        "TenantClass": 0,
        "Source": "RemoteBlockReader2.java:429",
        "ThreadID": 1,
        "ThreadName": "",
        "EventID": "403F48CE98B11B01",
        "ProcessID": 36430
      },
      {
        "Cycles": 0,
        "Agent": "edu.brown.cs.systems.xtrace.logging.BaggageWrappers",
        "ProcessName": "Read",
        "TaskID": "AD2E76A8AE7F3C2B",
        "ParentEventID": [
          "403F48CE98B11B01",
          "F09317CB39C358E7"
        ],
        "Label": "Merged current baggage with other baggage",
        "Title": "X-Trace Task",
        "Host": "pinky19.mpi-sws.org",
        "HRT": 26962416682760600,
        "Operation": "join",
        "Timestamp": "1557746056622.993408",
        "TenantClass": 0,
        "Source": "PacketHeader.java:168",
        "ThreadID": 1,
        "ThreadName": "",
        "EventID": "F5F2E45D19541947",
        "ProcessID": 36430
      },
      {
        "Cycles": 0,
        "Agent": "edu.brown.cs.systems.xtrace.logging.BaggageWrappers",
        "ProcessName": "Read",
        "TaskID": "AD2E76A8AE7F3C2B",
        "ParentEventID": [
          "2BEFFE88DC34D78B"
        ],
        "Label": "Forking current baggage with Baggage.fork()",
        "Title": "X-Trace Task",
        "Host": "pinky19.mpi-sws.org",
        "HRT": 26962416683032971,
        "Operation": "fork",
        "Timestamp": "1557746056623.265869",
        "TenantClass": 0,
        "Source": "RemoteBlockReader2.java:361",
        "ThreadID": 1,
        "ThreadName": "",
        "EventID": "6BF52BF3E2B9639D",
        "ProcessID": 36430
      },
      {
        "Cycles": 0,
        "Agent": "edu.brown.cs.systems.xtrace.logging.BaggageWrappers",
        "ProcessName": "Read",
        "TaskID": "AD2E76A8AE7F3C2B",
        "ParentEventID": [
          "924346200BC31275",
          "F5F2E45D19541947"
        ],
        "Label": "Merged current baggage with other baggage",
        "Title": "X-Trace Task",
        "Host": "pinky19.mpi-sws.org",
        "HRT": 26962416682990016,
        "Operation": "join",
        "Timestamp": "1557746056623.222900",
        "TenantClass": 0,
        "Source": "PacketHeader.java:168",
        "ThreadID": 1,
        "ThreadName": "",
        "EventID": "2BEFFE88DC34D78B",
        "ProcessID": 36430
      },
      {
        "Cycles": 0,
        "Agent": "Execution-Sleep",
        "ProcessName": "Data",
        "TaskID": "AD2E76A8AE7F3C2B",
        "ParentEventID": [
          "924346200BC31275"
        ],
        "Label": "waited",
        "Title": "X-Trace Task",
        "Host": "pinky20.mpi-sws.org",
        "Duration": "1078197",
        "HRT": 6565621042260661,
        "Operation": "waited",
        "Timestamp": "1557746056623.640381",
        "TenantClass": 0,
        "Source": "SocketIOWithTimeout.java:335",
        "ThreadID": 14317,
        "ThreadName": "",
        "EventID": "EDF232B99760342A",
        "BaggageBytes": "[[248 5] [240 0] [0 173 46 118 168 174 127 60 43] [240 1] [0 146 67 70 32 11 195 18 117] [240 3] [0 2]]",
        "ProcessID": 13111
      },
      {
        "Cycles": 0,
        "Agent": "edu.brown.cs.systems.xtrace.logging.BaggageWrappers",
        "ProcessName": "Data",
        "TaskID": "AD2E76A8AE7F3C2B",
        "ParentEventID": [
          "EDF232B99760342A",
          "6BF52BF3E2B9639D"
        ],
        "Label": "Merged current baggage with other baggage",
        "Title": "X-Trace Task",
        "Host": "pinky20.mpi-sws.org",
        "HRT": 6565621042331391,
        "Operation": "join",
        "Timestamp": "1557746056623.711182",
        "TenantClass": 0,
        "Source": "DataXceiver.java:574",
        "ThreadID": 14317,
        "ThreadName": "",
        "EventID": "C62E562E345779D0",
        "BaggageBytes": "[[248 5] [240 0] [0 173 46 118 168 174 127 60 43] [240 1] [0 237 242 50 185 151 96 52 42] [0 107 245 43 243 226 185 99 157] [240 3] [0 2]]",
        "ProcessID": 13111
      },
      {
        "Cycles": 0,
        "Agent": "Execution-CPU",
        "ProcessName": "Data",
        "TaskID": "AD2E76A8AE7F3C2B",
        "ParentEventID": [
          "C62E562E345779D0"
        ],
        "Label": "unset",
        "Title": "X-Trace Task",
        "Host": "pinky20.mpi-sws.org",
        "Duration": "12285904",
        "HRT": 6565621042358022,
        "Operation": "unset",
        "Timestamp": "1557746056623.737793",
        "TenantClass": 0,
        "Source": "DataXceiver.java:261",
        "ThreadID": 14317,
        "ThreadName": "",
        "EventID": "30A1840E8317401E",
        "BaggageBytes": "[[248 5] [240 0] [0 173 46 118 168 174 127 60 43] [240 1] [0 198 46 86 46 52 87 121 208] [240 3] [0 2]]",
        "ProcessID": 13111
      }
    ]
  }
]