[
  {
    "id": "A41FE6A0EA5670E6",
    "reports": [
      {
        "Cycles": 0,
        "Agent": "Execution-CPU",
        "ProcessName": "Read",
        "TaskID": "A41FE6A0EA5670E6",
        "ParentEventID": [
          "046F4AA0F9FD9276"
        ],
        "Label": "unset",
        "Title": "X-Trace Task",
        "Host": "pinky19.mpi-sws.org",
        "Duration": "22452019",
        "HRT": 25491816088649533,
        "Operation": "unset",
        "Timestamp": "1556275456028.738037",
        "TenantClass": 0,
        "Source": "Client.java:1027",
        "ThreadID": 1,
        "ThreadName": "",
        "EventID": "B95426CB3B6D352F",
        "ProcessID": 21035
      },
      {
        "Cycles": 0,
        "Agent": "edu.brown.cs.systems.retro.benchmarks.hdfs_client.Reader",
        "ProcessName": "Read",
        "TaskID": "A41FE6A0EA5670E6",
        "ParentEventID": [
          "7BA6897E434277CC"
        ],
        "Label": "Reading file",
        "Title": "X-Trace Task",
        "Host": "pinky19.mpi-sws.org",
        "HRT": 25491816088557646,
        "Timestamp": "1556275456028.646240",
        "TenantClass": 0,
        "ThreadID": 1,
        "ThreadName": "",
        "EventID": "CD50CCE7A9D94506",
        "ProcessID": 21035
      },
      {
        "Cycles": 0,
        "Agent": "org.apache.hadoop.ipc.ProtobufRpcEngine",
        "ProcessName": "Read",
        "TaskID": "A41FE6A0EA5670E6",
        "ParentEventID": [
          "CD50CCE7A9D94506"
        ],
        "Label": "Invoking org.apache.hadoop.hdfs.protocol.ClientProtocol.getBlockLocations",
        "Title": "X-Trace Task",
        "Host": "pinky19.mpi-sws.org",
        "HRT": 25491816088616790,
        "Timestamp": "1556275456028.705322",
        "TenantClass": 0,
        "Source": "ProtobufRpcEngine.java:228",
        "ThreadID": 1,
        "ThreadName": "",
        "EventID": "046F4AA0F9FD9276",
        "ProcessID": 21035
      },
      {
        "Cycles": 0,
        "Agent": "Execution-CPU",
        "ProcessName": "Read",
        "TaskID": "A41FE6A0EA5670E6",
        "ParentEventID": [
          "B95426CB3B6D352F"
        ],
        "Label": "set",
        "Title": "X-Trace Task",
        "Host": "pinky19.mpi-sws.org",
        "HRT": 25491816088682022,
        "Operation": "set",
        "Timestamp": "1556275456028.770752",
        "TenantClass": 0,
        "Source": "Client.java:1032",
        "ThreadID": 41,
        "ThreadName": "",
        "EventID": "62506150735B7A25",
        "ProcessID": 21035
      },
      {
        "Cycles": 0,
        "Agent": "edu.brown.cs.systems.xtrace.logging.BaggageWrappers",
        "ProcessName": "Read",
        "TaskID": "A41FE6A0EA5670E6",
        "ParentEventID": [
          "62506150735B7A25"
        ],
        "Label": "Forking current baggage with Baggage.fork()",
        "Title": "X-Trace Task",
        "Host": "pinky19.mpi-sws.org",
        "HRT": 25491816088714233,
        "Operation": "fork",
        "Timestamp": "1556275456028.802734",
        "TenantClass": 0,
        "Source": "Client.java:1043",
        "ThreadID": 41,
        "ThreadName": "",
        "EventID": "8B84A35E0E6C3553",
        "ProcessID": 21035
      },
      {
        "Cycles": 0,
        "Agent": "Execution-CPU",
        "ProcessName": "Read",
        "TaskID": "A41FE6A0EA5670E6",
        "ParentEventID": [
          "D2A7F3391E30418B"
        ],
        "Label": "set",
        "Title": "X-Trace Task",
        "Host": "pinky19.mpi-sws.org",
        "HRT": 25491816088825734,
        "Operation": "set",
        "Timestamp": "1556275456028.914307",
        "TenantClass": 0,
        "Source": "Client.java:1104",
        "ThreadID": 1,
        "ThreadName": "",
        "EventID": "190A0329ED004C8D",
        "ProcessID": 21035
      },
      {
        "Cycles": 0,
        "Agent": "Execution-CPU",
        "ProcessName": "Read",
        "TaskID": "A41FE6A0EA5670E6",
        "ParentEventID": [
          "8B84A35E0E6C3553"
        ],
        "Label": "unset",
        "Title": "X-Trace Task",
        "Host": "pinky19.mpi-sws.org",
        "Duration": "89396",
        "HRT": 25491816088802560,
        "Operation": "unset",
        "Timestamp": "1556275456028.891113",
        "TenantClass": 0,
        "Source": "Client.java:1062",
        "ThreadID": 41,
        "ThreadName": "",
        "EventID": "D2A7F3391E30418B",
        "ProcessID": 21035
      },
      {
        "Cycles": 0,
        "Agent": "Execution-CPU",
        "ProcessName": "Name",
        "TaskID": "A41FE6A0EA5670E6",
        "ParentEventID": [
          "8B84A35E0E6C3553"
        ],
        "Label": "set",
        "Title": "X-Trace Task",
        "Host": "pinky19.mpi-sws.org",
        "HRT": 25491816088855597,
        "Operation": "set",
        "Timestamp": "1556275456028.949707",
        "TenantClass": 0,
        "Source": "Server.java:1840",
        "ThreadID": 48,
        "ThreadName": "",
        "EventID": "3D5A3E582DA7D36E",
        "BaggageBytes": "[[248 5] [240 0] [0 164 31 230 160 234 86 112 230] [240 1] [0 139 132 163 94 14 108 53 83] [240 3] [0 2]]",
        "ProcessID": 2171
      },
      {
        "Cycles": 0,
        "Agent": "edu.brown.cs.systems.xtrace.logging.BaggageWrappers",
        "ProcessName": "Name",
        "TaskID": "A41FE6A0EA5670E6",
        "ParentEventID": [
          "3D5A3E582DA7D36E"
        ],
        "Label": "Forking current baggage with Baggage.fork()",
        "Title": "X-Trace Task",
        "Host": "pinky19.mpi-sws.org",
        "HRT": 25491816088885820,
        "Operation": "fork",
        "Timestamp": "1556275456028.979980",
        "TenantClass": 0,
        "Source": "Server.java:550",
        "ThreadID": 48,
        "ThreadName": "",
        "EventID": "E9B6D4F9CD2F2262",
        "BaggageBytes": "[[248 5] [240 0] [0 164 31 230 160 234 86 112 230] [240 1] [0 61 90 62 88 45 167 211 110] [240 3] [0 2]]",
        "ProcessID": 2171
      },
      {
        "Cycles": 0,
        "Agent": "Execution-CPU",
        "ProcessName": "Name",
        "TaskID": "A41FE6A0EA5670E6",
        "ParentEventID": [
          "E9B6D4F9CD2F2262"
        ],
        "Label": "set",
        "Title": "X-Trace Task",
        "Host": "pinky19.mpi-sws.org",
        "HRT": 25491816088918434,
        "Operation": "set",
        "Timestamp": "1556275456029.012695",
        "TenantClass": 0,
        "Source": "Server.java:2071",
        "ThreadID": 64,
        "ThreadName": "",
        "EventID": "98CC1C0EB8897383",
        "BaggageBytes": "[[248 5] [240 0] [0 164 31 230 160 234 86 112 230] [240 1] [0 233 182 212 249 205 47 34 98] [240 3] [0 2]]",
        "ProcessID": 2171
      },
      {
        "Cycles": 0,
        "Agent": "Execution-CPU",
        "ProcessName": "Name",
        "TaskID": "A41FE6A0EA5670E6",
        "ParentEventID": [
          "E9B6D4F9CD2F2262"
        ],
        "Label": "unset",
        "Title": "X-Trace Task",
        "Host": "pinky19.mpi-sws.org",
        "Duration": "25769",
        "HRT": 25491816088908143,
        "Operation": "unset",
        "Timestamp": "1556275456029.002441",
        "TenantClass": 0,
        "Source": "Server.java:1828",
        "ThreadID": 48,
        "ThreadName": "",
        "EventID": "1FA8F8DDC5E8BAE9",
        "BaggageBytes": "[[248 5] [240 0] [0 164 31 230 160 234 86 112 230] [240 1] [0 233 182 212 249 205 47 34 98] [240 3] [0 2]]",
        "ProcessID": 2171
      },
      {
        "Cycles": 0,
        "Agent": "org.apache.hadoop.hdfs.server.namenode.FSNamesystem.audit",
        "ProcessName": "Name",
        "TaskID": "A41FE6A0EA5670E6",
        "ParentEventID": [
          "09AA572059FB8172"
        ],
        "Label": "allowed=true\tugi=plascas (auth:SIMPLE)\tip=/139.19.171.63\tcmd=open\tsrc=/ds/MX30qzvhCqMhAEI5\tdst=null\tperm=null\tproto=rpc",
        "Title": "X-Trace Task",
        "Host": "pinky19.mpi-sws.org",
        "HRT": 25491816089001124,
        "Timestamp": "1556275456029.095215",
        "TenantClass": 0,
        "Source": "FSNamesystem.java:8313",
        "ThreadID": 64,
        "ThreadName": "",
        "EventID": "36AAF2CD187BFB6E",
        "BaggageBytes": "[[248 5] [240 0] [0 164 31 230 160 234 86 112 230] [240 1] [0 9 170 87 32 89 251 129 114] [240 3] [0 2]]",
        "ProcessID": 2171
      },
      {
        "Cycles": 0,
        "Agent": "org.apache.hadoop.ipc.Server",
        "ProcessName": "Name",
        "TaskID": "A41FE6A0EA5670E6",
        "ParentEventID": [
          "98CC1C0EB8897383"
        ],
        "Label": "getBlockLocations in org.apache.hadoop.hdfs.protocol.ClientProtocol",
        "Title": "X-Trace Task",
        "Host": "pinky19.mpi-sws.org",
        "HRT": 25491816088952518,
        "Timestamp": "1556275456029.046631",
        "TenantClass": 0,
        "Source": "ProtobufRpcEngine.java:601",
        "ThreadID": 64,
        "ThreadName": "",
        "EventID": "09AA572059FB8172",
        "BaggageBytes": "[[248 5] [240 0] [0 164 31 230 160 234 86 112 230] [240 1] [0 152 204 28 14 184 137 115 131] [240 3] [0 2]]",
        "ProcessID": 2171
      },
      {
        "Cycles": 0,
        "Agent": "edu.brown.cs.systems.xtrace.logging.BaggageWrappers",
        "ProcessName": "Name",
        "TaskID": "A41FE6A0EA5670E6",
        "ParentEventID": [
          "36AAF2CD187BFB6E"
        ],
        "Label": "Forking current baggage with Baggage.fork()",
        "Title": "X-Trace Task",
        "Host": "pinky19.mpi-sws.org",
        "HRT": 25491816089045369,
        "Operation": "fork",
        "Timestamp": "1556275456029.139648",
        "TenantClass": 0,
        "Source": "Server.java:2398",
        "ThreadID": 64,
        "ThreadName": "",
        "EventID": "B3A516B6C2FC9E05",
        "BaggageBytes": "[[248 5] [240 0] [0 164 31 230 160 234 86 112 230] [240 1] [0 54 170 242 205 24 123 251 110] [240 3] [0 2]]",
        "ProcessID": 2171
      },
      {
        "Cycles": 0,
        "Agent": "Execution-CPU",
        "ProcessName": "Read",
        "TaskID": "A41FE6A0EA5670E6",
        "ParentEventID": [
          "B3A516B6C2FC9E05"
        ],
        "Label": "set",
        "Title": "X-Trace Task",
        "Host": "pinky19.mpi-sws.org",
        "HRT": 25491816089197956,
        "Operation": "set",
        "Timestamp": "1556275456029.286621",
        "TenantClass": 0,
        "Source": "Client.java:302",
        "ThreadID": 37,
        "ThreadName": "",
        "EventID": "6276C466285F4A1E",
        "ProcessID": 21035
      },
      {
        "Cycles": 0,
        "Agent": "Execution-CPU",
        "ProcessName": "Name",
        "TaskID": "A41FE6A0EA5670E6",
        "ParentEventID": [
          "B3A516B6C2FC9E05"
        ],
        "Label": "unset",
        "Title": "X-Trace Task",
        "Host": "pinky19.mpi-sws.org",
        "Duration": "207748",
        "HRT": 25491816089148263,
        "Operation": "unset",
        "Timestamp": "1556275456029.242432",
        "TenantClass": 0,
        "Source": "Server.java:1058",
        "ThreadID": 64,
        "ThreadName": "",
        "EventID": "8798A9576AF4EEA0",
        "BaggageBytes": "[[248 5] [240 0] [0 164 31 230 160 234 86 112 230] [240 1] [0 179 165 22 182 194 252 158 5] [240 3] [0 2]]",
        "ProcessID": 2171
      },
      {
        "Cycles": 0,
        "Agent": "Execution-CPU",
        "ProcessName": "Read",
        "TaskID": "A41FE6A0EA5670E6",
        "ParentEventID": [
          "6276C466285F4A1E"
        ],
        "Label": "unset",
        "Title": "X-Trace Task",
        "Host": "pinky19.mpi-sws.org",
        "Duration": "12277",
        "HRT": 25491816089226088,
        "Operation": "unset",
        "Timestamp": "1556275456029.314697",
        "TenantClass": 0,
        "Source": "Client.java:1168",
        "ThreadID": 37,
        "ThreadName": "",
        "EventID": "FA86950D3B669A2E",
        "ProcessID": 21035
      },
      {
        "Cycles": 0,
        "Agent": "edu.brown.cs.systems.xtrace.logging.BaggageWrappers",
        "ProcessName": "Read",
        "TaskID": "A41FE6A0EA5670E6",
        "ParentEventID": [
          "1AE958C0070B2151",
          "FA86950D3B669A2E"
        ],
        "Label": "Merged current baggage with other baggage",
        "Title": "X-Trace Task",
        "Host": "pinky19.mpi-sws.org",
        "HRT": 25491816089262091,
        "Operation": "join",
        "Timestamp": "1556275456029.350830",
        "TenantClass": 0,
        "Source": "Client.java:1545",
        "ThreadID": 1,
        "ThreadName": "",
        "EventID": "8D251D5E35B51815",
        "ProcessID": 21035
      },
      {
        "Cycles": 0,
        "Agent": "org.apache.hadoop.ipc.ProtobufRpcEngine",
        "ProcessName": "Read",
        "TaskID": "A41FE6A0EA5670E6",
        "ParentEventID": [
          "8D251D5E35B51815"
        ],
        "Label": "org.apache.hadoop.hdfs.protocol.ClientProtocol.getBlockLocations completed",
        "Title": "X-Trace Task",
        "Host": "pinky19.mpi-sws.org",
        "HRT": 25491816089308484,
        "Timestamp": "1556275456029.397217",
        "TenantClass": 0,
        "Source": "ProtobufRpcEngine.java:275",
        "ThreadID": 1,
        "ThreadName": "",
        "EventID": "F89329D975C97D04",
        "ProcessID": 21035
      },
      {
        "Cycles": 0,
        "Agent": "Execution-Sleep",
        "ProcessName": "Read",
        "TaskID": "A41FE6A0EA5670E6",
        "ParentEventID": [
          "190A0329ED004C8D"
        ],
        "Label": "waited",
        "Title": "X-Trace Task",
        "Host": "pinky19.mpi-sws.org",
        "Duration": "410939",
        "HRT": 25491816089247773,
        "Operation": "waited",
        "Timestamp": "1556275456029.336426",
        "TenantClass": 0,
        "Source": "Client.java:1537",
        "ThreadID": 1,
        "ThreadName": "",
        "EventID": "1AE958C0070B2151",
        "ProcessID": 21035
      },
      {
        "Cycles": 0,
        "Agent": "edu.brown.cs.systems.xtrace.logging.BaggageWrappers",
        "ProcessName": "Read",
        "TaskID": "A41FE6A0EA5670E6",
        "ParentEventID": [
          "F89329D975C97D04"
        ],
        "Label": "Forking current baggage with Baggage.fork()",
        "Title": "X-Trace Task",
        "Host": "pinky19.mpi-sws.org",
        "HRT": 25491816089413258,
        "Operation": "fork",
        "Timestamp": "1556275456029.501953",
        "TenantClass": 0,
        "Source": "DataTransferProtoUtil.java:94",
        "ThreadID": 1,
        "ThreadName": "",
        "EventID": "A37B8B53DF89AE44",
        "ProcessID": 21035
      },
      {
        "Cycles": 0,
        "Agent": "Execution-CPU",
        "ProcessName": "Data",
        "TaskID": "A41FE6A0EA5670E6",
        "ParentEventID": [
          "A37B8B53DF89AE44"
        ],
        "Label": "set",
        "Title": "X-Trace Task",
        "Host": "pinky27.mpi-sws.org",
        "HRT": 14091091135945147,
        "Operation": "set",
        "Timestamp": "1556275456029.750000",
        "TenantClass": 0,
        "Source": "Receiver.java:117",
        "ThreadID": 6493,
        "ThreadName": "",
        "EventID": "A80C143C111551E1",
        "BaggageBytes": "[[248 5] [240 0] [0 164 31 230 160 234 86 112 230] [240 1] [0 163 123 139 83 223 137 174 68] [240 3] [0 2]]",
        "ProcessID": 31438
      },
      {
        "Cycles": 0,
        "Agent": "edu.brown.cs.systems.xtrace.logging.BaggageWrappers",
        "ProcessName": "Data",
        "TaskID": "A41FE6A0EA5670E6",
        "ParentEventID": [
          "DDC765CAF91C67AB"
        ],
        "Label": "Forking current baggage with Baggage.fork()",
        "Title": "X-Trace Task",
        "Host": "pinky27.mpi-sws.org",
        "HRT": 14091091136296778,
        "Operation": "fork",
        "Timestamp": "1556275456030.101562",
        "TenantClass": 0,
        "Source": "DataXceiver.java:1257",
        "ThreadID": 6493,
        "ThreadName": "",
        "EventID": "D06C9F78C2FF7DE4",
        "BaggageBytes": "[[248 5] [240 0] [0 164 31 230 160 234 86 112 230] [240 1] [0 221 199 101 202 249 28 103 171] [240 3] [0 2]]",
        "ProcessID": 31438
      },
      {
        "Cycles": 0,
        "Agent": "edu.brown.cs.systems.xtrace.logging.XTraceInit",
        "ProcessName": "Data",
        "TaskID": "A41FE6A0EA5670E6",
        "ParentEventID": [
          "A80C143C111551E1"
        ],
        "Label": "Thread.setName: DataXceiver for client DFSClient_NONMAPREDUCE_1377588049_1 at /139.19.171.63:35816 [Sending block BP-1633380353-139.19.171.63-1554193446451:blk_1073765892_25068]",
        "Title": "X-Trace Task",
        "Host": "pinky27.mpi-sws.org",
        "HRT": 14091091136050514,
        "Timestamp": "1556275456029.855225",
        "TenantClass": 0,
        "Source": "DataXceiver.java:168",
        "ThreadID": 6493,
        "ThreadName": "",
        "EventID": "DDC765CAF91C67AB",
        "BaggageBytes": "[[248 5] [240 0] [0 164 31 230 160 234 86 112 230] [240 1] [0 168 12 20 60 17 21 81 225] [240 3] [0 2]]",
        "ProcessID": 31438
      },
      {
        "Cycles": 0,
        "Agent": "Execution-Sleep",
        "ProcessName": "Read",
        "TaskID": "A41FE6A0EA5670E6",
        "ParentEventID": [
          "A37B8B53DF89AE44"
        ],
        "Label": "waited",
        "Title": "X-Trace Task",
        "Host": "pinky19.mpi-sws.org",
        "Duration": "784761",
        "HRT": 25491816090278942,
        "Operation": "waited",
        "Timestamp": "1556275456030.367676",
        "TenantClass": 0,
        "Source": "SocketIOWithTimeout.java:335",
        "ThreadID": 1,
        "ThreadName": "",
        "EventID": "A900F4E503B60B3C",
        "ProcessID": 21035
      },
      {
        "Cycles": 0,
        "Agent": "edu.brown.cs.systems.xtrace.logging.BaggageWrappers",
        "ProcessName": "Data",
        "TaskID": "A41FE6A0EA5670E6",
        "ParentEventID": [
          "D06C9F78C2FF7DE4"
        ],
        "Label": "Forking current baggage with Baggage.fork()",
        "Title": "X-Trace Task",
        "Host": "pinky27.mpi-sws.org",
        "HRT": 14091091136563322,
        "Operation": "fork",
        "Timestamp": "1556275456030.368164",
        "TenantClass": 0,
        "Source": "PacketHeader.java:95",
        "ThreadID": 6493,
        "ThreadName": "",
        "EventID": "EF2DB1C26A6B5A69",
        "BaggageBytes": "[[248 5] [240 0] [0 164 31 230 160 234 86 112 230] [240 1] [0 208 108 159 120 194 255 125 228] [240 3] [0 2]]",
        "ProcessID": 31438
      },
      {
        "Cycles": 0,
        "Agent": "edu.brown.cs.systems.xtrace.logging.BaggageWrappers",
        "ProcessName": "Read",
        "TaskID": "A41FE6A0EA5670E6",
        "ParentEventID": [
          "A900F4E503B60B3C",
          "D06C9F78C2FF7DE4"
        ],
        "Label": "Merged current baggage with other baggage",
        "Title": "X-Trace Task",
        "Host": "pinky19.mpi-sws.org",
        "HRT": 25491816090348964,
        "Operation": "join",
        "Timestamp": "1556275456030.437500",
        "TenantClass": 0,
        "Source": "RemoteBlockReader2.java:429",
        "ThreadID": 1,
        "ThreadName": "",
        "EventID": "0F1920A7105E6BAE",
        "ProcessID": 21035
      },
      {
        "Cycles": 0,
        "Agent": "Execution-Sleep",
        "ProcessName": "Read",
        "TaskID": "A41FE6A0EA5670E6",
        "ParentEventID": [
          "0F1920A7105E6BAE"
        ],
        "Label": "waited",
        "Title": "X-Trace Task",
        "Host": "pinky19.mpi-sws.org",
        "Duration": "32404",
        "HRT": 25491816090459631,
        "Operation": "waited",
        "Timestamp": "1556275456030.548340",
        "TenantClass": 0,
        "Source": "SocketIOWithTimeout.java:335",
        "ThreadID": 1,
        "ThreadName": "",
        "EventID": "B1136508CBB60916",
        "ProcessID": 21035
      },
      {
        "Cycles": 0,
        "Agent": "Execution-Sleep",
        "ProcessName": "Data",
        "TaskID": "A41FE6A0EA5670E6",
        "ParentEventID": [
          "EF2DB1C26A6B5A69"
        ],
        "Label": "waited",
        "Title": "X-Trace Task",
        "Host": "pinky27.mpi-sws.org",
        "Duration": "11490",
        "HRT": 14091091136728876,
        "Operation": "waited",
        "Timestamp": "1556275456030.533691",
        "TenantClass": 0,
        "Source": "SocketIOWithTimeout.java:335",
        "ThreadID": 6493,
        "ThreadName": "",
        "EventID": "64470DC9E8BCF49E",
        "BaggageBytes": "[[248 5] [240 0] [0 164 31 230 160 234 86 112 230] [240 1] [0 239 45 177 194 106 107 90 105] [240 3] [0 2]]",
        "ProcessID": 31438
      },
      {
        "Cycles": 0,
        "Agent": "Execution-Sleep",
        "ProcessName": "Read",
        "TaskID": "A41FE6A0EA5670E6",
        "ParentEventID": [
          "B1136508CBB60916"
        ],
        "Label": "waited",
        "Title": "X-Trace Task",
        "Host": "pinky19.mpi-sws.org",
        "Duration": "128464",
        "HRT": 25491816090681500,
        "Operation": "waited",
        "Timestamp": "1556275456030.770020",
        "TenantClass": 0,
        "Source": "SocketIOWithTimeout.java:335",
        "ThreadID": 1,
        "ThreadName": "",
        "EventID": "8FDCEF76D6A7F855",
        "ProcessID": 21035
      },
      {
        "Cycles": 0,
        "Agent": "edu.brown.cs.systems.xtrace.logging.BaggageWrappers",
        "ProcessName": "Data",
        "TaskID": "A41FE6A0EA5670E6",
        "ParentEventID": [
          "64470DC9E8BCF49E"
        ],
        "Label": "Forking current baggage with Baggage.fork()",
        "Title": "X-Trace Task",
        "Host": "pinky27.mpi-sws.org",
        "HRT": 14091091136918787,
        "Operation": "fork",
        "Timestamp": "1556275456030.723633",
        "TenantClass": 0,
        "Source": "PacketHeader.java:95",
        "ThreadID": 6493,
        "ThreadName": "",
        "EventID": "2F03F72CC2805493",
        "BaggageBytes": "[[248 5] [240 0] [0 164 31 230 160 234 86 112 230] [240 1] [0 100 71 13 201 232 188 244 158] [240 3] [0 2]]",
        "ProcessID": 31438
      },
      {
        "Cycles": 0,
        "Agent": "edu.brown.cs.systems.xtrace.logging.BaggageWrappers",
        "ProcessName": "Read",
        "TaskID": "A41FE6A0EA5670E6",
        "ParentEventID": [
          "8FDCEF76D6A7F855",
          "EF2DB1C26A6B5A69"
        ],
        "Label": "Merged current baggage with other baggage",
        "Title": "X-Trace Task",
        "Host": "pinky19.mpi-sws.org",
        "HRT": 25491816090724753,
        "Operation": "join",
        "Timestamp": "1556275456030.813477",
        "TenantClass": 0,
        "Source": "PacketHeader.java:168",
        "ThreadID": 1,
        "ThreadName": "",
        "EventID": "7DE39DD823E9D4F8",
        "ProcessID": 21035
      },
      {
        "Cycles": 0,
        "Agent": "Execution-Sleep",
        "ProcessName": "Read",
        "TaskID": "A41FE6A0EA5670E6",
        "ParentEventID": [
          "7DE39DD823E9D4F8"
        ],
        "Label": "waited",
        "Title": "X-Trace Task",
        "Host": "pinky19.mpi-sws.org",
        "Duration": "50222",
        "HRT": 25491816090806668,
        "Operation": "waited",
        "Timestamp": "1556275456030.895264",
        "TenantClass": 0,
        "Source": "SocketIOWithTimeout.java:335",
        "ThreadID": 1,
        "ThreadName": "",
        "EventID": "709BD26D40A09494",
        "ProcessID": 21035
      },
      {
        "Cycles": 0,
        "Agent": "edu.brown.cs.systems.xtrace.logging.BaggageWrappers",
        "ProcessName": "Read",
        "TaskID": "A41FE6A0EA5670E6",
        "ParentEventID": [
          "7E076A18B668F00A"
        ],
        "Label": "Forking current baggage with Baggage.fork()",
        "Title": "X-Trace Task",
        "Host": "pinky19.mpi-sws.org",
        "HRT": 25491816090884352,
        "Operation": "fork",
        "Timestamp": "1556275456030.972900",
        "TenantClass": 0,
        "Source": "RemoteBlockReader2.java:361",
        "ThreadID": 1,
        "ThreadName": "",
        "EventID": "E76B431FF4F339B9",
        "ProcessID": 21035
      },
      {
        "Cycles": 0,
        "Agent": "Execution-Sleep",
        "ProcessName": "Data",
        "TaskID": "A41FE6A0EA5670E6",
        "ParentEventID": [
          "2F03F72CC2805493"
        ],
        "Label": "waited",
        "Title": "X-Trace Task",
        "Host": "pinky27.mpi-sws.org",
        "Duration": "120801",
        "HRT": 14091091137253528,
        "Operation": "waited",
        "Timestamp": "1556275456031.058350",
        "TenantClass": 0,
        "Source": "SocketIOWithTimeout.java:335",
        "ThreadID": 6493,
        "ThreadName": "",
        "EventID": "A5122E66365DA153",
        "BaggageBytes": "[[248 5] [240 0] [0 164 31 230 160 234 86 112 230] [240 1] [0 47 3 247 44 194 128 84 147] [240 3] [0 2]]",
        "ProcessID": 31438
      },
      {
        "Cycles": 0,
        "Agent": "edu.brown.cs.systems.xtrace.logging.BaggageWrappers",
        "ProcessName": "Read",
        "TaskID": "A41FE6A0EA5670E6",
        "ParentEventID": [
          "709BD26D40A09494",
          "2F03F72CC2805493"
        ],
        "Label": "Merged current baggage with other baggage",
        "Title": "X-Trace Task",
        "Host": "pinky19.mpi-sws.org",
        "HRT": 25491816090872710,
        "Operation": "join",
        "Timestamp": "1556275456030.961426",
        "TenantClass": 0,
        "Source": "PacketHeader.java:168",
        "ThreadID": 1,
        "ThreadName": "",
        "EventID": "7E076A18B668F00A",
        "ProcessID": 21035
      },
      {
        "Cycles": 0,
        "Agent": "edu.brown.cs.systems.xtrace.logging.BaggageWrappers",
        "ProcessName": "Data",
        "TaskID": "A41FE6A0EA5670E6",
        "ParentEventID": [
          "E76B431FF4F339B9",
          "A5122E66365DA153"
        ],
        "Label": "Merged current baggage with other baggage",
        "Title": "X-Trace Task",
        "Host": "pinky27.mpi-sws.org",
        "HRT": 14091091137406029,
        "Operation": "join",
        "Timestamp": "1556275456031.210938",
        "TenantClass": 0,
        "Source": "DataXceiver.java:574",
        "ThreadID": 6493,
        "ThreadName": "",
        "EventID": "3A36EBFBA1EEF75B",
        "BaggageBytes": "[[248 5] [240 0] [0 164 31 230 160 234 86 112 230] [240 1] [0 165 18 46 102 54 93 161 83] [0 231 107 67 31 244 243 57 185] [240 3] [0 2]]",
        "ProcessID": 31438
      },
      {
        "Cycles": 0,
        "Agent": "Execution-CPU",
        "ProcessName": "Data",
        "TaskID": "A41FE6A0EA5670E6",
        "ParentEventID": [
          "3A36EBFBA1EEF75B"
        ],
        "Label": "unset",
        "Title": "X-Trace Task",
        "Host": "pinky27.mpi-sws.org",
        "Duration": "1468473",
        "HRT": 14091091137486943,
        "Operation": "unset",
        "Timestamp": "1556275456031.291748",
        "TenantClass": 0,
        "Source": "DataXceiver.java:261",
        "ThreadID": 6493,
        "ThreadName": "",
        "EventID": "EF7584CECFC21B89",
        "BaggageBytes": "[[248 5] [240 0] [0 164 31 230 160 234 86 112 230] [240 1] [0 58 54 235 251 161 238 247 91] [240 3] [0 2]]",
        "ProcessID": 31438
      },
      {
        "Cycles": 0,
        "Agent": "edu.brown.cs.systems.retro.benchmarks.hdfs_client.Reader",
        "ProcessName": "Read",
        "TaskID": "A41FE6A0EA5670E6",
        "ParentEventID": [
          "0"
        ],
        "Label": "Reading file",
        "Title": "X-Trace Task",
        "Host": "pinky19.mpi-sws.org",
        "HRT": 25491816088534040,
        "Timestamp": "1556275456028.622559",
        "TenantClass": 0,
        "ThreadID": 1,
        "ThreadName": "",
        "EventID": "7BA6897E434277CC",
        "ProcessID": 21035,
        "Tag": [
          "reader_1kb",
          "Read Size: 1024"
        ]
      }
    ]
  }
]