[
  {
    "id": "AACF935B32EFFAEF",
    "reports": [
      {
        "Cycles": 0,
        "Agent": "edu.brown.cs.systems.retro.benchmarks.hdfs_client.Reader",
        "ProcessName": "Read",
        "TaskID": "AACF935B32EFFAEF",
        "ParentEventID": [
          "CAF952F05D65DDFD"
        ],
        "Label": "Reading file",
        "Title": "X-Trace Task",
        "Host": "pinky19.mpi-sws.org",
        "HRT": 25491880360602251,
        "Timestamp": "1556275520300.847168",
        "TenantClass": 0,
        "ThreadID": 1,
        "ThreadName": "",
        "EventID": "0DA79CD0AE7B2E77",
        "ProcessID": 21035
      },
      {
        "Cycles": 0,
        "Agent": "Execution-CPU",
        "ProcessName": "Read",
        "TaskID": "AACF935B32EFFAEF",
        "ParentEventID": [
          "F0B5B5FD62EB2DAE"
        ],
        "Label": "set",
        "Title": "X-Trace Task",
        "Host": "pinky19.mpi-sws.org",
        "HRT": 25491880360700184,
        "Operation": "set",
        "Timestamp": "1556275520300.945068",
        "TenantClass": 0,
        "Source": "Client.java:1032",
        "ThreadID": 41,
        "ThreadName": "",
        "EventID": "B3C3E349166BD5C7",
        "ProcessID": 21035
      },
      {
        "Cycles": 0,
        "Agent": "Execution-CPU",
        "ProcessName": "Read",
        "TaskID": "AACF935B32EFFAEF",
        "ParentEventID": [
          "9296CF9A090E9102"
        ],
        "Label": "unset",
        "Title": "X-Trace Task",
        "Host": "pinky19.mpi-sws.org",
        "Duration": "22213075",
        "HRT": 25491880360669925,
        "Operation": "unset",
        "Timestamp": "1556275520300.914795",
        "TenantClass": 0,
        "Source": "Client.java:1027",
        "ThreadID": 1,
        "ThreadName": "",
        "EventID": "F0B5B5FD62EB2DAE",
        "ProcessID": 21035
      },
      {
        "Cycles": 0,
        "Agent": "edu.brown.cs.systems.xtrace.logging.BaggageWrappers",
        "ProcessName": "Read",
        "TaskID": "AACF935B32EFFAEF",
        "ParentEventID": [
          "B3C3E349166BD5C7"
        ],
        "Label": "Forking current baggage with Baggage.fork()",
        "Title": "X-Trace Task",
        "Host": "pinky19.mpi-sws.org",
        "HRT": 25491880360760364,
        "Operation": "fork",
        "Timestamp": "1556275520301.005371",
        "TenantClass": 0,
        "Source": "Client.java:1043",
        "ThreadID": 41,
        "ThreadName": "",
        "EventID": "4FBEC9A5BC8B735D",
        "ProcessID": 21035
      },
      {
        "Cycles": 0,
        "Agent": "org.apache.hadoop.ipc.ProtobufRpcEngine",
        "ProcessName": "Read",
        "TaskID": "AACF935B32EFFAEF",
        "ParentEventID": [
          "0DA79CD0AE7B2E77"
        ],
        "Label": "Invoking org.apache.hadoop.hdfs.protocol.ClientProtocol.getBlockLocations",
        "Title": "X-Trace Task",
        "Host": "pinky19.mpi-sws.org",
        "HRT": 25491880360646004,
        "Timestamp": "1556275520300.890869",
        "TenantClass": 0,
        "Source": "ProtobufRpcEngine.java:228",
        "ThreadID": 1,
        "ThreadName": "",
        "EventID": "9296CF9A090E9102",
        "ProcessID": 21035
      },
      {
        "Cycles": 0,
        "Agent": "Execution-CPU",
        "ProcessName": "Read",
        "TaskID": "AACF935B32EFFAEF",
        "ParentEventID": [
          "4FBEC9A5BC8B735D"
        ],
        "Label": "unset",
        "Title": "X-Trace Task",
        "Host": "pinky19.mpi-sws.org",
        "Duration": "85148",
        "HRT": 25491880360843418,
        "Operation": "unset",
        "Timestamp": "1556275520301.088379",
        "TenantClass": 0,
        "Source": "Client.java:1062",
        "ThreadID": 41,
        "ThreadName": "",
        "EventID": "32BA37316E8A6CA9",
        "ProcessID": 21035
      },
      {
        "Cycles": 0,
        "Agent": "Execution-CPU",
        "ProcessName": "Read",
        "TaskID": "AACF935B32EFFAEF",
        "ParentEventID": [
          "32BA37316E8A6CA9"
        ],
        "Label": "set",
        "Title": "X-Trace Task",
        "Host": "pinky19.mpi-sws.org",
        "HRT": 25491880360872818,
        "Operation": "set",
        "Timestamp": "1556275520301.117676",
        "TenantClass": 0,
        "Source": "Client.java:1104",
        "ThreadID": 1,
        "ThreadName": "",
        "EventID": "4B2ACF65E612087A",
        "ProcessID": 21035
      },
      {
        "Cycles": 0,
        "Agent": "Execution-CPU",
        "ProcessName": "Name",
        "TaskID": "AACF935B32EFFAEF",
        "ParentEventID": [
          "4FBEC9A5BC8B735D"
        ],
        "Label": "set",
        "Title": "X-Trace Task",
        "Host": "pinky19.mpi-sws.org",
        "HRT": 25491880360895823,
        "Operation": "set",
        "Timestamp": "1556275520301.161865",
        "TenantClass": 0,
        "Source": "Server.java:1840",
        "ThreadID": 48,
        "ThreadName": "",
        "EventID": "5A20D8767C54B97E",
        "BaggageBytes": "[[248 5] [240 0] [0 170 207 147 91 50 239 250 239] [240 1] [0 79 190 201 165 188 139 115 93] [240 3] [0 2]]",
        "ProcessID": 2171
      },
      {
        "Cycles": 0,
        "Agent": "Execution-CPU",
        "ProcessName": "Name",
        "TaskID": "AACF935B32EFFAEF",
        "ParentEventID": [
          "69D0C02D385983EA"
        ],
        "Label": "unset",
        "Title": "X-Trace Task",
        "Host": "pinky19.mpi-sws.org",
        "Duration": "26867",
        "HRT": 25491880360948032,
        "Operation": "unset",
        "Timestamp": "1556275520301.214111",
        "TenantClass": 0,
        "Source": "Server.java:1828",
        "ThreadID": 48,
        "ThreadName": "",
        "EventID": "EA5DA9039CB5A84B",
        "BaggageBytes": "[[248 5] [240 0] [0 170 207 147 91 50 239 250 239] [240 1] [0 105 208 192 45 56 89 131 234] [240 3] [0 2]]",
        "ProcessID": 2171
      },
      {
        "Cycles": 0,
        "Agent": "edu.brown.cs.systems.xtrace.logging.BaggageWrappers",
        "ProcessName": "Name",
        "TaskID": "AACF935B32EFFAEF",
        "ParentEventID": [
          "5A20D8767C54B97E"
        ],
        "Label": "Forking current baggage with Baggage.fork()",
        "Title": "X-Trace Task",
        "Host": "pinky19.mpi-sws.org",
        "HRT": 25491880360924611,
        "Operation": "fork",
        "Timestamp": "1556275520301.190674",
        "TenantClass": 0,
        "Source": "Server.java:550",
        "ThreadID": 48,
        "ThreadName": "",
        "EventID": "69D0C02D385983EA",
        "BaggageBytes": "[[248 5] [240 0] [0 170 207 147 91 50 239 250 239] [240 1] [0 90 32 216 118 124 84 185 126] [240 3] [0 2]]",
        "ProcessID": 2171
      },
      {
        "Cycles": 0,
        "Agent": "Execution-CPU",
        "ProcessName": "Name",
        "TaskID": "AACF935B32EFFAEF",
        "ParentEventID": [
          "69D0C02D385983EA"
        ],
        "Label": "set",
        "Title": "X-Trace Task",
        "Host": "pinky19.mpi-sws.org",
        "HRT": 25491880360955681,
        "Operation": "set",
        "Timestamp": "1556275520301.221924",
        "TenantClass": 0,
        "Source": "Server.java:2071",
        "ThreadID": 61,
        "ThreadName": "",
        "EventID": "752693CA8200DF7D",
        "BaggageBytes": "[[248 5] [240 0] [0 170 207 147 91 50 239 250 239] [240 1] [0 105 208 192 45 56 89 131 234] [240 3] [0 2]]",
        "ProcessID": 2171
      },
      {
        "Cycles": 0,
        "Agent": "org.apache.hadoop.ipc.Server",
        "ProcessName": "Name",
        "TaskID": "AACF935B32EFFAEF",
        "ParentEventID": [
          "752693CA8200DF7D"
        ],
        "Label": "getBlockLocations in org.apache.hadoop.hdfs.protocol.ClientProtocol",
        "Title": "X-Trace Task",
        "Host": "pinky19.mpi-sws.org",
        "HRT": 25491880360988747,
        "Timestamp": "1556275520301.254883",
        "TenantClass": 0,
        "Source": "ProtobufRpcEngine.java:601",
        "ThreadID": 61,
        "ThreadName": "",
        "EventID": "5A21F9718D72C850",
        "BaggageBytes": "[[248 5] [240 0] [0 170 207 147 91 50 239 250 239] [240 1] [0 117 38 147 202 130 0 223 125] [240 3] [0 2]]",
        "ProcessID": 2171
      },
      {
        "Cycles": 0,
        "Agent": "edu.brown.cs.systems.xtrace.logging.BaggageWrappers",
        "ProcessName": "Name",
        "TaskID": "AACF935B32EFFAEF",
        "ParentEventID": [
          "A9C938F5F2674D26"
        ],
        "Label": "Forking current baggage with Baggage.fork()",
        "Title": "X-Trace Task",
        "Host": "pinky19.mpi-sws.org",
        "HRT": 25491880361092071,
        "Operation": "fork",
        "Timestamp": "1556275520301.358154",
        "TenantClass": 0,
        "Source": "Server.java:2398",
        "ThreadID": 61,
        "ThreadName": "",
        "EventID": "98101FBF64909E4C",
        "BaggageBytes": "[[248 5] [240 0] [0 170 207 147 91 50 239 250 239] [240 1] [0 169 201 56 245 242 103 77 38] [240 3] [0 2]]",
        "ProcessID": 2171
      },
      {
        "Cycles": 0,
        "Agent": "org.apache.hadoop.hdfs.server.namenode.FSNamesystem.audit",
        "ProcessName": "Name",
        "TaskID": "AACF935B32EFFAEF",
        "ParentEventID": [
          "5A21F9718D72C850"
        ],
        "Label": "allowed=true\tugi=plascas (auth:SIMPLE)\tip=/139.19.171.63\tcmd=open\tsrc=/ds/RUjVxLduGNynofqv\tdst=null\tperm=null\tproto=rpc",
        "Title": "X-Trace Task",
        "Host": "pinky19.mpi-sws.org",
        "HRT": 25491880361042826,
        "Timestamp": "1556275520301.308838",
        "TenantClass": 0,
        "Source": "FSNamesystem.java:8313",
        "ThreadID": 61,
        "ThreadName": "",
        "EventID": "A9C938F5F2674D26",
        "BaggageBytes": "[[248 5] [240 0] [0 170 207 147 91 50 239 250 239] [240 1] [0 90 33 249 113 141 114 200 80] [240 3] [0 2]]",
        "ProcessID": 2171
      },
      {
        "Cycles": 0,
        "Agent": "Execution-CPU",
        "ProcessName": "Name",
        "TaskID": "AACF935B32EFFAEF",
        "ParentEventID": [
          "98101FBF64909E4C"
        ],
        "Label": "unset",
        "Title": "X-Trace Task",
        "Host": "pinky19.mpi-sws.org",
        "Duration": "229715",
        "HRT": 25491880361206815,
        "Operation": "unset",
        "Timestamp": "1556275520301.472900",
        "TenantClass": 0,
        "Source": "Server.java:1058",
        "ThreadID": 61,
        "ThreadName": "",
        "EventID": "99BB6106D10A3C8C",
        "BaggageBytes": "[[248 5] [240 0] [0 170 207 147 91 50 239 250 239] [240 1] [0 152 16 31 191 100 144 158 76] [240 3] [0 2]]",
        "ProcessID": 2171
      },
      {
        "Cycles": 0,
        "Agent": "Execution-CPU",
        "ProcessName": "Read",
        "TaskID": "AACF935B32EFFAEF",
        "ParentEventID": [
          "98101FBF64909E4C"
        ],
        "Label": "set",
        "Title": "X-Trace Task",
        "Host": "pinky19.mpi-sws.org",
        "HRT": 25491880361269537,
        "Operation": "set",
        "Timestamp": "1556275520301.514404",
        "TenantClass": 0,
        "Source": "Client.java:302",
        "ThreadID": 37,
        "ThreadName": "",
        "EventID": "B42BD872F6F11644",
        "ProcessID": 21035
      },
      {
        "Cycles": 0,
        "Agent": "Execution-Sleep",
        "ProcessName": "Read",
        "TaskID": "AACF935B32EFFAEF",
        "ParentEventID": [
          "4B2ACF65E612087A"
        ],
        "Label": "waited",
        "Title": "X-Trace Task",
        "Host": "pinky19.mpi-sws.org",
        "Duration": "438019",
        "HRT": 25491880361327524,
        "Operation": "waited",
        "Timestamp": "1556275520301.572510",
        "TenantClass": 0,
        "Source": "Client.java:1537",
        "ThreadID": 1,
        "ThreadName": "",
        "EventID": "01E0647AE29E5202",
        "ProcessID": 21035
      },
      {
        "Cycles": 0,
        "Agent": "Execution-CPU",
        "ProcessName": "Read",
        "TaskID": "AACF935B32EFFAEF",
        "ParentEventID": [
          "B42BD872F6F11644"
        ],
        "Label": "unset",
        "Title": "X-Trace Task",
        "Host": "pinky19.mpi-sws.org",
        "Duration": "10875",
        "HRT": 25491880361304882,
        "Operation": "unset",
        "Timestamp": "1556275520301.549805",
        "TenantClass": 0,
        "Source": "Client.java:1168",
        "ThreadID": 37,
        "ThreadName": "",
        "EventID": "B581E06B84397398",
        "ProcessID": 21035
      },
      {
        "Cycles": 0,
        "Agent": "org.apache.hadoop.ipc.ProtobufRpcEngine",
        "ProcessName": "Read",
        "TaskID": "AACF935B32EFFAEF",
        "ParentEventID": [
          "911F547C5EC5ABA0"
        ],
        "Label": "org.apache.hadoop.hdfs.protocol.ClientProtocol.getBlockLocations completed",
        "Title": "X-Trace Task",
        "Host": "pinky19.mpi-sws.org",
        "HRT": 25491880361404510,
        "Timestamp": "1556275520301.649414",
        "TenantClass": 0,
        "Source": "ProtobufRpcEngine.java:275",
        "ThreadID": 1,
        "ThreadName": "",
        "EventID": "49CE17A8CA0AF1F5",
        "ProcessID": 21035
      },
      {
        "Cycles": 0,
        "Agent": "edu.brown.cs.systems.xtrace.logging.BaggageWrappers",
        "ProcessName": "Read",
        "TaskID": "AACF935B32EFFAEF",
        "ParentEventID": [
          "49CE17A8CA0AF1F5"
        ],
        "Label": "Forking current baggage with Baggage.fork()",
        "Title": "X-Trace Task",
        "Host": "pinky19.mpi-sws.org",
        "HRT": 25491880361570293,
        "Operation": "fork",
        "Timestamp": "1556275520301.815186",
        "TenantClass": 0,
        "Source": "DataTransferProtoUtil.java:94",
        "ThreadID": 1,
        "ThreadName": "",
        "EventID": "B98B2B39D2D901C1",
        "ProcessID": 21035
      },
      {
        "Cycles": 0,
        "Agent": "edu.brown.cs.systems.xtrace.logging.BaggageWrappers",
        "ProcessName": "Read",
        "TaskID": "AACF935B32EFFAEF",
        "ParentEventID": [
          "B581E06B84397398",
          "01E0647AE29E5202"
        ],
        "Label": "Merged current baggage with other baggage",
        "Title": "X-Trace Task",
        "Host": "pinky19.mpi-sws.org",
        "HRT": 25491880361343363,
        "Operation": "join",
        "Timestamp": "1556275520301.588379",
        "TenantClass": 0,
        "Source": "Client.java:1545",
        "ThreadID": 1,
        "ThreadName": "",
        "EventID": "911F547C5EC5ABA0",
        "ProcessID": 21035
      },
      {
        "Cycles": 0,
        "Agent": "Execution-CPU",
        "ProcessName": "Data",
        "TaskID": "AACF935B32EFFAEF",
        "ParentEventID": [
          "B98B2B39D2D901C1"
        ],
        "Label": "set",
        "Title": "X-Trace Task",
        "Host": "pinky19.mpi-sws.org",
        "HRT": 25491880361725025,
        "Operation": "set",
        "Timestamp": "1556275520301.996094",
        "TenantClass": 0,
        "Source": "Receiver.java:117",
        "ThreadID": 9602,
        "ThreadName": "",
        "EventID": "576BF31624D26E82",
        "BaggageBytes": "[[248 5] [240 0] [0 170 207 147 91 50 239 250 239] [240 1] [0 185 139 43 57 210 217 1 193] [240 3] [0 2]]",
        "ProcessID": 2319
      },
      {
        "Cycles": 0,
        "Agent": "edu.brown.cs.systems.xtrace.logging.BaggageWrappers",
        "ProcessName": "Data",
        "TaskID": "AACF935B32EFFAEF",
        "ParentEventID": [
          "C2AC41129F24386D"
        ],
        "Label": "Forking current baggage with Baggage.fork()",
        "Title": "X-Trace Task",
        "Host": "pinky19.mpi-sws.org",
        "HRT": 25491880361832487,
        "Operation": "fork",
        "Timestamp": "1556275520302.103516",
        "TenantClass": 0,
        "Source": "DataXceiver.java:1257",
        "ThreadID": 9602,
        "ThreadName": "",
        "EventID": "50456A3C38B790AA",
        "BaggageBytes": "[[248 5] [240 0] [0 170 207 147 91 50 239 250 239] [240 1] [0 194 172 65 18 159 36 56 109] [240 3] [0 2]]",
        "ProcessID": 2319
      },
      {
        "Cycles": 0,
        "Agent": "edu.brown.cs.systems.xtrace.logging.XTraceInit",
        "ProcessName": "Data",
        "TaskID": "AACF935B32EFFAEF",
        "ParentEventID": [
          "576BF31624D26E82"
        ],
        "Label": "Thread.setName: DataXceiver for client DFSClient_NONMAPREDUCE_1377588049_1 at /139.19.171.63:36074 [Sending block BP-1633380353-139.19.171.63-1554193446451:blk_1073755531_14707]",
        "Title": "X-Trace Task",
        "Host": "pinky19.mpi-sws.org",
        "HRT": 25491880361761582,
        "Timestamp": "1556275520302.032471",
        "TenantClass": 0,
        "Source": "DataXceiver.java:168",
        "ThreadID": 9602,
        "ThreadName": "",
        "EventID": "C2AC41129F24386D",
        "BaggageBytes": "[[248 5] [240 0] [0 170 207 147 91 50 239 250 239] [240 1] [0 87 107 243 22 36 210 110 130] [240 3] [0 2]]",
        "ProcessID": 2319
      },
      {
        "Cycles": 0,
        "Agent": "edu.brown.cs.systems.xtrace.logging.BaggageWrappers",
        "ProcessName": "Data",
        "TaskID": "AACF935B32EFFAEF",
        "ParentEventID": [
          "50456A3C38B790AA"
        ],
        "Label": "Forking current baggage with Baggage.fork()",
        "Title": "X-Trace Task",
        "Host": "pinky19.mpi-sws.org",
        "HRT": 25491880361895277,
        "Operation": "fork",
        "Timestamp": "1556275520302.166260",
        "TenantClass": 0,
        "Source": "PacketHeader.java:95",
        "ThreadID": 9602,
        "ThreadName": "",
        "EventID": "F3E92E6555F90B8C",
        "BaggageBytes": "[[248 5] [240 0] [0 170 207 147 91 50 239 250 239] [240 1] [0 80 69 106 60 56 183 144 170] [240 3] [0 2]]",
        "ProcessID": 2319
      },
      {
        "Cycles": 0,
        "Agent": "Execution-Sleep",
        "ProcessName": "Data",
        "TaskID": "AACF935B32EFFAEF",
        "ParentEventID": [
          "F3E92E6555F90B8C"
        ],
        "Label": "waited",
        "Title": "X-Trace Task",
        "Host": "pinky19.mpi-sws.org",
        "Duration": "4115",
        "HRT": 25491880361952704,
        "Operation": "waited",
        "Timestamp": "1556275520302.223633",
        "TenantClass": 0,
        "Source": "SocketIOWithTimeout.java:335",
        "ThreadID": 9602,
        "ThreadName": "",
        "EventID": "08E3F5B7E0FA64D6",
        "BaggageBytes": "[[248 5] [240 0] [0 170 207 147 91 50 239 250 239] [240 1] [0 243 233 46 101 85 249 11 140] [240 3] [0 2]]",
        "ProcessID": 2319
      },
      {
        "Cycles": 0,
        "Agent": "Execution-Sleep",
        "ProcessName": "Read",
        "TaskID": "AACF935B32EFFAEF",
        "ParentEventID": [
          "B98B2B39D2D901C1"
        ],
        "Label": "waited",
        "Title": "X-Trace Task",
        "Host": "pinky19.mpi-sws.org",
        "Duration": "214297",
        "HRT": 25491880361892747,
        "Operation": "waited",
        "Timestamp": "1556275520302.137695",
        "TenantClass": 0,
        "Source": "SocketIOWithTimeout.java:335",
        "ThreadID": 1,
        "ThreadName": "",
        "EventID": "5B62A2322CA197E7",
        "ProcessID": 21035
      },
      {
        "Cycles": 0,
        "Agent": "edu.brown.cs.systems.xtrace.logging.BaggageWrappers",
        "ProcessName": "Read",
        "TaskID": "AACF935B32EFFAEF",
        "ParentEventID": [
          "5B62A2322CA197E7",
          "50456A3C38B790AA"
        ],
        "Label": "Merged current baggage with other baggage",
        "Title": "X-Trace Task",
        "Host": "pinky19.mpi-sws.org",
        "HRT": 25491880362009136,
        "Operation": "join",
        "Timestamp": "1556275520302.254150",
        "TenantClass": 0,
        "Source": "RemoteBlockReader2.java:429",
        "ThreadID": 1,
        "ThreadName": "",
        "EventID": "042A45A78F5936A5",
        "ProcessID": 21035
      },
      {
        "Cycles": 0,
        "Agent": "edu.brown.cs.systems.xtrace.logging.BaggageWrappers",
        "ProcessName": "Data",
        "TaskID": "AACF935B32EFFAEF",
        "ParentEventID": [
          "08E3F5B7E0FA64D6"
        ],
        "Label": "Forking current baggage with Baggage.fork()",
        "Title": "X-Trace Task",
        "Host": "pinky19.mpi-sws.org",
        "HRT": 25491880362012389,
        "Operation": "fork",
        "Timestamp": "1556275520302.283447",
        "TenantClass": 0,
        "Source": "PacketHeader.java:95",
        "ThreadID": 9602,
        "ThreadName": "",
        "EventID": "59821B86B6047D7A",
        "BaggageBytes": "[[248 5] [240 0] [0 170 207 147 91 50 239 250 239] [240 1] [0 8 227 245 183 224 250 100 214] [240 3] [0 2]]",
        "ProcessID": 2319
      },
      {
        "Cycles": 0,
        "Agent": "edu.brown.cs.systems.xtrace.logging.BaggageWrappers",
        "ProcessName": "Read",
        "TaskID": "AACF935B32EFFAEF",
        "ParentEventID": [
          "F3E92E6555F90B8C",
          "042A45A78F5936A5"
        ],
        "Label": "Merged current baggage with other baggage",
        "Title": "X-Trace Task",
        "Host": "pinky19.mpi-sws.org",
        "HRT": 25491880362103572,
        "Operation": "join",
        "Timestamp": "1556275520302.348633",
        "TenantClass": 0,
        "Source": "PacketHeader.java:168",
        "ThreadID": 1,
        "ThreadName": "",
        "EventID": "5389E7482C886FAE",
        "ProcessID": 21035
      },
      {
        "Cycles": 0,
        "Agent": "edu.brown.cs.systems.xtrace.logging.BaggageWrappers",
        "ProcessName": "Read",
        "TaskID": "AACF935B32EFFAEF",
        "ParentEventID": [
          "0FFA33ED6B742EE4"
        ],
        "Label": "Forking current baggage with Baggage.fork()",
        "Title": "X-Trace Task",
        "Host": "pinky19.mpi-sws.org",
        "HRT": 25491880362172238,
        "Operation": "fork",
        "Timestamp": "1556275520302.417236",
        "TenantClass": 0,
        "Source": "RemoteBlockReader2.java:361",
        "ThreadID": 1,
        "ThreadName": "",
        "EventID": "203F0A78F59BBAC3",
        "ProcessID": 21035
      },
      {
        "Cycles": 0,
        "Agent": "edu.brown.cs.systems.xtrace.logging.BaggageWrappers",
        "ProcessName": "Read",
        "TaskID": "AACF935B32EFFAEF",
        "ParentEventID": [
          "59821B86B6047D7A",
          "5389E7482C886FAE"
        ],
        "Label": "Merged current baggage with other baggage",
        "Title": "X-Trace Task",
        "Host": "pinky19.mpi-sws.org",
        "HRT": 25491880362161313,
        "Operation": "join",
        "Timestamp": "1556275520302.406250",
        "TenantClass": 0,
        "Source": "PacketHeader.java:168",
        "ThreadID": 1,
        "ThreadName": "",
        "EventID": "0FFA33ED6B742EE4",
        "ProcessID": 21035
      },
      {
        "Cycles": 0,
        "Agent": "Execution-Sleep",
        "ProcessName": "Data",
        "TaskID": "AACF935B32EFFAEF",
        "ParentEventID": [
          "59821B86B6047D7A"
        ],
        "Label": "waited",
        "Title": "X-Trace Task",
        "Host": "pinky19.mpi-sws.org",
        "Duration": "126200",
        "HRT": 25491880362219390,
        "Operation": "waited",
        "Timestamp": "1556275520302.490479",
        "TenantClass": 0,
        "Source": "SocketIOWithTimeout.java:335",
        "ThreadID": 9602,
        "ThreadName": "",
        "EventID": "7283AF47E3ADB22C",
        "BaggageBytes": "[[248 5] [240 0] [0 170 207 147 91 50 239 250 239] [240 1] [0 89 130 27 134 182 4 125 122] [240 3] [0 2]]",
        "ProcessID": 2319
      },
      {
        "Cycles": 0,
        "Agent": "Execution-CPU",
        "ProcessName": "Data",
        "TaskID": "AACF935B32EFFAEF",
        "ParentEventID": [
          "7F7C99B08E9146A1"
        ],
        "Label": "unset",
        "Title": "X-Trace Task",
        "Host": "pinky19.mpi-sws.org",
        "Duration": "536855",
        "HRT": 25491880362288196,
        "Operation": "unset",
        "Timestamp": "1556275520302.559082",
        "TenantClass": 0,
        "Source": "DataXceiver.java:261",
        "ThreadID": 9602,
        "ThreadName": "",
        "EventID": "A972CA0BFEC6BA76",
        "BaggageBytes": "[[248 5] [240 0] [0 170 207 147 91 50 239 250 239] [240 1] [0 127 124 153 176 142 145 70 161] [240 3] [0 2]]",
        "ProcessID": 2319
      },
      {
        "Cycles": 0,
        "Agent": "edu.brown.cs.systems.xtrace.logging.BaggageWrappers",
        "ProcessName": "Data",
        "TaskID": "AACF935B32EFFAEF",
        "ParentEventID": [
          "7283AF47E3ADB22C",
          "203F0A78F59BBAC3"
        ],
        "Label": "Merged current baggage with other baggage",
        "Title": "X-Trace Task",
        "Host": "pinky19.mpi-sws.org",
        "HRT": 25491880362269259,
        "Operation": "join",
        "Timestamp": "1556275520302.540283",
        "TenantClass": 0,
        "Source": "DataXceiver.java:574",
        "ThreadID": 9602,
        "ThreadName": "",
        "EventID": "7F7C99B08E9146A1",
        "BaggageBytes": "[[248 5] [240 0] [0 170 207 147 91 50 239 250 239] [240 1] [0 32 63 10 120 245 155 186 195] [0 114 131 175 71 227 173 178 44] [240 3] [0 2]]",
        "ProcessID": 2319
      },
      {
        "Cycles": 0,
        "Agent": "edu.brown.cs.systems.retro.benchmarks.hdfs_client.Reader",
        "ProcessName": "Read",
        "TaskID": "AACF935B32EFFAEF",
        "ParentEventID": [
          "0"
        ],
        "Label": "Reading file",
        "Title": "X-Trace Task",
        "Host": "pinky19.mpi-sws.org",
        "HRT": 25491880360585849,
        "Timestamp": "1556275520300.830811",
        "TenantClass": 0,
        "ThreadID": 1,
        "ThreadName": "",
        "EventID": "CAF952F05D65DDFD",
        "ProcessID": 21035,
        "Tag": [
          "reader_1kb",
          "Read Size: 1024"
        ]
      }
    ]
  }
]