[
  {
    "id": "3F35DAB6F8C6CDB0",
    "reports": [
      {
        "Cycles": 0,
        "Agent": "org.apache.hadoop.ipc.ProtobufRpcEngine",
        "ProcessName": "Read",
        "TaskID": "3F35DAB6F8C6CDB0",
        "ParentEventID": [
          "AE9D6EF2B5901D61"
        ],
        "Label": "Invoking org.apache.hadoop.hdfs.protocol.ClientProtocol.getBlockLocations",
        "Title": "X-Trace Task",
        "Host": "pinky19.mpi-sws.org",
        "HRT": 26966774780203731,
        "Timestamp": "1557750414720.689453",
        "TenantClass": 0,
        "Source": "ProtobufRpcEngine.java:228",
        "ThreadID": 1,
        "ThreadName": "",
        "EventID": "21A6508683BB0FDF",
        "ProcessID": 2801
      },
      {
        "Cycles": 0,
        "Agent": "edu.brown.cs.systems.retro.benchmarks.hdfs_client.Reader",
        "ProcessName": "Read",
        "TaskID": "3F35DAB6F8C6CDB0",
        "ParentEventID": [
          "7430B56CFE4676CD"
        ],
        "Label": "Reading file",
        "Title": "X-Trace Task",
        "Host": "pinky19.mpi-sws.org",
        "HRT": 26966774780177924,
        "Timestamp": "1557750414720.663574",
        "TenantClass": 0,
        "ThreadID": 1,
        "ThreadName": "",
        "EventID": "AE9D6EF2B5901D61",
        "ProcessID": 2801
      },
      {
        "Cycles": 0,
        "Agent": "Execution-CPU",
        "ProcessName": "Read",
        "TaskID": "3F35DAB6F8C6CDB0",
        "ParentEventID": [
          "D9F7412E3EE1AB42"
        ],
        "Label": "set",
        "Title": "X-Trace Task",
        "Host": "pinky19.mpi-sws.org",
        "HRT": 26966774780244783,
        "Operation": "set",
        "Timestamp": "1557750414720.730469",
        "TenantClass": 0,
        "Source": "Client.java:1032",
        "ThreadID": 41,
        "ThreadName": "",
        "EventID": "AD75236822A808B2",
        "ProcessID": 2801
      },
      {
        "Cycles": 0,
        "Agent": "Execution-CPU",
        "ProcessName": "Read",
        "TaskID": "3F35DAB6F8C6CDB0",
        "ParentEventID": [
          "21A6508683BB0FDF"
        ],
        "Label": "unset",
        "Title": "X-Trace Task",
        "Host": "pinky19.mpi-sws.org",
        "Duration": "22451264",
        "HRT": 26966774780221849,
        "Operation": "unset",
        "Timestamp": "1557750414720.707520",
        "TenantClass": 0,
        "Source": "Client.java:1027",
        "ThreadID": 1,
        "ThreadName": "",
        "EventID": "D9F7412E3EE1AB42",
        "ProcessID": 2801
      },
      {
        "Cycles": 0,
        "Agent": "Execution-CPU",
        "ProcessName": "Read",
        "TaskID": "3F35DAB6F8C6CDB0",
        "ParentEventID": [
          "DB585286B3CDC8BF"
        ],
        "Label": "unset",
        "Title": "X-Trace Task",
        "Host": "pinky19.mpi-sws.org",
        "Duration": "64438",
        "HRT": 26966774780325994,
        "Operation": "unset",
        "Timestamp": "1557750414720.811523",
        "TenantClass": 0,
        "Source": "Client.java:1062",
        "ThreadID": 41,
        "ThreadName": "",
        "EventID": "F48B630D57567F64",
        "ProcessID": 2801
      },
      {
        "Cycles": 0,
        "Agent": "edu.brown.cs.systems.xtrace.logging.BaggageWrappers",
        "ProcessName": "Read",
        "TaskID": "3F35DAB6F8C6CDB0",
        "ParentEventID": [
          "AD75236822A808B2"
        ],
        "Label": "Forking current baggage with Baggage.fork()",
        "Title": "X-Trace Task",
        "Host": "pinky19.mpi-sws.org",
        "HRT": 26966774780261229,
        "Operation": "fork",
        "Timestamp": "1557750414720.746826",
        "TenantClass": 0,
        "Source": "Client.java:1043",
        "ThreadID": 41,
        "ThreadName": "",
        "EventID": "DB585286B3CDC8BF",
        "ProcessID": 2801
      },
      {
        "Cycles": 0,
        "Agent": "Execution-CPU",
        "ProcessName": "Name",
        "TaskID": "3F35DAB6F8C6CDB0",
        "ParentEventID": [
          "DB585286B3CDC8BF"
        ],
        "Label": "set",
        "Title": "X-Trace Task",
        "Host": "pinky19.mpi-sws.org",
        "HRT": 26966774780414972,
        "Operation": "set",
        "Timestamp": "1557750414720.903076",
        "TenantClass": 0,
        "Source": "Server.java:1840",
        "ThreadID": 48,
        "ThreadName": "",
        "EventID": "3313749E798F1EEC",
        "BaggageBytes": "[[248 5] [240 0] [0 63 53 218 182 248 198 205 176] [240 1] [0 219 88 82 134 179 205 200 191] [240 3] [0 2]]",
        "ProcessID": 2171
      },
      {
        "Cycles": 0,
        "Agent": "Execution-CPU",
        "ProcessName": "Read",
        "TaskID": "3F35DAB6F8C6CDB0",
        "ParentEventID": [
          "F48B630D57567F64"
        ],
        "Label": "set",
        "Title": "X-Trace Task",
        "Host": "pinky19.mpi-sws.org",
        "HRT": 26966774780345478,
        "Operation": "set",
        "Timestamp": "1557750414720.831055",
        "TenantClass": 0,
        "Source": "Client.java:1104",
        "ThreadID": 1,
        "ThreadName": "",
        "EventID": "8A07BBB888A26972",
        "ProcessID": 2801
      },
      {
        "Cycles": 0,
        "Agent": "edu.brown.cs.systems.xtrace.logging.BaggageWrappers",
        "ProcessName": "Name",
        "TaskID": "3F35DAB6F8C6CDB0",
        "ParentEventID": [
          "3313749E798F1EEC"
        ],
        "Label": "Forking current baggage with Baggage.fork()",
        "Title": "X-Trace Task",
        "Host": "pinky19.mpi-sws.org",
        "HRT": 26966774780444987,
        "Operation": "fork",
        "Timestamp": "1557750414720.933105",
        "TenantClass": 0,
        "Source": "Server.java:550",
        "ThreadID": 48,
        "ThreadName": "",
        "EventID": "E28A45110475A606",
        "BaggageBytes": "[[248 5] [240 0] [0 63 53 218 182 248 198 205 176] [240 1] [0 51 19 116 158 121 143 30 236] [240 3] [0 2]]",
        "ProcessID": 2171
      },
      {
        "Cycles": 0,
        "Agent": "Execution-CPU",
        "ProcessName": "Name",
        "TaskID": "3F35DAB6F8C6CDB0",
        "ParentEventID": [
          "E28A45110475A606"
        ],
        "Label": "set",
        "Title": "X-Trace Task",
        "Host": "pinky19.mpi-sws.org",
        "HRT": 26966774780475015,
        "Operation": "set",
        "Timestamp": "1557750414720.963135",
        "TenantClass": 0,
        "Source": "Server.java:2071",
        "ThreadID": 61,
        "ThreadName": "",
        "EventID": "6D8CD6623869642B",
        "BaggageBytes": "[[248 5] [240 0] [0 63 53 218 182 248 198 205 176] [240 1] [0 226 138 69 17 4 117 166 6] [240 3] [0 2]]",
        "ProcessID": 2171
      },
      {
        "Cycles": 0,
        "Agent": "Execution-CPU",
        "ProcessName": "Name",
        "TaskID": "3F35DAB6F8C6CDB0",
        "ParentEventID": [
          "E28A45110475A606"
        ],
        "Label": "unset",
        "Title": "X-Trace Task",
        "Host": "pinky19.mpi-sws.org",
        "Duration": "25372",
        "HRT": 26966774780466333,
        "Operation": "unset",
        "Timestamp": "1557750414720.954590",
        "TenantClass": 0,
        "Source": "Server.java:1828",
        "ThreadID": 48,
        "ThreadName": "",
        "EventID": "F811A08EEF945B83",
        "BaggageBytes": "[[248 5] [240 0] [0 63 53 218 182 248 198 205 176] [240 1] [0 226 138 69 17 4 117 166 6] [240 3] [0 2]]",
        "ProcessID": 2171
      },
      {
        "Cycles": 0,
        "Agent": "org.apache.hadoop.ipc.Server",
        "ProcessName": "Name",
        "TaskID": "3F35DAB6F8C6CDB0",
        "ParentEventID": [
          "6D8CD6623869642B"
        ],
        "Label": "getBlockLocations in org.apache.hadoop.hdfs.protocol.ClientProtocol",
        "Title": "X-Trace Task",
        "Host": "pinky19.mpi-sws.org",
        "HRT": 26966774780511320,
        "Timestamp": "1557750414720.999512",
        "TenantClass": 0,
        "Source": "ProtobufRpcEngine.java:601",
        "ThreadID": 61,
        "ThreadName": "",
        "EventID": "52D5C8F210925348",
        "BaggageBytes": "[[248 5] [240 0] [0 63 53 218 182 248 198 205 176] [240 1] [0 109 140 214 98 56 105 100 43] [240 3] [0 2]]",
        "ProcessID": 2171
      },
      {
        "Cycles": 0,
        "Agent": "edu.brown.cs.systems.xtrace.logging.BaggageWrappers",
        "ProcessName": "Name",
        "TaskID": "3F35DAB6F8C6CDB0",
        "ParentEventID": [
          "483D42C751899F0F"
        ],
        "Label": "Forking current baggage with Baggage.fork()",
        "Title": "X-Trace Task",
        "Host": "pinky19.mpi-sws.org",
        "HRT": 26966774780602308,
        "Operation": "fork",
        "Timestamp": "1557750414721.090576",
        "TenantClass": 0,
        "Source": "Server.java:2398",
        "ThreadID": 61,
        "ThreadName": "",
        "EventID": "B43C2D5B0AF39A3F",
        "BaggageBytes": "[[248 5] [240 0] [0 63 53 218 182 248 198 205 176] [240 1] [0 72 61 66 199 81 137 159 15] [240 3] [0 2]]",
        "ProcessID": 2171
      },
      {
        "Cycles": 0,
        "Agent": "Execution-CPU",
        "ProcessName": "Name",
        "TaskID": "3F35DAB6F8C6CDB0",
        "ParentEventID": [
          "B43C2D5B0AF39A3F"
        ],
        "Label": "unset",
        "Title": "X-Trace Task",
        "Host": "pinky19.mpi-sws.org",
        "Duration": "209817",
        "HRT": 26966774780709340,
        "Operation": "unset",
        "Timestamp": "1557750414721.197510",
        "TenantClass": 0,
        "Source": "Server.java:1058",
        "ThreadID": 61,
        "ThreadName": "",
        "EventID": "0562EA0625DCCF2B",
        "BaggageBytes": "[[248 5] [240 0] [0 63 53 218 182 248 198 205 176] [240 1] [0 180 60 45 91 10 243 154 63] [240 3] [0 2]]",
        "ProcessID": 2171
      },
      {
        "Cycles": 0,
        "Agent": "org.apache.hadoop.hdfs.server.namenode.FSNamesystem.audit",
        "ProcessName": "Name",
        "TaskID": "3F35DAB6F8C6CDB0",
        "ParentEventID": [
          "52D5C8F210925348"
        ],
        "Label": "allowed=true\tugi=plascas (auth:SIMPLE)\tip=/139.19.171.63\tcmd=open\tsrc=/ds/TxUa1q61yVNPiInN\tdst=null\tperm=null\tproto=rpc",
        "Title": "X-Trace Task",
        "Host": "pinky19.mpi-sws.org",
        "HRT": 26966774780559847,
        "Timestamp": "1557750414721.048096",
        "TenantClass": 0,
        "Source": "FSNamesystem.java:8313",
        "ThreadID": 61,
        "ThreadName": "",
        "EventID": "483D42C751899F0F",
        "BaggageBytes": "[[248 5] [240 0] [0 63 53 218 182 248 198 205 176] [240 1] [0 82 213 200 242 16 146 83 72] [240 3] [0 2]]",
        "ProcessID": 2171
      },
      {
        "Cycles": 0,
        "Agent": "Execution-CPU",
        "ProcessName": "Read",
        "TaskID": "3F35DAB6F8C6CDB0",
        "ParentEventID": [
          "B43C2D5B0AF39A3F"
        ],
        "Label": "set",
        "Title": "X-Trace Task",
        "Host": "pinky19.mpi-sws.org",
        "HRT": 26966774780761333,
        "Operation": "set",
        "Timestamp": "1557750414721.247070",
        "TenantClass": 0,
        "Source": "Client.java:302",
        "ThreadID": 40,
        "ThreadName": "",
        "EventID": "B126F93489D2DB1F",
        "ProcessID": 2801
      },
      {
        "Cycles": 0,
        "Agent": "Execution-Sleep",
        "ProcessName": "Read",
        "TaskID": "3F35DAB6F8C6CDB0",
        "ParentEventID": [
          "8A07BBB888A26972"
        ],
        "Label": "waited",
        "Title": "X-Trace Task",
        "Host": "pinky19.mpi-sws.org",
        "Duration": "455030",
        "HRT": 26966774780807860,
        "Operation": "waited",
        "Timestamp": "1557750414721.293457",
        "TenantClass": 0,
        "Source": "Client.java:1537",
        "ThreadID": 1,
        "ThreadName": "",
        "EventID": "EF60A46BA79D05D1",
        "ProcessID": 2801
      },
      {
        "Cycles": 0,
        "Agent": "Execution-CPU",
        "ProcessName": "Read",
        "TaskID": "3F35DAB6F8C6CDB0",
        "ParentEventID": [
          "B126F93489D2DB1F"
        ],
        "Label": "unset",
        "Title": "X-Trace Task",
        "Host": "pinky19.mpi-sws.org",
        "Duration": "5336",
        "HRT": 26966774780789901,
        "Operation": "unset",
        "Timestamp": "1557750414721.275635",
        "TenantClass": 0,
        "Source": "Client.java:1168",
        "ThreadID": 40,
        "ThreadName": "",
        "EventID": "66A5647BA45910B6",
        "ProcessID": 2801
      },
      {
        "Cycles": 0,
        "Agent": "edu.brown.cs.systems.xtrace.logging.BaggageWrappers",
        "ProcessName": "Read",
        "TaskID": "3F35DAB6F8C6CDB0",
        "ParentEventID": [
          "66A5647BA45910B6",
          "EF60A46BA79D05D1"
        ],
        "Label": "Merged current baggage with other baggage",
        "Title": "X-Trace Task",
        "Host": "pinky19.mpi-sws.org",
        "HRT": 26966774780818612,
        "Operation": "join",
        "Timestamp": "1557750414721.304199",
        "TenantClass": 0,
        "Source": "Client.java:1545",
        "ThreadID": 1,
        "ThreadName": "",
        "EventID": "A8FA4D2B7F9F847B",
        "ProcessID": 2801
      },
      {
        "Cycles": 0,
        "Agent": "org.apache.hadoop.ipc.ProtobufRpcEngine",
        "ProcessName": "Read",
        "TaskID": "3F35DAB6F8C6CDB0",
        "ParentEventID": [
          "A8FA4D2B7F9F847B"
        ],
        "Label": "org.apache.hadoop.hdfs.protocol.ClientProtocol.getBlockLocations completed",
        "Title": "X-Trace Task",
        "Host": "pinky19.mpi-sws.org",
        "HRT": 26966774780854018,
        "Timestamp": "1557750414721.339600",
        "TenantClass": 0,
        "Source": "ProtobufRpcEngine.java:275",
        "ThreadID": 1,
        "ThreadName": "",
        "EventID": "C7FA944454B60D22",
        "ProcessID": 2801
      },
      {
        "Cycles": 0,
        "Agent": "Execution-Sleep",
        "ProcessName": "Read",
        "TaskID": "3F35DAB6F8C6CDB0",
        "ParentEventID": [
          "C7FA944454B60D22"
        ],
        "Label": "waited",
        "Title": "X-Trace Task",
        "Host": "pinky19.mpi-sws.org",
        "Duration": "132251",
        "HRT": 26966774781063032,
        "Operation": "waited",
        "Timestamp": "1557750414721.548584",
        "TenantClass": 0,
        "Source": "SocketIOWithTimeout.java:335",
        "ThreadID": 1,
        "ThreadName": "",
        "EventID": "5A514EA5B7385959",
        "ProcessID": 2801
      },
      {
        "Cycles": 0,
        "Agent": "Execution-CPU",
        "ProcessName": "Data",
        "TaskID": "3F35DAB6F8C6CDB0",
        "ParentEventID": [
          "EBC605E552325EA3"
        ],
        "Label": "set",
        "Title": "X-Trace Task",
        "Host": "pinky20.mpi-sws.org",
        "HRT": 6569979140586131,
        "Operation": "set",
        "Timestamp": "1557750414721.841064",
        "TenantClass": 0,
        "Source": "Receiver.java:117",
        "ThreadID": 15341,
        "ThreadName": "",
        "EventID": "EF997570CDC7367D",
        "BaggageBytes": "[[248 5] [240 0] [0 63 53 218 182 248 198 205 176] [240 1] [0 235 198 5 229 82 50 94 163] [240 3] [0 2]]",
        "ProcessID": 13111
      },
      {
        "Cycles": 0,
        "Agent": "edu.brown.cs.systems.xtrace.logging.XTraceInit",
        "ProcessName": "Data",
        "TaskID": "3F35DAB6F8C6CDB0",
        "ParentEventID": [
          "EF997570CDC7367D"
        ],
        "Label": "Thread.setName: DataXceiver for client DFSClient_NONMAPREDUCE_310321604_1 at /139.19.171.63:57518 [Sending block BP-1633380353-139.19.171.63-1554193446451:blk_1073756347_15523]",
        "Title": "X-Trace Task",
        "Host": "pinky20.mpi-sws.org",
        "HRT": 6569979140626202,
        "Timestamp": "1557750414721.881104",
        "TenantClass": 0,
        "Source": "DataXceiver.java:168",
        "ThreadID": 15341,
        "ThreadName": "",
        "EventID": "95C395B61C19E075",
        "BaggageBytes": "[[248 5] [240 0] [0 63 53 218 182 248 198 205 176] [240 1] [0 239 153 117 112 205 199 54 125] [240 3] [0 2]]",
        "ProcessID": 13111
      },
      {
        "Cycles": 0,
        "Agent": "edu.brown.cs.systems.xtrace.logging.BaggageWrappers",
        "ProcessName": "Read",
        "TaskID": "3F35DAB6F8C6CDB0",
        "ParentEventID": [
          "5A514EA5B7385959"
        ],
        "Label": "Forking current baggage with Baggage.fork()",
        "Title": "X-Trace Task",
        "Host": "pinky19.mpi-sws.org",
        "HRT": 26966774781108096,
        "Operation": "fork",
        "Timestamp": "1557750414721.593750",
        "TenantClass": 0,
        "Source": "DataTransferProtoUtil.java:94",
        "ThreadID": 1,
        "ThreadName": "",
        "EventID": "EBC605E552325EA3",
        "ProcessID": 2801
      },
      {
        "Cycles": 0,
        "Agent": "Execution-Sleep",
        "ProcessName": "Read",
        "TaskID": "3F35DAB6F8C6CDB0",
        "ParentEventID": [
          "EBC605E552325EA3"
        ],
        "Label": "waited",
        "Title": "X-Trace Task",
        "Host": "pinky19.mpi-sws.org",
        "Duration": "465349",
        "HRT": 26966774781661134,
        "Operation": "waited",
        "Timestamp": "1557750414722.146729",
        "TenantClass": 0,
        "Source": "SocketIOWithTimeout.java:335",
        "ThreadID": 1,
        "ThreadName": "",
        "EventID": "FBC17478F7CFABE6",
        "ProcessID": 2801
      },
      {
        "Cycles": 0,
        "Agent": "edu.brown.cs.systems.xtrace.logging.BaggageWrappers",
        "ProcessName": "Read",
        "TaskID": "3F35DAB6F8C6CDB0",
        "ParentEventID": [
          "FBC17478F7CFABE6",
          "1F3E13FB0F39018B"
        ],
        "Label": "Merged current baggage with other baggage",
        "Title": "X-Trace Task",
        "Host": "pinky19.mpi-sws.org",
        "HRT": 26966774781716303,
        "Operation": "join",
        "Timestamp": "1557750414722.201904",
        "TenantClass": 0,
        "Source": "RemoteBlockReader2.java:429",
        "ThreadID": 1,
        "ThreadName": "",
        "EventID": "DD27A4C817371342",
        "ProcessID": 2801
      },
      {
        "Cycles": 0,
        "Agent": "edu.brown.cs.systems.xtrace.logging.BaggageWrappers",
        "ProcessName": "Data",
        "TaskID": "3F35DAB6F8C6CDB0",
        "ParentEventID": [
          "95C395B61C19E075"
        ],
        "Label": "Forking current baggage with Baggage.fork()",
        "Title": "X-Trace Task",
        "Host": "pinky20.mpi-sws.org",
        "HRT": 6569979140711183,
        "Operation": "fork",
        "Timestamp": "1557750414721.966064",
        "TenantClass": 0,
        "Source": "DataXceiver.java:1257",
        "ThreadID": 15341,
        "ThreadName": "",
        "EventID": "1F3E13FB0F39018B",
        "BaggageBytes": "[[248 5] [240 0] [0 63 53 218 182 248 198 205 176] [240 1] [0 149 195 149 182 28 25 224 117] [240 3] [0 2]]",
        "ProcessID": 13111
      },
      {
        "Cycles": 0,
        "Agent": "Execution-Sleep",
        "ProcessName": "Data",
        "TaskID": "3F35DAB6F8C6CDB0",
        "ParentEventID": [
          "17B309CB1FED1227"
        ],
        "Label": "waited",
        "Title": "X-Trace Task",
        "Host": "pinky20.mpi-sws.org",
        "Duration": "5877",
        "HRT": 6569979140838321,
        "Operation": "waited",
        "Timestamp": "1557750414722.093262",
        "TenantClass": 0,
        "Source": "SocketIOWithTimeout.java:335",
        "ThreadID": 15341,
        "ThreadName": "",
        "EventID": "5797C4AF455038B3",
        "BaggageBytes": "[[248 5] [240 0] [0 63 53 218 182 248 198 205 176] [240 1] [0 23 179 9 203 31 237 18 39] [240 3] [0 2]]",
        "ProcessID": 13111
      },
      {
        "Cycles": 0,
        "Agent": "edu.brown.cs.systems.xtrace.logging.BaggageWrappers",
        "ProcessName": "Data",
        "TaskID": "3F35DAB6F8C6CDB0",
        "ParentEventID": [
          "5797C4AF455038B3"
        ],
        "Label": "Forking current baggage with Baggage.fork()",
        "Title": "X-Trace Task",
        "Host": "pinky20.mpi-sws.org",
        "HRT": 6569979140918096,
        "Operation": "fork",
        "Timestamp": "1557750414722.173096",
        "TenantClass": 0,
        "Source": "PacketHeader.java:95",
        "ThreadID": 15341,
        "ThreadName": "",
        "EventID": "6D376A4407D09472",
        "BaggageBytes": "[[248 5] [240 0] [0 63 53 218 182 248 198 205 176] [240 1] [0 87 151 196 175 69 80 56 179] [240 3] [0 2]]",
        "ProcessID": 13111
      },
      {
        "Cycles": 0,
        "Agent": "edu.brown.cs.systems.xtrace.logging.BaggageWrappers",
        "ProcessName": "Data",
        "TaskID": "3F35DAB6F8C6CDB0",
        "ParentEventID": [
          "1F3E13FB0F39018B"
        ],
        "Label": "Forking current baggage with Baggage.fork()",
        "Title": "X-Trace Task",
        "Host": "pinky20.mpi-sws.org",
        "HRT": 6569979140772905,
        "Operation": "fork",
        "Timestamp": "1557750414722.027832",
        "TenantClass": 0,
        "Source": "PacketHeader.java:95",
        "ThreadID": 15341,
        "ThreadName": "",
        "EventID": "17B309CB1FED1227",
        "BaggageBytes": "[[248 5] [240 0] [0 63 53 218 182 248 198 205 176] [240 1] [0 31 62 19 251 15 57 1 139] [240 3] [0 2]]",
        "ProcessID": 13111
      },
      {
        "Cycles": 0,
        "Agent": "Execution-Sleep",
        "ProcessName": "Read",
        "TaskID": "3F35DAB6F8C6CDB0",
        "ParentEventID": [
          "DD27A4C817371342"
        ],
        "Label": "waited",
        "Title": "X-Trace Task",
        "Host": "pinky19.mpi-sws.org",
        "Duration": "243345",
        "HRT": 26966774782023774,
        "Operation": "waited",
        "Timestamp": "1557750414722.509521",
        "TenantClass": 0,
        "Source": "SocketIOWithTimeout.java:335",
        "ThreadID": 1,
        "ThreadName": "",
        "EventID": "62C1553D7E519B4C",
        "ProcessID": 2801
      },
      {
        "Cycles": 0,
        "Agent": "Execution-Sleep",
        "ProcessName": "Read",
        "TaskID": "3F35DAB6F8C6CDB0",
        "ParentEventID": [
          "9F7AB3BEDCBBFE06"
        ],
        "Label": "waited",
        "Title": "X-Trace Task",
        "Host": "pinky19.mpi-sws.org",
        "Duration": "145761",
        "HRT": 26966774782512143,
        "Operation": "waited",
        "Timestamp": "1557750414722.997803",
        "TenantClass": 0,
        "Source": "SocketIOWithTimeout.java:335",
        "ThreadID": 1,
        "ThreadName": "",
        "EventID": "B9ED0D3D92955915",
        "ProcessID": 2801
      },
      {
        "Cycles": 0,
        "Agent": "Execution-Sleep",
        "ProcessName": "Read",
        "TaskID": "3F35DAB6F8C6CDB0",
        "ParentEventID": [
          "62C1553D7E519B4C"
        ],
        "Label": "waited",
        "Title": "X-Trace Task",
        "Host": "pinky19.mpi-sws.org",
        "Duration": "229308",
        "HRT": 26966774782305873,
        "Operation": "waited",
        "Timestamp": "1557750414722.791504",
        "TenantClass": 0,
        "Source": "SocketIOWithTimeout.java:335",
        "ThreadID": 1,
        "ThreadName": "",
        "EventID": "9F7AB3BEDCBBFE06",
        "ProcessID": 2801
      },
      {
        "Cycles": 0,
        "Agent": "edu.brown.cs.systems.xtrace.logging.BaggageWrappers",
        "ProcessName": "Read",
        "TaskID": "3F35DAB6F8C6CDB0",
        "ParentEventID": [
          "B9ED0D3D92955915",
          "17B309CB1FED1227"
        ],
        "Label": "Merged current baggage with other baggage",
        "Title": "X-Trace Task",
        "Host": "pinky19.mpi-sws.org",
        "HRT": 26966774782578548,
        "Operation": "join",
        "Timestamp": "1557750414723.064209",
        "TenantClass": 0,
        "Source": "PacketHeader.java:168",
        "ThreadID": 1,
        "ThreadName": "",
        "EventID": "118F42379BD371F7",
        "ProcessID": 2801
      },
      {
        "Cycles": 0,
        "Agent": "edu.brown.cs.systems.xtrace.logging.BaggageWrappers",
        "ProcessName": "Read",
        "TaskID": "3F35DAB6F8C6CDB0",
        "ParentEventID": [
          "565EBF5D6C08E248"
        ],
        "Label": "Forking current baggage with Baggage.fork()",
        "Title": "X-Trace Task",
        "Host": "pinky19.mpi-sws.org",
        "HRT": 26966774782704322,
        "Operation": "fork",
        "Timestamp": "1557750414723.189941",
        "TenantClass": 0,
        "Source": "RemoteBlockReader2.java:361",
        "ThreadID": 1,
        "ThreadName": "",
        "EventID": "897FF1C104D3F35D",
        "ProcessID": 2801
      },
      {
        "Cycles": 0,
        "Agent": "edu.brown.cs.systems.xtrace.logging.BaggageWrappers",
        "ProcessName": "Read",
        "TaskID": "3F35DAB6F8C6CDB0",
        "ParentEventID": [
          "118F42379BD371F7",
          "6D376A4407D09472"
        ],
        "Label": "Merged current baggage with other baggage",
        "Title": "X-Trace Task",
        "Host": "pinky19.mpi-sws.org",
        "HRT": 26966774782694935,
        "Operation": "join",
        "Timestamp": "1557750414723.180664",
        "TenantClass": 0,
        "Source": "PacketHeader.java:168",
        "ThreadID": 1,
        "ThreadName": "",
        "EventID": "565EBF5D6C08E248",
        "ProcessID": 2801
      },
      {
        "Cycles": 0,
        "Agent": "edu.brown.cs.systems.xtrace.logging.BaggageWrappers",
        "ProcessName": "Read",
        "TaskID": "3F35DAB6F8C6CDB0",
        "ParentEventID": [
          "897FF1C104D3F35D"
        ],
        "Label": "Forking current baggage with Baggage.fork()",
        "Title": "X-Trace Task",
        "Host": "pinky19.mpi-sws.org",
        "HRT": 26966774782757341,
        "Operation": "fork",
        "Timestamp": "1557750414723.242920",
        "TenantClass": 0,
        "Source": "DataTransferProtoUtil.java:94",
        "ThreadID": 1,
        "ThreadName": "",
        "EventID": "DD93C0383636B5BA",
        "ProcessID": 2801
      },
      {
        "Cycles": 0,
        "Agent": "Execution-Sleep",
        "ProcessName": "Data",
        "TaskID": "3F35DAB6F8C6CDB0",
        "ParentEventID": [
          "6D376A4407D09472"
        ],
        "Label": "waited",
        "Title": "X-Trace Task",
        "Host": "pinky20.mpi-sws.org",
        "Duration": "942117",
        "HRT": 6569979141937114,
        "Operation": "waited",
        "Timestamp": "1557750414723.192139",
        "TenantClass": 0,
        "Source": "SocketIOWithTimeout.java:335",
        "ThreadID": 15341,
        "ThreadName": "",
        "EventID": "5334E9469A1937BD",
        "BaggageBytes": "[[248 5] [240 0] [0 63 53 218 182 248 198 205 176] [240 1] [0 109 55 106 68 7 208 148 114] [240 3] [0 2]]",
        "ProcessID": 13111
      },
      {
        "Cycles": 0,
        "Agent": "edu.brown.cs.systems.xtrace.logging.BaggageWrappers",
        "ProcessName": "Data",
        "TaskID": "3F35DAB6F8C6CDB0",
        "ParentEventID": [
          "5334E9469A1937BD",
          "897FF1C104D3F35D"
        ],
        "Label": "Merged current baggage with other baggage",
        "Title": "X-Trace Task",
        "Host": "pinky20.mpi-sws.org",
        "HRT": 6569979142170741,
        "Operation": "join",
        "Timestamp": "1557750414723.425781",
        "TenantClass": 0,
        "Source": "DataXceiver.java:574",
        "ThreadID": 15341,
        "ThreadName": "",
        "EventID": "2A5D8A12CD5357FB",
        "BaggageBytes": "[[248 5] [240 0] [0 63 53 218 182 248 198 205 176] [240 1] [0 137 127 241 193 4 211 243 93] [0 83 52 233 70 154 25 55 189] [240 3] [0 2]]",
        "ProcessID": 13111
      },
      {
        "Cycles": 0,
        "Agent": "Execution-CPU",
        "ProcessName": "Data",
        "TaskID": "3F35DAB6F8C6CDB0",
        "ParentEventID": [
          "DD93C0383636B5BA"
        ],
        "Label": "set",
        "Title": "X-Trace Task",
        "Host": "pinky20.mpi-sws.org",
        "HRT": 6569979142335488,
        "Operation": "set",
        "Timestamp": "1557750414723.590576",
        "TenantClass": 0,
        "Source": "Receiver.java:117",
        "ThreadID": 15341,
        "ThreadName": "",
        "EventID": "53BBEAC5BF0F076C",
        "BaggageBytes": "[[248 5] [240 0] [0 63 53 218 182 248 198 205 176] [240 1] [0 221 147 192 56 54 54 181 186] [240 3] [0 2]]",
        "ProcessID": 13111
      },
      {
        "Cycles": 0,
        "Agent": "Execution-CPU",
        "ProcessName": "Data",
        "TaskID": "3F35DAB6F8C6CDB0",
        "ParentEventID": [
          "2A5D8A12CD5357FB"
        ],
        "Label": "unset",
        "Title": "X-Trace Task",
        "Host": "pinky20.mpi-sws.org",
        "Duration": "1642655",
        "HRT": 6569979142259311,
        "Operation": "unset",
        "Timestamp": "1557750414723.514404",
        "TenantClass": 0,
        "Source": "DataXceiver.java:261",
        "ThreadID": 15341,
        "ThreadName": "",
        "EventID": "1126FB2BD68E96D5",
        "BaggageBytes": "[[248 5] [240 0] [0 63 53 218 182 248 198 205 176] [240 1] [0 42 93 138 18 205 83 87 251] [240 3] [0 2]]",
        "ProcessID": 13111
      },
      {
        "Cycles": 0,
        "Agent": "edu.brown.cs.systems.xtrace.logging.XTraceInit",
        "ProcessName": "Data",
        "TaskID": "3F35DAB6F8C6CDB0",
        "ParentEventID": [
          "53BBEAC5BF0F076C"
        ],
        "Label": "Thread.setName: DataXceiver for client DFSClient_NONMAPREDUCE_310321604_1 at /139.19.171.63:57518 [Sending block BP-1633380353-139.19.171.63-1554193446451:blk_1073756347_15523]",
        "Title": "X-Trace Task",
        "Host": "pinky20.mpi-sws.org",
        "HRT": 6569979142441525,
        "Timestamp": "1557750414723.696533",
        "TenantClass": 0,
        "Source": "DataXceiver.java:168",
        "ThreadID": 15341,
        "ThreadName": "",
        "EventID": "71622C62EC0D83A1",
        "BaggageBytes": "[[248 5] [240 0] [0 63 53 218 182 248 198 205 176] [240 1] [0 83 187 234 197 191 15 7 108] [240 3] [0 2]]",
        "ProcessID": 13111
      },
      {
        "Cycles": 0,
        "Agent": "Execution-Sleep",
        "ProcessName": "Read",
        "TaskID": "3F35DAB6F8C6CDB0",
        "ParentEventID": [
          "DD93C0383636B5BA"
        ],
        "Label": "waited",
        "Title": "X-Trace Task",
        "Host": "pinky19.mpi-sws.org",
        "Duration": "880523",
        "HRT": 26966774783712809,
        "Operation": "waited",
        "Timestamp": "1557750414724.198486",
        "TenantClass": 0,
        "Source": "SocketIOWithTimeout.java:335",
        "ThreadID": 1,
        "ThreadName": "",
        "EventID": "D0E00FCE02CF482D",
        "ProcessID": 2801
      },
      {
        "Cycles": 0,
        "Agent": "edu.brown.cs.systems.xtrace.logging.BaggageWrappers",
        "ProcessName": "Data",
        "TaskID": "3F35DAB6F8C6CDB0",
        "ParentEventID": [
          "71622C62EC0D83A1"
        ],
        "Label": "Forking current baggage with Baggage.fork()",
        "Title": "X-Trace Task",
        "Host": "pinky20.mpi-sws.org",
        "HRT": 6569979142692018,
        "Operation": "fork",
        "Timestamp": "1557750414723.947021",
        "TenantClass": 0,
        "Source": "DataXceiver.java:1257",
        "ThreadID": 15341,
        "ThreadName": "",
        "EventID": "E374A20AE45B58AC",
        "BaggageBytes": "[[248 5] [240 0] [0 63 53 218 182 248 198 205 176] [240 1] [0 113 98 44 98 236 13 131 161] [240 3] [0 2]]",
        "ProcessID": 13111
      },
      {
        "Cycles": 0,
        "Agent": "edu.brown.cs.systems.xtrace.logging.BaggageWrappers",
        "ProcessName": "Read",
        "TaskID": "3F35DAB6F8C6CDB0",
        "ParentEventID": [
          "D0E00FCE02CF482D",
          "E374A20AE45B58AC"
        ],
        "Label": "Merged current baggage with other baggage",
        "Title": "X-Trace Task",
        "Host": "pinky19.mpi-sws.org",
        "HRT": 26966774783762628,
        "Operation": "join",
        "Timestamp": "1557750414724.248291",
        "TenantClass": 0,
        "Source": "RemoteBlockReader2.java:429",
        "ThreadID": 1,
        "ThreadName": "",
        "EventID": "FAD6CF875EC01B9D",
        "ProcessID": 2801
      },
      {
        "Cycles": 0,
        "Agent": "edu.brown.cs.systems.xtrace.logging.BaggageWrappers",
        "ProcessName": "Data",
        "TaskID": "3F35DAB6F8C6CDB0",
        "ParentEventID": [
          "E374A20AE45B58AC"
        ],
        "Label": "Forking current baggage with Baggage.fork()",
        "Title": "X-Trace Task",
        "Host": "pinky20.mpi-sws.org",
        "HRT": 6569979142869655,
        "Operation": "fork",
        "Timestamp": "1557750414724.124756",
        "TenantClass": 0,
        "Source": "PacketHeader.java:95",
        "ThreadID": 15341,
        "ThreadName": "",
        "EventID": "B6FBB2A6DD8E1795",
        "BaggageBytes": "[[248 5] [240 0] [0 63 53 218 182 248 198 205 176] [240 1] [0 227 116 162 10 228 91 88 172] [240 3] [0 2]]",
        "ProcessID": 13111
      },
      {
        "Cycles": 0,
        "Agent": "Execution-Sleep",
        "ProcessName": "Read",
        "TaskID": "3F35DAB6F8C6CDB0",
        "ParentEventID": [
          "FAD6CF875EC01B9D"
        ],
        "Label": "waited",
        "Title": "X-Trace Task",
        "Host": "pinky19.mpi-sws.org",
        "Duration": "83599",
        "HRT": 26966774783882885,
        "Operation": "waited",
        "Timestamp": "1557750414724.368652",
        "TenantClass": 0,
        "Source": "SocketIOWithTimeout.java:335",
        "ThreadID": 1,
        "ThreadName": "",
        "EventID": "890B07BA65859BC0",
        "ProcessID": 2801
      },
      {
        "Cycles": 0,
        "Agent": "edu.brown.cs.systems.xtrace.logging.BaggageWrappers",
        "ProcessName": "Data",
        "TaskID": "3F35DAB6F8C6CDB0",
        "ParentEventID": [
          "213193774848BD50"
        ],
        "Label": "Forking current baggage with Baggage.fork()",
        "Title": "X-Trace Task",
        "Host": "pinky20.mpi-sws.org",
        "HRT": 6569979143267949,
        "Operation": "fork",
        "Timestamp": "1557750414724.522949",
        "TenantClass": 0,
        "Source": "PacketHeader.java:95",
        "ThreadID": 15341,
        "ThreadName": "",
        "EventID": "F25F20D106DA3F85",
        "BaggageBytes": "[[248 5] [240 0] [0 63 53 218 182 248 198 205 176] [240 1] [0 33 49 147 119 72 72 189 80] [240 3] [0 2]]",
        "ProcessID": 13111
      },
      {
        "Cycles": 0,
        "Agent": "Execution-Sleep",
        "ProcessName": "Data",
        "TaskID": "3F35DAB6F8C6CDB0",
        "ParentEventID": [
          "B6FBB2A6DD8E1795"
        ],
        "Label": "waited",
        "Title": "X-Trace Task",
        "Host": "pinky20.mpi-sws.org",
        "Duration": "12210",
        "HRT": 6569979143045752,
        "Operation": "waited",
        "Timestamp": "1557750414724.300781",
        "TenantClass": 0,
        "Source": "SocketIOWithTimeout.java:335",
        "ThreadID": 15341,
        "ThreadName": "",
        "EventID": "213193774848BD50",
        "BaggageBytes": "[[248 5] [240 0] [0 63 53 218 182 248 198 205 176] [240 1] [0 182 251 178 166 221 142 23 149] [240 3] [0 2]]",
        "ProcessID": 13111
      },
      {
        "Cycles": 0,
        "Agent": "Execution-Sleep",
        "ProcessName": "Read",
        "TaskID": "3F35DAB6F8C6CDB0",
        "ParentEventID": [
          "890B07BA65859BC0"
        ],
        "Label": "waited",
        "Title": "X-Trace Task",
        "Host": "pinky19.mpi-sws.org",
        "Duration": "407942",
        "HRT": 26966774784350014,
        "Operation": "waited",
        "Timestamp": "1557750414724.835693",
        "TenantClass": 0,
        "Source": "SocketIOWithTimeout.java:335",
        "ThreadID": 1,
        "ThreadName": "",
        "EventID": "2FCA03C8BCFBD25C",
        "ProcessID": 2801
      },
      {
        "Cycles": 0,
        "Agent": "Execution-Sleep",
        "ProcessName": "Data",
        "TaskID": "3F35DAB6F8C6CDB0",
        "ParentEventID": [
          "F25F20D106DA3F85"
        ],
        "Label": "waited",
        "Title": "X-Trace Task",
        "Host": "pinky20.mpi-sws.org",
        "Duration": "162427",
        "HRT": 6569979143557646,
        "Operation": "waited",
        "Timestamp": "1557750414724.812744",
        "TenantClass": 0,
        "Source": "SocketIOWithTimeout.java:335",
        "ThreadID": 15341,
        "ThreadName": "",
        "EventID": "1D0402823BB12650",
        "BaggageBytes": "[[248 5] [240 0] [0 63 53 218 182 248 198 205 176] [240 1] [0 242 95 32 209 6 218 63 133] [240 3] [0 2]]",
        "ProcessID": 13111
      },
      {
        "Cycles": 0,
        "Agent": "Execution-Sleep",
        "ProcessName": "Read",
        "TaskID": "3F35DAB6F8C6CDB0",
        "ParentEventID": [
          "2FCA03C8BCFBD25C"
        ],
        "Label": "waited",
        "Title": "X-Trace Task",
        "Host": "pinky19.mpi-sws.org",
        "Duration": "154183",
        "HRT": 26966774784566446,
        "Operation": "waited",
        "Timestamp": "1557750414725.052002",
        "TenantClass": 0,
        "Source": "SocketIOWithTimeout.java:335",
        "ThreadID": 1,
        "ThreadName": "",
        "EventID": "C46A710B33BAA9C6",
        "ProcessID": 2801
      },
      {
        "Cycles": 0,
        "Agent": "Execution-Sleep",
        "ProcessName": "Read",
        "TaskID": "3F35DAB6F8C6CDB0",
        "ParentEventID": [
          "C46A710B33BAA9C6"
        ],
        "Label": "waited",
        "Title": "X-Trace Task",
        "Host": "pinky19.mpi-sws.org",
        "Duration": "141730",
        "HRT": 26966774784768223,
        "Operation": "waited",
        "Timestamp": "1557750414725.253906",
        "TenantClass": 0,
        "Source": "SocketIOWithTimeout.java:335",
        "ThreadID": 1,
        "ThreadName": "",
        "EventID": "98314C1F561234AB",
        "ProcessID": 2801
      },
      {
        "Cycles": 0,
        "Agent": "edu.brown.cs.systems.xtrace.logging.BaggageWrappers",
        "ProcessName": "Data",
        "TaskID": "3F35DAB6F8C6CDB0",
        "ParentEventID": [
          "1D0402823BB12650"
        ],
        "Label": "Forking current baggage with Baggage.fork()",
        "Title": "X-Trace Task",
        "Host": "pinky20.mpi-sws.org",
        "HRT": 6569979143701913,
        "Operation": "fork",
        "Timestamp": "1557750414724.956787",
        "TenantClass": 0,
        "Source": "PacketHeader.java:95",
        "ThreadID": 15341,
        "ThreadName": "",
        "EventID": "B435727FD093087B",
        "BaggageBytes": "[[248 5] [240 0] [0 63 53 218 182 248 198 205 176] [240 1] [0 29 4 2 130 59 177 38 80] [240 3] [0 2]]",
        "ProcessID": 13111
      },
      {
        "Cycles": 0,
        "Agent": "Execution-Sleep",
        "ProcessName": "Read",
        "TaskID": "3F35DAB6F8C6CDB0",
        "ParentEventID": [
          "98314C1F561234AB"
        ],
        "Label": "waited",
        "Title": "X-Trace Task",
        "Host": "pinky19.mpi-sws.org",
        "Duration": "169414",
        "HRT": 26966774784981894,
        "Operation": "waited",
        "Timestamp": "1557750414725.467529",
        "TenantClass": 0,
        "Source": "SocketIOWithTimeout.java:335",
        "ThreadID": 1,
        "ThreadName": "",
        "EventID": "43183DF98BBE2479",
        "ProcessID": 2801
      },
      {
        "Cycles": 0,
        "Agent": "Execution-Sleep",
        "ProcessName": "Data",
        "TaskID": "3F35DAB6F8C6CDB0",
        "ParentEventID": [
          "B435727FD093087B"
        ],
        "Label": "waited",
        "Title": "X-Trace Task",
        "Host": "pinky20.mpi-sws.org",
        "Duration": "10017",
        "HRT": 6569979143898150,
        "Operation": "waited",
        "Timestamp": "1557750414725.153076",
        "TenantClass": 0,
        "Source": "SocketIOWithTimeout.java:335",
        "ThreadID": 15341,
        "ThreadName": "",
        "EventID": "C41CC0D63FE4CEFD",
        "BaggageBytes": "[[248 5] [240 0] [0 63 53 218 182 248 198 205 176] [240 1] [0 180 53 114 127 208 147 8 123] [240 3] [0 2]]",
        "ProcessID": 13111
      },
      {
        "Cycles": 0,
        "Agent": "edu.brown.cs.systems.xtrace.logging.BaggageWrappers",
        "ProcessName": "Read",
        "TaskID": "3F35DAB6F8C6CDB0",
        "ParentEventID": [
          "B6FBB2A6DD8E1795",
          "43183DF98BBE2479"
        ],
        "Label": "Merged current baggage with other baggage",
        "Title": "X-Trace Task",
        "Host": "pinky19.mpi-sws.org",
        "HRT": 26966774785021088,
        "Operation": "join",
        "Timestamp": "1557750414725.506836",
        "TenantClass": 0,
        "Source": "PacketHeader.java:168",
        "ThreadID": 1,
        "ThreadName": "",
        "EventID": "5FC8AC75AC6D2CD9",
        "ProcessID": 2801
      },
      {
        "Cycles": 0,
        "Agent": "edu.brown.cs.systems.xtrace.logging.BaggageWrappers",
        "ProcessName": "Data",
        "TaskID": "3F35DAB6F8C6CDB0",
        "ParentEventID": [
          "C41CC0D63FE4CEFD"
        ],
        "Label": "Forking current baggage with Baggage.fork()",
        "Title": "X-Trace Task",
        "Host": "pinky20.mpi-sws.org",
        "HRT": 6569979144074337,
        "Operation": "fork",
        "Timestamp": "1557750414725.329346",
        "TenantClass": 0,
        "Source": "PacketHeader.java:95",
        "ThreadID": 15341,
        "ThreadName": "",
        "EventID": "E83EADF55C7D65CA",
        "BaggageBytes": "[[248 5] [240 0] [0 63 53 218 182 248 198 205 176] [240 1] [0 196 28 192 214 63 228 206 253] [240 3] [0 2]]",
        "ProcessID": 13111
      },
      {
        "Cycles": 0,
        "Agent": "Execution-Sleep",
        "ProcessName": "Data",
        "TaskID": "3F35DAB6F8C6CDB0",
        "ParentEventID": [
          "E83EADF55C7D65CA"
        ],
        "Label": "waited",
        "Title": "X-Trace Task",
        "Host": "pinky20.mpi-sws.org",
        "Duration": "10057",
        "HRT": 6569979144289877,
        "Operation": "waited",
        "Timestamp": "1557750414725.544922",
        "TenantClass": 0,
        "Source": "SocketIOWithTimeout.java:335",
        "ThreadID": 15341,
        "ThreadName": "",
        "EventID": "29E27CC809644332",
        "BaggageBytes": "[[248 5] [240 0] [0 63 53 218 182 248 198 205 176] [240 1] [0 232 62 173 245 92 125 101 202] [240 3] [0 2]]",
        "ProcessID": 13111
      },
      {
        "Cycles": 0,
        "Agent": "Execution-CPU",
        "ProcessName": "Data",
        "TaskID": "3F35DAB6F8C6CDB0",
        "ParentEventID": [
          "29E27CC809644332"
        ],
        "Label": "unset",
        "Title": "X-Trace Task",
        "Host": "pinky20.mpi-sws.org",
        "Duration": "2230927",
        "HRT": 6569979144647158,
        "Operation": "unset",
        "Timestamp": "1557750414725.902100",
        "TenantClass": 0,
        "Source": "DataXceiver.java:261",
        "ThreadID": 15341,
        "ThreadName": "",
        "EventID": "F009403DCB8CC463",
        "BaggageBytes": "[[248 5] [240 0] [0 63 53 218 182 248 198 205 176] [240 1] [0 41 226 124 200 9 100 67 50] [240 3] [0 2]]",
        "ProcessID": 13111
      },
      {
        "Cycles": 0,
        "Agent": "edu.brown.cs.systems.retro.benchmarks.hdfs_client.Reader",
        "ProcessName": "Read",
        "TaskID": "3F35DAB6F8C6CDB0",
        "ParentEventID": [
          "0"
        ],
        "Label": "Reading file",
        "Title": "X-Trace Task",
        "Host": "pinky19.mpi-sws.org",
        "HRT": 26966774780162431,
        "Timestamp": "1557750414720.648193",
        "TenantClass": 0,
        "ThreadID": 1,
        "ThreadName": "",
        "EventID": "7430B56CFE4676CD",
        "ProcessID": 2801,
        "Tag": [
          "reader_100kb",
          "Read Size: 102400"
        ]
      }
    ]
  }
]