[
  {
    "id": "AE5F14EA3C8834DC",
    "reports": [
      {
        "Cycles": 0,
        "Agent": "Execution-CPU",
        "ProcessName": "Read",
        "TaskID": "AE5F14EA3C8834DC",
        "ParentEventID": [
          "83C4C0DB736344AD"
        ],
        "Label": "unset",
        "Title": "X-Trace Task",
        "Host": "pinky19.mpi-sws.org",
        "Duration": "22263994",
        "HRT": 26962582648808229,
        "Operation": "unset",
        "Timestamp": "1557746222588.970459",
        "TenantClass": 0,
        "Source": "Client.java:1027",
        "ThreadID": 1,
        "ThreadName": "",
        "EventID": "F7B9CB3E264792B3",
        "ProcessID": 36430
      },
      {
        "Cycles": 0,
        "Agent": "edu.brown.cs.systems.retro.benchmarks.hdfs_client.Reader",
        "ProcessName": "Read",
        "TaskID": "AE5F14EA3C8834DC",
        "ParentEventID": [
          "6650B204A1A27692"
        ],
        "Label": "Reading file",
        "Title": "X-Trace Task",
        "Host": "pinky19.mpi-sws.org",
        "HRT": 26962582648765874,
        "Timestamp": "1557746222588.928223",
        "TenantClass": 0,
        "ThreadID": 1,
        "ThreadName": "",
        "EventID": "44A9F8A2BF6357E3",
        "ProcessID": 36430
      },
      {
        "Cycles": 0,
        "Agent": "org.apache.hadoop.ipc.ProtobufRpcEngine",
        "ProcessName": "Read",
        "TaskID": "AE5F14EA3C8834DC",
        "ParentEventID": [
          "44A9F8A2BF6357E3"
        ],
        "Label": "Invoking org.apache.hadoop.hdfs.protocol.ClientProtocol.getBlockLocations",
        "Title": "X-Trace Task",
        "Host": "pinky19.mpi-sws.org",
        "HRT": 26962582648789374,
        "Timestamp": "1557746222588.951660",
        "TenantClass": 0,
        "Source": "ProtobufRpcEngine.java:228",
        "ThreadID": 1,
        "ThreadName": "",
        "EventID": "83C4C0DB736344AD",
        "ProcessID": 36430
      },
      {
        "Cycles": 0,
        "Agent": "edu.brown.cs.systems.xtrace.logging.BaggageWrappers",
        "ProcessName": "Read",
        "TaskID": "AE5F14EA3C8834DC",
        "ParentEventID": [
          "2AA763B1D1C20485"
        ],
        "Label": "Forking current baggage with Baggage.fork()",
        "Title": "X-Trace Task",
        "Host": "pinky19.mpi-sws.org",
        "HRT": 26962582648855935,
        "Operation": "fork",
        "Timestamp": "1557746222589.018311",
        "TenantClass": 0,
        "Source": "Client.java:1043",
        "ThreadID": 41,
        "ThreadName": "",
        "EventID": "4572D162B0767C5A",
        "ProcessID": 36430
      },
      {
        "Cycles": 0,
        "Agent": "Execution-CPU",
        "ProcessName": "Read",
        "TaskID": "AE5F14EA3C8834DC",
        "ParentEventID": [
          "F7B9CB3E264792B3"
        ],
        "Label": "set",
        "Title": "X-Trace Task",
        "Host": "pinky19.mpi-sws.org",
        "HRT": 26962582648833262,
        "Operation": "set",
        "Timestamp": "1557746222588.995605",
        "TenantClass": 0,
        "Source": "Client.java:1032",
        "ThreadID": 41,
        "ThreadName": "",
        "EventID": "2AA763B1D1C20485",
        "ProcessID": 36430
      },
      {
        "Cycles": 0,
        "Agent": "Execution-CPU",
        "ProcessName": "Read",
        "TaskID": "AE5F14EA3C8834DC",
        "ParentEventID": [
          "4572D162B0767C5A"
        ],
        "Label": "unset",
        "Title": "X-Trace Task",
        "Host": "pinky19.mpi-sws.org",
        "Duration": "74532",
        "HRT": 26962582648929283,
        "Operation": "unset",
        "Timestamp": "1557746222589.091553",
        "TenantClass": 0,
        "Source": "Client.java:1062",
        "ThreadID": 41,
        "ThreadName": "",
        "EventID": "4ECAB6540989C2BA",
        "ProcessID": 36430
      },
      {
        "Cycles": 0,
        "Agent": "Execution-CPU",
        "ProcessName": "Read",
        "TaskID": "AE5F14EA3C8834DC",
        "ParentEventID": [
          "4ECAB6540989C2BA"
        ],
        "Label": "set",
        "Title": "X-Trace Task",
        "Host": "pinky19.mpi-sws.org",
        "HRT": 26962582648955490,
        "Operation": "set",
        "Timestamp": "1557746222589.117920",
        "TenantClass": 0,
        "Source": "Client.java:1104",
        "ThreadID": 1,
        "ThreadName": "",
        "EventID": "9307D853F4AFEB37",
        "ProcessID": 36430
      },
      {
        "Cycles": 0,
        "Agent": "edu.brown.cs.systems.xtrace.logging.BaggageWrappers",
        "ProcessName": "Name",
        "TaskID": "AE5F14EA3C8834DC",
        "ParentEventID": [
          "6E003A568AA87BC3"
        ],
        "Label": "Forking current baggage with Baggage.fork()",
        "Title": "X-Trace Task",
        "Host": "pinky19.mpi-sws.org",
        "HRT": 26962582649032240,
        "Operation": "fork",
        "Timestamp": "1557746222589.195801",
        "TenantClass": 0,
        "Source": "Server.java:550",
        "ThreadID": 48,
        "ThreadName": "",
        "EventID": "371797E42414FB3B",
        "BaggageBytes": "[[248 5] [240 0] [0 174 95 20 234 60 136 52 220] [240 1] [0 110 0 58 86 138 168 123 195] [240 3] [0 2]]",
        "ProcessID": 2171
      },
      {
        "Cycles": 0,
        "Agent": "Execution-CPU",
        "ProcessName": "Name",
        "TaskID": "AE5F14EA3C8834DC",
        "ParentEventID": [
          "4572D162B0767C5A"
        ],
        "Label": "set",
        "Title": "X-Trace Task",
        "Host": "pinky19.mpi-sws.org",
        "HRT": 26962582649002192,
        "Operation": "set",
        "Timestamp": "1557746222589.165771",
        "TenantClass": 0,
        "Source": "Server.java:1840",
        "ThreadID": 48,
        "ThreadName": "",
        "EventID": "6E003A568AA87BC3",
        "BaggageBytes": "[[248 5] [240 0] [0 174 95 20 234 60 136 52 220] [240 1] [0 69 114 209 98 176 118 124 90] [240 3] [0 2]]",
        "ProcessID": 2171
      },
      {
        "Cycles": 0,
        "Agent": "Execution-CPU",
        "ProcessName": "Name",
        "TaskID": "AE5F14EA3C8834DC",
        "ParentEventID": [
          "371797E42414FB3B"
        ],
        "Label": "unset",
        "Title": "X-Trace Task",
        "Host": "pinky19.mpi-sws.org",
        "Duration": "26951",
        "HRT": 26962582649055260,
        "Operation": "unset",
        "Timestamp": "1557746222589.218750",
        "TenantClass": 0,
        "Source": "Server.java:1828",
        "ThreadID": 48,
        "ThreadName": "",
        "EventID": "755BAADB43B8EDF7",
        "BaggageBytes": "[[248 5] [240 0] [0 174 95 20 234 60 136 52 220] [240 1] [0 55 23 151 228 36 20 251 59] [240 3] [0 2]]",
        "ProcessID": 2171
      },
      {
        "Cycles": 0,
        "Agent": "org.apache.hadoop.ipc.Server",
        "ProcessName": "Name",
        "TaskID": "AE5F14EA3C8834DC",
        "ParentEventID": [
          "84C05630D50D295F"
        ],
        "Label": "getBlockLocations in org.apache.hadoop.hdfs.protocol.ClientProtocol",
        "Title": "X-Trace Task",
        "Host": "pinky19.mpi-sws.org",
        "HRT": 26962582649095242,
        "Timestamp": "1557746222589.258789",
        "TenantClass": 0,
        "Source": "ProtobufRpcEngine.java:601",
        "ThreadID": 57,
        "ThreadName": "",
        "EventID": "0530440E90B17F8A",
        "BaggageBytes": "[[248 5] [240 0] [0 174 95 20 234 60 136 52 220] [240 1] [0 132 192 86 48 213 13 41 95] [240 3] [0 2]]",
        "ProcessID": 2171
      },
      {
        "Cycles": 0,
        "Agent": "Execution-CPU",
        "ProcessName": "Name",
        "TaskID": "AE5F14EA3C8834DC",
        "ParentEventID": [
          "371797E42414FB3B"
        ],
        "Label": "set",
        "Title": "X-Trace Task",
        "Host": "pinky19.mpi-sws.org",
        "HRT": 26962582649062077,
        "Operation": "set",
        "Timestamp": "1557746222589.225586",
        "TenantClass": 0,
        "Source": "Server.java:2071",
        "ThreadID": 57,
        "ThreadName": "",
        "EventID": "84C05630D50D295F",
        "BaggageBytes": "[[248 5] [240 0] [0 174 95 20 234 60 136 52 220] [240 1] [0 55 23 151 228 36 20 251 59] [240 3] [0 2]]",
        "ProcessID": 2171
      },
      {
        "Cycles": 0,
        "Agent": "org.apache.hadoop.hdfs.server.namenode.FSNamesystem.audit",
        "ProcessName": "Name",
        "TaskID": "AE5F14EA3C8834DC",
        "ParentEventID": [
          "0530440E90B17F8A"
        ],
        "Label": "allowed=true\tugi=plascas (auth:SIMPLE)\tip=/139.19.171.63\tcmd=open\tsrc=/ds/7nwc5Sb8Ercv8olG\tdst=null\tperm=null\tproto=rpc",
        "Title": "X-Trace Task",
        "Host": "pinky19.mpi-sws.org",
        "HRT": 26962582649143855,
        "Timestamp": "1557746222589.307373",
        "TenantClass": 0,
        "Source": "FSNamesystem.java:8313",
        "ThreadID": 57,
        "ThreadName": "",
        "EventID": "1DF74113E3A5A9A0",
        "BaggageBytes": "[[248 5] [240 0] [0 174 95 20 234 60 136 52 220] [240 1] [0 5 48 68 14 144 177 127 138] [240 3] [0 2]]",
        "ProcessID": 2171
      },
      {
        "Cycles": 0,
        "Agent": "Execution-CPU",
        "ProcessName": "Name",
        "TaskID": "AE5F14EA3C8834DC",
        "ParentEventID": [
          "7A8E6425FF355E97"
        ],
        "Label": "unset",
        "Title": "X-Trace Task",
        "Host": "pinky19.mpi-sws.org",
        "Duration": "206589",
        "HRT": 26962582649290722,
        "Operation": "unset",
        "Timestamp": "1557746222589.454346",
        "TenantClass": 0,
        "Source": "Server.java:1058",
        "ThreadID": 57,
        "ThreadName": "",
        "EventID": "29E2746EFDFCEAC7",
        "BaggageBytes": "[[248 5] [240 0] [0 174 95 20 234 60 136 52 220] [240 1] [0 122 142 100 37 255 53 94 151] [240 3] [0 2]]",
        "ProcessID": 2171
      },
      {
        "Cycles": 0,
        "Agent": "Execution-CPU",
        "ProcessName": "Read",
        "TaskID": "AE5F14EA3C8834DC",
        "ParentEventID": [
          "7A8E6425FF355E97"
        ],
        "Label": "set",
        "Title": "X-Trace Task",
        "Host": "pinky19.mpi-sws.org",
        "HRT": 26962582649334417,
        "Operation": "set",
        "Timestamp": "1557746222589.496826",
        "TenantClass": 0,
        "Source": "Client.java:302",
        "ThreadID": 37,
        "ThreadName": "",
        "EventID": "0945165BFB1E9181",
        "ProcessID": 36430
      },
      {
        "Cycles": 0,
        "Agent": "edu.brown.cs.systems.xtrace.logging.BaggageWrappers",
        "ProcessName": "Name",
        "TaskID": "AE5F14EA3C8834DC",
        "ParentEventID": [
          "1DF74113E3A5A9A0"
        ],
        "Label": "Forking current baggage with Baggage.fork()",
        "Title": "X-Trace Task",
        "Host": "pinky19.mpi-sws.org",
        "HRT": 26962582649185846,
        "Operation": "fork",
        "Timestamp": "1557746222589.349365",
        "TenantClass": 0,
        "Source": "Server.java:2398",
        "ThreadID": 57,
        "ThreadName": "",
        "EventID": "7A8E6425FF355E97",
        "BaggageBytes": "[[248 5] [240 0] [0 174 95 20 234 60 136 52 220] [240 1] [0 29 247 65 19 227 165 169 160] [240 3] [0 2]]",
        "ProcessID": 2171
      },
      {
        "Cycles": 0,
        "Agent": "Execution-CPU",
        "ProcessName": "Read",
        "TaskID": "AE5F14EA3C8834DC",
        "ParentEventID": [
          "0945165BFB1E9181"
        ],
        "Label": "unset",
        "Title": "X-Trace Task",
        "Host": "pinky19.mpi-sws.org",
        "Duration": "6519",
        "HRT": 26962582649351802,
        "Operation": "unset",
        "Timestamp": "1557746222589.514160",
        "TenantClass": 0,
        "Source": "Client.java:1168",
        "ThreadID": 37,
        "ThreadName": "",
        "EventID": "08B4D8AA33C6F399",
        "ProcessID": 36430
      },
      {
        "Cycles": 0,
        "Agent": "Execution-Sleep",
        "ProcessName": "Read",
        "TaskID": "AE5F14EA3C8834DC",
        "ParentEventID": [
          "9307D853F4AFEB37"
        ],
        "Label": "waited",
        "Title": "X-Trace Task",
        "Host": "pinky19.mpi-sws.org",
        "Duration": "403792",
        "HRT": 26962582649368147,
        "Operation": "waited",
        "Timestamp": "1557746222589.530518",
        "TenantClass": 0,
        "Source": "Client.java:1537",
        "ThreadID": 1,
        "ThreadName": "",
        "EventID": "95D8E70B990C61ED",
        "ProcessID": 36430
      },
      {
        "Cycles": 0,
        "Agent": "edu.brown.cs.systems.xtrace.logging.BaggageWrappers",
        "ProcessName": "Read",
        "TaskID": "AE5F14EA3C8834DC",
        "ParentEventID": [
          "95D8E70B990C61ED",
          "08B4D8AA33C6F399"
        ],
        "Label": "Merged current baggage with other baggage",
        "Title": "X-Trace Task",
        "Host": "pinky19.mpi-sws.org",
        "HRT": 26962582649398813,
        "Operation": "join",
        "Timestamp": "1557746222589.561035",
        "TenantClass": 0,
        "Source": "Client.java:1545",
        "ThreadID": 1,
        "ThreadName": "",
        "EventID": "0E7490431F35ACA6",
        "ProcessID": 36430
      },
      {
        "Cycles": 0,
        "Agent": "edu.brown.cs.systems.xtrace.logging.BaggageWrappers",
        "ProcessName": "Read",
        "TaskID": "AE5F14EA3C8834DC",
        "ParentEventID": [
          "DCF43E5E45D3AD6F"
        ],
        "Label": "Forking current baggage with Baggage.fork()",
        "Title": "X-Trace Task",
        "Host": "pinky19.mpi-sws.org",
        "HRT": 26962582649527450,
        "Operation": "fork",
        "Timestamp": "1557746222589.689697",
        "TenantClass": 0,
        "Source": "DataTransferProtoUtil.java:94",
        "ThreadID": 1,
        "ThreadName": "",
        "EventID": "DA214779B22DDF7D",
        "ProcessID": 36430
      },
      {
        "Cycles": 0,
        "Agent": "org.apache.hadoop.ipc.ProtobufRpcEngine",
        "ProcessName": "Read",
        "TaskID": "AE5F14EA3C8834DC",
        "ParentEventID": [
          "0E7490431F35ACA6"
        ],
        "Label": "org.apache.hadoop.hdfs.protocol.ClientProtocol.getBlockLocations completed",
        "Title": "X-Trace Task",
        "Host": "pinky19.mpi-sws.org",
        "HRT": 26962582649457461,
        "Timestamp": "1557746222589.619873",
        "TenantClass": 0,
        "Source": "ProtobufRpcEngine.java:275",
        "ThreadID": 1,
        "ThreadName": "",
        "EventID": "DCF43E5E45D3AD6F",
        "ProcessID": 36430
      },
      {
        "Cycles": 0,
        "Agent": "Execution-CPU",
        "ProcessName": "Data",
        "TaskID": "AE5F14EA3C8834DC",
        "ParentEventID": [
          "DA214779B22DDF7D"
        ],
        "Label": "set",
        "Title": "X-Trace Task",
        "Host": "pinky22.mpi-sws.org",
        "HRT": 47512554904272191,
        "Operation": "set",
        "Timestamp": "1557746222589.897461",
        "TenantClass": 0,
        "Source": "Receiver.java:117",
        "ThreadID": 15142,
        "ThreadName": "",
        "EventID": "97DFB6DCB8847319",
        "BaggageBytes": "[[248 5] [240 0] [0 174 95 20 234 60 136 52 220] [240 1] [0 218 33 71 121 178 45 223 125] [240 3] [0 2]]",
        "ProcessID": 28841
      },
      {
        "Cycles": 0,
        "Agent": "edu.brown.cs.systems.xtrace.logging.BaggageWrappers",
        "ProcessName": "Data",
        "TaskID": "AE5F14EA3C8834DC",
        "ParentEventID": [
          "B27D7F8E1F3A6185"
        ],
        "Label": "Forking current baggage with Baggage.fork()",
        "Title": "X-Trace Task",
        "Host": "pinky22.mpi-sws.org",
        "HRT": 47512554904498191,
        "Operation": "fork",
        "Timestamp": "1557746222590.123291",
        "TenantClass": 0,
        "Source": "DataXceiver.java:1257",
        "ThreadID": 15142,
        "ThreadName": "",
        "EventID": "9D9280A607CF874B",
        "BaggageBytes": "[[248 5] [240 0] [0 174 95 20 234 60 136 52 220] [240 1] [0 178 125 127 142 31 58 97 133] [240 3] [0 2]]",
        "ProcessID": 28841
      },
      {
        "Cycles": 0,
        "Agent": "edu.brown.cs.systems.xtrace.logging.XTraceInit",
        "ProcessName": "Data",
        "TaskID": "AE5F14EA3C8834DC",
        "ParentEventID": [
          "97DFB6DCB8847319"
        ],
        "Label": "Thread.setName: DataXceiver for client DFSClient_NONMAPREDUCE_778905418_1 at /139.19.171.63:45362 [Sending block BP-1633380353-139.19.171.63-1554193446451:blk_1073759995_19171]",
        "Title": "X-Trace Task",
        "Host": "pinky22.mpi-sws.org",
        "HRT": 47512554904339917,
        "Timestamp": "1557746222589.965088",
        "TenantClass": 0,
        "Source": "DataXceiver.java:168",
        "ThreadID": 15142,
        "ThreadName": "",
        "EventID": "B27D7F8E1F3A6185",
        "BaggageBytes": "[[248 5] [240 0] [0 174 95 20 234 60 136 52 220] [240 1] [0 151 223 182 220 184 132 115 25] [240 3] [0 2]]",
        "ProcessID": 28841
      },
      {
        "Cycles": 0,
        "Agent": "Execution-Sleep",
        "ProcessName": "Read",
        "TaskID": "AE5F14EA3C8834DC",
        "ParentEventID": [
          "DA214779B22DDF7D"
        ],
        "Label": "waited",
        "Title": "X-Trace Task",
        "Host": "pinky19.mpi-sws.org",
        "Duration": "474234",
        "HRT": 26962582650091577,
        "Operation": "waited",
        "Timestamp": "1557746222590.253906",
        "TenantClass": 0,
        "Source": "SocketIOWithTimeout.java:335",
        "ThreadID": 1,
        "ThreadName": "",
        "EventID": "8A55CF578018B3A0",
        "ProcessID": 36430
      },
      {
        "Cycles": 0,
        "Agent": "edu.brown.cs.systems.xtrace.logging.BaggageWrappers",
        "ProcessName": "Read",
        "TaskID": "AE5F14EA3C8834DC",
        "ParentEventID": [
          "8A55CF578018B3A0",
          "9D9280A607CF874B"
        ],
        "Label": "Merged current baggage with other baggage",
        "Title": "X-Trace Task",
        "Host": "pinky19.mpi-sws.org",
        "HRT": 26962582650163450,
        "Operation": "join",
        "Timestamp": "1557746222590.325684",
        "TenantClass": 0,
        "Source": "RemoteBlockReader2.java:429",
        "ThreadID": 1,
        "ThreadName": "",
        "EventID": "19C03598A2E3049F",
        "ProcessID": 36430
      },
      {
        "Cycles": 0,
        "Agent": "edu.brown.cs.systems.xtrace.logging.BaggageWrappers",
        "ProcessName": "Data",
        "TaskID": "AE5F14EA3C8834DC",
        "ParentEventID": [
          "9D9280A607CF874B"
        ],
        "Label": "Forking current baggage with Baggage.fork()",
        "Title": "X-Trace Task",
        "Host": "pinky22.mpi-sws.org",
        "HRT": 47512554904640668,
        "Operation": "fork",
        "Timestamp": "1557746222590.265869",
        "TenantClass": 0,
        "Source": "PacketHeader.java:95",
        "ThreadID": 15142,
        "ThreadName": "",
        "EventID": "03FD0B3C560A4EA9",
        "BaggageBytes": "[[248 5] [240 0] [0 174 95 20 234 60 136 52 220] [240 1] [0 157 146 128 166 7 207 135 75] [240 3] [0 2]]",
        "ProcessID": 28841
      },
      {
        "Cycles": 0,
        "Agent": "edu.brown.cs.systems.xtrace.logging.BaggageWrappers",
        "ProcessName": "Data",
        "TaskID": "AE5F14EA3C8834DC",
        "ParentEventID": [
          "A434B8FC679B7152"
        ],
        "Label": "Forking current baggage with Baggage.fork()",
        "Title": "X-Trace Task",
        "Host": "pinky22.mpi-sws.org",
        "HRT": 47512554904913522,
        "Operation": "fork",
        "Timestamp": "1557746222590.538818",
        "TenantClass": 0,
        "Source": "PacketHeader.java:95",
        "ThreadID": 15142,
        "ThreadName": "",
        "EventID": "05BB3EC151D04328",
        "BaggageBytes": "[[248 5] [240 0] [0 174 95 20 234 60 136 52 220] [240 1] [0 164 52 184 252 103 155 113 82] [240 3] [0 2]]",
        "ProcessID": 28841
      },
      {
        "Cycles": 0,
        "Agent": "Execution-Sleep",
        "ProcessName": "Read",
        "TaskID": "AE5F14EA3C8834DC",
        "ParentEventID": [
          "19C03598A2E3049F"
        ],
        "Label": "waited",
        "Title": "X-Trace Task",
        "Host": "pinky19.mpi-sws.org",
        "Duration": "242843",
        "HRT": 26962582650485889,
        "Operation": "waited",
        "Timestamp": "1557746222590.648193",
        "TenantClass": 0,
        "Source": "SocketIOWithTimeout.java:335",
        "ThreadID": 1,
        "ThreadName": "",
        "EventID": "1365A5A39362503D",
        "ProcessID": 36430
      },
      {
        "Cycles": 0,
        "Agent": "Execution-Sleep",
        "ProcessName": "Data",
        "TaskID": "AE5F14EA3C8834DC",
        "ParentEventID": [
          "03FD0B3C560A4EA9"
        ],
        "Label": "waited",
        "Title": "X-Trace Task",
        "Host": "pinky22.mpi-sws.org",
        "Duration": "8057",
        "HRT": 47512554904761952,
        "Operation": "waited",
        "Timestamp": "1557746222590.387207",
        "TenantClass": 0,
        "Source": "SocketIOWithTimeout.java:335",
        "ThreadID": 15142,
        "ThreadName": "",
        "EventID": "A434B8FC679B7152",
        "BaggageBytes": "[[248 5] [240 0] [0 174 95 20 234 60 136 52 220] [240 1] [0 3 253 11 60 86 10 78 169] [240 3] [0 2]]",
        "ProcessID": 28841
      },
      {
        "Cycles": 0,
        "Agent": "edu.brown.cs.systems.xtrace.logging.BaggageWrappers",
        "ProcessName": "Read",
        "TaskID": "AE5F14EA3C8834DC",
        "ParentEventID": [
          "03FD0B3C560A4EA9",
          "1365A5A39362503D"
        ],
        "Label": "Merged current baggage with other baggage",
        "Title": "X-Trace Task",
        "Host": "pinky19.mpi-sws.org",
        "HRT": 26962582650547842,
        "Operation": "join",
        "Timestamp": "1557746222590.710205",
        "TenantClass": 0,
        "Source": "PacketHeader.java:168",
        "ThreadID": 1,
        "ThreadName": "",
        "EventID": "6CBA388B66AC338A",
        "ProcessID": 36430
      },
      {
        "Cycles": 0,
        "Agent": "edu.brown.cs.systems.xtrace.logging.BaggageWrappers",
        "ProcessName": "Read",
        "TaskID": "AE5F14EA3C8834DC",
        "ParentEventID": [
          "1A25865ECAE1AD71"
        ],
        "Label": "Forking current baggage with Baggage.fork()",
        "Title": "X-Trace Task",
        "Host": "pinky19.mpi-sws.org",
        "HRT": 26962582650634755,
        "Operation": "fork",
        "Timestamp": "1557746222590.797119",
        "TenantClass": 0,
        "Source": "RemoteBlockReader2.java:361",
        "ThreadID": 1,
        "ThreadName": "",
        "EventID": "BBBBD3D57C62E8A6",
        "ProcessID": 36430
      },
      {
        "Cycles": 0,
        "Agent": "edu.brown.cs.systems.xtrace.logging.BaggageWrappers",
        "ProcessName": "Read",
        "TaskID": "AE5F14EA3C8834DC",
        "ParentEventID": [
          "05BB3EC151D04328",
          "6CBA388B66AC338A"
        ],
        "Label": "Merged current baggage with other baggage",
        "Title": "X-Trace Task",
        "Host": "pinky19.mpi-sws.org",
        "HRT": 26962582650624735,
        "Operation": "join",
        "Timestamp": "1557746222590.787109",
        "TenantClass": 0,
        "Source": "PacketHeader.java:168",
        "ThreadID": 1,
        "ThreadName": "",
        "EventID": "1A25865ECAE1AD71",
        "ProcessID": 36430
      },
      {
        "Cycles": 0,
        "Agent": "Execution-Sleep",
        "ProcessName": "Data",
        "TaskID": "AE5F14EA3C8834DC",
        "ParentEventID": [
          "05BB3EC151D04328"
        ],
        "Label": "waited",
        "Title": "X-Trace Task",
        "Host": "pinky22.mpi-sws.org",
        "Duration": "176504",
        "HRT": 47512554905266433,
        "Operation": "waited",
        "Timestamp": "1557746222590.891602",
        "TenantClass": 0,
        "Source": "SocketIOWithTimeout.java:335",
        "ThreadID": 15142,
        "ThreadName": "",
        "EventID": "9658C36D73AAB2A7",
        "BaggageBytes": "[[248 5] [240 0] [0 174 95 20 234 60 136 52 220] [240 1] [0 5 187 62 193 81 208 67 40] [240 3] [0 2]]",
        "ProcessID": 28841
      },
      {
        "Cycles": 0,
        "Agent": "Execution-CPU",
        "ProcessName": "Data",
        "TaskID": "AE5F14EA3C8834DC",
        "ParentEventID": [
          "995BFF6C63A98F41"
        ],
        "Label": "unset",
        "Title": "X-Trace Task",
        "Host": "pinky22.mpi-sws.org",
        "Duration": "1127646",
        "HRT": 47512554905445817,
        "Operation": "unset",
        "Timestamp": "1557746222591.071045",
        "TenantClass": 0,
        "Source": "DataXceiver.java:261",
        "ThreadID": 15142,
        "ThreadName": "",
        "EventID": "739E4387DB791339",
        "BaggageBytes": "[[248 5] [240 0] [0 174 95 20 234 60 136 52 220] [240 1] [0 153 91 255 108 99 169 143 65] [240 3] [0 2]]",
        "ProcessID": 28841
      },
      {
        "Cycles": 0,
        "Agent": "edu.brown.cs.systems.xtrace.logging.BaggageWrappers",
        "ProcessName": "Data",
        "TaskID": "AE5F14EA3C8834DC",
        "ParentEventID": [
          "BBBBD3D57C62E8A6",
          "9658C36D73AAB2A7"
        ],
        "Label": "Merged current baggage with other baggage",
        "Title": "X-Trace Task",
        "Host": "pinky22.mpi-sws.org",
        "HRT": 47512554905374213,
        "Operation": "join",
        "Timestamp": "1557746222590.999512",
        "TenantClass": 0,
        "Source": "DataXceiver.java:574",
        "ThreadID": 15142,
        "ThreadName": "",
        "EventID": "995BFF6C63A98F41",
        "BaggageBytes": "[[248 5] [240 0] [0 174 95 20 234 60 136 52 220] [240 1] [0 150 88 195 109 115 170 178 167] [0 187 187 211 213 124 98 232 166] [240 3] [0 2]]",
        "ProcessID": 28841
      },
      {
        "Cycles": 0,
        "Agent": "edu.brown.cs.systems.retro.benchmarks.hdfs_client.Reader",
        "ProcessName": "Read",
        "TaskID": "AE5F14EA3C8834DC",
        "ParentEventID": [
          "0"
        ],
        "Label": "Reading file",
        "Title": "X-Trace Task",
        "Host": "pinky19.mpi-sws.org",
        "HRT": 26962582648749697,
        "Timestamp": "1557746222588.912109",
        "TenantClass": 0,
        "ThreadID": 1,
        "ThreadName": "",
        "EventID": "6650B204A1A27692",
        "ProcessID": 36430,
        "Tag": [
          "reader_10kb",
          "Read Size: 10240"
        ]
      }
    ]
  }
]