[
  {
    "id": "22D8C01DC11C3EAD",
    "reports": [
      {
        "Cycles": 0,
        "Agent": "Execution-CPU",
        "ProcessName": "Read",
        "TaskID": "22D8C01DC11C3EAD",
        "ParentEventID": [
          "B81BB5E8282A4207"
        ],
        "Label": "unset",
        "Title": "X-Trace Task",
        "Host": "pinky19.mpi-sws.org",
        "Duration": "22210264",
        "HRT": 26962646853334297,
        "Operation": "unset",
        "Timestamp": "1557746286793.654297",
        "TenantClass": 0,
        "Source": "Client.java:1027",
        "ThreadID": 1,
        "ThreadName": "",
        "EventID": "56DDC7CE655F62C1",
        "ProcessID": 36430
      },
      {
        "Cycles": 0,
        "Agent": "org.apache.hadoop.ipc.ProtobufRpcEngine",
        "ProcessName": "Read",
        "TaskID": "22D8C01DC11C3EAD",
        "ParentEventID": [
          "F54C2A7D06E29656"
        ],
        "Label": "Invoking org.apache.hadoop.hdfs.protocol.ClientProtocol.getBlockLocations",
        "Title": "X-Trace Task",
        "Host": "pinky19.mpi-sws.org",
        "HRT": 26962646853318979,
        "Timestamp": "1557746286793.638916",
        "TenantClass": 0,
        "Source": "ProtobufRpcEngine.java:228",
        "ThreadID": 1,
        "ThreadName": "",
        "EventID": "B81BB5E8282A4207",
        "ProcessID": 36430
      },
      {
        "Cycles": 0,
        "Agent": "edu.brown.cs.systems.retro.benchmarks.hdfs_client.Reader",
        "ProcessName": "Read",
        "TaskID": "22D8C01DC11C3EAD",
        "ParentEventID": [
          "0"
        ],
        "Label": "Reading file",
        "Title": "X-Trace Task",
        "Host": "pinky19.mpi-sws.org",
        "HRT": 26962646853266607,
        "Timestamp": "1557746286793.586670",
        "TenantClass": 0,
        "ThreadID": 1,
        "ThreadName": "",
        "EventID": "A63AA6815F7E9459",
        "ProcessID": 36430,
        "Tag": [
          "reader_10kb",
          "Read Size: 10240"
        ]
      },
      {
        "Cycles": 0,
        "Agent": "edu.brown.cs.systems.xtrace.logging.BaggageWrappers",
        "ProcessName": "Read",
        "TaskID": "22D8C01DC11C3EAD",
        "ParentEventID": [
          "3DA115282BFC069C"
        ],
        "Label": "Forking current baggage with Baggage.fork()",
        "Title": "X-Trace Task",
        "Host": "pinky19.mpi-sws.org",
        "HRT": 26962646853392257,
        "Operation": "fork",
        "Timestamp": "1557746286793.712158",
        "TenantClass": 0,
        "Source": "Client.java:1043",
        "ThreadID": 41,
        "ThreadName": "",
        "EventID": "37834F48A74EEBFE",
        "ProcessID": 36430
      },
      {
        "Cycles": 0,
        "Agent": "Execution-CPU",
        "ProcessName": "Read",
        "TaskID": "22D8C01DC11C3EAD",
        "ParentEventID": [
          "56DDC7CE655F62C1"
        ],
        "Label": "set",
        "Title": "X-Trace Task",
        "Host": "pinky19.mpi-sws.org",
        "HRT": 26962646853376855,
        "Operation": "set",
        "Timestamp": "1557746286793.696777",
        "TenantClass": 0,
        "Source": "Client.java:1032",
        "ThreadID": 41,
        "ThreadName": "",
        "EventID": "3DA115282BFC069C",
        "ProcessID": 36430
      },
      {
        "Cycles": 0,
        "Agent": "Execution-CPU",
        "ProcessName": "Read",
        "TaskID": "22D8C01DC11C3EAD",
        "ParentEventID": [
          "3902A03C016F8669"
        ],
        "Label": "set",
        "Title": "X-Trace Task",
        "Host": "pinky19.mpi-sws.org",
        "HRT": 26962646853489252,
        "Operation": "set",
        "Timestamp": "1557746286793.809326",
        "TenantClass": 0,
        "Source": "Client.java:1104",
        "ThreadID": 1,
        "ThreadName": "",
        "EventID": "5C115A9D2B603D88",
        "ProcessID": 36430
      },
      {
        "Cycles": 0,
        "Agent": "Execution-CPU",
        "ProcessName": "Name",
        "TaskID": "22D8C01DC11C3EAD",
        "ParentEventID": [
          "37834F48A74EEBFE"
        ],
        "Label": "set",
        "Title": "X-Trace Task",
        "Host": "pinky19.mpi-sws.org",
        "HRT": 26962646853558645,
        "Operation": "set",
        "Timestamp": "1557746286793.878662",
        "TenantClass": 0,
        "Source": "Server.java:1840",
        "ThreadID": 48,
        "ThreadName": "",
        "EventID": "BD3EF4DFB1F5C04D",
        "BaggageBytes": "[[248 5] [240 0] [0 34 216 192 29 193 28 62 173] [240 1] [0 55 131 79 72 167 78 235 254] [240 3] [0 2]]",
        "ProcessID": 2171
      },
      {
        "Cycles": 0,
        "Agent": "Execution-CPU",
        "ProcessName": "Read",
        "TaskID": "22D8C01DC11C3EAD",
        "ParentEventID": [
          "37834F48A74EEBFE"
        ],
        "Label": "unset",
        "Title": "X-Trace Task",
        "Host": "pinky19.mpi-sws.org",
        "Duration": "76841",
        "HRT": 26962646853467857,
        "Operation": "unset",
        "Timestamp": "1557746286793.787842",
        "TenantClass": 0,
        "Source": "Client.java:1062",
        "ThreadID": 41,
        "ThreadName": "",
        "EventID": "3902A03C016F8669",
        "ProcessID": 36430
      },
      {
        "Cycles": 0,
        "Agent": "Execution-CPU",
        "ProcessName": "Name",
        "TaskID": "22D8C01DC11C3EAD",
        "ParentEventID": [
          "C71401D7B62F1F4A"
        ],
        "Label": "unset",
        "Title": "X-Trace Task",
        "Host": "pinky19.mpi-sws.org",
        "Duration": "27607",
        "HRT": 26962646853618979,
        "Operation": "unset",
        "Timestamp": "1557746286793.939209",
        "TenantClass": 0,
        "Source": "Server.java:1828",
        "ThreadID": 48,
        "ThreadName": "",
        "EventID": "067D14048D3B2827",
        "BaggageBytes": "[[248 5] [240 0] [0 34 216 192 29 193 28 62 173] [240 1] [0 199 20 1 215 182 47 31 74] [240 3] [0 2]]",
        "ProcessID": 2171
      },
      {
        "Cycles": 0,
        "Agent": "Execution-CPU",
        "ProcessName": "Name",
        "TaskID": "22D8C01DC11C3EAD",
        "ParentEventID": [
          "C71401D7B62F1F4A"
        ],
        "Label": "set",
        "Title": "X-Trace Task",
        "Host": "pinky19.mpi-sws.org",
        "HRT": 26962646853628063,
        "Operation": "set",
        "Timestamp": "1557746286793.948242",
        "TenantClass": 0,
        "Source": "Server.java:2071",
        "ThreadID": 55,
        "ThreadName": "",
        "EventID": "F87C432D0926946D",
        "BaggageBytes": "[[248 5] [240 0] [0 34 216 192 29 193 28 62 173] [240 1] [0 199 20 1 215 182 47 31 74] [240 3] [0 2]]",
        "ProcessID": 2171
      },
      {
        "Cycles": 0,
        "Agent": "edu.brown.cs.systems.xtrace.logging.BaggageWrappers",
        "ProcessName": "Name",
        "TaskID": "22D8C01DC11C3EAD",
        "ParentEventID": [
          "BD3EF4DFB1F5C04D"
        ],
        "Label": "Forking current baggage with Baggage.fork()",
        "Title": "X-Trace Task",
        "Host": "pinky19.mpi-sws.org",
        "HRT": 26962646853596422,
        "Operation": "fork",
        "Timestamp": "1557746286793.916504",
        "TenantClass": 0,
        "Source": "Server.java:550",
        "ThreadID": 48,
        "ThreadName": "",
        "EventID": "C71401D7B62F1F4A",
        "BaggageBytes": "[[248 5] [240 0] [0 34 216 192 29 193 28 62 173] [240 1] [0 189 62 244 223 177 245 192 77] [240 3] [0 2]]",
        "ProcessID": 2171
      },
      {
        "Cycles": 0,
        "Agent": "org.apache.hadoop.ipc.Server",
        "ProcessName": "Name",
        "TaskID": "22D8C01DC11C3EAD",
        "ParentEventID": [
          "F87C432D0926946D"
        ],
        "Label": "getBlockLocations in org.apache.hadoop.hdfs.protocol.ClientProtocol",
        "Title": "X-Trace Task",
        "Host": "pinky19.mpi-sws.org",
        "HRT": 26962646853676929,
        "Timestamp": "1557746286793.997070",
        "TenantClass": 0,
        "Source": "ProtobufRpcEngine.java:601",
        "ThreadID": 55,
        "ThreadName": "",
        "EventID": "B4AC710BA035763D",
        "BaggageBytes": "[[248 5] [240 0] [0 34 216 192 29 193 28 62 173] [240 1] [0 248 124 67 45 9 38 148 109] [240 3] [0 2]]",
        "ProcessID": 2171
      },
      {
        "Cycles": 0,
        "Agent": "edu.brown.cs.systems.xtrace.logging.BaggageWrappers",
        "ProcessName": "Name",
        "TaskID": "22D8C01DC11C3EAD",
        "ParentEventID": [
          "96AC8A28B6DCC0E7"
        ],
        "Label": "Forking current baggage with Baggage.fork()",
        "Title": "X-Trace Task",
        "Host": "pinky19.mpi-sws.org",
        "HRT": 26962646853795784,
        "Operation": "fork",
        "Timestamp": "1557746286794.115967",
        "TenantClass": 0,
        "Source": "Server.java:2398",
        "ThreadID": 55,
        "ThreadName": "",
        "EventID": "EA6141A5147D16ED",
        "BaggageBytes": "[[248 5] [240 0] [0 34 216 192 29 193 28 62 173] [240 1] [0 150 172 138 40 182 220 192 231] [240 3] [0 2]]",
        "ProcessID": 2171
      },
      {
        "Cycles": 0,
        "Agent": "org.apache.hadoop.hdfs.server.namenode.FSNamesystem.audit",
        "ProcessName": "Name",
        "TaskID": "22D8C01DC11C3EAD",
        "ParentEventID": [
          "B4AC710BA035763D"
        ],
        "Label": "allowed=true\tugi=plascas (auth:SIMPLE)\tip=/139.19.171.63\tcmd=open\tsrc=/ds/zwPWv0EtrQEBiVoK\tdst=null\tperm=null\tproto=rpc",
        "Title": "X-Trace Task",
        "Host": "pinky19.mpi-sws.org",
        "HRT": 26962646853731567,
        "Timestamp": "1557746286794.051758",
        "TenantClass": 0,
        "Source": "FSNamesystem.java:8313",
        "ThreadID": 55,
        "ThreadName": "",
        "EventID": "96AC8A28B6DCC0E7",
        "BaggageBytes": "[[248 5] [240 0] [0 34 216 192 29 193 28 62 173] [240 1] [0 180 172 113 11 160 53 118 61] [240 3] [0 2]]",
        "ProcessID": 2171
      },
      {
        "Cycles": 0,
        "Agent": "Execution-CPU",
        "ProcessName": "Name",
        "TaskID": "22D8C01DC11C3EAD",
        "ParentEventID": [
          "EA6141A5147D16ED"
        ],
        "Label": "unset",
        "Title": "X-Trace Task",
        "Host": "pinky19.mpi-sws.org",
        "Duration": "258760",
        "HRT": 26962646853920548,
        "Operation": "unset",
        "Timestamp": "1557746286794.240723",
        "TenantClass": 0,
        "Source": "Server.java:1058",
        "ThreadID": 55,
        "ThreadName": "",
        "EventID": "F75D4A771AF953B5",
        "BaggageBytes": "[[248 5] [240 0] [0 34 216 192 29 193 28 62 173] [240 1] [0 234 97 65 165 20 125 22 237] [240 3] [0 2]]",
        "ProcessID": 2171
      },
      {
        "Cycles": 0,
        "Agent": "Execution-CPU",
        "ProcessName": "Read",
        "TaskID": "22D8C01DC11C3EAD",
        "ParentEventID": [
          "EA6141A5147D16ED"
        ],
        "Label": "set",
        "Title": "X-Trace Task",
        "Host": "pinky19.mpi-sws.org",
        "HRT": 26962646853962464,
        "Operation": "set",
        "Timestamp": "1557746286794.282471",
        "TenantClass": 0,
        "Source": "Client.java:302",
        "ThreadID": 37,
        "ThreadName": "",
        "EventID": "0DB3A9B9CECCC7A3",
        "ProcessID": 36430
      },
      {
        "Cycles": 0,
        "Agent": "Execution-Sleep",
        "ProcessName": "Read",
        "TaskID": "22D8C01DC11C3EAD",
        "ParentEventID": [
          "5C115A9D2B603D88"
        ],
        "Label": "waited",
        "Title": "X-Trace Task",
        "Host": "pinky19.mpi-sws.org",
        "Duration": "508218",
        "HRT": 26962646854006619,
        "Operation": "waited",
        "Timestamp": "1557746286794.326660",
        "TenantClass": 0,
        "Source": "Client.java:1537",
        "ThreadID": 1,
        "ThreadName": "",
        "EventID": "15DB84FEBA95C28C",
        "ProcessID": 36430
      },
      {
        "Cycles": 0,
        "Agent": "Execution-CPU",
        "ProcessName": "Read",
        "TaskID": "22D8C01DC11C3EAD",
        "ParentEventID": [
          "0DB3A9B9CECCC7A3"
        ],
        "Label": "unset",
        "Title": "X-Trace Task",
        "Host": "pinky19.mpi-sws.org",
        "Duration": "5895",
        "HRT": 26962646853984704,
        "Operation": "unset",
        "Timestamp": "1557746286794.304688",
        "TenantClass": 0,
        "Source": "Client.java:1168",
        "ThreadID": 37,
        "ThreadName": "",
        "EventID": "8F1A0FFFE24188CB",
        "ProcessID": 36430
      },
      {
        "Cycles": 0,
        "Agent": "edu.brown.cs.systems.xtrace.logging.BaggageWrappers",
        "ProcessName": "Read",
        "TaskID": "22D8C01DC11C3EAD",
        "ParentEventID": [
          "15DB84FEBA95C28C",
          "8F1A0FFFE24188CB"
        ],
        "Label": "Merged current baggage with other baggage",
        "Title": "X-Trace Task",
        "Host": "pinky19.mpi-sws.org",
        "HRT": 26962646854018267,
        "Operation": "join",
        "Timestamp": "1557746286794.338135",
        "TenantClass": 0,
        "Source": "Client.java:1545",
        "ThreadID": 1,
        "ThreadName": "",
        "EventID": "0843D98710B1ABE6",
        "ProcessID": 36430
      },
      {
        "Cycles": 0,
        "Agent": "org.apache.hadoop.ipc.ProtobufRpcEngine",
        "ProcessName": "Read",
        "TaskID": "22D8C01DC11C3EAD",
        "ParentEventID": [
          "0843D98710B1ABE6"
        ],
        "Label": "org.apache.hadoop.hdfs.protocol.ClientProtocol.getBlockLocations completed",
        "Title": "X-Trace Task",
        "Host": "pinky19.mpi-sws.org",
        "HRT": 26962646854052438,
        "Timestamp": "1557746286794.372314",
        "TenantClass": 0,
        "Source": "ProtobufRpcEngine.java:275",
        "ThreadID": 1,
        "ThreadName": "",
        "EventID": "378FFFAA8D7A4FD4",
        "ProcessID": 36430
      },
      {
        "Cycles": 0,
        "Agent": "edu.brown.cs.systems.xtrace.logging.BaggageWrappers",
        "ProcessName": "Read",
        "TaskID": "22D8C01DC11C3EAD",
        "ParentEventID": [
          "378FFFAA8D7A4FD4"
        ],
        "Label": "Forking current baggage with Baggage.fork()",
        "Title": "X-Trace Task",
        "Host": "pinky19.mpi-sws.org",
        "HRT": 26962646854103077,
        "Operation": "fork",
        "Timestamp": "1557746286794.423096",
        "TenantClass": 0,
        "Source": "DataTransferProtoUtil.java:94",
        "ThreadID": 1,
        "ThreadName": "",
        "EventID": "0583BDB6F95CE0B1",
        "ProcessID": 36430
      },
      {
        "Cycles": 0,
        "Agent": "edu.brown.cs.systems.xtrace.logging.XTraceInit",
        "ProcessName": "Data",
        "TaskID": "22D8C01DC11C3EAD",
        "ParentEventID": [
          "6901B309090A4961"
        ],
        "Label": "Thread.setName: DataXceiver for client DFSClient_NONMAPREDUCE_778905418_1 at /139.19.171.63:35320 [Sending block BP-1633380353-139.19.171.63-1554193446451:blk_1073759363_18539]",
        "Title": "X-Trace Task",
        "Host": "pinky21.mpi-sws.org",
        "HRT": 10808956560795189,
        "Timestamp": "1557746286794.846436",
        "TenantClass": 0,
        "Source": "DataXceiver.java:168",
        "ThreadID": 14875,
        "ThreadName": "",
        "EventID": "00ADDE3DF670978C",
        "BaggageBytes": "[[248 5] [240 0] [0 34 216 192 29 193 28 62 173] [240 1] [0 105 1 179 9 9 10 73 97] [240 3] [0 2]]",
        "ProcessID": 20775
      },
      {
        "Cycles": 0,
        "Agent": "Execution-CPU",
        "ProcessName": "Data",
        "TaskID": "22D8C01DC11C3EAD",
        "ParentEventID": [
          "0583BDB6F95CE0B1"
        ],
        "Label": "set",
        "Title": "X-Trace Task",
        "Host": "pinky21.mpi-sws.org",
        "HRT": 10808956560693749,
        "Operation": "set",
        "Timestamp": "1557746286794.745117",
        "TenantClass": 0,
        "Source": "Receiver.java:117",
        "ThreadID": 14875,
        "ThreadName": "",
        "EventID": "6901B309090A4961",
        "BaggageBytes": "[[248 5] [240 0] [0 34 216 192 29 193 28 62 173] [240 1] [0 5 131 189 182 249 92 224 177] [240 3] [0 2]]",
        "ProcessID": 20775
      },
      {
        "Cycles": 0,
        "Agent": "edu.brown.cs.systems.retro.benchmarks.hdfs_client.Reader",
        "ProcessName": "Read",
        "TaskID": "22D8C01DC11C3EAD",
        "ParentEventID": [
          "A63AA6815F7E9459"
        ],
        "Label": "Reading file",
        "Title": "X-Trace Task",
        "Host": "pinky19.mpi-sws.org",
        "HRT": 26962646853294331,
        "Timestamp": "1557746286793.614258",
        "TenantClass": 0,
        "ThreadID": 1,
        "ThreadName": "",
        "EventID": "F54C2A7D06E29656",
        "ProcessID": 36430
      },
      {
        "Cycles": 0,
        "Agent": "edu.brown.cs.systems.xtrace.logging.BaggageWrappers",
        "ProcessName": "Data",
        "TaskID": "22D8C01DC11C3EAD",
        "ParentEventID": [
          "00ADDE3DF670978C"
        ],
        "Label": "Forking current baggage with Baggage.fork()",
        "Title": "X-Trace Task",
        "Host": "pinky21.mpi-sws.org",
        "HRT": 10808956571691038,
        "Operation": "fork",
        "Timestamp": "1557746286805.742188",
        "TenantClass": 0,
        "Source": "DataXceiver.java:1257",
        "ThreadID": 14875,
        "ThreadName": "",
        "EventID": "5206682EA0CE9590",
        "BaggageBytes": "[[248 5] [240 0] [0 34 216 192 29 193 28 62 173] [240 1] [0 0 173 222 61 246 112 151 140] [240 3] [0 2]]",
        "ProcessID": 20775
      },
      {
        "Cycles": 0,
        "Agent": "edu.brown.cs.systems.xtrace.logging.BaggageWrappers",
        "ProcessName": "Data",
        "TaskID": "22D8C01DC11C3EAD",
        "ParentEventID": [
          "5206682EA0CE9590"
        ],
        "Label": "Forking current baggage with Baggage.fork()",
        "Title": "X-Trace Task",
        "Host": "pinky21.mpi-sws.org",
        "HRT": 10808956571765376,
        "Operation": "fork",
        "Timestamp": "1557746286805.816650",
        "TenantClass": 0,
        "Source": "PacketHeader.java:95",
        "ThreadID": 14875,
        "ThreadName": "",
        "EventID": "8ED49CE82D080F5C",
        "BaggageBytes": "[[248 5] [240 0] [0 34 216 192 29 193 28 62 173] [240 1] [0 82 6 104 46 160 206 149 144] [240 3] [0 2]]",
        "ProcessID": 20775
      },
      {
        "Cycles": 0,
        "Agent": "Execution-Sleep",
        "ProcessName": "Data",
        "TaskID": "22D8C01DC11C3EAD",
        "ParentEventID": [
          "8ED49CE82D080F5C"
        ],
        "Label": "waited",
        "Title": "X-Trace Task",
        "Host": "pinky21.mpi-sws.org",
        "Duration": "14752",
        "HRT": 10808956571838325,
        "Operation": "waited",
        "Timestamp": "1557746286805.889648",
        "TenantClass": 0,
        "Source": "SocketIOWithTimeout.java:335",
        "ThreadID": 14875,
        "ThreadName": "",
        "EventID": "2031C82CBE3DDDD9",
        "BaggageBytes": "[[248 5] [240 0] [0 34 216 192 29 193 28 62 173] [240 1] [0 142 212 156 232 45 8 15 92] [240 3] [0 2]]",
        "ProcessID": 20775
      },
      {
        "Cycles": 0,
        "Agent": "Execution-Sleep",
        "ProcessName": "Read",
        "TaskID": "22D8C01DC11C3EAD",
        "ParentEventID": [
          "0583BDB6F95CE0B1"
        ],
        "Label": "waited",
        "Title": "X-Trace Task",
        "Host": "pinky19.mpi-sws.org",
        "Duration": "11359526",
        "HRT": 26962646865546430,
        "Operation": "waited",
        "Timestamp": "1557746286805.866455",
        "TenantClass": 0,
        "Source": "SocketIOWithTimeout.java:335",
        "ThreadID": 1,
        "ThreadName": "",
        "EventID": "4CB97E4F6E32193B",
        "ProcessID": 36430
      },
      {
        "Cycles": 0,
        "Agent": "edu.brown.cs.systems.xtrace.logging.BaggageWrappers",
        "ProcessName": "Read",
        "TaskID": "22D8C01DC11C3EAD",
        "ParentEventID": [
          "4CB97E4F6E32193B",
          "5206682EA0CE9590"
        ],
        "Label": "Merged current baggage with other baggage",
        "Title": "X-Trace Task",
        "Host": "pinky19.mpi-sws.org",
        "HRT": 26962646865634310,
        "Operation": "join",
        "Timestamp": "1557746286805.954346",
        "TenantClass": 0,
        "Source": "RemoteBlockReader2.java:429",
        "ThreadID": 1,
        "ThreadName": "",
        "EventID": "A44C2D5AFA26D801",
        "ProcessID": 36430
      },
      {
        "Cycles": 0,
        "Agent": "edu.brown.cs.systems.xtrace.logging.BaggageWrappers",
        "ProcessName": "Data",
        "TaskID": "22D8C01DC11C3EAD",
        "ParentEventID": [
          "2031C82CBE3DDDD9"
        ],
        "Label": "Forking current baggage with Baggage.fork()",
        "Title": "X-Trace Task",
        "Host": "pinky21.mpi-sws.org",
        "HRT": 10808956576954067,
        "Operation": "fork",
        "Timestamp": "1557746286811.005371",
        "TenantClass": 0,
        "Source": "PacketHeader.java:95",
        "ThreadID": 14875,
        "ThreadName": "",
        "EventID": "20ABD8A7B26E8575",
        "BaggageBytes": "[[248 5] [240 0] [0 34 216 192 29 193 28 62 173] [240 1] [0 32 49 200 44 190 61 221 217] [240 3] [0 2]]",
        "ProcessID": 20775
      },
      {
        "Cycles": 0,
        "Agent": "Execution-Sleep",
        "ProcessName": "Read",
        "TaskID": "22D8C01DC11C3EAD",
        "ParentEventID": [
          "A44C2D5AFA26D801"
        ],
        "Label": "waited",
        "Title": "X-Trace Task",
        "Host": "pinky19.mpi-sws.org",
        "Duration": "5114284",
        "HRT": 26962646870825949,
        "Operation": "waited",
        "Timestamp": "1557746286811.145996",
        "TenantClass": 0,
        "Source": "SocketIOWithTimeout.java:335",
        "ThreadID": 1,
        "ThreadName": "",
        "EventID": "4ACFB064D372707B",
        "ProcessID": 36430
      },
      {
        "Cycles": 0,
        "Agent": "edu.brown.cs.systems.xtrace.logging.BaggageWrappers",
        "ProcessName": "Read",
        "TaskID": "22D8C01DC11C3EAD",
        "ParentEventID": [
          "4ACFB064D372707B",
          "8ED49CE82D080F5C"
        ],
        "Label": "Merged current baggage with other baggage",
        "Title": "X-Trace Task",
        "Host": "pinky19.mpi-sws.org",
        "HRT": 26962646870888392,
        "Operation": "join",
        "Timestamp": "1557746286811.208252",
        "TenantClass": 0,
        "Source": "PacketHeader.java:168",
        "ThreadID": 1,
        "ThreadName": "",
        "EventID": "987A5A9749E4C52A",
        "ProcessID": 36430
      },
      {
        "Cycles": 0,
        "Agent": "edu.brown.cs.systems.xtrace.logging.BaggageWrappers",
        "ProcessName": "Read",
        "TaskID": "22D8C01DC11C3EAD",
        "ParentEventID": [
          "20ABD8A7B26E8575",
          "987A5A9749E4C52A"
        ],
        "Label": "Merged current baggage with other baggage",
        "Title": "X-Trace Task",
        "Host": "pinky19.mpi-sws.org",
        "HRT": 26962646870939332,
        "Operation": "join",
        "Timestamp": "1557746286811.259277",
        "TenantClass": 0,
        "Source": "PacketHeader.java:168",
        "ThreadID": 1,
        "ThreadName": "",
        "EventID": "47190F7FBB303065",
        "ProcessID": 36430
      },
      {
        "Cycles": 0,
        "Agent": "edu.brown.cs.systems.xtrace.logging.BaggageWrappers",
        "ProcessName": "Read",
        "TaskID": "22D8C01DC11C3EAD",
        "ParentEventID": [
          "47190F7FBB303065"
        ],
        "Label": "Forking current baggage with Baggage.fork()",
        "Title": "X-Trace Task",
        "Host": "pinky19.mpi-sws.org",
        "HRT": 26962646870949083,
        "Operation": "fork",
        "Timestamp": "1557746286811.269043",
        "TenantClass": 0,
        "Source": "RemoteBlockReader2.java:361",
        "ThreadID": 1,
        "ThreadName": "",
        "EventID": "A8D96D3CF2AE1DC5",
        "ProcessID": 36430
      },
      {
        "Cycles": 0,
        "Agent": "edu.brown.cs.systems.xtrace.logging.BaggageWrappers",
        "ProcessName": "Data",
        "TaskID": "22D8C01DC11C3EAD",
        "ParentEventID": [
          "A8D96D3CF2AE1DC5",
          "1AB80641FEA49CD8"
        ],
        "Label": "Merged current baggage with other baggage",
        "Title": "X-Trace Task",
        "Host": "pinky21.mpi-sws.org",
        "HRT": 10808956577430107,
        "Operation": "join",
        "Timestamp": "1557746286811.481445",
        "TenantClass": 0,
        "Source": "DataXceiver.java:574",
        "ThreadID": 14875,
        "ThreadName": "",
        "EventID": "AC2487F0E97DE665",
        "BaggageBytes": "[[248 5] [240 0] [0 34 216 192 29 193 28 62 173] [240 1] [0 168 217 109 60 242 174 29 197] [0 26 184 6 65 254 164 156 216] [240 3] [0 2]]",
        "ProcessID": 20775
      },
      {
        "Cycles": 0,
        "Agent": "Execution-Sleep",
        "ProcessName": "Data",
        "TaskID": "22D8C01DC11C3EAD",
        "ParentEventID": [
          "20ABD8A7B26E8575"
        ],
        "Label": "waited",
        "Title": "X-Trace Task",
        "Host": "pinky21.mpi-sws.org",
        "Duration": "304191",
        "HRT": 10808956577363310,
        "Operation": "waited",
        "Timestamp": "1557746286811.414551",
        "TenantClass": 0,
        "Source": "SocketIOWithTimeout.java:335",
        "ThreadID": 14875,
        "ThreadName": "",
        "EventID": "1AB80641FEA49CD8",
        "BaggageBytes": "[[248 5] [240 0] [0 34 216 192 29 193 28 62 173] [240 1] [0 32 171 216 167 178 110 133 117] [240 3] [0 2]]",
        "ProcessID": 20775
      },
      {
        "Cycles": 0,
        "Agent": "Execution-CPU",
        "ProcessName": "Data",
        "TaskID": "22D8C01DC11C3EAD",
        "ParentEventID": [
          "AC2487F0E97DE665"
        ],
        "Label": "unset",
        "Title": "X-Trace Task",
        "Host": "pinky21.mpi-sws.org",
        "Duration": "16690500",
        "HRT": 10808956577456313,
        "Operation": "unset",
        "Timestamp": "1557746286811.507568",
        "TenantClass": 0,
        "Source": "DataXceiver.java:261",
        "ThreadID": 14875,
        "ThreadName": "",
        "EventID": "1CA23281F16FEB77",
        "BaggageBytes": "[[248 5] [240 0] [0 34 216 192 29 193 28 62 173] [240 1] [0 172 36 135 240 233 125 230 101] [240 3] [0 2]]",
        "ProcessID": 20775
      }
    ]
  }
]