[
  {
    "id": "C2A678DFA276698C",
    "reports": [
      {
        "Cycles": 0,
        "Agent": "Execution-CPU",
        "ProcessName": "Read",
        "TaskID": "C2A678DFA276698C",
        "ParentEventID": [
          "1B813A74883E18A8"
        ],
        "Label": "unset",
        "Title": "X-Trace Task",
        "Host": "pinky19.mpi-sws.org",
        "Duration": "22189902",
        "HRT": 26962454080624070,
        "Operation": "unset",
        "Timestamp": "1557746094021.028076",
        "TenantClass": 0,
        "Source": "Client.java:1027",
        "ThreadID": 1,
        "ThreadName": "",
        "EventID": "6E46A736B10339B7",
        "ProcessID": 36430
      },
      {
        "Cycles": 0,
        "Agent": "org.apache.hadoop.ipc.ProtobufRpcEngine",
        "ProcessName": "Read",
        "TaskID": "C2A678DFA276698C",
        "ParentEventID": [
          "7524760786F3BFAF"
        ],
        "Label": "Invoking org.apache.hadoop.hdfs.protocol.ClientProtocol.getBlockLocations",
        "Title": "X-Trace Task",
        "Host": "pinky19.mpi-sws.org",
        "HRT": 26962454080597213,
        "Timestamp": "1557746094021.001221",
        "TenantClass": 0,
        "Source": "ProtobufRpcEngine.java:228",
        "ThreadID": 1,
        "ThreadName": "",
        "EventID": "1B813A74883E18A8",
        "ProcessID": 36430
      },
      {
        "Cycles": 0,
        "Agent": "edu.brown.cs.systems.retro.benchmarks.hdfs_client.Reader",
        "ProcessName": "Read",
        "TaskID": "C2A678DFA276698C",
        "ParentEventID": [
          "0"
        ],
        "Label": "Reading file",
        "Title": "X-Trace Task",
        "Host": "pinky19.mpi-sws.org",
        "HRT": 26962454080541102,
        "Timestamp": "1557746094020.945312",
        "TenantClass": 0,
        "ThreadID": 1,
        "ThreadName": "",
        "EventID": "57A8BE3263A962D3",
        "ProcessID": 36430,
        "Tag": [
          "reader_10kb",
          "Read Size: 10240"
        ]
      },
      {
        "Cycles": 0,
        "Agent": "edu.brown.cs.systems.retro.benchmarks.hdfs_client.Reader",
        "ProcessName": "Read",
        "TaskID": "C2A678DFA276698C",
        "ParentEventID": [
          "57A8BE3263A962D3"
        ],
        "Label": "Reading file",
        "Title": "X-Trace Task",
        "Host": "pinky19.mpi-sws.org",
        "HRT": 26962454080558892,
        "Timestamp": "1557746094020.962891",
        "TenantClass": 0,
        "ThreadID": 1,
        "ThreadName": "",
        "EventID": "7524760786F3BFAF",
        "ProcessID": 36430
      },
      {
        "Cycles": 0,
        "Agent": "Execution-CPU",
        "ProcessName": "Read",
        "TaskID": "C2A678DFA276698C",
        "ParentEventID": [
          "6E46A736B10339B7"
        ],
        "Label": "set",
        "Title": "X-Trace Task",
        "Host": "pinky19.mpi-sws.org",
        "HRT": 26962454080648919,
        "Operation": "set",
        "Timestamp": "1557746094021.052979",
        "TenantClass": 0,
        "Source": "Client.java:1032",
        "ThreadID": 41,
        "ThreadName": "",
        "EventID": "B1F5459DFBA9072C",
        "ProcessID": 36430
      },
      {
        "Cycles": 0,
        "Agent": "edu.brown.cs.systems.xtrace.logging.BaggageWrappers",
        "ProcessName": "Read",
        "TaskID": "C2A678DFA276698C",
        "ParentEventID": [
          "B1F5459DFBA9072C"
        ],
        "Label": "Forking current baggage with Baggage.fork()",
        "Title": "X-Trace Task",
        "Host": "pinky19.mpi-sws.org",
        "HRT": 26962454080659318,
        "Operation": "fork",
        "Timestamp": "1557746094021.063477",
        "TenantClass": 0,
        "Source": "Client.java:1043",
        "ThreadID": 41,
        "ThreadName": "",
        "EventID": "BF42365D45032E76",
        "ProcessID": 36430
      },
      {
        "Cycles": 0,
        "Agent": "Execution-CPU",
        "ProcessName": "Read",
        "TaskID": "C2A678DFA276698C",
        "ParentEventID": [
          "BF42365D45032E76"
        ],
        "Label": "unset",
        "Title": "X-Trace Task",
        "Host": "pinky19.mpi-sws.org",
        "Duration": "65470",
        "HRT": 26962454080723929,
        "Operation": "unset",
        "Timestamp": "1557746094021.127930",
        "TenantClass": 0,
        "Source": "Client.java:1062",
        "ThreadID": 41,
        "ThreadName": "",
        "EventID": "541E038D7A51937E",
        "ProcessID": 36430
      },
      {
        "Cycles": 0,
        "Agent": "Execution-CPU",
        "ProcessName": "Name",
        "TaskID": "C2A678DFA276698C",
        "ParentEventID": [
          "BF42365D45032E76"
        ],
        "Label": "set",
        "Title": "X-Trace Task",
        "Host": "pinky19.mpi-sws.org",
        "HRT": 26962454080797024,
        "Operation": "set",
        "Timestamp": "1557746094021.208984",
        "TenantClass": 0,
        "Source": "Server.java:1840",
        "ThreadID": 48,
        "ThreadName": "",
        "EventID": "B9B01BF904431A72",
        "BaggageBytes": "[[248 5] [240 0] [0 194 166 120 223 162 118 105 140] [240 1] [0 191 66 54 93 69 3 46 118] [240 3] [0 2]]",
        "ProcessID": 2171
      },
      {
        "Cycles": 0,
        "Agent": "Execution-CPU",
        "ProcessName": "Read",
        "TaskID": "C2A678DFA276698C",
        "ParentEventID": [
          "541E038D7A51937E"
        ],
        "Label": "set",
        "Title": "X-Trace Task",
        "Host": "pinky19.mpi-sws.org",
        "HRT": 26962454080772258,
        "Operation": "set",
        "Timestamp": "1557746094021.176270",
        "TenantClass": 0,
        "Source": "Client.java:1104",
        "ThreadID": 1,
        "ThreadName": "",
        "EventID": "A4810271D5BCBF7D",
        "ProcessID": 36430
      },
      {
        "Cycles": 0,
        "Agent": "edu.brown.cs.systems.xtrace.logging.BaggageWrappers",
        "ProcessName": "Name",
        "TaskID": "C2A678DFA276698C",
        "ParentEventID": [
          "B9B01BF904431A72"
        ],
        "Label": "Forking current baggage with Baggage.fork()",
        "Title": "X-Trace Task",
        "Host": "pinky19.mpi-sws.org",
        "HRT": 26962454080829481,
        "Operation": "fork",
        "Timestamp": "1557746094021.241455",
        "TenantClass": 0,
        "Source": "Server.java:550",
        "ThreadID": 48,
        "ThreadName": "",
        "EventID": "2A1BBE1AD837F385",
        "BaggageBytes": "[[248 5] [240 0] [0 194 166 120 223 162 118 105 140] [240 1] [0 185 176 27 249 4 67 26 114] [240 3] [0 2]]",
        "ProcessID": 2171
      },
      {
        "Cycles": 0,
        "Agent": "Execution-CPU",
        "ProcessName": "Name",
        "TaskID": "C2A678DFA276698C",
        "ParentEventID": [
          "2A1BBE1AD837F385"
        ],
        "Label": "unset",
        "Title": "X-Trace Task",
        "Host": "pinky19.mpi-sws.org",
        "Duration": "24756",
        "HRT": 26962454080850276,
        "Operation": "unset",
        "Timestamp": "1557746094021.262207",
        "TenantClass": 0,
        "Source": "Server.java:1828",
        "ThreadID": 48,
        "ThreadName": "",
        "EventID": "061568593E2B40AE",
        "BaggageBytes": "[[248 5] [240 0] [0 194 166 120 223 162 118 105 140] [240 1] [0 42 27 190 26 216 55 243 133] [240 3] [0 2]]",
        "ProcessID": 2171
      },
      {
        "Cycles": 0,
        "Agent": "org.apache.hadoop.ipc.Server",
        "ProcessName": "Name",
        "TaskID": "C2A678DFA276698C",
        "ParentEventID": [
          "5381D69465CDA091"
        ],
        "Label": "getBlockLocations in org.apache.hadoop.hdfs.protocol.ClientProtocol",
        "Title": "X-Trace Task",
        "Host": "pinky19.mpi-sws.org",
        "HRT": 26962454080890757,
        "Timestamp": "1557746094021.302734",
        "TenantClass": 0,
        "Source": "ProtobufRpcEngine.java:601",
        "ThreadID": 59,
        "ThreadName": "",
        "EventID": "A307CE48446EBE6A",
        "BaggageBytes": "[[248 5] [240 0] [0 194 166 120 223 162 118 105 140] [240 1] [0 83 129 214 148 101 205 160 145] [240 3] [0 2]]",
        "ProcessID": 2171
      },
      {
        "Cycles": 0,
        "Agent": "org.apache.hadoop.hdfs.server.namenode.FSNamesystem.audit",
        "ProcessName": "Name",
        "TaskID": "C2A678DFA276698C",
        "ParentEventID": [
          "A307CE48446EBE6A"
        ],
        "Label": "allowed=true\tugi=plascas (auth:SIMPLE)\tip=/139.19.171.63\tcmd=open\tsrc=/ds/OnNWJLGwdKY5Ften\tdst=null\tperm=null\tproto=rpc",
        "Title": "X-Trace Task",
        "Host": "pinky19.mpi-sws.org",
        "HRT": 26962454080939130,
        "Timestamp": "1557746094021.351074",
        "TenantClass": 0,
        "Source": "FSNamesystem.java:8313",
        "ThreadID": 59,
        "ThreadName": "",
        "EventID": "1C3593ABABEBE721",
        "BaggageBytes": "[[248 5] [240 0] [0 194 166 120 223 162 118 105 140] [240 1] [0 163 7 206 72 68 110 190 106] [240 3] [0 2]]",
        "ProcessID": 2171
      },
      {
        "Cycles": 0,
        "Agent": "edu.brown.cs.systems.xtrace.logging.BaggageWrappers",
        "ProcessName": "Name",
        "TaskID": "C2A678DFA276698C",
        "ParentEventID": [
          "1C3593ABABEBE721"
        ],
        "Label": "Forking current baggage with Baggage.fork()",
        "Title": "X-Trace Task",
        "Host": "pinky19.mpi-sws.org",
        "HRT": 26962454080981287,
        "Operation": "fork",
        "Timestamp": "1557746094021.393311",
        "TenantClass": 0,
        "Source": "Server.java:2398",
        "ThreadID": 59,
        "ThreadName": "",
        "EventID": "808D44C0F549D88C",
        "BaggageBytes": "[[248 5] [240 0] [0 194 166 120 223 162 118 105 140] [240 1] [0 28 53 147 171 171 235 231 33] [240 3] [0 2]]",
        "ProcessID": 2171
      },
      {
        "Cycles": 0,
        "Agent": "Execution-CPU",
        "ProcessName": "Name",
        "TaskID": "C2A678DFA276698C",
        "ParentEventID": [
          "2A1BBE1AD837F385"
        ],
        "Label": "set",
        "Title": "X-Trace Task",
        "Host": "pinky19.mpi-sws.org",
        "HRT": 26962454080857683,
        "Operation": "set",
        "Timestamp": "1557746094021.269775",
        "TenantClass": 0,
        "Source": "Server.java:2071",
        "ThreadID": 59,
        "ThreadName": "",
        "EventID": "5381D69465CDA091",
        "BaggageBytes": "[[248 5] [240 0] [0 194 166 120 223 162 118 105 140] [240 1] [0 42 27 190 26 216 55 243 133] [240 3] [0 2]]",
        "ProcessID": 2171
      },
      {
        "Cycles": 0,
        "Agent": "Execution-CPU",
        "ProcessName": "Name",
        "TaskID": "C2A678DFA276698C",
        "ParentEventID": [
          "808D44C0F549D88C"
        ],
        "Label": "unset",
        "Title": "X-Trace Task",
        "Host": "pinky19.mpi-sws.org",
        "Duration": "203735",
        "HRT": 26962454081083822,
        "Operation": "unset",
        "Timestamp": "1557746094021.495850",
        "TenantClass": 0,
        "Source": "Server.java:1058",
        "ThreadID": 59,
        "ThreadName": "",
        "EventID": "83A09AE904AF8274",
        "BaggageBytes": "[[248 5] [240 0] [0 194 166 120 223 162 118 105 140] [240 1] [0 128 141 68 192 245 73 216 140] [240 3] [0 2]]",
        "ProcessID": 2171
      },
      {
        "Cycles": 0,
        "Agent": "Execution-CPU",
        "ProcessName": "Read",
        "TaskID": "C2A678DFA276698C",
        "ParentEventID": [
          "95BD0BC499EFA472"
        ],
        "Label": "unset",
        "Title": "X-Trace Task",
        "Host": "pinky19.mpi-sws.org",
        "Duration": "10121",
        "HRT": 26962454081160066,
        "Operation": "unset",
        "Timestamp": "1557746094021.564209",
        "TenantClass": 0,
        "Source": "Client.java:1168",
        "ThreadID": 37,
        "ThreadName": "",
        "EventID": "15C0E2860667609E",
        "ProcessID": 36430
      },
      {
        "Cycles": 0,
        "Agent": "Execution-CPU",
        "ProcessName": "Read",
        "TaskID": "C2A678DFA276698C",
        "ParentEventID": [
          "808D44C0F549D88C"
        ],
        "Label": "set",
        "Title": "X-Trace Task",
        "Host": "pinky19.mpi-sws.org",
        "HRT": 26962454081134726,
        "Operation": "set",
        "Timestamp": "1557746094021.538818",
        "TenantClass": 0,
        "Source": "Client.java:302",
        "ThreadID": 37,
        "ThreadName": "",
        "EventID": "95BD0BC499EFA472",
        "ProcessID": 36430
      },
      {
        "Cycles": 0,
        "Agent": "Execution-Sleep",
        "ProcessName": "Read",
        "TaskID": "C2A678DFA276698C",
        "ParentEventID": [
          "A4810271D5BCBF7D"
        ],
        "Label": "waited",
        "Title": "X-Trace Task",
        "Host": "pinky19.mpi-sws.org",
        "Duration": "411024",
        "HRT": 26962454081203397,
        "Operation": "waited",
        "Timestamp": "1557746094021.607422",
        "TenantClass": 0,
        "Source": "Client.java:1537",
        "ThreadID": 1,
        "ThreadName": "",
        "EventID": "F22DB4A801C95FB6",
        "ProcessID": 36430
      },
      {
        "Cycles": 0,
        "Agent": "org.apache.hadoop.ipc.ProtobufRpcEngine",
        "ProcessName": "Read",
        "TaskID": "C2A678DFA276698C",
        "ParentEventID": [
          "C57B861742DED3AC"
        ],
        "Label": "org.apache.hadoop.hdfs.protocol.ClientProtocol.getBlockLocations completed",
        "Title": "X-Trace Task",
        "Host": "pinky19.mpi-sws.org",
        "HRT": 26962454081274595,
        "Timestamp": "1557746094021.678711",
        "TenantClass": 0,
        "Source": "ProtobufRpcEngine.java:275",
        "ThreadID": 1,
        "ThreadName": "",
        "EventID": "CC435DE44E2D1536",
        "ProcessID": 36430
      },
      {
        "Cycles": 0,
        "Agent": "edu.brown.cs.systems.xtrace.logging.BaggageWrappers",
        "ProcessName": "Read",
        "TaskID": "C2A678DFA276698C",
        "ParentEventID": [
          "15C0E2860667609E",
          "F22DB4A801C95FB6"
        ],
        "Label": "Merged current baggage with other baggage",
        "Title": "X-Trace Task",
        "Host": "pinky19.mpi-sws.org",
        "HRT": 26962454081230726,
        "Operation": "join",
        "Timestamp": "1557746094021.634766",
        "TenantClass": 0,
        "Source": "Client.java:1545",
        "ThreadID": 1,
        "ThreadName": "",
        "EventID": "C57B861742DED3AC",
        "ProcessID": 36430
      },
      {
        "Cycles": 0,
        "Agent": "edu.brown.cs.systems.xtrace.logging.BaggageWrappers",
        "ProcessName": "Read",
        "TaskID": "C2A678DFA276698C",
        "ParentEventID": [
          "CC435DE44E2D1536"
        ],
        "Label": "Forking current baggage with Baggage.fork()",
        "Title": "X-Trace Task",
        "Host": "pinky19.mpi-sws.org",
        "HRT": 26962454081349372,
        "Operation": "fork",
        "Timestamp": "1557746094021.753418",
        "TenantClass": 0,
        "Source": "DataTransferProtoUtil.java:94",
        "ThreadID": 1,
        "ThreadName": "",
        "EventID": "3D7B86A265569C84",
        "ProcessID": 36430
      },
      {
        "Cycles": 0,
        "Agent": "edu.brown.cs.systems.xtrace.logging.XTraceInit",
        "ProcessName": "Data",
        "TaskID": "C2A678DFA276698C",
        "ParentEventID": [
          "04440FC6B34C85FE"
        ],
        "Label": "Thread.setName: DataXceiver for client DFSClient_NONMAPREDUCE_778905418_1 at /139.19.171.63:36880 [Sending block BP-1633380353-139.19.171.63-1554193446451:blk_1073767190_26366]",
        "Title": "X-Trace Task",
        "Host": "pinky26.mpi-sws.org",
        "HRT": 47512110811765980,
        "Timestamp": "1557746094022.324219",
        "TenantClass": 0,
        "Source": "DataXceiver.java:168",
        "ThreadID": 8227,
        "ThreadName": "",
        "EventID": "B7D9F67DF544F554",
        "BaggageBytes": "[[248 5] [240 0] [0 194 166 120 223 162 118 105 140] [240 1] [0 4 68 15 198 179 76 133 254] [240 3] [0 2]]",
        "ProcessID": 17069
      },
      {
        "Cycles": 0,
        "Agent": "Execution-CPU",
        "ProcessName": "Data",
        "TaskID": "C2A678DFA276698C",
        "ParentEventID": [
          "3D7B86A265569C84"
        ],
        "Label": "set",
        "Title": "X-Trace Task",
        "Host": "pinky26.mpi-sws.org",
        "HRT": 47512110811642688,
        "Operation": "set",
        "Timestamp": "1557746094022.200928",
        "TenantClass": 0,
        "Source": "Receiver.java:117",
        "ThreadID": 8227,
        "ThreadName": "",
        "EventID": "04440FC6B34C85FE",
        "BaggageBytes": "[[248 5] [240 0] [0 194 166 120 223 162 118 105 140] [240 1] [0 61 123 134 162 101 86 156 132] [240 3] [0 2]]",
        "ProcessID": 17069
      },
      {
        "Cycles": 0,
        "Agent": "edu.brown.cs.systems.xtrace.logging.BaggageWrappers",
        "ProcessName": "Data",
        "TaskID": "C2A678DFA276698C",
        "ParentEventID": [
          "B7D9F67DF544F554"
        ],
        "Label": "Forking current baggage with Baggage.fork()",
        "Title": "X-Trace Task",
        "Host": "pinky26.mpi-sws.org",
        "HRT": 47512110840964658,
        "Operation": "fork",
        "Timestamp": "1557746094051.522705",
        "TenantClass": 0,
        "Source": "DataXceiver.java:1257",
        "ThreadID": 8227,
        "ThreadName": "",
        "EventID": "E2102FBB49054E32",
        "BaggageBytes": "[[248 5] [240 0] [0 194 166 120 223 162 118 105 140] [240 1] [0 183 217 246 125 245 68 245 84] [240 3] [0 2]]",
        "ProcessID": 17069
      },
      {
        "Cycles": 0,
        "Agent": "Execution-Sleep",
        "ProcessName": "Read",
        "TaskID": "C2A678DFA276698C",
        "ParentEventID": [
          "3D7B86A265569C84"
        ],
        "Label": "waited",
        "Title": "X-Trace Task",
        "Host": "pinky19.mpi-sws.org",
        "Duration": "29819174",
        "HRT": 26962454111269560,
        "Operation": "waited",
        "Timestamp": "1557746094051.673584",
        "TenantClass": 0,
        "Source": "SocketIOWithTimeout.java:335",
        "ThreadID": 1,
        "ThreadName": "",
        "EventID": "A19D6E2D5B13FCC1",
        "ProcessID": 36430
      },
      {
        "Cycles": 0,
        "Agent": "edu.brown.cs.systems.xtrace.logging.BaggageWrappers",
        "ProcessName": "Data",
        "TaskID": "C2A678DFA276698C",
        "ParentEventID": [
          "E2102FBB49054E32"
        ],
        "Label": "Forking current baggage with Baggage.fork()",
        "Title": "X-Trace Task",
        "Host": "pinky26.mpi-sws.org",
        "HRT": 47512110841183428,
        "Operation": "fork",
        "Timestamp": "1557746094051.741455",
        "TenantClass": 0,
        "Source": "PacketHeader.java:95",
        "ThreadID": 8227,
        "ThreadName": "",
        "EventID": "848C7D3900D2850F",
        "BaggageBytes": "[[248 5] [240 0] [0 194 166 120 223 162 118 105 140] [240 1] [0 226 16 47 187 73 5 78 50] [240 3] [0 2]]",
        "ProcessID": 17069
      },
      {
        "Cycles": 0,
        "Agent": "edu.brown.cs.systems.xtrace.logging.BaggageWrappers",
        "ProcessName": "Read",
        "TaskID": "C2A678DFA276698C",
        "ParentEventID": [
          "E2102FBB49054E32",
          "A19D6E2D5B13FCC1"
        ],
        "Label": "Merged current baggage with other baggage",
        "Title": "X-Trace Task",
        "Host": "pinky19.mpi-sws.org",
        "HRT": 26962454111355284,
        "Operation": "join",
        "Timestamp": "1557746094051.759277",
        "TenantClass": 0,
        "Source": "RemoteBlockReader2.java:429",
        "ThreadID": 1,
        "ThreadName": "",
        "EventID": "E7B87E7C1C023151",
        "ProcessID": 36430
      },
      {
        "Cycles": 0,
        "Agent": "Execution-Sleep",
        "ProcessName": "Data",
        "TaskID": "C2A678DFA276698C",
        "ParentEventID": [
          "848C7D3900D2850F"
        ],
        "Label": "waited",
        "Title": "X-Trace Task",
        "Host": "pinky26.mpi-sws.org",
        "Duration": "7493",
        "HRT": 47512110841260178,
        "Operation": "waited",
        "Timestamp": "1557746094051.818359",
        "TenantClass": 0,
        "Source": "SocketIOWithTimeout.java:335",
        "ThreadID": 8227,
        "ThreadName": "",
        "EventID": "59EC8D3E28EAA18B",
        "BaggageBytes": "[[248 5] [240 0] [0 194 166 120 223 162 118 105 140] [240 1] [0 132 140 125 57 0 210 133 15] [240 3] [0 2]]",
        "ProcessID": 17069
      },
      {
        "Cycles": 0,
        "Agent": "Execution-Sleep",
        "ProcessName": "Read",
        "TaskID": "C2A678DFA276698C",
        "ParentEventID": [
          "E7B87E7C1C023151"
        ],
        "Label": "waited",
        "Title": "X-Trace Task",
        "Host": "pinky19.mpi-sws.org",
        "Duration": "6877795",
        "HRT": 26962454118328580,
        "Operation": "waited",
        "Timestamp": "1557746094058.732666",
        "TenantClass": 0,
        "Source": "SocketIOWithTimeout.java:335",
        "ThreadID": 1,
        "ThreadName": "",
        "EventID": "E550F82C7180A9EC",
        "ProcessID": 36430
      },
      {
        "Cycles": 0,
        "Agent": "edu.brown.cs.systems.xtrace.logging.BaggageWrappers",
        "ProcessName": "Read",
        "TaskID": "C2A678DFA276698C",
        "ParentEventID": [
          "E550F82C7180A9EC",
          "848C7D3900D2850F"
        ],
        "Label": "Merged current baggage with other baggage",
        "Title": "X-Trace Task",
        "Host": "pinky19.mpi-sws.org",
        "HRT": 26962454118406745,
        "Operation": "join",
        "Timestamp": "1557746094058.810791",
        "TenantClass": 0,
        "Source": "PacketHeader.java:168",
        "ThreadID": 1,
        "ThreadName": "",
        "EventID": "C9DD38E0FAD96B0A",
        "ProcessID": 36430
      },
      {
        "Cycles": 0,
        "Agent": "Execution-Sleep",
        "ProcessName": "Read",
        "TaskID": "C2A678DFA276698C",
        "ParentEventID": [
          "C9DD38E0FAD96B0A"
        ],
        "Label": "waited",
        "Title": "X-Trace Task",
        "Host": "pinky19.mpi-sws.org",
        "Duration": "12263",
        "HRT": 26962454118468056,
        "Operation": "waited",
        "Timestamp": "1557746094058.872070",
        "TenantClass": 0,
        "Source": "SocketIOWithTimeout.java:335",
        "ThreadID": 1,
        "ThreadName": "",
        "EventID": "3F533AB63EF65A36",
        "ProcessID": 36430
      },
      {
        "Cycles": 0,
        "Agent": "edu.brown.cs.systems.xtrace.logging.BaggageWrappers",
        "ProcessName": "Data",
        "TaskID": "C2A678DFA276698C",
        "ParentEventID": [
          "59EC8D3E28EAA18B"
        ],
        "Label": "Forking current baggage with Baggage.fork()",
        "Title": "X-Trace Task",
        "Host": "pinky26.mpi-sws.org",
        "HRT": 47512110848137426,
        "Operation": "fork",
        "Timestamp": "1557746094058.695557",
        "TenantClass": 0,
        "Source": "PacketHeader.java:95",
        "ThreadID": 8227,
        "ThreadName": "",
        "EventID": "6F94FEA2760FCF77",
        "BaggageBytes": "[[248 5] [240 0] [0 194 166 120 223 162 118 105 140] [240 1] [0 89 236 141 62 40 234 161 139] [240 3] [0 2]]",
        "ProcessID": 17069
      },
      {
        "Cycles": 0,
        "Agent": "edu.brown.cs.systems.xtrace.logging.BaggageWrappers",
        "ProcessName": "Read",
        "TaskID": "C2A678DFA276698C",
        "ParentEventID": [
          "6F94FEA2760FCF77",
          "3F533AB63EF65A36"
        ],
        "Label": "Merged current baggage with other baggage",
        "Title": "X-Trace Task",
        "Host": "pinky19.mpi-sws.org",
        "HRT": 26962454118540620,
        "Operation": "join",
        "Timestamp": "1557746094058.944824",
        "TenantClass": 0,
        "Source": "PacketHeader.java:168",
        "ThreadID": 1,
        "ThreadName": "",
        "EventID": "54784F4D4214FA3F",
        "ProcessID": 36430
      },
      {
        "Cycles": 0,
        "Agent": "edu.brown.cs.systems.xtrace.logging.BaggageWrappers",
        "ProcessName": "Read",
        "TaskID": "C2A678DFA276698C",
        "ParentEventID": [
          "54784F4D4214FA3F"
        ],
        "Label": "Forking current baggage with Baggage.fork()",
        "Title": "X-Trace Task",
        "Host": "pinky19.mpi-sws.org",
        "HRT": 26962454118552980,
        "Operation": "fork",
        "Timestamp": "1557746094058.957031",
        "TenantClass": 0,
        "Source": "RemoteBlockReader2.java:361",
        "ThreadID": 1,
        "ThreadName": "",
        "EventID": "7D0F7040B494816C",
        "ProcessID": 36430
      },
      {
        "Cycles": 0,
        "Agent": "Execution-Sleep",
        "ProcessName": "Data",
        "TaskID": "C2A678DFA276698C",
        "ParentEventID": [
          "6F94FEA2760FCF77"
        ],
        "Label": "waited",
        "Title": "X-Trace Task",
        "Host": "pinky26.mpi-sws.org",
        "Duration": "102460",
        "HRT": 47512110848511280,
        "Operation": "waited",
        "Timestamp": "1557746094059.069336",
        "TenantClass": 0,
        "Source": "SocketIOWithTimeout.java:335",
        "ThreadID": 8227,
        "ThreadName": "",
        "EventID": "311E542E4D684EB3",
        "BaggageBytes": "[[248 5] [240 0] [0 194 166 120 223 162 118 105 140] [240 1] [0 111 148 254 162 118 15 207 119] [240 3] [0 2]]",
        "ProcessID": 17069
      },
      {
        "Cycles": 0,
        "Agent": "edu.brown.cs.systems.xtrace.logging.BaggageWrappers",
        "ProcessName": "Data",
        "TaskID": "C2A678DFA276698C",
        "ParentEventID": [
          "7D0F7040B494816C",
          "311E542E4D684EB3"
        ],
        "Label": "Merged current baggage with other baggage",
        "Title": "X-Trace Task",
        "Host": "pinky26.mpi-sws.org",
        "HRT": 47512110848635565,
        "Operation": "join",
        "Timestamp": "1557746094059.193604",
        "TenantClass": 0,
        "Source": "DataXceiver.java:574",
        "ThreadID": 8227,
        "ThreadName": "",
        "EventID": "8E428D831AC2C100",
        "BaggageBytes": "[[248 5] [240 0] [0 194 166 120 223 162 118 105 140] [240 1] [0 49 30 84 46 77 104 78 179] [0 125 15 112 64 180 148 129 108] [240 3] [0 2]]",
        "ProcessID": 17069
      },
      {
        "Cycles": 0,
        "Agent": "Execution-CPU",
        "ProcessName": "Data",
        "TaskID": "C2A678DFA276698C",
        "ParentEventID": [
          "8E428D831AC2C100"
        ],
        "Label": "unset",
        "Title": "X-Trace Task",
        "Host": "pinky26.mpi-sws.org",
        "Duration": "36972548",
        "HRT": 47512110848670095,
        "Operation": "unset",
        "Timestamp": "1557746094059.228271",
        "TenantClass": 0,
        "Source": "DataXceiver.java:261",
        "ThreadID": 8227,
        "ThreadName": "",
        "EventID": "CA65ABDD96904008",
        "BaggageBytes": "[[248 5] [240 0] [0 194 166 120 223 162 118 105 140] [240 1] [0 142 66 141 131 26 194 193 0] [240 3] [0 2]]",
        "ProcessID": 17069
      }
    ]
  }
]