[
  {
    "id": "EE305307D76A070C",
    "reports": [
      {
        "Cycles": 0,
        "Agent": "Execution-CPU",
        "ProcessName": "Read",
        "TaskID": "EE305307D76A070C",
        "ParentEventID": [
          "6BB111B190CCFFE2"
        ],
        "Label": "unset",
        "Title": "X-Trace Task",
        "Host": "pinky19.mpi-sws.org",
        "Duration": "22152464",
        "HRT": 25491845571855777,
        "Operation": "unset",
        "Timestamp": "1556275485511.007568",
        "TenantClass": 0,
        "Source": "Client.java:1027",
        "ThreadID": 1,
        "ThreadName": "",
        "EventID": "1F1A006C9ABF0298",
        "ProcessID": 21035
      },
      {
        "Cycles": 0,
        "Agent": "org.apache.hadoop.ipc.ProtobufRpcEngine",
        "ProcessName": "Read",
        "TaskID": "EE305307D76A070C",
        "ParentEventID": [
          "D2A37D2063E13C8B"
        ],
        "Label": "Invoking org.apache.hadoop.hdfs.protocol.ClientProtocol.getBlockLocations",
        "Title": "X-Trace Task",
        "Host": "pinky19.mpi-sws.org",
        "HRT": 25491845571822874,
        "Timestamp": "1556275485510.974609",
        "TenantClass": 0,
        "Source": "ProtobufRpcEngine.java:228",
        "ThreadID": 1,
        "ThreadName": "",
        "EventID": "6BB111B190CCFFE2",
        "ProcessID": 21035
      },
      {
        "Cycles": 0,
        "Agent": "edu.brown.cs.systems.retro.benchmarks.hdfs_client.Reader",
        "ProcessName": "Read",
        "TaskID": "EE305307D76A070C",
        "ParentEventID": [
          "8BECAC75A235C305"
        ],
        "Label": "Reading file",
        "Title": "X-Trace Task",
        "Host": "pinky19.mpi-sws.org",
        "HRT": 25491845571791266,
        "Timestamp": "1556275485510.943115",
        "TenantClass": 0,
        "ThreadID": 1,
        "ThreadName": "",
        "EventID": "D2A37D2063E13C8B",
        "ProcessID": 21035
      },
      {
        "Cycles": 0,
        "Agent": "Execution-CPU",
        "ProcessName": "Read",
        "TaskID": "EE305307D76A070C",
        "ParentEventID": [
          "1F1A006C9ABF0298"
        ],
        "Label": "set",
        "Title": "X-Trace Task",
        "Host": "pinky19.mpi-sws.org",
        "HRT": 25491845571888180,
        "Operation": "set",
        "Timestamp": "1556275485511.039795",
        "TenantClass": 0,
        "Source": "Client.java:1032",
        "ThreadID": 41,
        "ThreadName": "",
        "EventID": "84666B8E91419CEF",
        "ProcessID": 21035
      },
      {
        "Cycles": 0,
        "Agent": "edu.brown.cs.systems.xtrace.logging.BaggageWrappers",
        "ProcessName": "Read",
        "TaskID": "EE305307D76A070C",
        "ParentEventID": [
          "84666B8E91419CEF"
        ],
        "Label": "Forking current baggage with Baggage.fork()",
        "Title": "X-Trace Task",
        "Host": "pinky19.mpi-sws.org",
        "HRT": 25491845571909129,
        "Operation": "fork",
        "Timestamp": "1556275485511.060791",
        "TenantClass": 0,
        "Source": "Client.java:1043",
        "ThreadID": 41,
        "ThreadName": "",
        "EventID": "2C243FAC67A24EF0",
        "ProcessID": 21035
      },
      {
        "Cycles": 0,
        "Agent": "Execution-CPU",
        "ProcessName": "Read",
        "TaskID": "EE305307D76A070C",
        "ParentEventID": [
          "2C243FAC67A24EF0"
        ],
        "Label": "unset",
        "Title": "X-Trace Task",
        "Host": "pinky19.mpi-sws.org",
        "Duration": "82205",
        "HRT": 25491845571990114,
        "Operation": "unset",
        "Timestamp": "1556275485511.141846",
        "TenantClass": 0,
        "Source": "Client.java:1062",
        "ThreadID": 41,
        "ThreadName": "",
        "EventID": "BA1E31DB264F2AE0",
        "ProcessID": 21035
      },
      {
        "Cycles": 0,
        "Agent": "Execution-CPU",
        "ProcessName": "Read",
        "TaskID": "EE305307D76A070C",
        "ParentEventID": [
          "BA1E31DB264F2AE0"
        ],
        "Label": "set",
        "Title": "X-Trace Task",
        "Host": "pinky19.mpi-sws.org",
        "HRT": 25491845572016152,
        "Operation": "set",
        "Timestamp": "1556275485511.167969",
        "TenantClass": 0,
        "Source": "Client.java:1104",
        "ThreadID": 1,
        "ThreadName": "",
        "EventID": "4E93E7EB625C081E",
        "ProcessID": 21035
      },
      {
        "Cycles": 0,
        "Agent": "Execution-CPU",
        "ProcessName": "Name",
        "TaskID": "EE305307D76A070C",
        "ParentEventID": [
          "2C243FAC67A24EF0"
        ],
        "Label": "set",
        "Title": "X-Trace Task",
        "Host": "pinky19.mpi-sws.org",
        "HRT": 25491845572050587,
        "Operation": "set",
        "Timestamp": "1556275485511.438721",
        "TenantClass": 0,
        "Source": "Server.java:1840",
        "ThreadID": 48,
        "ThreadName": "",
        "EventID": "CAD61994C0348A17",
        "BaggageBytes": "[[248 5] [240 0] [0 238 48 83 7 215 106 7 12] [240 1] [0 44 36 63 172 103 162 78 240] [240 3] [0 2]]",
        "ProcessID": 2171
      },
      {
        "Cycles": 0,
        "Agent": "Execution-CPU",
        "ProcessName": "Name",
        "TaskID": "EE305307D76A070C",
        "ParentEventID": [
          "9533493BF7F66D8E"
        ],
        "Label": "unset",
        "Title": "X-Trace Task",
        "Host": "pinky19.mpi-sws.org",
        "Duration": "33111",
        "HRT": 25491845572113295,
        "Operation": "unset",
        "Timestamp": "1556275485511.501221",
        "TenantClass": 0,
        "Source": "Server.java:1828",
        "ThreadID": 48,
        "ThreadName": "",
        "EventID": "A3CD494A04C64412",
        "BaggageBytes": "[[248 5] [240 0] [0 238 48 83 7 215 106 7 12] [240 1] [0 149 51 73 59 247 246 109 142] [240 3] [0 2]]",
        "ProcessID": 2171
      },
      {
        "Cycles": 0,
        "Agent": "Execution-CPU",
        "ProcessName": "Name",
        "TaskID": "EE305307D76A070C",
        "ParentEventID": [
          "9533493BF7F66D8E"
        ],
        "Label": "set",
        "Title": "X-Trace Task",
        "Host": "pinky19.mpi-sws.org",
        "HRT": 25491845572121711,
        "Operation": "set",
        "Timestamp": "1556275485511.509766",
        "TenantClass": 0,
        "Source": "Server.java:2071",
        "ThreadID": 64,
        "ThreadName": "",
        "EventID": "EEB209BC6E60116F",
        "BaggageBytes": "[[248 5] [240 0] [0 238 48 83 7 215 106 7 12] [240 1] [0 149 51 73 59 247 246 109 142] [240 3] [0 2]]",
        "ProcessID": 2171
      },
      {
        "Cycles": 0,
        "Agent": "edu.brown.cs.systems.xtrace.logging.BaggageWrappers",
        "ProcessName": "Name",
        "TaskID": "EE305307D76A070C",
        "ParentEventID": [
          "CAD61994C0348A17"
        ],
        "Label": "Forking current baggage with Baggage.fork()",
        "Title": "X-Trace Task",
        "Host": "pinky19.mpi-sws.org",
        "HRT": 25491845572084516,
        "Operation": "fork",
        "Timestamp": "1556275485511.472656",
        "TenantClass": 0,
        "Source": "Server.java:550",
        "ThreadID": 48,
        "ThreadName": "",
        "EventID": "9533493BF7F66D8E",
        "BaggageBytes": "[[248 5] [240 0] [0 238 48 83 7 215 106 7 12] [240 1] [0 202 214 25 148 192 52 138 23] [240 3] [0 2]]",
        "ProcessID": 2171
      },
      {
        "Cycles": 0,
        "Agent": "org.apache.hadoop.ipc.Server",
        "ProcessName": "Name",
        "TaskID": "EE305307D76A070C",
        "ParentEventID": [
          "EEB209BC6E60116F"
        ],
        "Label": "getBlockLocations in org.apache.hadoop.hdfs.protocol.ClientProtocol",
        "Title": "X-Trace Task",
        "Host": "pinky19.mpi-sws.org",
        "HRT": 25491845572154216,
        "Timestamp": "1556275485511.542236",
        "TenantClass": 0,
        "Source": "ProtobufRpcEngine.java:601",
        "ThreadID": 64,
        "ThreadName": "",
        "EventID": "C159575220B71AD0",
        "BaggageBytes": "[[248 5] [240 0] [0 238 48 83 7 215 106 7 12] [240 1] [0 238 178 9 188 110 96 17 111] [240 3] [0 2]]",
        "ProcessID": 2171
      },
      {
        "Cycles": 0,
        "Agent": "org.apache.hadoop.hdfs.server.namenode.FSNamesystem.audit",
        "ProcessName": "Name",
        "TaskID": "EE305307D76A070C",
        "ParentEventID": [
          "C159575220B71AD0"
        ],
        "Label": "allowed=true\tugi=plascas (auth:SIMPLE)\tip=/139.19.171.63\tcmd=open\tsrc=/ds/1md50tf1cPWK4dYp\tdst=null\tperm=null\tproto=rpc",
        "Title": "X-Trace Task",
        "Host": "pinky19.mpi-sws.org",
        "HRT": 25491845572199708,
        "Timestamp": "1556275485511.587646",
        "TenantClass": 0,
        "Source": "FSNamesystem.java:8313",
        "ThreadID": 64,
        "ThreadName": "",
        "EventID": "7BD3903547359F26",
        "BaggageBytes": "[[248 5] [240 0] [0 238 48 83 7 215 106 7 12] [240 1] [0 193 89 87 82 32 183 26 208] [240 3] [0 2]]",
        "ProcessID": 2171
      },
      {
        "Cycles": 0,
        "Agent": "edu.brown.cs.systems.xtrace.logging.BaggageWrappers",
        "ProcessName": "Name",
        "TaskID": "EE305307D76A070C",
        "ParentEventID": [
          "7BD3903547359F26"
        ],
        "Label": "Forking current baggage with Baggage.fork()",
        "Title": "X-Trace Task",
        "Host": "pinky19.mpi-sws.org",
        "HRT": 25491845572240295,
        "Operation": "fork",
        "Timestamp": "1556275485511.628418",
        "TenantClass": 0,
        "Source": "Server.java:2398",
        "ThreadID": 64,
        "ThreadName": "",
        "EventID": "5A7C6835ABDF7646",
        "BaggageBytes": "[[248 5] [240 0] [0 238 48 83 7 215 106 7 12] [240 1] [0 123 211 144 53 71 53 159 38] [240 3] [0 2]]",
        "ProcessID": 2171
      },
      {
        "Cycles": 0,
        "Agent": "Execution-CPU",
        "ProcessName": "Name",
        "TaskID": "EE305307D76A070C",
        "ParentEventID": [
          "5A7C6835ABDF7646"
        ],
        "Label": "unset",
        "Title": "X-Trace Task",
        "Host": "pinky19.mpi-sws.org",
        "Duration": "198255",
        "HRT": 25491845572341457,
        "Operation": "unset",
        "Timestamp": "1556275485511.729492",
        "TenantClass": 0,
        "Source": "Server.java:1058",
        "ThreadID": 64,
        "ThreadName": "",
        "EventID": "DCD3B9837668B595",
        "BaggageBytes": "[[248 5] [240 0] [0 238 48 83 7 215 106 7 12] [240 1] [0 90 124 104 53 171 223 118 70] [240 3] [0 2]]",
        "ProcessID": 2171
      },
      {
        "Cycles": 0,
        "Agent": "Execution-CPU",
        "ProcessName": "Read",
        "TaskID": "EE305307D76A070C",
        "ParentEventID": [
          "5A7C6835ABDF7646"
        ],
        "Label": "set",
        "Title": "X-Trace Task",
        "Host": "pinky19.mpi-sws.org",
        "HRT": 25491845572415965,
        "Operation": "set",
        "Timestamp": "1556275485511.567627",
        "TenantClass": 0,
        "Source": "Client.java:302",
        "ThreadID": 37,
        "ThreadName": "",
        "EventID": "D6F064FBD60D2CBC",
        "ProcessID": 21035
      },
      {
        "Cycles": 0,
        "Agent": "Execution-CPU",
        "ProcessName": "Read",
        "TaskID": "EE305307D76A070C",
        "ParentEventID": [
          "D6F064FBD60D2CBC"
        ],
        "Label": "unset",
        "Title": "X-Trace Task",
        "Host": "pinky19.mpi-sws.org",
        "Duration": "10270",
        "HRT": 25491845572442961,
        "Operation": "unset",
        "Timestamp": "1556275485511.594727",
        "TenantClass": 0,
        "Source": "Client.java:1168",
        "ThreadID": 37,
        "ThreadName": "",
        "EventID": "BB569F2A8322B952",
        "ProcessID": 21035
      },
      {
        "Cycles": 0,
        "Agent": "Execution-Sleep",
        "ProcessName": "Read",
        "TaskID": "EE305307D76A070C",
        "ParentEventID": [
          "4E93E7EB625C081E"
        ],
        "Label": "waited",
        "Title": "X-Trace Task",
        "Host": "pinky19.mpi-sws.org",
        "Duration": "431162",
        "HRT": 25491845572461007,
        "Operation": "waited",
        "Timestamp": "1556275485511.612793",
        "TenantClass": 0,
        "Source": "Client.java:1537",
        "ThreadID": 1,
        "ThreadName": "",
        "EventID": "57FF973497AA21D3",
        "ProcessID": 21035
      },
      {
        "Cycles": 0,
        "Agent": "edu.brown.cs.systems.xtrace.logging.BaggageWrappers",
        "ProcessName": "Read",
        "TaskID": "EE305307D76A070C",
        "ParentEventID": [
          "BB569F2A8322B952",
          "57FF973497AA21D3"
        ],
        "Label": "Merged current baggage with other baggage",
        "Title": "X-Trace Task",
        "Host": "pinky19.mpi-sws.org",
        "HRT": 25491845572479752,
        "Operation": "join",
        "Timestamp": "1556275485511.631592",
        "TenantClass": 0,
        "Source": "Client.java:1545",
        "ThreadID": 1,
        "ThreadName": "",
        "EventID": "0FFA793FBE2D2F76",
        "ProcessID": 21035
      },
      {
        "Cycles": 0,
        "Agent": "org.apache.hadoop.ipc.ProtobufRpcEngine",
        "ProcessName": "Read",
        "TaskID": "EE305307D76A070C",
        "ParentEventID": [
          "0FFA793FBE2D2F76"
        ],
        "Label": "org.apache.hadoop.hdfs.protocol.ClientProtocol.getBlockLocations completed",
        "Title": "X-Trace Task",
        "Host": "pinky19.mpi-sws.org",
        "HRT": 25491845572527049,
        "Timestamp": "1556275485511.678711",
        "TenantClass": 0,
        "Source": "ProtobufRpcEngine.java:275",
        "ThreadID": 1,
        "ThreadName": "",
        "EventID": "BDDDC627A778BAEE",
        "ProcessID": 21035
      },
      {
        "Cycles": 0,
        "Agent": "edu.brown.cs.systems.xtrace.logging.BaggageWrappers",
        "ProcessName": "Read",
        "TaskID": "EE305307D76A070C",
        "ParentEventID": [
          "BDDDC627A778BAEE"
        ],
        "Label": "Forking current baggage with Baggage.fork()",
        "Title": "X-Trace Task",
        "Host": "pinky19.mpi-sws.org",
        "HRT": 25491845572603753,
        "Operation": "fork",
        "Timestamp": "1556275485511.755371",
        "TenantClass": 0,
        "Source": "DataTransferProtoUtil.java:94",
        "ThreadID": 1,
        "ThreadName": "",
        "EventID": "9E0A56FC04B15382",
        "ProcessID": 21035
      },
      {
        "Cycles": 0,
        "Agent": "Execution-CPU",
        "ProcessName": "Data",
        "TaskID": "EE305307D76A070C",
        "ParentEventID": [
          "9E0A56FC04B15382"
        ],
        "Label": "set",
        "Title": "X-Trace Task",
        "Host": "pinky20.mpi-sws.org",
        "HRT": 5095049932543508,
        "Operation": "set",
        "Timestamp": "1556275485512.068848",
        "TenantClass": 0,
        "Source": "Receiver.java:117",
        "ThreadID": 5400,
        "ThreadName": "",
        "EventID": "FF342F4282B64AA9",
        "BaggageBytes": "[[248 5] [240 0] [0 238 48 83 7 215 106 7 12] [240 1] [0 158 10 86 252 4 177 83 130] [240 3] [0 2]]",
        "ProcessID": 13111
      },
      {
        "Cycles": 0,
        "Agent": "edu.brown.cs.systems.xtrace.logging.XTraceInit",
        "ProcessName": "Data",
        "TaskID": "EE305307D76A070C",
        "ParentEventID": [
          "FF342F4282B64AA9"
        ],
        "Label": "Thread.setName: DataXceiver for client DFSClient_NONMAPREDUCE_1377588049_1 at /139.19.171.63:32854 [Sending block BP-1633380353-139.19.171.63-1554193446451:blk_1073767302_26478]",
        "Title": "X-Trace Task",
        "Host": "pinky20.mpi-sws.org",
        "HRT": 5095049932643185,
        "Timestamp": "1556275485512.168457",
        "TenantClass": 0,
        "Source": "DataXceiver.java:168",
        "ThreadID": 5400,
        "ThreadName": "",
        "EventID": "94E90BEE4C829EBB",
        "BaggageBytes": "[[248 5] [240 0] [0 238 48 83 7 215 106 7 12] [240 1] [0 255 52 47 66 130 182 74 169] [240 3] [0 2]]",
        "ProcessID": 13111
      },
      {
        "Cycles": 0,
        "Agent": "Execution-Sleep",
        "ProcessName": "Read",
        "TaskID": "EE305307D76A070C",
        "ParentEventID": [
          "9E0A56FC04B15382"
        ],
        "Label": "waited",
        "Title": "X-Trace Task",
        "Host": "pinky19.mpi-sws.org",
        "Duration": "793191",
        "HRT": 25491845573494083,
        "Operation": "waited",
        "Timestamp": "1556275485512.645752",
        "TenantClass": 0,
        "Source": "SocketIOWithTimeout.java:335",
        "ThreadID": 1,
        "ThreadName": "",
        "EventID": "0EA6C89AD37EAEC8",
        "ProcessID": 21035
      },
      {
        "Cycles": 0,
        "Agent": "edu.brown.cs.systems.xtrace.logging.BaggageWrappers",
        "ProcessName": "Read",
        "TaskID": "EE305307D76A070C",
        "ParentEventID": [
          "0EA6C89AD37EAEC8",
          "907B4B11850E4F86"
        ],
        "Label": "Merged current baggage with other baggage",
        "Title": "X-Trace Task",
        "Host": "pinky19.mpi-sws.org",
        "HRT": 25491845573574864,
        "Operation": "join",
        "Timestamp": "1556275485512.726562",
        "TenantClass": 0,
        "Source": "RemoteBlockReader2.java:429",
        "ThreadID": 1,
        "ThreadName": "",
        "EventID": "C9AE938C7B45D60F",
        "ProcessID": 21035
      },
      {
        "Cycles": 0,
        "Agent": "edu.brown.cs.systems.xtrace.logging.BaggageWrappers",
        "ProcessName": "Data",
        "TaskID": "EE305307D76A070C",
        "ParentEventID": [
          "94E90BEE4C829EBB"
        ],
        "Label": "Forking current baggage with Baggage.fork()",
        "Title": "X-Trace Task",
        "Host": "pinky20.mpi-sws.org",
        "HRT": 5095049932902048,
        "Operation": "fork",
        "Timestamp": "1556275485512.427490",
        "TenantClass": 0,
        "Source": "DataXceiver.java:1257",
        "ThreadID": 5400,
        "ThreadName": "",
        "EventID": "907B4B11850E4F86",
        "BaggageBytes": "[[248 5] [240 0] [0 238 48 83 7 215 106 7 12] [240 1] [0 148 233 11 238 76 130 158 187] [240 3] [0 2]]",
        "ProcessID": 13111
      },
      {
        "Cycles": 0,
        "Agent": "edu.brown.cs.systems.xtrace.logging.BaggageWrappers",
        "ProcessName": "Data",
        "TaskID": "EE305307D76A070C",
        "ParentEventID": [
          "907B4B11850E4F86"
        ],
        "Label": "Forking current baggage with Baggage.fork()",
        "Title": "X-Trace Task",
        "Host": "pinky20.mpi-sws.org",
        "HRT": 5095049933076474,
        "Operation": "fork",
        "Timestamp": "1556275485512.601807",
        "TenantClass": 0,
        "Source": "PacketHeader.java:95",
        "ThreadID": 5400,
        "ThreadName": "",
        "EventID": "9C35ECDE6812121A",
        "BaggageBytes": "[[248 5] [240 0] [0 238 48 83 7 215 106 7 12] [240 1] [0 144 123 75 17 133 14 79 134] [240 3] [0 2]]",
        "ProcessID": 13111
      },
      {
        "Cycles": 0,
        "Agent": "Execution-Sleep",
        "ProcessName": "Read",
        "TaskID": "EE305307D76A070C",
        "ParentEventID": [
          "C9AE938C7B45D60F"
        ],
        "Label": "waited",
        "Title": "X-Trace Task",
        "Host": "pinky19.mpi-sws.org",
        "Duration": "32846",
        "HRT": 25491845573670261,
        "Operation": "waited",
        "Timestamp": "1556275485512.822021",
        "TenantClass": 0,
        "Source": "SocketIOWithTimeout.java:335",
        "ThreadID": 1,
        "ThreadName": "",
        "EventID": "422D547E01B7E1BD",
        "ProcessID": 21035
      },
      {
        "Cycles": 0,
        "Agent": "Execution-Sleep",
        "ProcessName": "Read",
        "TaskID": "EE305307D76A070C",
        "ParentEventID": [
          "422D547E01B7E1BD"
        ],
        "Label": "waited",
        "Title": "X-Trace Task",
        "Host": "pinky19.mpi-sws.org",
        "Duration": "148228",
        "HRT": 25491845573881171,
        "Operation": "waited",
        "Timestamp": "1556275485513.032959",
        "TenantClass": 0,
        "Source": "SocketIOWithTimeout.java:335",
        "ThreadID": 1,
        "ThreadName": "",
        "EventID": "3BE0A4209E7A802A",
        "ProcessID": 21035
      },
      {
        "Cycles": 0,
        "Agent": "Execution-Sleep",
        "ProcessName": "Data",
        "TaskID": "EE305307D76A070C",
        "ParentEventID": [
          "9C35ECDE6812121A"
        ],
        "Label": "waited",
        "Title": "X-Trace Task",
        "Host": "pinky20.mpi-sws.org",
        "Duration": "10649",
        "HRT": 5095049933258200,
        "Operation": "waited",
        "Timestamp": "1556275485512.783447",
        "TenantClass": 0,
        "Source": "SocketIOWithTimeout.java:335",
        "ThreadID": 5400,
        "ThreadName": "",
        "EventID": "DA86498F46BA7118",
        "BaggageBytes": "[[248 5] [240 0] [0 238 48 83 7 215 106 7 12] [240 1] [0 156 53 236 222 104 18 18 26] [240 3] [0 2]]",
        "ProcessID": 13111
      },
      {
        "Cycles": 0,
        "Agent": "edu.brown.cs.systems.xtrace.logging.BaggageWrappers",
        "ProcessName": "Data",
        "TaskID": "EE305307D76A070C",
        "ParentEventID": [
          "DA86498F46BA7118"
        ],
        "Label": "Forking current baggage with Baggage.fork()",
        "Title": "X-Trace Task",
        "Host": "pinky20.mpi-sws.org",
        "HRT": 5095049933425609,
        "Operation": "fork",
        "Timestamp": "1556275485512.950928",
        "TenantClass": 0,
        "Source": "PacketHeader.java:95",
        "ThreadID": 5400,
        "ThreadName": "",
        "EventID": "DC2DE9CD4D8DD70F",
        "BaggageBytes": "[[248 5] [240 0] [0 238 48 83 7 215 106 7 12] [240 1] [0 218 134 73 143 70 186 113 24] [240 3] [0 2]]",
        "ProcessID": 13111
      },
      {
        "Cycles": 0,
        "Agent": "Execution-Sleep",
        "ProcessName": "Read",
        "TaskID": "EE305307D76A070C",
        "ParentEventID": [
          "0AE3E12B8537D4C1"
        ],
        "Label": "waited",
        "Title": "X-Trace Task",
        "Host": "pinky19.mpi-sws.org",
        "Duration": "32281",
        "HRT": 25491845573999351,
        "Operation": "waited",
        "Timestamp": "1556275485513.151123",
        "TenantClass": 0,
        "Source": "SocketIOWithTimeout.java:335",
        "ThreadID": 1,
        "ThreadName": "",
        "EventID": "0C468DD1A7643D6B",
        "ProcessID": 21035
      },
      {
        "Cycles": 0,
        "Agent": "edu.brown.cs.systems.xtrace.logging.BaggageWrappers",
        "ProcessName": "Read",
        "TaskID": "EE305307D76A070C",
        "ParentEventID": [
          "9C35ECDE6812121A",
          "3BE0A4209E7A802A"
        ],
        "Label": "Merged current baggage with other baggage",
        "Title": "X-Trace Task",
        "Host": "pinky19.mpi-sws.org",
        "HRT": 25491845573921147,
        "Operation": "join",
        "Timestamp": "1556275485513.072998",
        "TenantClass": 0,
        "Source": "PacketHeader.java:168",
        "ThreadID": 1,
        "ThreadName": "",
        "EventID": "0AE3E12B8537D4C1",
        "ProcessID": 21035
      },
      {
        "Cycles": 0,
        "Agent": "edu.brown.cs.systems.xtrace.logging.BaggageWrappers",
        "ProcessName": "Read",
        "TaskID": "EE305307D76A070C",
        "ParentEventID": [
          "0C468DD1A7643D6B",
          "DC2DE9CD4D8DD70F"
        ],
        "Label": "Merged current baggage with other baggage",
        "Title": "X-Trace Task",
        "Host": "pinky19.mpi-sws.org",
        "HRT": 25491845574045225,
        "Operation": "join",
        "Timestamp": "1556275485513.197021",
        "TenantClass": 0,
        "Source": "PacketHeader.java:168",
        "ThreadID": 1,
        "ThreadName": "",
        "EventID": "18FAE9F0AB7E8F93",
        "ProcessID": 21035
      },
      {
        "Cycles": 0,
        "Agent": "edu.brown.cs.systems.xtrace.logging.BaggageWrappers",
        "ProcessName": "Read",
        "TaskID": "EE305307D76A070C",
        "ParentEventID": [
          "18FAE9F0AB7E8F93"
        ],
        "Label": "Forking current baggage with Baggage.fork()",
        "Title": "X-Trace Task",
        "Host": "pinky19.mpi-sws.org",
        "HRT": 25491845574055225,
        "Operation": "fork",
        "Timestamp": "1556275485513.207031",
        "TenantClass": 0,
        "Source": "RemoteBlockReader2.java:361",
        "ThreadID": 1,
        "ThreadName": "",
        "EventID": "38B555C038173345",
        "ProcessID": 21035
      },
      {
        "Cycles": 0,
        "Agent": "Execution-Sleep",
        "ProcessName": "Data",
        "TaskID": "EE305307D76A070C",
        "ParentEventID": [
          "DC2DE9CD4D8DD70F"
        ],
        "Label": "waited",
        "Title": "X-Trace Task",
        "Host": "pinky20.mpi-sws.org",
        "Duration": "51157",
        "HRT": 5095049933726176,
        "Operation": "waited",
        "Timestamp": "1556275485513.251465",
        "TenantClass": 0,
        "Source": "SocketIOWithTimeout.java:335",
        "ThreadID": 5400,
        "ThreadName": "",
        "EventID": "67A3CE121AFA2909",
        "BaggageBytes": "[[248 5] [240 0] [0 238 48 83 7 215 106 7 12] [240 1] [0 220 45 233 205 77 141 215 15] [240 3] [0 2]]",
        "ProcessID": 13111
      },
      {
        "Cycles": 0,
        "Agent": "Execution-CPU",
        "ProcessName": "Data",
        "TaskID": "EE305307D76A070C",
        "ParentEventID": [
          "81A0EE15711EEC24"
        ],
        "Label": "unset",
        "Title": "X-Trace Task",
        "Host": "pinky20.mpi-sws.org",
        "Duration": "1310315",
        "HRT": 5095049933925613,
        "Operation": "unset",
        "Timestamp": "1556275485513.450928",
        "TenantClass": 0,
        "Source": "DataXceiver.java:261",
        "ThreadID": 5400,
        "ThreadName": "",
        "EventID": "F1F6674916BAA239",
        "BaggageBytes": "[[248 5] [240 0] [0 238 48 83 7 215 106 7 12] [240 1] [0 129 160 238 21 113 30 236 36] [240 3] [0 2]]",
        "ProcessID": 13111
      },
      {
        "Cycles": 0,
        "Agent": "edu.brown.cs.systems.xtrace.logging.BaggageWrappers",
        "ProcessName": "Data",
        "TaskID": "EE305307D76A070C",
        "ParentEventID": [
          "67A3CE121AFA2909",
          "38B555C038173345"
        ],
        "Label": "Merged current baggage with other baggage",
        "Title": "X-Trace Task",
        "Host": "pinky20.mpi-sws.org",
        "HRT": 5095049933872753,
        "Operation": "join",
        "Timestamp": "1556275485513.398193",
        "TenantClass": 0,
        "Source": "DataXceiver.java:574",
        "ThreadID": 5400,
        "ThreadName": "",
        "EventID": "81A0EE15711EEC24",
        "BaggageBytes": "[[248 5] [240 0] [0 238 48 83 7 215 106 7 12] [240 1] [0 56 181 85 192 56 23 51 69] [0 103 163 206 18 26 250 41 9] [240 3] [0 2]]",
        "ProcessID": 13111
      },
      {
        "Cycles": 0,
        "Agent": "edu.brown.cs.systems.retro.benchmarks.hdfs_client.Reader",
        "ProcessName": "Read",
        "TaskID": "EE305307D76A070C",
        "ParentEventID": [
          "0"
        ],
        "Label": "Reading file",
        "Title": "X-Trace Task",
        "Host": "pinky19.mpi-sws.org",
        "HRT": 25491845571775574,
        "Timestamp": "1556275485510.927246",
        "TenantClass": 0,
        "ThreadID": 1,
        "ThreadName": "",
        "EventID": "8BECAC75A235C305",
        "ProcessID": 21035,
        "Tag": [
          "reader_1kb",
          "Read Size: 1024"
        ]
      }
    ]
  }
]