[
  {
    "id": "29D58D703FEF3DCB",
    "reports": [
      {
        "Cycles": 0,
        "Agent": "edu.brown.cs.systems.retro.benchmarks.hdfs_client.Reader",
        "ProcessName": "Read",
        "TaskID": "29D58D703FEF3DCB",
        "ParentEventID": [
          "10D93F9EBDA371D3"
        ],
        "Label": "Reading file",
        "Title": "X-Trace Task",
        "Host": "pinky19.mpi-sws.org",
        "HRT": 26962571572357444,
        "Timestamp": "1557746211512.574219",
        "TenantClass": 0,
        "ThreadID": 1,
        "ThreadName": "",
        "EventID": "01DB6E9800F8502C",
        "ProcessID": 36430
      },
      {
        "Cycles": 0,
        "Agent": "Execution-CPU",
        "ProcessName": "Read",
        "TaskID": "29D58D703FEF3DCB",
        "ParentEventID": [
          "86EBA4F39A5657AB"
        ],
        "Label": "unset",
        "Title": "X-Trace Task",
        "Host": "pinky19.mpi-sws.org",
        "Duration": "35725399",
        "HRT": 26962571572399494,
        "Operation": "unset",
        "Timestamp": "1557746211512.616211",
        "TenantClass": 0,
        "Source": "Client.java:1027",
        "ThreadID": 1,
        "ThreadName": "",
        "EventID": "1906F61125795961",
        "ProcessID": 36430
      },
      {
        "Cycles": 0,
        "Agent": "org.apache.hadoop.ipc.ProtobufRpcEngine",
        "ProcessName": "Read",
        "TaskID": "29D58D703FEF3DCB",
        "ParentEventID": [
          "01DB6E9800F8502C"
        ],
        "Label": "Invoking org.apache.hadoop.hdfs.protocol.ClientProtocol.getBlockLocations",
        "Title": "X-Trace Task",
        "Host": "pinky19.mpi-sws.org",
        "HRT": 26962571572381263,
        "Timestamp": "1557746211512.598145",
        "TenantClass": 0,
        "Source": "ProtobufRpcEngine.java:228",
        "ThreadID": 1,
        "ThreadName": "",
        "EventID": "86EBA4F39A5657AB",
        "ProcessID": 36430
      },
      {
        "Cycles": 0,
        "Agent": "Execution-CPU",
        "ProcessName": "Read",
        "TaskID": "29D58D703FEF3DCB",
        "ParentEventID": [
          "1906F61125795961"
        ],
        "Label": "set",
        "Title": "X-Trace Task",
        "Host": "pinky19.mpi-sws.org",
        "HRT": 26962571572461445,
        "Operation": "set",
        "Timestamp": "1557746211512.678223",
        "TenantClass": 0,
        "Source": "Client.java:1032",
        "ThreadID": 41,
        "ThreadName": "",
        "EventID": "549AAACC2E85A304",
        "ProcessID": 36430
      },
      {
        "Cycles": 0,
        "Agent": "edu.brown.cs.systems.xtrace.logging.BaggageWrappers",
        "ProcessName": "Read",
        "TaskID": "29D58D703FEF3DCB",
        "ParentEventID": [
          "549AAACC2E85A304"
        ],
        "Label": "Forking current baggage with Baggage.fork()",
        "Title": "X-Trace Task",
        "Host": "pinky19.mpi-sws.org",
        "HRT": 26962571572482326,
        "Operation": "fork",
        "Timestamp": "1557746211512.698975",
        "TenantClass": 0,
        "Source": "Client.java:1043",
        "ThreadID": 41,
        "ThreadName": "",
        "EventID": "F688697D449AA3BE",
        "ProcessID": 36430
      },
      {
        "Cycles": 0,
        "Agent": "Execution-CPU",
        "ProcessName": "Read",
        "TaskID": "29D58D703FEF3DCB",
        "ParentEventID": [
          "F688697D449AA3BE"
        ],
        "Label": "unset",
        "Title": "X-Trace Task",
        "Host": "pinky19.mpi-sws.org",
        "Duration": "74965",
        "HRT": 26962571572556509,
        "Operation": "unset",
        "Timestamp": "1557746211512.773193",
        "TenantClass": 0,
        "Source": "Client.java:1062",
        "ThreadID": 41,
        "ThreadName": "",
        "EventID": "E2F69F49B4048CC5",
        "ProcessID": 36430
      },
      {
        "Cycles": 0,
        "Agent": "Execution-CPU",
        "ProcessName": "Read",
        "TaskID": "29D58D703FEF3DCB",
        "ParentEventID": [
          "E2F69F49B4048CC5"
        ],
        "Label": "set",
        "Title": "X-Trace Task",
        "Host": "pinky19.mpi-sws.org",
        "HRT": 26962571572577078,
        "Operation": "set",
        "Timestamp": "1557746211512.793945",
        "TenantClass": 0,
        "Source": "Client.java:1104",
        "ThreadID": 1,
        "ThreadName": "",
        "EventID": "CC54B404F5D91160",
        "ProcessID": 36430
      },
      {
        "Cycles": 0,
        "Agent": "Execution-CPU",
        "ProcessName": "Name",
        "TaskID": "29D58D703FEF3DCB",
        "ParentEventID": [
          "F688697D449AA3BE"
        ],
        "Label": "set",
        "Title": "X-Trace Task",
        "Host": "pinky19.mpi-sws.org",
        "HRT": 26962571572614326,
        "Operation": "set",
        "Timestamp": "1557746211512.854736",
        "TenantClass": 0,
        "Source": "Server.java:1840",
        "ThreadID": 48,
        "ThreadName": "",
        "EventID": "06CF88C27DED0FEC",
        "BaggageBytes": "[[248 5] [240 0] [0 41 213 141 112 63 239 61 203] [240 1] [0 246 136 105 125 68 154 163 190] [240 3] [0 2]]",
        "ProcessID": 2171
      },
      {
        "Cycles": 0,
        "Agent": "Execution-CPU",
        "ProcessName": "Name",
        "TaskID": "29D58D703FEF3DCB",
        "ParentEventID": [
          "7209A10E924F624C"
        ],
        "Label": "unset",
        "Title": "X-Trace Task",
        "Host": "pinky19.mpi-sws.org",
        "Duration": "33946",
        "HRT": 26962571572674272,
        "Operation": "unset",
        "Timestamp": "1557746211512.914795",
        "TenantClass": 0,
        "Source": "Server.java:1828",
        "ThreadID": 48,
        "ThreadName": "",
        "EventID": "576D712B4C12FF6C",
        "BaggageBytes": "[[248 5] [240 0] [0 41 213 141 112 63 239 61 203] [240 1] [0 114 9 161 14 146 79 98 76] [240 3] [0 2]]",
        "ProcessID": 2171
      },
      {
        "Cycles": 0,
        "Agent": "edu.brown.cs.systems.xtrace.logging.BaggageWrappers",
        "ProcessName": "Name",
        "TaskID": "29D58D703FEF3DCB",
        "ParentEventID": [
          "06CF88C27DED0FEC"
        ],
        "Label": "Forking current baggage with Baggage.fork()",
        "Title": "X-Trace Task",
        "Host": "pinky19.mpi-sws.org",
        "HRT": 26962571572644795,
        "Operation": "fork",
        "Timestamp": "1557746211512.885254",
        "TenantClass": 0,
        "Source": "Server.java:550",
        "ThreadID": 48,
        "ThreadName": "",
        "EventID": "7209A10E924F624C",
        "BaggageBytes": "[[248 5] [240 0] [0 41 213 141 112 63 239 61 203] [240 1] [0 6 207 136 194 125 237 15 236] [240 3] [0 2]]",
        "ProcessID": 2171
      },
      {
        "Cycles": 0,
        "Agent": "Execution-CPU",
        "ProcessName": "Name",
        "TaskID": "29D58D703FEF3DCB",
        "ParentEventID": [
          "7209A10E924F624C"
        ],
        "Label": "set",
        "Title": "X-Trace Task",
        "Host": "pinky19.mpi-sws.org",
        "HRT": 26962571572681808,
        "Operation": "set",
        "Timestamp": "1557746211512.922363",
        "TenantClass": 0,
        "Source": "Server.java:2071",
        "ThreadID": 63,
        "ThreadName": "",
        "EventID": "C96A834AA7180E88",
        "BaggageBytes": "[[248 5] [240 0] [0 41 213 141 112 63 239 61 203] [240 1] [0 114 9 161 14 146 79 98 76] [240 3] [0 2]]",
        "ProcessID": 2171
      },
      {
        "Cycles": 0,
        "Agent": "org.apache.hadoop.ipc.Server",
        "ProcessName": "Name",
        "TaskID": "29D58D703FEF3DCB",
        "ParentEventID": [
          "C96A834AA7180E88"
        ],
        "Label": "getBlockLocations in org.apache.hadoop.hdfs.protocol.ClientProtocol",
        "Title": "X-Trace Task",
        "Host": "pinky19.mpi-sws.org",
        "HRT": 26962571572714731,
        "Timestamp": "1557746211512.955078",
        "TenantClass": 0,
        "Source": "ProtobufRpcEngine.java:601",
        "ThreadID": 63,
        "ThreadName": "",
        "EventID": "A6E3114007B2B49F",
        "BaggageBytes": "[[248 5] [240 0] [0 41 213 141 112 63 239 61 203] [240 1] [0 201 106 131 74 167 24 14 136] [240 3] [0 2]]",
        "ProcessID": 2171
      },
      {
        "Cycles": 0,
        "Agent": "edu.brown.cs.systems.xtrace.logging.BaggageWrappers",
        "ProcessName": "Name",
        "TaskID": "29D58D703FEF3DCB",
        "ParentEventID": [
          "858CDB44D7D347E2"
        ],
        "Label": "Forking current baggage with Baggage.fork()",
        "Title": "X-Trace Task",
        "Host": "pinky19.mpi-sws.org",
        "HRT": 26962571572809876,
        "Operation": "fork",
        "Timestamp": "1557746211513.050293",
        "TenantClass": 0,
        "Source": "Server.java:2398",
        "ThreadID": 63,
        "ThreadName": "",
        "EventID": "43897EA64651B51D",
        "BaggageBytes": "[[248 5] [240 0] [0 41 213 141 112 63 239 61 203] [240 1] [0 133 140 219 68 215 211 71 226] [240 3] [0 2]]",
        "ProcessID": 2171
      },
      {
        "Cycles": 0,
        "Agent": "org.apache.hadoop.hdfs.server.namenode.FSNamesystem.audit",
        "ProcessName": "Name",
        "TaskID": "29D58D703FEF3DCB",
        "ParentEventID": [
          "A6E3114007B2B49F"
        ],
        "Label": "allowed=true\tugi=plascas (auth:SIMPLE)\tip=/139.19.171.63\tcmd=open\tsrc=/ds/hy3NcWJeT4z6NSU4\tdst=null\tperm=null\tproto=rpc",
        "Title": "X-Trace Task",
        "Host": "pinky19.mpi-sws.org",
        "HRT": 26962571572766147,
        "Timestamp": "1557746211513.006592",
        "TenantClass": 0,
        "Source": "FSNamesystem.java:8313",
        "ThreadID": 63,
        "ThreadName": "",
        "EventID": "858CDB44D7D347E2",
        "BaggageBytes": "[[248 5] [240 0] [0 41 213 141 112 63 239 61 203] [240 1] [0 166 227 17 64 7 178 180 159] [240 3] [0 2]]",
        "ProcessID": 2171
      },
      {
        "Cycles": 0,
        "Agent": "Execution-CPU",
        "ProcessName": "Name",
        "TaskID": "29D58D703FEF3DCB",
        "ParentEventID": [
          "43897EA64651B51D"
        ],
        "Label": "unset",
        "Title": "X-Trace Task",
        "Host": "pinky19.mpi-sws.org",
        "Duration": "209167",
        "HRT": 26962571572912640,
        "Operation": "unset",
        "Timestamp": "1557746211513.153076",
        "TenantClass": 0,
        "Source": "Server.java:1058",
        "ThreadID": 63,
        "ThreadName": "",
        "EventID": "3C20631B097C47E9",
        "BaggageBytes": "[[248 5] [240 0] [0 41 213 141 112 63 239 61 203] [240 1] [0 67 137 126 166 70 81 181 29] [240 3] [0 2]]",
        "ProcessID": 2171
      },
      {
        "Cycles": 0,
        "Agent": "Execution-CPU",
        "ProcessName": "Read",
        "TaskID": "29D58D703FEF3DCB",
        "ParentEventID": [
          "5167272DF61E764A"
        ],
        "Label": "unset",
        "Title": "X-Trace Task",
        "Host": "pinky19.mpi-sws.org",
        "Duration": "7084",
        "HRT": 26962571573012489,
        "Operation": "unset",
        "Timestamp": "1557746211513.229248",
        "TenantClass": 0,
        "Source": "Client.java:1168",
        "ThreadID": 37,
        "ThreadName": "",
        "EventID": "0B8D6BD51526A693",
        "ProcessID": 36430
      },
      {
        "Cycles": 0,
        "Agent": "Execution-CPU",
        "ProcessName": "Read",
        "TaskID": "29D58D703FEF3DCB",
        "ParentEventID": [
          "43897EA64651B51D"
        ],
        "Label": "set",
        "Title": "X-Trace Task",
        "Host": "pinky19.mpi-sws.org",
        "HRT": 26962571572989340,
        "Operation": "set",
        "Timestamp": "1557746211513.206055",
        "TenantClass": 0,
        "Source": "Client.java:302",
        "ThreadID": 37,
        "ThreadName": "",
        "EventID": "5167272DF61E764A",
        "ProcessID": 36430
      },
      {
        "Cycles": 0,
        "Agent": "Execution-Sleep",
        "ProcessName": "Read",
        "TaskID": "29D58D703FEF3DCB",
        "ParentEventID": [
          "CC54B404F5D91160"
        ],
        "Label": "waited",
        "Title": "X-Trace Task",
        "Host": "pinky19.mpi-sws.org",
        "Duration": "444767",
        "HRT": 26962571573030524,
        "Operation": "waited",
        "Timestamp": "1557746211513.247314",
        "TenantClass": 0,
        "Source": "Client.java:1537",
        "ThreadID": 1,
        "ThreadName": "",
        "EventID": "000C0269BDD79468",
        "ProcessID": 36430
      },
      {
        "Cycles": 0,
        "Agent": "edu.brown.cs.systems.xtrace.logging.BaggageWrappers",
        "ProcessName": "Read",
        "TaskID": "29D58D703FEF3DCB",
        "ParentEventID": [
          "0B8D6BD51526A693",
          "000C0269BDD79468"
        ],
        "Label": "Merged current baggage with other baggage",
        "Title": "X-Trace Task",
        "Host": "pinky19.mpi-sws.org",
        "HRT": 26962571573040292,
        "Operation": "join",
        "Timestamp": "1557746211513.257080",
        "TenantClass": 0,
        "Source": "Client.java:1545",
        "ThreadID": 1,
        "ThreadName": "",
        "EventID": "B55F3AC8A19ED673",
        "ProcessID": 36430
      },
      {
        "Cycles": 0,
        "Agent": "org.apache.hadoop.ipc.ProtobufRpcEngine",
        "ProcessName": "Read",
        "TaskID": "29D58D703FEF3DCB",
        "ParentEventID": [
          "B55F3AC8A19ED673"
        ],
        "Label": "org.apache.hadoop.hdfs.protocol.ClientProtocol.getBlockLocations completed",
        "Title": "X-Trace Task",
        "Host": "pinky19.mpi-sws.org",
        "HRT": 26962571573075089,
        "Timestamp": "1557746211513.291748",
        "TenantClass": 0,
        "Source": "ProtobufRpcEngine.java:275",
        "ThreadID": 1,
        "ThreadName": "",
        "EventID": "3E8D05F6425EC6AD",
        "ProcessID": 36430
      },
      {
        "Cycles": 0,
        "Agent": "edu.brown.cs.systems.xtrace.logging.BaggageWrappers",
        "ProcessName": "Read",
        "TaskID": "29D58D703FEF3DCB",
        "ParentEventID": [
          "3E8D05F6425EC6AD"
        ],
        "Label": "Forking current baggage with Baggage.fork()",
        "Title": "X-Trace Task",
        "Host": "pinky19.mpi-sws.org",
        "HRT": 26962571573152380,
        "Operation": "fork",
        "Timestamp": "1557746211513.369141",
        "TenantClass": 0,
        "Source": "DataTransferProtoUtil.java:94",
        "ThreadID": 1,
        "ThreadName": "",
        "EventID": "ED919E67D82075D5",
        "ProcessID": 36430
      },
      {
        "Cycles": 0,
        "Agent": "edu.brown.cs.systems.xtrace.logging.XTraceInit",
        "ProcessName": "Data",
        "TaskID": "29D58D703FEF3DCB",
        "ParentEventID": [
          "6E58D6B563F9D662"
        ],
        "Label": "Thread.setName: DataXceiver for client DFSClient_NONMAPREDUCE_778905418_1 at /139.19.171.63:39908 [Sending block BP-1633380353-139.19.171.63-1554193446451:blk_1073766012_25188]",
        "Title": "X-Trace Task",
        "Host": "pinky20.mpi-sws.org",
        "HRT": 6565775932543448,
        "Timestamp": "1557746211513.798584",
        "TenantClass": 0,
        "Source": "DataXceiver.java:168",
        "ThreadID": 14317,
        "ThreadName": "",
        "EventID": "AD3B7044164D6B4C",
        "BaggageBytes": "[[248 5] [240 0] [0 41 213 141 112 63 239 61 203] [240 1] [0 110 88 214 181 99 249 214 98] [240 3] [0 2]]",
        "ProcessID": 13111
      },
      {
        "Cycles": 0,
        "Agent": "edu.brown.cs.systems.xtrace.logging.BaggageWrappers",
        "ProcessName": "Data",
        "TaskID": "29D58D703FEF3DCB",
        "ParentEventID": [
          "AD3B7044164D6B4C"
        ],
        "Label": "Forking current baggage with Baggage.fork()",
        "Title": "X-Trace Task",
        "Host": "pinky20.mpi-sws.org",
        "HRT": 6565775932782879,
        "Operation": "fork",
        "Timestamp": "1557746211514.038086",
        "TenantClass": 0,
        "Source": "DataXceiver.java:1257",
        "ThreadID": 14317,
        "ThreadName": "",
        "EventID": "B3DA3540CD112D72",
        "BaggageBytes": "[[248 5] [240 0] [0 41 213 141 112 63 239 61 203] [240 1] [0 173 59 112 68 22 77 107 76] [240 3] [0 2]]",
        "ProcessID": 13111
      },
      {
        "Cycles": 0,
        "Agent": "Execution-Sleep",
        "ProcessName": "Read",
        "TaskID": "29D58D703FEF3DCB",
        "ParentEventID": [
          "ED919E67D82075D5"
        ],
        "Label": "waited",
        "Title": "X-Trace Task",
        "Host": "pinky19.mpi-sws.org",
        "Duration": "723335",
        "HRT": 26962571573975133,
        "Operation": "waited",
        "Timestamp": "1557746211514.191895",
        "TenantClass": 0,
        "Source": "SocketIOWithTimeout.java:335",
        "ThreadID": 1,
        "ThreadName": "",
        "EventID": "920F5EE07B2F1EEC",
        "ProcessID": 36430
      },
      {
        "Cycles": 0,
        "Agent": "Execution-CPU",
        "ProcessName": "Data",
        "TaskID": "29D58D703FEF3DCB",
        "ParentEventID": [
          "ED919E67D82075D5"
        ],
        "Label": "set",
        "Title": "X-Trace Task",
        "Host": "pinky20.mpi-sws.org",
        "HRT": 6565775932443105,
        "Operation": "set",
        "Timestamp": "1557746211513.698242",
        "TenantClass": 0,
        "Source": "Receiver.java:117",
        "ThreadID": 14317,
        "ThreadName": "",
        "EventID": "6E58D6B563F9D662",
        "BaggageBytes": "[[248 5] [240 0] [0 41 213 141 112 63 239 61 203] [240 1] [0 237 145 158 103 216 32 117 213] [240 3] [0 2]]",
        "ProcessID": 13111
      },
      {
        "Cycles": 0,
        "Agent": "edu.brown.cs.systems.xtrace.logging.BaggageWrappers",
        "ProcessName": "Data",
        "TaskID": "29D58D703FEF3DCB",
        "ParentEventID": [
          "B3DA3540CD112D72"
        ],
        "Label": "Forking current baggage with Baggage.fork()",
        "Title": "X-Trace Task",
        "Host": "pinky20.mpi-sws.org",
        "HRT": 6565775932944419,
        "Operation": "fork",
        "Timestamp": "1557746211514.199707",
        "TenantClass": 0,
        "Source": "PacketHeader.java:95",
        "ThreadID": 14317,
        "ThreadName": "",
        "EventID": "E52399AC9E3AE654",
        "BaggageBytes": "[[248 5] [240 0] [0 41 213 141 112 63 239 61 203] [240 1] [0 179 218 53 64 205 17 45 114] [240 3] [0 2]]",
        "ProcessID": 13111
      },
      {
        "Cycles": 0,
        "Agent": "Execution-Sleep",
        "ProcessName": "Read",
        "TaskID": "29D58D703FEF3DCB",
        "ParentEventID": [
          "783E330FD3D97867"
        ],
        "Label": "waited",
        "Title": "X-Trace Task",
        "Host": "pinky19.mpi-sws.org",
        "Duration": "29075",
        "HRT": 26962571574163007,
        "Operation": "waited",
        "Timestamp": "1557746211514.379883",
        "TenantClass": 0,
        "Source": "SocketIOWithTimeout.java:335",
        "ThreadID": 1,
        "ThreadName": "",
        "EventID": "31D372A5AC43DCF8",
        "ProcessID": 36430
      },
      {
        "Cycles": 0,
        "Agent": "Execution-Sleep",
        "ProcessName": "Data",
        "TaskID": "29D58D703FEF3DCB",
        "ParentEventID": [
          "E52399AC9E3AE654"
        ],
        "Label": "waited",
        "Title": "X-Trace Task",
        "Host": "pinky20.mpi-sws.org",
        "Duration": "11653",
        "HRT": 6565775933138999,
        "Operation": "waited",
        "Timestamp": "1557746211514.394287",
        "TenantClass": 0,
        "Source": "SocketIOWithTimeout.java:335",
        "ThreadID": 14317,
        "ThreadName": "",
        "EventID": "40EFB4AB4CA2E479",
        "BaggageBytes": "[[248 5] [240 0] [0 41 213 141 112 63 239 61 203] [240 1] [0 229 35 153 172 158 58 230 84] [240 3] [0 2]]",
        "ProcessID": 13111
      },
      {
        "Cycles": 0,
        "Agent": "edu.brown.cs.systems.xtrace.logging.BaggageWrappers",
        "ProcessName": "Read",
        "TaskID": "29D58D703FEF3DCB",
        "ParentEventID": [
          "920F5EE07B2F1EEC",
          "B3DA3540CD112D72"
        ],
        "Label": "Merged current baggage with other baggage",
        "Title": "X-Trace Task",
        "Host": "pinky19.mpi-sws.org",
        "HRT": 26962571574073160,
        "Operation": "join",
        "Timestamp": "1557746211514.290039",
        "TenantClass": 0,
        "Source": "RemoteBlockReader2.java:429",
        "ThreadID": 1,
        "ThreadName": "",
        "EventID": "783E330FD3D97867",
        "ProcessID": 36430
      },
      {
        "Cycles": 0,
        "Agent": "edu.brown.cs.systems.xtrace.logging.BaggageWrappers",
        "ProcessName": "Data",
        "TaskID": "29D58D703FEF3DCB",
        "ParentEventID": [
          "40EFB4AB4CA2E479"
        ],
        "Label": "Forking current baggage with Baggage.fork()",
        "Title": "X-Trace Task",
        "Host": "pinky20.mpi-sws.org",
        "HRT": 6565775933332573,
        "Operation": "fork",
        "Timestamp": "1557746211514.587891",
        "TenantClass": 0,
        "Source": "PacketHeader.java:95",
        "ThreadID": 14317,
        "ThreadName": "",
        "EventID": "88A746F2E70BCFAF",
        "BaggageBytes": "[[248 5] [240 0] [0 41 213 141 112 63 239 61 203] [240 1] [0 64 239 180 171 76 162 228 121] [240 3] [0 2]]",
        "ProcessID": 13111
      },
      {
        "Cycles": 0,
        "Agent": "Execution-Sleep",
        "ProcessName": "Read",
        "TaskID": "29D58D703FEF3DCB",
        "ParentEventID": [
          "31D372A5AC43DCF8"
        ],
        "Label": "waited",
        "Title": "X-Trace Task",
        "Host": "pinky19.mpi-sws.org",
        "Duration": "261990",
        "HRT": 26962571574489345,
        "Operation": "waited",
        "Timestamp": "1557746211514.706055",
        "TenantClass": 0,
        "Source": "SocketIOWithTimeout.java:335",
        "ThreadID": 1,
        "ThreadName": "",
        "EventID": "30D4FE7350EEDC15",
        "ProcessID": 36430
      },
      {
        "Cycles": 0,
        "Agent": "edu.brown.cs.systems.xtrace.logging.BaggageWrappers",
        "ProcessName": "Read",
        "TaskID": "29D58D703FEF3DCB",
        "ParentEventID": [
          "88A746F2E70BCFAF",
          "7E5FF0C761A9E2AE"
        ],
        "Label": "Merged current baggage with other baggage",
        "Title": "X-Trace Task",
        "Host": "pinky19.mpi-sws.org",
        "HRT": 26962571574601161,
        "Operation": "join",
        "Timestamp": "1557746211514.817871",
        "TenantClass": 0,
        "Source": "PacketHeader.java:168",
        "ThreadID": 1,
        "ThreadName": "",
        "EventID": "40F66D40DB2D66AE",
        "ProcessID": 36430
      },
      {
        "Cycles": 0,
        "Agent": "edu.brown.cs.systems.xtrace.logging.BaggageWrappers",
        "ProcessName": "Read",
        "TaskID": "29D58D703FEF3DCB",
        "ParentEventID": [
          "40F66D40DB2D66AE"
        ],
        "Label": "Forking current baggage with Baggage.fork()",
        "Title": "X-Trace Task",
        "Host": "pinky19.mpi-sws.org",
        "HRT": 26962571574610196,
        "Operation": "fork",
        "Timestamp": "1557746211514.826904",
        "TenantClass": 0,
        "Source": "RemoteBlockReader2.java:361",
        "ThreadID": 1,
        "ThreadName": "",
        "EventID": "B853E996EAE5E438",
        "ProcessID": 36430
      },
      {
        "Cycles": 0,
        "Agent": "Execution-Sleep",
        "ProcessName": "Data",
        "TaskID": "29D58D703FEF3DCB",
        "ParentEventID": [
          "88A746F2E70BCFAF"
        ],
        "Label": "waited",
        "Title": "X-Trace Task",
        "Host": "pinky20.mpi-sws.org",
        "Duration": "58807",
        "HRT": 6565775933672213,
        "Operation": "waited",
        "Timestamp": "1557746211514.927490",
        "TenantClass": 0,
        "Source": "SocketIOWithTimeout.java:335",
        "ThreadID": 14317,
        "ThreadName": "",
        "EventID": "A30203BD67EF4D71",
        "BaggageBytes": "[[248 5] [240 0] [0 41 213 141 112 63 239 61 203] [240 1] [0 136 167 70 242 231 11 207 175] [240 3] [0 2]]",
        "ProcessID": 13111
      },
      {
        "Cycles": 0,
        "Agent": "edu.brown.cs.systems.xtrace.logging.BaggageWrappers",
        "ProcessName": "Read",
        "TaskID": "29D58D703FEF3DCB",
        "ParentEventID": [
          "E52399AC9E3AE654",
          "30D4FE7350EEDC15"
        ],
        "Label": "Merged current baggage with other baggage",
        "Title": "X-Trace Task",
        "Host": "pinky19.mpi-sws.org",
        "HRT": 26962571574543445,
        "Operation": "join",
        "Timestamp": "1557746211514.760254",
        "TenantClass": 0,
        "Source": "PacketHeader.java:168",
        "ThreadID": 1,
        "ThreadName": "",
        "EventID": "7E5FF0C761A9E2AE",
        "ProcessID": 36430
      },
      {
        "Cycles": 0,
        "Agent": "edu.brown.cs.systems.xtrace.logging.BaggageWrappers",
        "ProcessName": "Data",
        "TaskID": "29D58D703FEF3DCB",
        "ParentEventID": [
          "A30203BD67EF4D71",
          "B853E996EAE5E438"
        ],
        "Label": "Merged current baggage with other baggage",
        "Title": "X-Trace Task",
        "Host": "pinky20.mpi-sws.org",
        "HRT": 6565775933801593,
        "Operation": "join",
        "Timestamp": "1557746211515.056885",
        "TenantClass": 0,
        "Source": "DataXceiver.java:574",
        "ThreadID": 14317,
        "ThreadName": "",
        "EventID": "274783FDC5052323",
        "BaggageBytes": "[[248 5] [240 0] [0 41 213 141 112 63 239 61 203] [240 1] [0 163 2 3 189 103 239 77 113] [0 184 83 233 150 234 229 228 56] [240 3] [0 2]]",
        "ProcessID": 13111
      },
      {
        "Cycles": 0,
        "Agent": "Execution-CPU",
        "ProcessName": "Data",
        "TaskID": "29D58D703FEF3DCB",
        "ParentEventID": [
          "274783FDC5052323"
        ],
        "Label": "unset",
        "Title": "X-Trace Task",
        "Host": "pinky20.mpi-sws.org",
        "Duration": "1339145",
        "HRT": 6565775933853877,
        "Operation": "unset",
        "Timestamp": "1557746211515.109131",
        "TenantClass": 0,
        "Source": "DataXceiver.java:261",
        "ThreadID": 14317,
        "ThreadName": "",
        "EventID": "AD2F922E5512ED49",
        "BaggageBytes": "[[248 5] [240 0] [0 41 213 141 112 63 239 61 203] [240 1] [0 39 71 131 253 197 5 35 35] [240 3] [0 2]]",
        "ProcessID": 13111
      },
      {
        "Cycles": 0,
        "Agent": "edu.brown.cs.systems.retro.benchmarks.hdfs_client.Reader",
        "ProcessName": "Read",
        "TaskID": "29D58D703FEF3DCB",
        "ParentEventID": [
          "0"
        ],
        "Label": "Reading file",
        "Title": "X-Trace Task",
        "Host": "pinky19.mpi-sws.org",
        "HRT": 26962571572346210,
        "Timestamp": "1557746211512.562988",
        "TenantClass": 0,
        "ThreadID": 1,
        "ThreadName": "",
        "EventID": "10D93F9EBDA371D3",
        "ProcessID": 36430,
        "Tag": [
          "reader_10kb",
          "Read Size: 10240"
        ]
      }
    ]
  }
]