[
  {
    "id": "C8D82DAE85E550EA",
    "reports": [
      {
        "Cycles": 0,
        "Agent": "Execution-CPU",
        "ProcessName": "Read",
        "TaskID": "C8D82DAE85E550EA",
        "ParentEventID": [
          "9F63CDE40D4EA9C2"
        ],
        "Label": "unset",
        "Title": "X-Trace Task",
        "Host": "pinky19.mpi-sws.org",
        "Duration": "39656341",
        "HRT": 26962479943759581,
        "Operation": "unset",
        "Timestamp": "1557746119884.105957",
        "TenantClass": 0,
        "Source": "Client.java:1027",
        "ThreadID": 1,
        "ThreadName": "",
        "EventID": "41640C5B46066E26",
        "ProcessID": 36430
      },
      {
        "Cycles": 0,
        "Agent": "edu.brown.cs.systems.retro.benchmarks.hdfs_client.Reader",
        "ProcessName": "Read",
        "TaskID": "C8D82DAE85E550EA",
        "ParentEventID": [
          "FBF9967268A6BA4A"
        ],
        "Label": "Reading file",
        "Title": "X-Trace Task",
        "Host": "pinky19.mpi-sws.org",
        "HRT": 26962479943686827,
        "Timestamp": "1557746119884.033203",
        "TenantClass": 0,
        "ThreadID": 1,
        "ThreadName": "",
        "EventID": "FDF5E503DBA06DDA",
        "ProcessID": 36430
      },
      {
        "Cycles": 0,
        "Agent": "edu.brown.cs.systems.retro.benchmarks.hdfs_client.Reader",
        "ProcessName": "Read",
        "TaskID": "C8D82DAE85E550EA",
        "ParentEventID": [
          "0"
        ],
        "Label": "Reading file",
        "Title": "X-Trace Task",
        "Host": "pinky19.mpi-sws.org",
        "HRT": 26962479943669216,
        "Timestamp": "1557746119884.015625",
        "TenantClass": 0,
        "ThreadID": 1,
        "ThreadName": "",
        "EventID": "FBF9967268A6BA4A",
        "ProcessID": 36430,
        "Tag": [
          "reader_10kb",
          "Read Size: 10240"
        ]
      },
      {
        "Cycles": 0,
        "Agent": "org.apache.hadoop.ipc.ProtobufRpcEngine",
        "ProcessName": "Read",
        "TaskID": "C8D82DAE85E550EA",
        "ParentEventID": [
          "FDF5E503DBA06DDA"
        ],
        "Label": "Invoking org.apache.hadoop.hdfs.protocol.ClientProtocol.getBlockLocations",
        "Title": "X-Trace Task",
        "Host": "pinky19.mpi-sws.org",
        "HRT": 26962479943722683,
        "Timestamp": "1557746119884.069092",
        "TenantClass": 0,
        "Source": "ProtobufRpcEngine.java:228",
        "ThreadID": 1,
        "ThreadName": "",
        "EventID": "9F63CDE40D4EA9C2",
        "ProcessID": 36430
      },
      {
        "Cycles": 0,
        "Agent": "Execution-CPU",
        "ProcessName": "Read",
        "TaskID": "C8D82DAE85E550EA",
        "ParentEventID": [
          "41640C5B46066E26"
        ],
        "Label": "set",
        "Title": "X-Trace Task",
        "Host": "pinky19.mpi-sws.org",
        "HRT": 26962479943790977,
        "Operation": "set",
        "Timestamp": "1557746119884.137451",
        "TenantClass": 0,
        "Source": "Client.java:1032",
        "ThreadID": 41,
        "ThreadName": "",
        "EventID": "32577C5915419174",
        "ProcessID": 36430
      },
      {
        "Cycles": 0,
        "Agent": "edu.brown.cs.systems.xtrace.logging.BaggageWrappers",
        "ProcessName": "Read",
        "TaskID": "C8D82DAE85E550EA",
        "ParentEventID": [
          "32577C5915419174"
        ],
        "Label": "Forking current baggage with Baggage.fork()",
        "Title": "X-Trace Task",
        "Host": "pinky19.mpi-sws.org",
        "HRT": 26962479943810043,
        "Operation": "fork",
        "Timestamp": "1557746119884.156494",
        "TenantClass": 0,
        "Source": "Client.java:1043",
        "ThreadID": 41,
        "ThreadName": "",
        "EventID": "B35E63D14A7A5AF9",
        "ProcessID": 36430
      },
      {
        "Cycles": 0,
        "Agent": "Execution-CPU",
        "ProcessName": "Read",
        "TaskID": "C8D82DAE85E550EA",
        "ParentEventID": [
          "C7171857708364C8"
        ],
        "Label": "set",
        "Title": "X-Trace Task",
        "Host": "pinky19.mpi-sws.org",
        "HRT": 26962479943904994,
        "Operation": "set",
        "Timestamp": "1557746119884.251465",
        "TenantClass": 0,
        "Source": "Client.java:1104",
        "ThreadID": 1,
        "ThreadName": "",
        "EventID": "22D42F0CA1028E71",
        "ProcessID": 36430
      },
      {
        "Cycles": 0,
        "Agent": "Execution-CPU",
        "ProcessName": "Name",
        "TaskID": "C8D82DAE85E550EA",
        "ParentEventID": [
          "B35E63D14A7A5AF9"
        ],
        "Label": "set",
        "Title": "X-Trace Task",
        "Host": "pinky19.mpi-sws.org",
        "HRT": 26962479943933250,
        "Operation": "set",
        "Timestamp": "1557746119884.322510",
        "TenantClass": 0,
        "Source": "Server.java:1840",
        "ThreadID": 48,
        "ThreadName": "",
        "EventID": "33052B7EA17E9649",
        "BaggageBytes": "[[248 5] [240 0] [0 200 216 45 174 133 229 80 234] [240 1] [0 179 94 99 209 74 122 90 249] [240 3] [0 2]]",
        "ProcessID": 2171
      },
      {
        "Cycles": 0,
        "Agent": "Execution-CPU",
        "ProcessName": "Read",
        "TaskID": "C8D82DAE85E550EA",
        "ParentEventID": [
          "B35E63D14A7A5AF9"
        ],
        "Label": "unset",
        "Title": "X-Trace Task",
        "Host": "pinky19.mpi-sws.org",
        "Duration": "69032",
        "HRT": 26962479943878307,
        "Operation": "unset",
        "Timestamp": "1557746119884.224854",
        "TenantClass": 0,
        "Source": "Client.java:1062",
        "ThreadID": 41,
        "ThreadName": "",
        "EventID": "C7171857708364C8",
        "ProcessID": 36430
      },
      {
        "Cycles": 0,
        "Agent": "edu.brown.cs.systems.xtrace.logging.BaggageWrappers",
        "ProcessName": "Name",
        "TaskID": "C8D82DAE85E550EA",
        "ParentEventID": [
          "33052B7EA17E9649"
        ],
        "Label": "Forking current baggage with Baggage.fork()",
        "Title": "X-Trace Task",
        "Host": "pinky19.mpi-sws.org",
        "HRT": 26962479943963318,
        "Operation": "fork",
        "Timestamp": "1557746119884.352539",
        "TenantClass": 0,
        "Source": "Server.java:550",
        "ThreadID": 48,
        "ThreadName": "",
        "EventID": "328B39F13989CDD5",
        "BaggageBytes": "[[248 5] [240 0] [0 200 216 45 174 133 229 80 234] [240 1] [0 51 5 43 126 161 126 150 73] [240 3] [0 2]]",
        "ProcessID": 2171
      },
      {
        "Cycles": 0,
        "Agent": "Execution-CPU",
        "ProcessName": "Name",
        "TaskID": "C8D82DAE85E550EA",
        "ParentEventID": [
          "328B39F13989CDD5"
        ],
        "Label": "set",
        "Title": "X-Trace Task",
        "Host": "pinky19.mpi-sws.org",
        "HRT": 26962479944005010,
        "Operation": "set",
        "Timestamp": "1557746119884.394287",
        "TenantClass": 0,
        "Source": "Server.java:2071",
        "ThreadID": 57,
        "ThreadName": "",
        "EventID": "CE68801FCC794B97",
        "BaggageBytes": "[[248 5] [240 0] [0 200 216 45 174 133 229 80 234] [240 1] [0 50 139 57 241 57 137 205 213] [240 3] [0 2]]",
        "ProcessID": 2171
      },
      {
        "Cycles": 0,
        "Agent": "org.apache.hadoop.ipc.Server",
        "ProcessName": "Name",
        "TaskID": "C8D82DAE85E550EA",
        "ParentEventID": [
          "CE68801FCC794B97"
        ],
        "Label": "getBlockLocations in org.apache.hadoop.hdfs.protocol.ClientProtocol",
        "Title": "X-Trace Task",
        "Host": "pinky19.mpi-sws.org",
        "HRT": 26962479944042751,
        "Timestamp": "1557746119884.431885",
        "TenantClass": 0,
        "Source": "ProtobufRpcEngine.java:601",
        "ThreadID": 57,
        "ThreadName": "",
        "EventID": "20FAD5AF4324A50E",
        "BaggageBytes": "[[248 5] [240 0] [0 200 216 45 174 133 229 80 234] [240 1] [0 206 104 128 31 204 121 75 151] [240 3] [0 2]]",
        "ProcessID": 2171
      },
      {
        "Cycles": 0,
        "Agent": "org.apache.hadoop.hdfs.server.namenode.FSNamesystem.audit",
        "ProcessName": "Name",
        "TaskID": "C8D82DAE85E550EA",
        "ParentEventID": [
          "20FAD5AF4324A50E"
        ],
        "Label": "allowed=true\tugi=plascas (auth:SIMPLE)\tip=/139.19.171.63\tcmd=open\tsrc=/ds/Buzh7x8GTfo0eyxs\tdst=null\tperm=null\tproto=rpc",
        "Title": "X-Trace Task",
        "Host": "pinky19.mpi-sws.org",
        "HRT": 26962479944105114,
        "Timestamp": "1557746119884.494385",
        "TenantClass": 0,
        "Source": "FSNamesystem.java:8313",
        "ThreadID": 57,
        "ThreadName": "",
        "EventID": "E8D711E84EC8444A",
        "BaggageBytes": "[[248 5] [240 0] [0 200 216 45 174 133 229 80 234] [240 1] [0 32 250 213 175 67 36 165 14] [240 3] [0 2]]",
        "ProcessID": 2171
      },
      {
        "Cycles": 0,
        "Agent": "edu.brown.cs.systems.xtrace.logging.BaggageWrappers",
        "ProcessName": "Name",
        "TaskID": "C8D82DAE85E550EA",
        "ParentEventID": [
          "E8D711E84EC8444A"
        ],
        "Label": "Forking current baggage with Baggage.fork()",
        "Title": "X-Trace Task",
        "Host": "pinky19.mpi-sws.org",
        "HRT": 26962479944175159,
        "Operation": "fork",
        "Timestamp": "1557746119884.564453",
        "TenantClass": 0,
        "Source": "Server.java:2398",
        "ThreadID": 57,
        "ThreadName": "",
        "EventID": "56B3EED17578C878",
        "BaggageBytes": "[[248 5] [240 0] [0 200 216 45 174 133 229 80 234] [240 1] [0 232 215 17 232 78 200 68 74] [240 3] [0 2]]",
        "ProcessID": 2171
      },
      {
        "Cycles": 0,
        "Agent": "Execution-CPU",
        "ProcessName": "Name",
        "TaskID": "C8D82DAE85E550EA",
        "ParentEventID": [
          "328B39F13989CDD5"
        ],
        "Label": "unset",
        "Title": "X-Trace Task",
        "Host": "pinky19.mpi-sws.org",
        "Duration": "37622",
        "HRT": 26962479943996744,
        "Operation": "unset",
        "Timestamp": "1557746119884.385986",
        "TenantClass": 0,
        "Source": "Server.java:1828",
        "ThreadID": 48,
        "ThreadName": "",
        "EventID": "82FAC5E61D8A96CD",
        "BaggageBytes": "[[248 5] [240 0] [0 200 216 45 174 133 229 80 234] [240 1] [0 50 139 57 241 57 137 205 213] [240 3] [0 2]]",
        "ProcessID": 2171
      },
      {
        "Cycles": 0,
        "Agent": "Execution-CPU",
        "ProcessName": "Name",
        "TaskID": "C8D82DAE85E550EA",
        "ParentEventID": [
          "56B3EED17578C878"
        ],
        "Label": "unset",
        "Title": "X-Trace Task",
        "Host": "pinky19.mpi-sws.org",
        "Duration": "281573",
        "HRT": 26962479944309365,
        "Operation": "unset",
        "Timestamp": "1557746119884.698486",
        "TenantClass": 0,
        "Source": "Server.java:1058",
        "ThreadID": 57,
        "ThreadName": "",
        "EventID": "B6F6DBDE997F7EA5",
        "BaggageBytes": "[[248 5] [240 0] [0 200 216 45 174 133 229 80 234] [240 1] [0 86 179 238 209 117 120 200 120] [240 3] [0 2]]",
        "ProcessID": 2171
      },
      {
        "Cycles": 0,
        "Agent": "Execution-CPU",
        "ProcessName": "Read",
        "TaskID": "C8D82DAE85E550EA",
        "ParentEventID": [
          "56B3EED17578C878"
        ],
        "Label": "set",
        "Title": "X-Trace Task",
        "Host": "pinky19.mpi-sws.org",
        "HRT": 26962479944383874,
        "Operation": "set",
        "Timestamp": "1557746119884.730225",
        "TenantClass": 0,
        "Source": "Client.java:302",
        "ThreadID": 37,
        "ThreadName": "",
        "EventID": "EF21682B7C55AC2D",
        "ProcessID": 36430
      },
      {
        "Cycles": 0,
        "Agent": "Execution-CPU",
        "ProcessName": "Read",
        "TaskID": "C8D82DAE85E550EA",
        "ParentEventID": [
          "EF21682B7C55AC2D"
        ],
        "Label": "unset",
        "Title": "X-Trace Task",
        "Host": "pinky19.mpi-sws.org",
        "Duration": "10144",
        "HRT": 26962479944410731,
        "Operation": "unset",
        "Timestamp": "1557746119884.757080",
        "TenantClass": 0,
        "Source": "Client.java:1168",
        "ThreadID": 37,
        "ThreadName": "",
        "EventID": "BEC75C955091EA5B",
        "ProcessID": 36430
      },
      {
        "Cycles": 0,
        "Agent": "edu.brown.cs.systems.xtrace.logging.BaggageWrappers",
        "ProcessName": "Read",
        "TaskID": "C8D82DAE85E550EA",
        "ParentEventID": [
          "BEC75C955091EA5B",
          "0241EB64D2E2A384"
        ],
        "Label": "Merged current baggage with other baggage",
        "Title": "X-Trace Task",
        "Host": "pinky19.mpi-sws.org",
        "HRT": 26962479944480998,
        "Operation": "join",
        "Timestamp": "1557746119884.827393",
        "TenantClass": 0,
        "Source": "Client.java:1545",
        "ThreadID": 1,
        "ThreadName": "",
        "EventID": "FBA64E5C40E73741",
        "ProcessID": 36430
      },
      {
        "Cycles": 0,
        "Agent": "org.apache.hadoop.ipc.ProtobufRpcEngine",
        "ProcessName": "Read",
        "TaskID": "C8D82DAE85E550EA",
        "ParentEventID": [
          "FBA64E5C40E73741"
        ],
        "Label": "org.apache.hadoop.hdfs.protocol.ClientProtocol.getBlockLocations completed",
        "Title": "X-Trace Task",
        "Host": "pinky19.mpi-sws.org",
        "HRT": 26962479944544544,
        "Timestamp": "1557746119884.890869",
        "TenantClass": 0,
        "Source": "ProtobufRpcEngine.java:275",
        "ThreadID": 1,
        "ThreadName": "",
        "EventID": "F9B9E7864B115ABE",
        "ProcessID": 36430
      },
      {
        "Cycles": 0,
        "Agent": "Execution-Sleep",
        "ProcessName": "Read",
        "TaskID": "C8D82DAE85E550EA",
        "ParentEventID": [
          "22D42F0CA1028E71"
        ],
        "Label": "waited",
        "Title": "X-Trace Task",
        "Host": "pinky19.mpi-sws.org",
        "Duration": "529207",
        "HRT": 26962479944454534,
        "Operation": "waited",
        "Timestamp": "1557746119884.801025",
        "TenantClass": 0,
        "Source": "Client.java:1537",
        "ThreadID": 1,
        "ThreadName": "",
        "EventID": "0241EB64D2E2A384",
        "ProcessID": 36430
      },
      {
        "Cycles": 0,
        "Agent": "edu.brown.cs.systems.xtrace.logging.BaggageWrappers",
        "ProcessName": "Read",
        "TaskID": "C8D82DAE85E550EA",
        "ParentEventID": [
          "F9B9E7864B115ABE"
        ],
        "Label": "Forking current baggage with Baggage.fork()",
        "Title": "X-Trace Task",
        "Host": "pinky19.mpi-sws.org",
        "HRT": 26962479944627319,
        "Operation": "fork",
        "Timestamp": "1557746119884.973877",
        "TenantClass": 0,
        "Source": "DataTransferProtoUtil.java:94",
        "ThreadID": 1,
        "ThreadName": "",
        "EventID": "6521179DFF54EFA7",
        "ProcessID": 36430
      },
      {
        "Cycles": 0,
        "Agent": "Execution-CPU",
        "ProcessName": "Data",
        "TaskID": "C8D82DAE85E550EA",
        "ParentEventID": [
          "6521179DFF54EFA7"
        ],
        "Label": "set",
        "Title": "X-Trace Task",
        "Host": "pinky21.mpi-sws.org",
        "HRT": 10808789651278567,
        "Operation": "set",
        "Timestamp": "1557746119885.326904",
        "TenantClass": 0,
        "Source": "Receiver.java:117",
        "ThreadID": 14875,
        "ThreadName": "",
        "EventID": "3A6459D2231277C0",
        "BaggageBytes": "[[248 5] [240 0] [0 200 216 45 174 133 229 80 234] [240 1] [0 101 33 23 157 255 84 239 167] [240 3] [0 2]]",
        "ProcessID": 20775
      },
      {
        "Cycles": 0,
        "Agent": "edu.brown.cs.systems.xtrace.logging.XTraceInit",
        "ProcessName": "Data",
        "TaskID": "C8D82DAE85E550EA",
        "ParentEventID": [
          "3A6459D2231277C0"
        ],
        "Label": "Thread.setName: DataXceiver for client DFSClient_NONMAPREDUCE_778905418_1 at /139.19.171.63:35320 [Sending block BP-1633380353-139.19.171.63-1554193446451:blk_1073756603_15779]",
        "Title": "X-Trace Task",
        "Host": "pinky21.mpi-sws.org",
        "HRT": 10808789651379198,
        "Timestamp": "1557746119885.427490",
        "TenantClass": 0,
        "Source": "DataXceiver.java:168",
        "ThreadID": 14875,
        "ThreadName": "",
        "EventID": "7929C268B8193A12",
        "BaggageBytes": "[[248 5] [240 0] [0 200 216 45 174 133 229 80 234] [240 1] [0 58 100 89 210 35 18 119 192] [240 3] [0 2]]",
        "ProcessID": 20775
      },
      {
        "Cycles": 0,
        "Agent": "edu.brown.cs.systems.xtrace.logging.BaggageWrappers",
        "ProcessName": "Data",
        "TaskID": "C8D82DAE85E550EA",
        "ParentEventID": [
          "7929C268B8193A12"
        ],
        "Label": "Forking current baggage with Baggage.fork()",
        "Title": "X-Trace Task",
        "Host": "pinky21.mpi-sws.org",
        "HRT": 10808789651531525,
        "Operation": "fork",
        "Timestamp": "1557746119885.579834",
        "TenantClass": 0,
        "Source": "DataXceiver.java:1257",
        "ThreadID": 14875,
        "ThreadName": "",
        "EventID": "C5261F53E61640D5",
        "BaggageBytes": "[[248 5] [240 0] [0 200 216 45 174 133 229 80 234] [240 1] [0 121 41 194 104 184 25 58 18] [240 3] [0 2]]",
        "ProcessID": 20775
      },
      {
        "Cycles": 0,
        "Agent": "edu.brown.cs.systems.xtrace.logging.BaggageWrappers",
        "ProcessName": "Data",
        "TaskID": "C8D82DAE85E550EA",
        "ParentEventID": [
          "C5261F53E61640D5"
        ],
        "Label": "Forking current baggage with Baggage.fork()",
        "Title": "X-Trace Task",
        "Host": "pinky21.mpi-sws.org",
        "HRT": 10808789651683131,
        "Operation": "fork",
        "Timestamp": "1557746119885.731445",
        "TenantClass": 0,
        "Source": "PacketHeader.java:95",
        "ThreadID": 14875,
        "ThreadName": "",
        "EventID": "8CCA47D6AA2102D5",
        "BaggageBytes": "[[248 5] [240 0] [0 200 216 45 174 133 229 80 234] [240 1] [0 197 38 31 83 230 22 64 213] [240 3] [0 2]]",
        "ProcessID": 20775
      },
      {
        "Cycles": 0,
        "Agent": "Execution-Sleep",
        "ProcessName": "Read",
        "TaskID": "C8D82DAE85E550EA",
        "ParentEventID": [
          "6521179DFF54EFA7"
        ],
        "Label": "waited",
        "Title": "X-Trace Task",
        "Host": "pinky19.mpi-sws.org",
        "Duration": "671498",
        "HRT": 26962479945395245,
        "Operation": "waited",
        "Timestamp": "1557746119885.741699",
        "TenantClass": 0,
        "Source": "SocketIOWithTimeout.java:335",
        "ThreadID": 1,
        "ThreadName": "",
        "EventID": "14A10BF685E8BCC3",
        "ProcessID": 36430
      },
      {
        "Cycles": 0,
        "Agent": "edu.brown.cs.systems.xtrace.logging.BaggageWrappers",
        "ProcessName": "Read",
        "TaskID": "C8D82DAE85E550EA",
        "ParentEventID": [
          "14A10BF685E8BCC3",
          "C5261F53E61640D5"
        ],
        "Label": "Merged current baggage with other baggage",
        "Title": "X-Trace Task",
        "Host": "pinky19.mpi-sws.org",
        "HRT": 26962479945501088,
        "Operation": "join",
        "Timestamp": "1557746119885.847412",
        "TenantClass": 0,
        "Source": "RemoteBlockReader2.java:429",
        "ThreadID": 1,
        "ThreadName": "",
        "EventID": "DBB443EF8023FB90",
        "ProcessID": 36430
      },
      {
        "Cycles": 0,
        "Agent": "Execution-Sleep",
        "ProcessName": "Data",
        "TaskID": "C8D82DAE85E550EA",
        "ParentEventID": [
          "8CCA47D6AA2102D5"
        ],
        "Label": "waited",
        "Title": "X-Trace Task",
        "Host": "pinky21.mpi-sws.org",
        "Duration": "6882",
        "HRT": 10808789651794028,
        "Operation": "waited",
        "Timestamp": "1557746119885.842285",
        "TenantClass": 0,
        "Source": "SocketIOWithTimeout.java:335",
        "ThreadID": 14875,
        "ThreadName": "",
        "EventID": "C742D9CF6C471140",
        "BaggageBytes": "[[248 5] [240 0] [0 200 216 45 174 133 229 80 234] [240 1] [0 140 202 71 214 170 33 2 213] [240 3] [0 2]]",
        "ProcessID": 20775
      },
      {
        "Cycles": 0,
        "Agent": "Execution-Sleep",
        "ProcessName": "Read",
        "TaskID": "C8D82DAE85E550EA",
        "ParentEventID": [
          "DBB443EF8023FB90"
        ],
        "Label": "waited",
        "Title": "X-Trace Task",
        "Host": "pinky19.mpi-sws.org",
        "Duration": "116950",
        "HRT": 26962479945715199,
        "Operation": "waited",
        "Timestamp": "1557746119886.061523",
        "TenantClass": 0,
        "Source": "SocketIOWithTimeout.java:335",
        "ThreadID": 1,
        "ThreadName": "",
        "EventID": "3917E13D3CE1A095",
        "ProcessID": 36430
      },
      {
        "Cycles": 0,
        "Agent": "edu.brown.cs.systems.xtrace.logging.BaggageWrappers",
        "ProcessName": "Data",
        "TaskID": "C8D82DAE85E550EA",
        "ParentEventID": [
          "C742D9CF6C471140"
        ],
        "Label": "Forking current baggage with Baggage.fork()",
        "Title": "X-Trace Task",
        "Host": "pinky21.mpi-sws.org",
        "HRT": 10808789651908372,
        "Operation": "fork",
        "Timestamp": "1557746119885.956543",
        "TenantClass": 0,
        "Source": "PacketHeader.java:95",
        "ThreadID": 14875,
        "ThreadName": "",
        "EventID": "ADA274E3F5F83B0C",
        "BaggageBytes": "[[248 5] [240 0] [0 200 216 45 174 133 229 80 234] [240 1] [0 199 66 217 207 108 71 17 64] [240 3] [0 2]]",
        "ProcessID": 20775
      },
      {
        "Cycles": 0,
        "Agent": "edu.brown.cs.systems.xtrace.logging.BaggageWrappers",
        "ProcessName": "Read",
        "TaskID": "C8D82DAE85E550EA",
        "ParentEventID": [
          "8CCA47D6AA2102D5",
          "3917E13D3CE1A095"
        ],
        "Label": "Merged current baggage with other baggage",
        "Title": "X-Trace Task",
        "Host": "pinky19.mpi-sws.org",
        "HRT": 26962479945767193,
        "Operation": "join",
        "Timestamp": "1557746119886.113525",
        "TenantClass": 0,
        "Source": "PacketHeader.java:168",
        "ThreadID": 1,
        "ThreadName": "",
        "EventID": "AE307B9230682047",
        "ProcessID": 36430
      },
      {
        "Cycles": 0,
        "Agent": "edu.brown.cs.systems.xtrace.logging.BaggageWrappers",
        "ProcessName": "Read",
        "TaskID": "C8D82DAE85E550EA",
        "ParentEventID": [
          "68D5776A97E648B5"
        ],
        "Label": "Forking current baggage with Baggage.fork()",
        "Title": "X-Trace Task",
        "Host": "pinky19.mpi-sws.org",
        "HRT": 26962479945831678,
        "Operation": "fork",
        "Timestamp": "1557746119886.178223",
        "TenantClass": 0,
        "Source": "RemoteBlockReader2.java:361",
        "ThreadID": 1,
        "ThreadName": "",
        "EventID": "EC2799074C45285B",
        "ProcessID": 36430
      },
      {
        "Cycles": 0,
        "Agent": "edu.brown.cs.systems.xtrace.logging.BaggageWrappers",
        "ProcessName": "Read",
        "TaskID": "C8D82DAE85E550EA",
        "ParentEventID": [
          "ADA274E3F5F83B0C",
          "AE307B9230682047"
        ],
        "Label": "Merged current baggage with other baggage",
        "Title": "X-Trace Task",
        "Host": "pinky19.mpi-sws.org",
        "HRT": 26962479945822135,
        "Operation": "join",
        "Timestamp": "1557746119886.168457",
        "TenantClass": 0,
        "Source": "PacketHeader.java:168",
        "ThreadID": 1,
        "ThreadName": "",
        "EventID": "68D5776A97E648B5",
        "ProcessID": 36430
      },
      {
        "Cycles": 0,
        "Agent": "Execution-Sleep",
        "ProcessName": "Data",
        "TaskID": "C8D82DAE85E550EA",
        "ParentEventID": [
          "ADA274E3F5F83B0C"
        ],
        "Label": "waited",
        "Title": "X-Trace Task",
        "Host": "pinky21.mpi-sws.org",
        "Duration": "169151",
        "HRT": 10808789652200531,
        "Operation": "waited",
        "Timestamp": "1557746119886.248779",
        "TenantClass": 0,
        "Source": "SocketIOWithTimeout.java:335",
        "ThreadID": 14875,
        "ThreadName": "",
        "EventID": "F34FCDB20F9EF515",
        "BaggageBytes": "[[248 5] [240 0] [0 200 216 45 174 133 229 80 234] [240 1] [0 173 162 116 227 245 248 59 12] [240 3] [0 2]]",
        "ProcessID": 20775
      },
      {
        "Cycles": 0,
        "Agent": "edu.brown.cs.systems.xtrace.logging.BaggageWrappers",
        "ProcessName": "Data",
        "TaskID": "C8D82DAE85E550EA",
        "ParentEventID": [
          "F34FCDB20F9EF515",
          "EC2799074C45285B"
        ],
        "Label": "Merged current baggage with other baggage",
        "Title": "X-Trace Task",
        "Host": "pinky21.mpi-sws.org",
        "HRT": 10808789652342175,
        "Operation": "join",
        "Timestamp": "1557746119886.390381",
        "TenantClass": 0,
        "Source": "DataXceiver.java:574",
        "ThreadID": 14875,
        "ThreadName": "",
        "EventID": "BA9739B843702C18",
        "BaggageBytes": "[[248 5] [240 0] [0 200 216 45 174 133 229 80 234] [240 1] [0 236 39 153 7 76 69 40 91] [0 243 79 205 178 15 158 245 21] [240 3] [0 2]]",
        "ProcessID": 20775
      },
      {
        "Cycles": 0,
        "Agent": "Execution-CPU",
        "ProcessName": "Data",
        "TaskID": "C8D82DAE85E550EA",
        "ParentEventID": [
          "BA9739B843702C18"
        ],
        "Label": "unset",
        "Title": "X-Trace Task",
        "Host": "pinky21.mpi-sws.org",
        "Duration": "1028658",
        "HRT": 10808789652378385,
        "Operation": "unset",
        "Timestamp": "1557746119886.426514",
        "TenantClass": 0,
        "Source": "DataXceiver.java:261",
        "ThreadID": 14875,
        "ThreadName": "",
        "EventID": "E4607615F6784DFB",
        "BaggageBytes": "[[248 5] [240 0] [0 200 216 45 174 133 229 80 234] [240 1] [0 186 151 57 184 67 112 44 24] [240 3] [0 2]]",
        "ProcessID": 20775
      }
    ]
  }
]