[
  {
    "id": "3C53F32305BB5905",
    "reports": [
      {
        "Cycles": 0,
        "Agent": "org.apache.hadoop.ipc.ProtobufRpcEngine",
        "ProcessName": "Read",
        "TaskID": "3C53F32305BB5905",
        "ParentEventID": [
          "4162E6BD8FE29C54"
        ],
        "Label": "Invoking org.apache.hadoop.hdfs.protocol.ClientProtocol.getBlockLocations",
        "Title": "X-Trace Task",
        "Host": "pinky19.mpi-sws.org",
        "HRT": 26962465306663159,
        "Timestamp": "1557746105246.774414",
        "TenantClass": 0,
        "Source": "ProtobufRpcEngine.java:228",
        "ThreadID": 1,
        "ThreadName": "",
        "EventID": "0CF3E83631E73117",
        "ProcessID": 36430
      },
      {
        "Cycles": 0,
        "Agent": "Execution-CPU",
        "ProcessName": "Read",
        "TaskID": "3C53F32305BB5905",
        "ParentEventID": [
          "AB5E3019427EA550"
        ],
        "Label": "set",
        "Title": "X-Trace Task",
        "Host": "pinky19.mpi-sws.org",
        "HRT": 26962465306763400,
        "Operation": "set",
        "Timestamp": "1557746105246.874512",
        "TenantClass": 0,
        "Source": "Client.java:1032",
        "ThreadID": 41,
        "ThreadName": "",
        "EventID": "417E5E4924051239",
        "ProcessID": 36430
      },
      {
        "Cycles": 0,
        "Agent": "edu.brown.cs.systems.xtrace.logging.BaggageWrappers",
        "ProcessName": "Read",
        "TaskID": "3C53F32305BB5905",
        "ParentEventID": [
          "417E5E4924051239"
        ],
        "Label": "Forking current baggage with Baggage.fork()",
        "Title": "X-Trace Task",
        "Host": "pinky19.mpi-sws.org",
        "HRT": 26962465306798057,
        "Operation": "fork",
        "Timestamp": "1557746105246.909180",
        "TenantClass": 0,
        "Source": "Client.java:1043",
        "ThreadID": 41,
        "ThreadName": "",
        "EventID": "29C8772036930A3F",
        "ProcessID": 36430
      },
      {
        "Cycles": 0,
        "Agent": "edu.brown.cs.systems.retro.benchmarks.hdfs_client.Reader",
        "ProcessName": "Read",
        "TaskID": "3C53F32305BB5905",
        "ParentEventID": [
          "1208166C8DD1BF63"
        ],
        "Label": "Reading file",
        "Title": "X-Trace Task",
        "Host": "pinky19.mpi-sws.org",
        "HRT": 26962465306545615,
        "Timestamp": "1557746105246.656738",
        "TenantClass": 0,
        "ThreadID": 1,
        "ThreadName": "",
        "EventID": "4162E6BD8FE29C54",
        "ProcessID": 36430
      },
      {
        "Cycles": 0,
        "Agent": "Execution-CPU",
        "ProcessName": "Read",
        "TaskID": "3C53F32305BB5905",
        "ParentEventID": [
          "0CF3E83631E73117"
        ],
        "Label": "unset",
        "Title": "X-Trace Task",
        "Host": "pinky19.mpi-sws.org",
        "Duration": "22428197",
        "HRT": 26962465306710320,
        "Operation": "unset",
        "Timestamp": "1557746105246.821533",
        "TenantClass": 0,
        "Source": "Client.java:1027",
        "ThreadID": 1,
        "ThreadName": "",
        "EventID": "AB5E3019427EA550",
        "ProcessID": 36430
      },
      {
        "Cycles": 0,
        "Agent": "Execution-CPU",
        "ProcessName": "Read",
        "TaskID": "3C53F32305BB5905",
        "ParentEventID": [
          "29C8772036930A3F"
        ],
        "Label": "unset",
        "Title": "X-Trace Task",
        "Host": "pinky19.mpi-sws.org",
        "Duration": "100434",
        "HRT": 26962465306885065,
        "Operation": "unset",
        "Timestamp": "1557746105246.996338",
        "TenantClass": 0,
        "Source": "Client.java:1062",
        "ThreadID": 41,
        "ThreadName": "",
        "EventID": "E3350C0CDF9441AA",
        "ProcessID": 36430
      },
      {
        "Cycles": 0,
        "Agent": "Execution-CPU",
        "ProcessName": "Read",
        "TaskID": "3C53F32305BB5905",
        "ParentEventID": [
          "E3350C0CDF9441AA"
        ],
        "Label": "set",
        "Title": "X-Trace Task",
        "Host": "pinky19.mpi-sws.org",
        "HRT": 26962465306923425,
        "Operation": "set",
        "Timestamp": "1557746105247.034668",
        "TenantClass": 0,
        "Source": "Client.java:1104",
        "ThreadID": 1,
        "ThreadName": "",
        "EventID": "1AE8BE6376057144",
        "ProcessID": 36430
      },
      {
        "Cycles": 0,
        "Agent": "Execution-CPU",
        "ProcessName": "Name",
        "TaskID": "3C53F32305BB5905",
        "ParentEventID": [
          "29C8772036930A3F"
        ],
        "Label": "set",
        "Title": "X-Trace Task",
        "Host": "pinky19.mpi-sws.org",
        "HRT": 26962465306956977,
        "Operation": "set",
        "Timestamp": "1557746105247.080811",
        "TenantClass": 0,
        "Source": "Server.java:1840",
        "ThreadID": 48,
        "ThreadName": "",
        "EventID": "CE9841F0EB2209CF",
        "BaggageBytes": "[[248 5] [240 0] [0 60 83 243 35 5 187 89 5] [240 1] [0 41 200 119 32 54 147 10 63] [240 3] [0 2]]",
        "ProcessID": 2171
      },
      {
        "Cycles": 0,
        "Agent": "Execution-CPU",
        "ProcessName": "Name",
        "TaskID": "3C53F32305BB5905",
        "ParentEventID": [
          "95B3F6C3FCAF341A"
        ],
        "Label": "unset",
        "Title": "X-Trace Task",
        "Host": "pinky19.mpi-sws.org",
        "Duration": "24534",
        "HRT": 26962465307011094,
        "Operation": "unset",
        "Timestamp": "1557746105247.134766",
        "TenantClass": 0,
        "Source": "Server.java:1828",
        "ThreadID": 48,
        "ThreadName": "",
        "EventID": "4713EA92F6107A7C",
        "BaggageBytes": "[[248 5] [240 0] [0 60 83 243 35 5 187 89 5] [240 1] [0 149 179 246 195 252 175 52 26] [240 3] [0 2]]",
        "ProcessID": 2171
      },
      {
        "Cycles": 0,
        "Agent": "edu.brown.cs.systems.xtrace.logging.BaggageWrappers",
        "ProcessName": "Name",
        "TaskID": "3C53F32305BB5905",
        "ParentEventID": [
          "CE9841F0EB2209CF"
        ],
        "Label": "Forking current baggage with Baggage.fork()",
        "Title": "X-Trace Task",
        "Host": "pinky19.mpi-sws.org",
        "HRT": 26962465306990303,
        "Operation": "fork",
        "Timestamp": "1557746105247.114014",
        "TenantClass": 0,
        "Source": "Server.java:550",
        "ThreadID": 48,
        "ThreadName": "",
        "EventID": "95B3F6C3FCAF341A",
        "BaggageBytes": "[[248 5] [240 0] [0 60 83 243 35 5 187 89 5] [240 1] [0 206 152 65 240 235 34 9 207] [240 3] [0 2]]",
        "ProcessID": 2171
      },
      {
        "Cycles": 0,
        "Agent": "Execution-CPU",
        "ProcessName": "Name",
        "TaskID": "3C53F32305BB5905",
        "ParentEventID": [
          "95B3F6C3FCAF341A"
        ],
        "Label": "set",
        "Title": "X-Trace Task",
        "Host": "pinky19.mpi-sws.org",
        "HRT": 26962465307021522,
        "Operation": "set",
        "Timestamp": "1557746105247.145264",
        "TenantClass": 0,
        "Source": "Server.java:2071",
        "ThreadID": 55,
        "ThreadName": "",
        "EventID": "E4E5CCDC04B1FD82",
        "BaggageBytes": "[[248 5] [240 0] [0 60 83 243 35 5 187 89 5] [240 1] [0 149 179 246 195 252 175 52 26] [240 3] [0 2]]",
        "ProcessID": 2171
      },
      {
        "Cycles": 0,
        "Agent": "org.apache.hadoop.hdfs.server.namenode.FSNamesystem.audit",
        "ProcessName": "Name",
        "TaskID": "3C53F32305BB5905",
        "ParentEventID": [
          "2ACA0817D16A4013"
        ],
        "Label": "allowed=true\tugi=plascas (auth:SIMPLE)\tip=/139.19.171.63\tcmd=open\tsrc=/ds/ePLAZIeGPLbPp6TC\tdst=null\tperm=null\tproto=rpc",
        "Title": "X-Trace Task",
        "Host": "pinky19.mpi-sws.org",
        "HRT": 26962465307131532,
        "Timestamp": "1557746105247.255371",
        "TenantClass": 0,
        "Source": "FSNamesystem.java:8313",
        "ThreadID": 55,
        "ThreadName": "",
        "EventID": "678AD84DBF093309",
        "BaggageBytes": "[[248 5] [240 0] [0 60 83 243 35 5 187 89 5] [240 1] [0 42 202 8 23 209 106 64 19] [240 3] [0 2]]",
        "ProcessID": 2171
      },
      {
        "Cycles": 0,
        "Agent": "org.apache.hadoop.ipc.Server",
        "ProcessName": "Name",
        "TaskID": "3C53F32305BB5905",
        "ParentEventID": [
          "E4E5CCDC04B1FD82"
        ],
        "Label": "getBlockLocations in org.apache.hadoop.hdfs.protocol.ClientProtocol",
        "Title": "X-Trace Task",
        "Host": "pinky19.mpi-sws.org",
        "HRT": 26962465307066242,
        "Timestamp": "1557746105247.189941",
        "TenantClass": 0,
        "Source": "ProtobufRpcEngine.java:601",
        "ThreadID": 55,
        "ThreadName": "",
        "EventID": "2ACA0817D16A4013",
        "BaggageBytes": "[[248 5] [240 0] [0 60 83 243 35 5 187 89 5] [240 1] [0 228 229 204 220 4 177 253 130] [240 3] [0 2]]",
        "ProcessID": 2171
      },
      {
        "Cycles": 0,
        "Agent": "edu.brown.cs.systems.xtrace.logging.BaggageWrappers",
        "ProcessName": "Name",
        "TaskID": "3C53F32305BB5905",
        "ParentEventID": [
          "678AD84DBF093309"
        ],
        "Label": "Forking current baggage with Baggage.fork()",
        "Title": "X-Trace Task",
        "Host": "pinky19.mpi-sws.org",
        "HRT": 26962465307180417,
        "Operation": "fork",
        "Timestamp": "1557746105247.304199",
        "TenantClass": 0,
        "Source": "Server.java:2398",
        "ThreadID": 55,
        "ThreadName": "",
        "EventID": "22929AC21043D304",
        "BaggageBytes": "[[248 5] [240 0] [0 60 83 243 35 5 187 89 5] [240 1] [0 103 138 216 77 191 9 51 9] [240 3] [0 2]]",
        "ProcessID": 2171
      },
      {
        "Cycles": 0,
        "Agent": "Execution-CPU",
        "ProcessName": "Read",
        "TaskID": "3C53F32305BB5905",
        "ParentEventID": [
          "22929AC21043D304"
        ],
        "Label": "set",
        "Title": "X-Trace Task",
        "Host": "pinky19.mpi-sws.org",
        "HRT": 26962465307364710,
        "Operation": "set",
        "Timestamp": "1557746105247.475830",
        "TenantClass": 0,
        "Source": "Client.java:302",
        "ThreadID": 37,
        "ThreadName": "",
        "EventID": "AEB1273250ECBA1E",
        "ProcessID": 36430
      },
      {
        "Cycles": 0,
        "Agent": "Execution-CPU",
        "ProcessName": "Name",
        "TaskID": "3C53F32305BB5905",
        "ParentEventID": [
          "22929AC21043D304"
        ],
        "Label": "unset",
        "Title": "X-Trace Task",
        "Host": "pinky19.mpi-sws.org",
        "Duration": "249645",
        "HRT": 26962465307300343,
        "Operation": "unset",
        "Timestamp": "1557746105247.424072",
        "TenantClass": 0,
        "Source": "Server.java:1058",
        "ThreadID": 55,
        "ThreadName": "",
        "EventID": "256B2F9B4B2E233F",
        "BaggageBytes": "[[248 5] [240 0] [0 60 83 243 35 5 187 89 5] [240 1] [0 34 146 154 194 16 67 211 4] [240 3] [0 2]]",
        "ProcessID": 2171
      },
      {
        "Cycles": 0,
        "Agent": "Execution-CPU",
        "ProcessName": "Read",
        "TaskID": "3C53F32305BB5905",
        "ParentEventID": [
          "AEB1273250ECBA1E"
        ],
        "Label": "unset",
        "Title": "X-Trace Task",
        "Host": "pinky19.mpi-sws.org",
        "Duration": "35579",
        "HRT": 26962465307419751,
        "Operation": "unset",
        "Timestamp": "1557746105247.531006",
        "TenantClass": 0,
        "Source": "Client.java:1168",
        "ThreadID": 37,
        "ThreadName": "",
        "EventID": "7ADA602CC93C49E0",
        "ProcessID": 36430
      },
      {
        "Cycles": 0,
        "Agent": "edu.brown.cs.systems.xtrace.logging.BaggageWrappers",
        "ProcessName": "Read",
        "TaskID": "3C53F32305BB5905",
        "ParentEventID": [
          "7ADA602CC93C49E0",
          "8E891CE1C02ED147"
        ],
        "Label": "Merged current baggage with other baggage",
        "Title": "X-Trace Task",
        "Host": "pinky19.mpi-sws.org",
        "HRT": 26962465307470382,
        "Operation": "join",
        "Timestamp": "1557746105247.581543",
        "TenantClass": 0,
        "Source": "Client.java:1545",
        "ThreadID": 1,
        "ThreadName": "",
        "EventID": "7DF748D484311ABB",
        "ProcessID": 36430
      },
      {
        "Cycles": 0,
        "Agent": "org.apache.hadoop.ipc.ProtobufRpcEngine",
        "ProcessName": "Read",
        "TaskID": "3C53F32305BB5905",
        "ParentEventID": [
          "7DF748D484311ABB"
        ],
        "Label": "org.apache.hadoop.hdfs.protocol.ClientProtocol.getBlockLocations completed",
        "Title": "X-Trace Task",
        "Host": "pinky19.mpi-sws.org",
        "HRT": 26962465307566925,
        "Timestamp": "1557746105247.678223",
        "TenantClass": 0,
        "Source": "ProtobufRpcEngine.java:275",
        "ThreadID": 1,
        "ThreadName": "",
        "EventID": "06A9C6369E4EC531",
        "ProcessID": 36430
      },
      {
        "Cycles": 0,
        "Agent": "Execution-Sleep",
        "ProcessName": "Read",
        "TaskID": "3C53F32305BB5905",
        "ParentEventID": [
          "1AE8BE6376057144"
        ],
        "Label": "waited",
        "Title": "X-Trace Task",
        "Host": "pinky19.mpi-sws.org",
        "Duration": "507926",
        "HRT": 26962465307447452,
        "Operation": "waited",
        "Timestamp": "1557746105247.558594",
        "TenantClass": 0,
        "Source": "Client.java:1537",
        "ThreadID": 1,
        "ThreadName": "",
        "EventID": "8E891CE1C02ED147",
        "ProcessID": 36430
      },
      {
        "Cycles": 0,
        "Agent": "edu.brown.cs.systems.xtrace.logging.BaggageWrappers",
        "ProcessName": "Read",
        "TaskID": "3C53F32305BB5905",
        "ParentEventID": [
          "06A9C6369E4EC531"
        ],
        "Label": "Forking current baggage with Baggage.fork()",
        "Title": "X-Trace Task",
        "Host": "pinky19.mpi-sws.org",
        "HRT": 26962465307714207,
        "Operation": "fork",
        "Timestamp": "1557746105247.825439",
        "TenantClass": 0,
        "Source": "DataTransferProtoUtil.java:94",
        "ThreadID": 1,
        "ThreadName": "",
        "EventID": "4FFB0253693367A4",
        "ProcessID": 36430
      },
      {
        "Cycles": 0,
        "Agent": "Execution-CPU",
        "ProcessName": "Data",
        "TaskID": "3C53F32305BB5905",
        "ParentEventID": [
          "4FFB0253693367A4"
        ],
        "Label": "set",
        "Title": "X-Trace Task",
        "Host": "pinky21.mpi-sws.org",
        "HRT": 10808775014372419,
        "Operation": "set",
        "Timestamp": "1557746105248.208984",
        "TenantClass": 0,
        "Source": "Receiver.java:117",
        "ThreadID": 14875,
        "ThreadName": "",
        "EventID": "7B7544817E5DE34D",
        "BaggageBytes": "[[248 5] [240 0] [0 60 83 243 35 5 187 89 5] [240 1] [0 79 251 2 83 105 51 103 164] [240 3] [0 2]]",
        "ProcessID": 20775
      },
      {
        "Cycles": 0,
        "Agent": "edu.brown.cs.systems.xtrace.logging.XTraceInit",
        "ProcessName": "Data",
        "TaskID": "3C53F32305BB5905",
        "ParentEventID": [
          "7B7544817E5DE34D"
        ],
        "Label": "Thread.setName: DataXceiver for client DFSClient_NONMAPREDUCE_778905418_1 at /139.19.171.63:35320 [Sending block BP-1633380353-139.19.171.63-1554193446451:blk_1073762803_21979]",
        "Title": "X-Trace Task",
        "Host": "pinky21.mpi-sws.org",
        "HRT": 10808775014473250,
        "Timestamp": "1557746105248.309814",
        "TenantClass": 0,
        "Source": "DataXceiver.java:168",
        "ThreadID": 14875,
        "ThreadName": "",
        "EventID": "DEB1D52FD691C114",
        "BaggageBytes": "[[248 5] [240 0] [0 60 83 243 35 5 187 89 5] [240 1] [0 123 117 68 129 126 93 227 77] [240 3] [0 2]]",
        "ProcessID": 20775
      },
      {
        "Cycles": 0,
        "Agent": "edu.brown.cs.systems.retro.benchmarks.hdfs_client.Reader",
        "ProcessName": "Read",
        "TaskID": "3C53F32305BB5905",
        "ParentEventID": [
          "0"
        ],
        "Label": "Reading file",
        "Title": "X-Trace Task",
        "Host": "pinky19.mpi-sws.org",
        "HRT": 26962465306512743,
        "Timestamp": "1557746105246.624023",
        "TenantClass": 0,
        "ThreadID": 1,
        "ThreadName": "",
        "EventID": "1208166C8DD1BF63",
        "ProcessID": 36430,
        "Tag": [
          "reader_10kb",
          "Read Size: 10240"
        ]
      },
      {
        "Cycles": 0,
        "Agent": "edu.brown.cs.systems.xtrace.logging.BaggageWrappers",
        "ProcessName": "Data",
        "TaskID": "3C53F32305BB5905",
        "ParentEventID": [
          "DEB1D52FD691C114"
        ],
        "Label": "Forking current baggage with Baggage.fork()",
        "Title": "X-Trace Task",
        "Host": "pinky21.mpi-sws.org",
        "HRT": 10808775034007748,
        "Operation": "fork",
        "Timestamp": "1557746105267.844482",
        "TenantClass": 0,
        "Source": "DataXceiver.java:1257",
        "ThreadID": 14875,
        "ThreadName": "",
        "EventID": "EA9EC77C8AA01516",
        "BaggageBytes": "[[248 5] [240 0] [0 60 83 243 35 5 187 89 5] [240 1] [0 222 177 213 47 214 145 193 20] [240 3] [0 2]]",
        "ProcessID": 20775
      },
      {
        "Cycles": 0,
        "Agent": "Execution-Sleep",
        "ProcessName": "Data",
        "TaskID": "3C53F32305BB5905",
        "ParentEventID": [
          "70CE9C96FF7CE7A8"
        ],
        "Label": "waited",
        "Title": "X-Trace Task",
        "Host": "pinky21.mpi-sws.org",
        "Duration": "8300",
        "HRT": 10808775034143995,
        "Operation": "waited",
        "Timestamp": "1557746105267.980713",
        "TenantClass": 0,
        "Source": "SocketIOWithTimeout.java:335",
        "ThreadID": 14875,
        "ThreadName": "",
        "EventID": "34E3592B41452389",
        "BaggageBytes": "[[248 5] [240 0] [0 60 83 243 35 5 187 89 5] [240 1] [0 112 206 156 150 255 124 231 168] [240 3] [0 2]]",
        "ProcessID": 20775
      },
      {
        "Cycles": 0,
        "Agent": "Execution-Sleep",
        "ProcessName": "Read",
        "TaskID": "3C53F32305BB5905",
        "ParentEventID": [
          "4FFB0253693367A4"
        ],
        "Label": "waited",
        "Title": "X-Trace Task",
        "Host": "pinky19.mpi-sws.org",
        "Duration": "20034409",
        "HRT": 26962465327868419,
        "Operation": "waited",
        "Timestamp": "1557746105267.979736",
        "TenantClass": 0,
        "Source": "SocketIOWithTimeout.java:335",
        "ThreadID": 1,
        "ThreadName": "",
        "EventID": "5FA9EFEC35813BEF",
        "ProcessID": 36430
      },
      {
        "Cycles": 0,
        "Agent": "edu.brown.cs.systems.xtrace.logging.BaggageWrappers",
        "ProcessName": "Data",
        "TaskID": "3C53F32305BB5905",
        "ParentEventID": [
          "EA9EC77C8AA01516"
        ],
        "Label": "Forking current baggage with Baggage.fork()",
        "Title": "X-Trace Task",
        "Host": "pinky21.mpi-sws.org",
        "HRT": 10808775034082257,
        "Operation": "fork",
        "Timestamp": "1557746105267.918945",
        "TenantClass": 0,
        "Source": "PacketHeader.java:95",
        "ThreadID": 14875,
        "ThreadName": "",
        "EventID": "70CE9C96FF7CE7A8",
        "BaggageBytes": "[[248 5] [240 0] [0 60 83 243 35 5 187 89 5] [240 1] [0 234 158 199 124 138 160 21 22] [240 3] [0 2]]",
        "ProcessID": 20775
      },
      {
        "Cycles": 0,
        "Agent": "edu.brown.cs.systems.xtrace.logging.BaggageWrappers",
        "ProcessName": "Read",
        "TaskID": "3C53F32305BB5905",
        "ParentEventID": [
          "5FA9EFEC35813BEF",
          "EA9EC77C8AA01516"
        ],
        "Label": "Merged current baggage with other baggage",
        "Title": "X-Trace Task",
        "Host": "pinky19.mpi-sws.org",
        "HRT": 26962465328013443,
        "Operation": "join",
        "Timestamp": "1557746105268.124756",
        "TenantClass": 0,
        "Source": "RemoteBlockReader2.java:429",
        "ThreadID": 1,
        "ThreadName": "",
        "EventID": "901265156FE573D6",
        "ProcessID": 36430
      },
      {
        "Cycles": 0,
        "Agent": "edu.brown.cs.systems.xtrace.logging.BaggageWrappers",
        "ProcessName": "Data",
        "TaskID": "3C53F32305BB5905",
        "ParentEventID": [
          "34E3592B41452389"
        ],
        "Label": "Forking current baggage with Baggage.fork()",
        "Title": "X-Trace Task",
        "Host": "pinky21.mpi-sws.org",
        "HRT": 10808775037875184,
        "Operation": "fork",
        "Timestamp": "1557746105271.711914",
        "TenantClass": 0,
        "Source": "PacketHeader.java:95",
        "ThreadID": 14875,
        "ThreadName": "",
        "EventID": "E43C72C279F4C4EF",
        "BaggageBytes": "[[248 5] [240 0] [0 60 83 243 35 5 187 89 5] [240 1] [0 52 227 89 43 65 69 35 137] [240 3] [0 2]]",
        "ProcessID": 20775
      },
      {
        "Cycles": 0,
        "Agent": "Execution-Sleep",
        "ProcessName": "Read",
        "TaskID": "3C53F32305BB5905",
        "ParentEventID": [
          "901265156FE573D6"
        ],
        "Label": "waited",
        "Title": "X-Trace Task",
        "Host": "pinky19.mpi-sws.org",
        "Duration": "3614081",
        "HRT": 26962465331753250,
        "Operation": "waited",
        "Timestamp": "1557746105271.864502",
        "TenantClass": 0,
        "Source": "SocketIOWithTimeout.java:335",
        "ThreadID": 1,
        "ThreadName": "",
        "EventID": "85A22955CFFD9977",
        "ProcessID": 36430
      },
      {
        "Cycles": 0,
        "Agent": "edu.brown.cs.systems.xtrace.logging.BaggageWrappers",
        "ProcessName": "Read",
        "TaskID": "3C53F32305BB5905",
        "ParentEventID": [
          "70CE9C96FF7CE7A8",
          "85A22955CFFD9977"
        ],
        "Label": "Merged current baggage with other baggage",
        "Title": "X-Trace Task",
        "Host": "pinky19.mpi-sws.org",
        "HRT": 26962465331856393,
        "Operation": "join",
        "Timestamp": "1557746105271.967529",
        "TenantClass": 0,
        "Source": "PacketHeader.java:168",
        "ThreadID": 1,
        "ThreadName": "",
        "EventID": "50F50212C7CC647D",
        "ProcessID": 36430
      },
      {
        "Cycles": 0,
        "Agent": "edu.brown.cs.systems.xtrace.logging.BaggageWrappers",
        "ProcessName": "Read",
        "TaskID": "3C53F32305BB5905",
        "ParentEventID": [
          "50F50212C7CC647D",
          "E43C72C279F4C4EF"
        ],
        "Label": "Merged current baggage with other baggage",
        "Title": "X-Trace Task",
        "Host": "pinky19.mpi-sws.org",
        "HRT": 26962465331953477,
        "Operation": "join",
        "Timestamp": "1557746105272.064697",
        "TenantClass": 0,
        "Source": "PacketHeader.java:168",
        "ThreadID": 1,
        "ThreadName": "",
        "EventID": "E83E0E9427F54FCA",
        "ProcessID": 36430
      },
      {
        "Cycles": 0,
        "Agent": "edu.brown.cs.systems.xtrace.logging.BaggageWrappers",
        "ProcessName": "Read",
        "TaskID": "3C53F32305BB5905",
        "ParentEventID": [
          "E83E0E9427F54FCA"
        ],
        "Label": "Forking current baggage with Baggage.fork()",
        "Title": "X-Trace Task",
        "Host": "pinky19.mpi-sws.org",
        "HRT": 26962465331974119,
        "Operation": "fork",
        "Timestamp": "1557746105272.085449",
        "TenantClass": 0,
        "Source": "RemoteBlockReader2.java:361",
        "ThreadID": 1,
        "ThreadName": "",
        "EventID": "10629A20CB618778",
        "ProcessID": 36430
      },
      {
        "Cycles": 0,
        "Agent": "Execution-Sleep",
        "ProcessName": "Data",
        "TaskID": "3C53F32305BB5905",
        "ParentEventID": [
          "E43C72C279F4C4EF"
        ],
        "Label": "waited",
        "Title": "X-Trace Task",
        "Host": "pinky21.mpi-sws.org",
        "Duration": "468012",
        "HRT": 10808775038462393,
        "Operation": "waited",
        "Timestamp": "1557746105272.299072",
        "TenantClass": 0,
        "Source": "SocketIOWithTimeout.java:335",
        "ThreadID": 14875,
        "ThreadName": "",
        "EventID": "739B322C2B053C70",
        "BaggageBytes": "[[248 5] [240 0] [0 60 83 243 35 5 187 89 5] [240 1] [0 228 60 114 194 121 244 196 239] [240 3] [0 2]]",
        "ProcessID": 20775
      },
      {
        "Cycles": 0,
        "Agent": "edu.brown.cs.systems.xtrace.logging.BaggageWrappers",
        "ProcessName": "Data",
        "TaskID": "3C53F32305BB5905",
        "ParentEventID": [
          "739B322C2B053C70",
          "10629A20CB618778"
        ],
        "Label": "Merged current baggage with other baggage",
        "Title": "X-Trace Task",
        "Host": "pinky21.mpi-sws.org",
        "HRT": 10808775038529199,
        "Operation": "join",
        "Timestamp": "1557746105272.365723",
        "TenantClass": 0,
        "Source": "DataXceiver.java:574",
        "ThreadID": 14875,
        "ThreadName": "",
        "EventID": "3D18BA54545205C8",
        "BaggageBytes": "[[248 5] [240 0] [0 60 83 243 35 5 187 89 5] [240 1] [0 16 98 154 32 203 97 135 120] [0 115 155 50 44 43 5 60 112] [240 3] [0 2]]",
        "ProcessID": 20775
      },
      {
        "Cycles": 0,
        "Agent": "Execution-CPU",
        "ProcessName": "Data",
        "TaskID": "3C53F32305BB5905",
        "ParentEventID": [
          "3D18BA54545205C8"
        ],
        "Label": "unset",
        "Title": "X-Trace Task",
        "Host": "pinky21.mpi-sws.org",
        "Duration": "24112174",
        "HRT": 10808775038555927,
        "Operation": "unset",
        "Timestamp": "1557746105272.392578",
        "TenantClass": 0,
        "Source": "DataXceiver.java:261",
        "ThreadID": 14875,
        "ThreadName": "",
        "EventID": "6DDF4828D45A372C",
        "BaggageBytes": "[[248 5] [240 0] [0 60 83 243 35 5 187 89 5] [240 1] [0 61 24 186 84 84 82 5 200] [240 3] [0 2]]",
        "ProcessID": 20775
      }
    ]
  }
]