[
  {
    "id": "F73ADD0934B01CCD",
    "reports": [
      {
        "Cycles": 0,
        "Agent": "edu.brown.cs.systems.retro.benchmarks.hdfs_client.Reader",
        "ProcessName": "Read",
        "TaskID": "F73ADD0934B01CCD",
        "ParentEventID": [
          "6526EED1D43938E3"
        ],
        "Label": "Reading file",
        "Title": "X-Trace Task",
        "Host": "pinky19.mpi-sws.org",
        "HRT": 25491938059986293,
        "Timestamp": "1556275578000.112793",
        "TenantClass": 0,
        "ThreadID": 1,
        "ThreadName": "",
        "EventID": "6E35DAF70715B820",
        "ProcessID": 21035
      },
      {
        "Cycles": 0,
        "Agent": "Execution-CPU",
        "ProcessName": "Read",
        "TaskID": "F73ADD0934B01CCD",
        "ParentEventID": [
          "C71D0DEEAEF3C1D1"
        ],
        "Label": "unset",
        "Title": "X-Trace Task",
        "Host": "pinky19.mpi-sws.org",
        "Duration": "21403024",
        "HRT": 25491938060099821,
        "Operation": "unset",
        "Timestamp": "1556275578000.226318",
        "TenantClass": 0,
        "Source": "Client.java:1027",
        "ThreadID": 1,
        "ThreadName": "",
        "EventID": "696F94C9224CAE60",
        "ProcessID": 21035
      },
      {
        "Cycles": 0,
        "Agent": "org.apache.hadoop.ipc.ProtobufRpcEngine",
        "ProcessName": "Read",
        "TaskID": "F73ADD0934B01CCD",
        "ParentEventID": [
          "6E35DAF70715B820"
        ],
        "Label": "Invoking org.apache.hadoop.hdfs.protocol.ClientProtocol.getBlockLocations",
        "Title": "X-Trace Task",
        "Host": "pinky19.mpi-sws.org",
        "HRT": 25491938060077533,
        "Timestamp": "1556275578000.204102",
        "TenantClass": 0,
        "Source": "ProtobufRpcEngine.java:228",
        "ThreadID": 1,
        "ThreadName": "",
        "EventID": "C71D0DEEAEF3C1D1",
        "ProcessID": 21035
      },
      {
        "Cycles": 0,
        "Agent": "Execution-CPU",
        "ProcessName": "Read",
        "TaskID": "F73ADD0934B01CCD",
        "ParentEventID": [
          "696F94C9224CAE60"
        ],
        "Label": "set",
        "Title": "X-Trace Task",
        "Host": "pinky19.mpi-sws.org",
        "HRT": 25491938060157777,
        "Operation": "set",
        "Timestamp": "1556275578000.284424",
        "TenantClass": 0,
        "Source": "Client.java:1032",
        "ThreadID": 41,
        "ThreadName": "",
        "EventID": "778EC5DE999F8A65",
        "ProcessID": 21035
      },
      {
        "Cycles": 0,
        "Agent": "edu.brown.cs.systems.xtrace.logging.BaggageWrappers",
        "ProcessName": "Read",
        "TaskID": "F73ADD0934B01CCD",
        "ParentEventID": [
          "778EC5DE999F8A65"
        ],
        "Label": "Forking current baggage with Baggage.fork()",
        "Title": "X-Trace Task",
        "Host": "pinky19.mpi-sws.org",
        "HRT": 25491938060178279,
        "Operation": "fork",
        "Timestamp": "1556275578000.304932",
        "TenantClass": 0,
        "Source": "Client.java:1043",
        "ThreadID": 41,
        "ThreadName": "",
        "EventID": "19928B9947FBAD94",
        "ProcessID": 21035
      },
      {
        "Cycles": 0,
        "Agent": "Execution-CPU",
        "ProcessName": "Read",
        "TaskID": "F73ADD0934B01CCD",
        "ParentEventID": [
          "19928B9947FBAD94"
        ],
        "Label": "unset",
        "Title": "X-Trace Task",
        "Host": "pinky19.mpi-sws.org",
        "Duration": "69021",
        "HRT": 25491938060246569,
        "Operation": "unset",
        "Timestamp": "1556275578000.373047",
        "TenantClass": 0,
        "Source": "Client.java:1062",
        "ThreadID": 41,
        "ThreadName": "",
        "EventID": "3B777ED80C09C603",
        "ProcessID": 21035
      },
      {
        "Cycles": 0,
        "Agent": "Execution-CPU",
        "ProcessName": "Read",
        "TaskID": "F73ADD0934B01CCD",
        "ParentEventID": [
          "3B777ED80C09C603"
        ],
        "Label": "set",
        "Title": "X-Trace Task",
        "Host": "pinky19.mpi-sws.org",
        "HRT": 25491938060270215,
        "Operation": "set",
        "Timestamp": "1556275578000.396729",
        "TenantClass": 0,
        "Source": "Client.java:1104",
        "ThreadID": 1,
        "ThreadName": "",
        "EventID": "C16C1B01A45E3F95",
        "ProcessID": 21035
      },
      {
        "Cycles": 0,
        "Agent": "Execution-CPU",
        "ProcessName": "Name",
        "TaskID": "F73ADD0934B01CCD",
        "ParentEventID": [
          "19928B9947FBAD94"
        ],
        "Label": "set",
        "Title": "X-Trace Task",
        "Host": "pinky19.mpi-sws.org",
        "HRT": 25491938060292519,
        "Operation": "set",
        "Timestamp": "1556275578000.445312",
        "TenantClass": 0,
        "Source": "Server.java:1840",
        "ThreadID": 48,
        "ThreadName": "",
        "EventID": "A161D24E06BA36B7",
        "BaggageBytes": "[[248 5] [240 0] [0 247 58 221 9 52 176 28 205] [240 1] [0 25 146 139 153 71 251 173 148] [240 3] [0 2]]",
        "ProcessID": 2171
      },
      {
        "Cycles": 0,
        "Agent": "edu.brown.cs.systems.xtrace.logging.BaggageWrappers",
        "ProcessName": "Name",
        "TaskID": "F73ADD0934B01CCD",
        "ParentEventID": [
          "A161D24E06BA36B7"
        ],
        "Label": "Forking current baggage with Baggage.fork()",
        "Title": "X-Trace Task",
        "Host": "pinky19.mpi-sws.org",
        "HRT": 25491938060316044,
        "Operation": "fork",
        "Timestamp": "1556275578000.468750",
        "TenantClass": 0,
        "Source": "Server.java:550",
        "ThreadID": 48,
        "ThreadName": "",
        "EventID": "40474155531E445D",
        "BaggageBytes": "[[248 5] [240 0] [0 247 58 221 9 52 176 28 205] [240 1] [0 161 97 210 78 6 186 54 183] [240 3] [0 2]]",
        "ProcessID": 2171
      },
      {
        "Cycles": 0,
        "Agent": "Execution-CPU",
        "ProcessName": "Name",
        "TaskID": "F73ADD0934B01CCD",
        "ParentEventID": [
          "40474155531E445D"
        ],
        "Label": "set",
        "Title": "X-Trace Task",
        "Host": "pinky19.mpi-sws.org",
        "HRT": 25491938060343112,
        "Operation": "set",
        "Timestamp": "1556275578000.495850",
        "TenantClass": 0,
        "Source": "Server.java:2071",
        "ThreadID": 55,
        "ThreadName": "",
        "EventID": "00EFF6FFB920453C",
        "BaggageBytes": "[[248 5] [240 0] [0 247 58 221 9 52 176 28 205] [240 1] [0 64 71 65 85 83 30 68 93] [240 3] [0 2]]",
        "ProcessID": 2171
      },
      {
        "Cycles": 0,
        "Agent": "Execution-CPU",
        "ProcessName": "Name",
        "TaskID": "F73ADD0934B01CCD",
        "ParentEventID": [
          "40474155531E445D"
        ],
        "Label": "unset",
        "Title": "X-Trace Task",
        "Host": "pinky19.mpi-sws.org",
        "Duration": "21429",
        "HRT": 25491938060334838,
        "Operation": "unset",
        "Timestamp": "1556275578000.487549",
        "TenantClass": 0,
        "Source": "Server.java:1828",
        "ThreadID": 48,
        "ThreadName": "",
        "EventID": "3A91ED5622AE4605",
        "BaggageBytes": "[[248 5] [240 0] [0 247 58 221 9 52 176 28 205] [240 1] [0 64 71 65 85 83 30 68 93] [240 3] [0 2]]",
        "ProcessID": 2171
      },
      {
        "Cycles": 0,
        "Agent": "org.apache.hadoop.ipc.Server",
        "ProcessName": "Name",
        "TaskID": "F73ADD0934B01CCD",
        "ParentEventID": [
          "00EFF6FFB920453C"
        ],
        "Label": "getBlockLocations in org.apache.hadoop.hdfs.protocol.ClientProtocol",
        "Title": "X-Trace Task",
        "Host": "pinky19.mpi-sws.org",
        "HRT": 25491938060377592,
        "Timestamp": "1556275578000.530273",
        "TenantClass": 0,
        "Source": "ProtobufRpcEngine.java:601",
        "ThreadID": 55,
        "ThreadName": "",
        "EventID": "95A48A4066D3EFC7",
        "BaggageBytes": "[[248 5] [240 0] [0 247 58 221 9 52 176 28 205] [240 1] [0 0 239 246 255 185 32 69 60] [240 3] [0 2]]",
        "ProcessID": 2171
      },
      {
        "Cycles": 0,
        "Agent": "org.apache.hadoop.hdfs.server.namenode.FSNamesystem.audit",
        "ProcessName": "Name",
        "TaskID": "F73ADD0934B01CCD",
        "ParentEventID": [
          "95A48A4066D3EFC7"
        ],
        "Label": "allowed=true\tugi=plascas (auth:SIMPLE)\tip=/139.19.171.63\tcmd=open\tsrc=/ds/kPdv61FijlZZ7RZr\tdst=null\tperm=null\tproto=rpc",
        "Title": "X-Trace Task",
        "Host": "pinky19.mpi-sws.org",
        "HRT": 25491938060425071,
        "Timestamp": "1556275578000.577881",
        "TenantClass": 0,
        "Source": "FSNamesystem.java:8313",
        "ThreadID": 55,
        "ThreadName": "",
        "EventID": "2FC660D07F0AEBB0",
        "BaggageBytes": "[[248 5] [240 0] [0 247 58 221 9 52 176 28 205] [240 1] [0 149 164 138 64 102 211 239 199] [240 3] [0 2]]",
        "ProcessID": 2171
      },
      {
        "Cycles": 0,
        "Agent": "edu.brown.cs.systems.xtrace.logging.BaggageWrappers",
        "ProcessName": "Name",
        "TaskID": "F73ADD0934B01CCD",
        "ParentEventID": [
          "2FC660D07F0AEBB0"
        ],
        "Label": "Forking current baggage with Baggage.fork()",
        "Title": "X-Trace Task",
        "Host": "pinky19.mpi-sws.org",
        "HRT": 25491938060466892,
        "Operation": "fork",
        "Timestamp": "1556275578000.619629",
        "TenantClass": 0,
        "Source": "Server.java:2398",
        "ThreadID": 55,
        "ThreadName": "",
        "EventID": "2A98D68C47B7D3E2",
        "BaggageBytes": "[[248 5] [240 0] [0 247 58 221 9 52 176 28 205] [240 1] [0 47 198 96 208 127 10 235 176] [240 3] [0 2]]",
        "ProcessID": 2171
      },
      {
        "Cycles": 0,
        "Agent": "Execution-CPU",
        "ProcessName": "Name",
        "TaskID": "F73ADD0934B01CCD",
        "ParentEventID": [
          "2A98D68C47B7D3E2"
        ],
        "Label": "unset",
        "Title": "X-Trace Task",
        "Host": "pinky19.mpi-sws.org",
        "Duration": "205463",
        "HRT": 25491938060571771,
        "Operation": "unset",
        "Timestamp": "1556275578000.724609",
        "TenantClass": 0,
        "Source": "Server.java:1058",
        "ThreadID": 55,
        "ThreadName": "",
        "EventID": "34DCA33A268E2BF1",
        "BaggageBytes": "[[248 5] [240 0] [0 247 58 221 9 52 176 28 205] [240 1] [0 42 152 214 140 71 183 211 226] [240 3] [0 2]]",
        "ProcessID": 2171
      },
      {
        "Cycles": 0,
        "Agent": "Execution-CPU",
        "ProcessName": "Read",
        "TaskID": "F73ADD0934B01CCD",
        "ParentEventID": [
          "2A98D68C47B7D3E2"
        ],
        "Label": "set",
        "Title": "X-Trace Task",
        "Host": "pinky19.mpi-sws.org",
        "HRT": 25491938060633503,
        "Operation": "set",
        "Timestamp": "1556275578000.760010",
        "TenantClass": 0,
        "Source": "Client.java:302",
        "ThreadID": 37,
        "ThreadName": "",
        "EventID": "933F6BCD2C5BE893",
        "ProcessID": 21035
      },
      {
        "Cycles": 0,
        "Agent": "Execution-CPU",
        "ProcessName": "Read",
        "TaskID": "F73ADD0934B01CCD",
        "ParentEventID": [
          "933F6BCD2C5BE893"
        ],
        "Label": "unset",
        "Title": "X-Trace Task",
        "Host": "pinky19.mpi-sws.org",
        "Duration": "6177",
        "HRT": 25491938060652795,
        "Operation": "unset",
        "Timestamp": "1556275578000.779297",
        "TenantClass": 0,
        "Source": "Client.java:1168",
        "ThreadID": 37,
        "ThreadName": "",
        "EventID": "8FAC352A93836FBC",
        "ProcessID": 21035
      },
      {
        "Cycles": 0,
        "Agent": "Execution-Sleep",
        "ProcessName": "Read",
        "TaskID": "F73ADD0934B01CCD",
        "ParentEventID": [
          "C16C1B01A45E3F95"
        ],
        "Label": "waited",
        "Title": "X-Trace Task",
        "Host": "pinky19.mpi-sws.org",
        "Duration": "391432",
        "HRT": 25491938060673470,
        "Operation": "waited",
        "Timestamp": "1556275578000.800049",
        "TenantClass": 0,
        "Source": "Client.java:1537",
        "ThreadID": 1,
        "ThreadName": "",
        "EventID": "D937D015DBC6A54F",
        "ProcessID": 21035
      },
      {
        "Cycles": 0,
        "Agent": "org.apache.hadoop.ipc.ProtobufRpcEngine",
        "ProcessName": "Read",
        "TaskID": "F73ADD0934B01CCD",
        "ParentEventID": [
          "68165B0420E497DC"
        ],
        "Label": "org.apache.hadoop.hdfs.protocol.ClientProtocol.getBlockLocations completed",
        "Title": "X-Trace Task",
        "Host": "pinky19.mpi-sws.org",
        "HRT": 25491938060728396,
        "Timestamp": "1556275578000.854980",
        "TenantClass": 0,
        "Source": "ProtobufRpcEngine.java:275",
        "ThreadID": 1,
        "ThreadName": "",
        "EventID": "99E37B4F5ADD86DE",
        "ProcessID": 21035
      },
      {
        "Cycles": 0,
        "Agent": "edu.brown.cs.systems.xtrace.logging.BaggageWrappers",
        "ProcessName": "Read",
        "TaskID": "F73ADD0934B01CCD",
        "ParentEventID": [
          "8FAC352A93836FBC",
          "D937D015DBC6A54F"
        ],
        "Label": "Merged current baggage with other baggage",
        "Title": "X-Trace Task",
        "Host": "pinky19.mpi-sws.org",
        "HRT": 25491938060686562,
        "Operation": "join",
        "Timestamp": "1556275578000.813232",
        "TenantClass": 0,
        "Source": "Client.java:1545",
        "ThreadID": 1,
        "ThreadName": "",
        "EventID": "68165B0420E497DC",
        "ProcessID": 21035
      },
      {
        "Cycles": 0,
        "Agent": "edu.brown.cs.systems.xtrace.logging.BaggageWrappers",
        "ProcessName": "Read",
        "TaskID": "F73ADD0934B01CCD",
        "ParentEventID": [
          "99E37B4F5ADD86DE"
        ],
        "Label": "Forking current baggage with Baggage.fork()",
        "Title": "X-Trace Task",
        "Host": "pinky19.mpi-sws.org",
        "HRT": 25491938060794065,
        "Operation": "fork",
        "Timestamp": "1556275578000.920654",
        "TenantClass": 0,
        "Source": "DataTransferProtoUtil.java:94",
        "ThreadID": 1,
        "ThreadName": "",
        "EventID": "B39354CF1C678872",
        "ProcessID": 21035
      },
      {
        "Cycles": 0,
        "Agent": "Execution-CPU",
        "ProcessName": "Data",
        "TaskID": "F73ADD0934B01CCD",
        "ParentEventID": [
          "B39354CF1C678872"
        ],
        "Label": "set",
        "Title": "X-Trace Task",
        "Host": "pinky19.mpi-sws.org",
        "HRT": 25491938060914899,
        "Operation": "set",
        "Timestamp": "1556275578001.056396",
        "TenantClass": 0,
        "Source": "Receiver.java:117",
        "ThreadID": 9602,
        "ThreadName": "",
        "EventID": "16F62DED8C6C39D5",
        "BaggageBytes": "[[248 5] [240 0] [0 247 58 221 9 52 176 28 205] [240 1] [0 179 147 84 207 28 103 136 114] [240 3] [0 2]]",
        "ProcessID": 2319
      },
      {
        "Cycles": 0,
        "Agent": "edu.brown.cs.systems.xtrace.logging.XTraceInit",
        "ProcessName": "Data",
        "TaskID": "F73ADD0934B01CCD",
        "ParentEventID": [
          "16F62DED8C6C39D5"
        ],
        "Label": "Thread.setName: DataXceiver for client DFSClient_NONMAPREDUCE_1377588049_1 at /139.19.171.63:36074 [Sending block BP-1633380353-139.19.171.63-1554193446451:blk_1073763203_22379]",
        "Title": "X-Trace Task",
        "Host": "pinky19.mpi-sws.org",
        "HRT": 25491938060948174,
        "Timestamp": "1556275578001.089600",
        "TenantClass": 0,
        "Source": "DataXceiver.java:168",
        "ThreadID": 9602,
        "ThreadName": "",
        "EventID": "553B6CDE9F9DBDF1",
        "BaggageBytes": "[[248 5] [240 0] [0 247 58 221 9 52 176 28 205] [240 1] [0 22 246 45 237 140 108 57 213] [240 3] [0 2]]",
        "ProcessID": 2319
      },
      {
        "Cycles": 0,
        "Agent": "edu.brown.cs.systems.xtrace.logging.BaggageWrappers",
        "ProcessName": "Data",
        "TaskID": "F73ADD0934B01CCD",
        "ParentEventID": [
          "553B6CDE9F9DBDF1"
        ],
        "Label": "Forking current baggage with Baggage.fork()",
        "Title": "X-Trace Task",
        "Host": "pinky19.mpi-sws.org",
        "HRT": 25491938061017597,
        "Operation": "fork",
        "Timestamp": "1556275578001.158936",
        "TenantClass": 0,
        "Source": "DataXceiver.java:1257",
        "ThreadID": 9602,
        "ThreadName": "",
        "EventID": "99EADE0EB84E703A",
        "BaggageBytes": "[[248 5] [240 0] [0 247 58 221 9 52 176 28 205] [240 1] [0 85 59 108 222 159 157 189 241] [240 3] [0 2]]",
        "ProcessID": 2319
      },
      {
        "Cycles": 0,
        "Agent": "Execution-Sleep",
        "ProcessName": "Read",
        "TaskID": "F73ADD0934B01CCD",
        "ParentEventID": [
          "B39354CF1C678872"
        ],
        "Label": "waited",
        "Title": "X-Trace Task",
        "Host": "pinky19.mpi-sws.org",
        "Duration": "192948",
        "HRT": 25491938061078038,
        "Operation": "waited",
        "Timestamp": "1556275578001.204590",
        "TenantClass": 0,
        "Source": "SocketIOWithTimeout.java:335",
        "ThreadID": 1,
        "ThreadName": "",
        "EventID": "9DF09F7EA08B74A2",
        "ProcessID": 21035
      },
      {
        "Cycles": 0,
        "Agent": "edu.brown.cs.systems.xtrace.logging.BaggageWrappers",
        "ProcessName": "Data",
        "TaskID": "F73ADD0934B01CCD",
        "ParentEventID": [
          "99EADE0EB84E703A"
        ],
        "Label": "Forking current baggage with Baggage.fork()",
        "Title": "X-Trace Task",
        "Host": "pinky19.mpi-sws.org",
        "HRT": 25491938061077291,
        "Operation": "fork",
        "Timestamp": "1556275578001.218750",
        "TenantClass": 0,
        "Source": "PacketHeader.java:95",
        "ThreadID": 9602,
        "ThreadName": "",
        "EventID": "6C06B3686CBA6730",
        "BaggageBytes": "[[248 5] [240 0] [0 247 58 221 9 52 176 28 205] [240 1] [0 153 234 222 14 184 78 112 58] [240 3] [0 2]]",
        "ProcessID": 2319
      },
      {
        "Cycles": 0,
        "Agent": "Execution-Sleep",
        "ProcessName": "Data",
        "TaskID": "F73ADD0934B01CCD",
        "ParentEventID": [
          "6C06B3686CBA6730"
        ],
        "Label": "waited",
        "Title": "X-Trace Task",
        "Host": "pinky19.mpi-sws.org",
        "Duration": "4039",
        "HRT": 25491938061133691,
        "Operation": "waited",
        "Timestamp": "1556275578001.275146",
        "TenantClass": 0,
        "Source": "SocketIOWithTimeout.java:335",
        "ThreadID": 9602,
        "ThreadName": "",
        "EventID": "F0BF831AB80C1C4F",
        "BaggageBytes": "[[248 5] [240 0] [0 247 58 221 9 52 176 28 205] [240 1] [0 108 6 179 104 108 186 103 48] [240 3] [0 2]]",
        "ProcessID": 2319
      },
      {
        "Cycles": 0,
        "Agent": "edu.brown.cs.systems.xtrace.logging.BaggageWrappers",
        "ProcessName": "Read",
        "TaskID": "F73ADD0934B01CCD",
        "ParentEventID": [
          "99EADE0EB84E703A",
          "9DF09F7EA08B74A2"
        ],
        "Label": "Merged current baggage with other baggage",
        "Title": "X-Trace Task",
        "Host": "pinky19.mpi-sws.org",
        "HRT": 25491938061163095,
        "Operation": "join",
        "Timestamp": "1556275578001.289795",
        "TenantClass": 0,
        "Source": "RemoteBlockReader2.java:429",
        "ThreadID": 1,
        "ThreadName": "",
        "EventID": "D7876EE2615E801A",
        "ProcessID": 21035
      },
      {
        "Cycles": 0,
        "Agent": "edu.brown.cs.systems.xtrace.logging.BaggageWrappers",
        "ProcessName": "Data",
        "TaskID": "F73ADD0934B01CCD",
        "ParentEventID": [
          "F0BF831AB80C1C4F"
        ],
        "Label": "Forking current baggage with Baggage.fork()",
        "Title": "X-Trace Task",
        "Host": "pinky19.mpi-sws.org",
        "HRT": 25491938061191783,
        "Operation": "fork",
        "Timestamp": "1556275578001.333252",
        "TenantClass": 0,
        "Source": "PacketHeader.java:95",
        "ThreadID": 9602,
        "ThreadName": "",
        "EventID": "9EE935CD2FA5ECF0",
        "BaggageBytes": "[[248 5] [240 0] [0 247 58 221 9 52 176 28 205] [240 1] [0 240 191 131 26 184 12 28 79] [240 3] [0 2]]",
        "ProcessID": 2319
      },
      {
        "Cycles": 0,
        "Agent": "edu.brown.cs.systems.xtrace.logging.BaggageWrappers",
        "ProcessName": "Read",
        "TaskID": "F73ADD0934B01CCD",
        "ParentEventID": [
          "9EE935CD2FA5ECF0",
          "D477657BD439B94D"
        ],
        "Label": "Merged current baggage with other baggage",
        "Title": "X-Trace Task",
        "Host": "pinky19.mpi-sws.org",
        "HRT": 25491938061316273,
        "Operation": "join",
        "Timestamp": "1556275578001.442871",
        "TenantClass": 0,
        "Source": "PacketHeader.java:168",
        "ThreadID": 1,
        "ThreadName": "",
        "EventID": "B0C93EA9FE4BA645",
        "ProcessID": 21035
      },
      {
        "Cycles": 0,
        "Agent": "edu.brown.cs.systems.xtrace.logging.BaggageWrappers",
        "ProcessName": "Read",
        "TaskID": "F73ADD0934B01CCD",
        "ParentEventID": [
          "B0C93EA9FE4BA645"
        ],
        "Label": "Forking current baggage with Baggage.fork()",
        "Title": "X-Trace Task",
        "Host": "pinky19.mpi-sws.org",
        "HRT": 25491938061326652,
        "Operation": "fork",
        "Timestamp": "1556275578001.453369",
        "TenantClass": 0,
        "Source": "RemoteBlockReader2.java:361",
        "ThreadID": 1,
        "ThreadName": "",
        "EventID": "1762E38DD3485EBA",
        "ProcessID": 21035
      },
      {
        "Cycles": 0,
        "Agent": "edu.brown.cs.systems.xtrace.logging.BaggageWrappers",
        "ProcessName": "Read",
        "TaskID": "F73ADD0934B01CCD",
        "ParentEventID": [
          "D7876EE2615E801A",
          "6C06B3686CBA6730"
        ],
        "Label": "Merged current baggage with other baggage",
        "Title": "X-Trace Task",
        "Host": "pinky19.mpi-sws.org",
        "HRT": 25491938061258252,
        "Operation": "join",
        "Timestamp": "1556275578001.384766",
        "TenantClass": 0,
        "Source": "PacketHeader.java:168",
        "ThreadID": 1,
        "ThreadName": "",
        "EventID": "D477657BD439B94D",
        "ProcessID": 21035
      },
      {
        "Cycles": 0,
        "Agent": "Execution-Sleep",
        "ProcessName": "Data",
        "TaskID": "F73ADD0934B01CCD",
        "ParentEventID": [
          "9EE935CD2FA5ECF0"
        ],
        "Label": "waited",
        "Title": "X-Trace Task",
        "Host": "pinky19.mpi-sws.org",
        "Duration": "102563",
        "HRT": 25491938061372034,
        "Operation": "waited",
        "Timestamp": "1556275578001.513428",
        "TenantClass": 0,
        "Source": "SocketIOWithTimeout.java:335",
        "ThreadID": 9602,
        "ThreadName": "",
        "EventID": "A25AA9385C3CC1DC",
        "BaggageBytes": "[[248 5] [240 0] [0 247 58 221 9 52 176 28 205] [240 1] [0 158 233 53 205 47 165 236 240] [240 3] [0 2]]",
        "ProcessID": 2319
      },
      {
        "Cycles": 0,
        "Agent": "edu.brown.cs.systems.xtrace.logging.BaggageWrappers",
        "ProcessName": "Data",
        "TaskID": "F73ADD0934B01CCD",
        "ParentEventID": [
          "1762E38DD3485EBA",
          "A25AA9385C3CC1DC"
        ],
        "Label": "Merged current baggage with other baggage",
        "Title": "X-Trace Task",
        "Host": "pinky19.mpi-sws.org",
        "HRT": 25491938061421746,
        "Operation": "join",
        "Timestamp": "1556275578001.563232",
        "TenantClass": 0,
        "Source": "DataXceiver.java:574",
        "ThreadID": 9602,
        "ThreadName": "",
        "EventID": "0CFD6BCEB71EA923",
        "BaggageBytes": "[[248 5] [240 0] [0 247 58 221 9 52 176 28 205] [240 1] [0 162 90 169 56 92 60 193 220] [0 23 98 227 141 211 72 94 186] [240 3] [0 2]]",
        "ProcessID": 2319
      },
      {
        "Cycles": 0,
        "Agent": "Execution-CPU",
        "ProcessName": "Data",
        "TaskID": "F73ADD0934B01CCD",
        "ParentEventID": [
          "0CFD6BCEB71EA923"
        ],
        "Label": "unset",
        "Title": "X-Trace Task",
        "Host": "pinky19.mpi-sws.org",
        "Duration": "502352",
        "HRT": 25491938061440814,
        "Operation": "unset",
        "Timestamp": "1556275578001.582275",
        "TenantClass": 0,
        "Source": "DataXceiver.java:261",
        "ThreadID": 9602,
        "ThreadName": "",
        "EventID": "A0726A686FD62CF0",
        "BaggageBytes": "[[248 5] [240 0] [0 247 58 221 9 52 176 28 205] [240 1] [0 12 253 107 206 183 30 169 35] [240 3] [0 2]]",
        "ProcessID": 2319
      },
      {
        "Cycles": 0,
        "Agent": "edu.brown.cs.systems.retro.benchmarks.hdfs_client.Reader",
        "ProcessName": "Read",
        "TaskID": "F73ADD0934B01CCD",
        "ParentEventID": [
          "0"
        ],
        "Label": "Reading file",
        "Title": "X-Trace Task",
        "Host": "pinky19.mpi-sws.org",
        "HRT": 25491938059946432,
        "Timestamp": "1556275578000.072998",
        "TenantClass": 0,
        "ThreadID": 1,
        "ThreadName": "",
        "EventID": "6526EED1D43938E3",
        "ProcessID": 21035,
        "Tag": [
          "reader_1kb",
          "Read Size: 1024"
        ]
      }
    ]
  }
]