[
  {
    "id": "5A993F93FE695551",
    "reports": [
      {
        "Cycles": 0,
        "Agent": "Execution-CPU",
        "ProcessName": "Read",
        "TaskID": "5A993F93FE695551",
        "ParentEventID": [
          "DF6CD8B840AC954E"
        ],
        "Label": "unset",
        "Title": "X-Trace Task",
        "Host": "pinky19.mpi-sws.org",
        "Duration": "22198303",
        "HRT": 26962422440147001,
        "Operation": "unset",
        "Timestamp": "1557746062380.234863",
        "TenantClass": 0,
        "Source": "Client.java:1027",
        "ThreadID": 1,
        "ThreadName": "",
        "EventID": "2701C55A7ED1CA08",
        "ProcessID": 36430
      },
      {
        "Cycles": 0,
        "Agent": "edu.brown.cs.systems.retro.benchmarks.hdfs_client.Reader",
        "ProcessName": "Read",
        "TaskID": "5A993F93FE695551",
        "ParentEventID": [
          "5C8AE8C157BB5CDF"
        ],
        "Label": "Reading file",
        "Title": "X-Trace Task",
        "Host": "pinky19.mpi-sws.org",
        "HRT": 26962422440018917,
        "Timestamp": "1557746062380.106934",
        "TenantClass": 0,
        "ThreadID": 1,
        "ThreadName": "",
        "EventID": "F72D8864658A7D01",
        "ProcessID": 36430
      },
      {
        "Cycles": 0,
        "Agent": "edu.brown.cs.systems.retro.benchmarks.hdfs_client.Reader",
        "ProcessName": "Read",
        "TaskID": "5A993F93FE695551",
        "ParentEventID": [
          "0"
        ],
        "Label": "Reading file",
        "Title": "X-Trace Task",
        "Host": "pinky19.mpi-sws.org",
        "HRT": 26962422439990028,
        "Timestamp": "1557746062380.077881",
        "TenantClass": 0,
        "ThreadID": 1,
        "ThreadName": "",
        "EventID": "5C8AE8C157BB5CDF",
        "ProcessID": 36430,
        "Tag": [
          "reader_10kb",
          "Read Size: 10240"
        ]
      },
      {
        "Cycles": 0,
        "Agent": "org.apache.hadoop.ipc.ProtobufRpcEngine",
        "ProcessName": "Read",
        "TaskID": "5A993F93FE695551",
        "ParentEventID": [
          "F72D8864658A7D01"
        ],
        "Label": "Invoking org.apache.hadoop.hdfs.protocol.ClientProtocol.getBlockLocations",
        "Title": "X-Trace Task",
        "Host": "pinky19.mpi-sws.org",
        "HRT": 26962422440095711,
        "Timestamp": "1557746062380.183594",
        "TenantClass": 0,
        "Source": "ProtobufRpcEngine.java:228",
        "ThreadID": 1,
        "ThreadName": "",
        "EventID": "DF6CD8B840AC954E",
        "ProcessID": 36430
      },
      {
        "Cycles": 0,
        "Agent": "Execution-CPU",
        "ProcessName": "Read",
        "TaskID": "5A993F93FE695551",
        "ParentEventID": [
          "2701C55A7ED1CA08"
        ],
        "Label": "set",
        "Title": "X-Trace Task",
        "Host": "pinky19.mpi-sws.org",
        "HRT": 26962422440209497,
        "Operation": "set",
        "Timestamp": "1557746062380.297363",
        "TenantClass": 0,
        "Source": "Client.java:1032",
        "ThreadID": 41,
        "ThreadName": "",
        "EventID": "BAE7AF5E5464625F",
        "ProcessID": 36430
      },
      {
        "Cycles": 0,
        "Agent": "edu.brown.cs.systems.xtrace.logging.BaggageWrappers",
        "ProcessName": "Read",
        "TaskID": "5A993F93FE695551",
        "ParentEventID": [
          "BAE7AF5E5464625F"
        ],
        "Label": "Forking current baggage with Baggage.fork()",
        "Title": "X-Trace Task",
        "Host": "pinky19.mpi-sws.org",
        "HRT": 26962422440237543,
        "Operation": "fork",
        "Timestamp": "1557746062380.325439",
        "TenantClass": 0,
        "Source": "Client.java:1043",
        "ThreadID": 41,
        "ThreadName": "",
        "EventID": "72CA6BB47545F425",
        "ProcessID": 36430
      },
      {
        "Cycles": 0,
        "Agent": "Execution-CPU",
        "ProcessName": "Read",
        "TaskID": "5A993F93FE695551",
        "ParentEventID": [
          "AB9F59D21BB71644"
        ],
        "Label": "set",
        "Title": "X-Trace Task",
        "Host": "pinky19.mpi-sws.org",
        "HRT": 26962422440381097,
        "Operation": "set",
        "Timestamp": "1557746062380.468994",
        "TenantClass": 0,
        "Source": "Client.java:1104",
        "ThreadID": 1,
        "ThreadName": "",
        "EventID": "E6BE73F93F5435A3",
        "ProcessID": 36430
      },
      {
        "Cycles": 0,
        "Agent": "Execution-CPU",
        "ProcessName": "Read",
        "TaskID": "5A993F93FE695551",
        "ParentEventID": [
          "72CA6BB47545F425"
        ],
        "Label": "unset",
        "Title": "X-Trace Task",
        "Host": "pinky19.mpi-sws.org",
        "Duration": "110238",
        "HRT": 26962422440343132,
        "Operation": "unset",
        "Timestamp": "1557746062380.431152",
        "TenantClass": 0,
        "Source": "Client.java:1062",
        "ThreadID": 41,
        "ThreadName": "",
        "EventID": "AB9F59D21BB71644",
        "ProcessID": 36430
      },
      {
        "Cycles": 0,
        "Agent": "Execution-CPU",
        "ProcessName": "Name",
        "TaskID": "5A993F93FE695551",
        "ParentEventID": [
          "72CA6BB47545F425"
        ],
        "Label": "set",
        "Title": "X-Trace Task",
        "Host": "pinky19.mpi-sws.org",
        "HRT": 26962422440415823,
        "Operation": "set",
        "Timestamp": "1557746062380.516846",
        "TenantClass": 0,
        "Source": "Server.java:1840",
        "ThreadID": 48,
        "ThreadName": "",
        "EventID": "08FD32D35D56DA61",
        "BaggageBytes": "[[248 5] [240 0] [0 90 153 63 147 254 105 85 81] [240 1] [0 114 202 107 180 117 69 244 37] [240 3] [0 2]]",
        "ProcessID": 2171
      },
      {
        "Cycles": 0,
        "Agent": "Execution-CPU",
        "ProcessName": "Name",
        "TaskID": "5A993F93FE695551",
        "ParentEventID": [
          "F0D230E45C3EEE40"
        ],
        "Label": "unset",
        "Title": "X-Trace Task",
        "Host": "pinky19.mpi-sws.org",
        "Duration": "32157",
        "HRT": 26962422440486593,
        "Operation": "unset",
        "Timestamp": "1557746062380.587646",
        "TenantClass": 0,
        "Source": "Server.java:1828",
        "ThreadID": 48,
        "ThreadName": "",
        "EventID": "65220118FFC38168",
        "BaggageBytes": "[[248 5] [240 0] [0 90 153 63 147 254 105 85 81] [240 1] [0 240 210 48 228 92 62 238 64] [240 3] [0 2]]",
        "ProcessID": 2171
      },
      {
        "Cycles": 0,
        "Agent": "Execution-CPU",
        "ProcessName": "Name",
        "TaskID": "5A993F93FE695551",
        "ParentEventID": [
          "F0D230E45C3EEE40"
        ],
        "Label": "set",
        "Title": "X-Trace Task",
        "Host": "pinky19.mpi-sws.org",
        "HRT": 26962422440498710,
        "Operation": "set",
        "Timestamp": "1557746062380.599609",
        "TenantClass": 0,
        "Source": "Server.java:2071",
        "ThreadID": 55,
        "ThreadName": "",
        "EventID": "94218108175085BF",
        "BaggageBytes": "[[248 5] [240 0] [0 90 153 63 147 254 105 85 81] [240 1] [0 240 210 48 228 92 62 238 64] [240 3] [0 2]]",
        "ProcessID": 2171
      },
      {
        "Cycles": 0,
        "Agent": "org.apache.hadoop.hdfs.server.namenode.FSNamesystem.audit",
        "ProcessName": "Name",
        "TaskID": "5A993F93FE695551",
        "ParentEventID": [
          "519C56DA9209596C"
        ],
        "Label": "allowed=true\tugi=plascas (auth:SIMPLE)\tip=/139.19.171.63\tcmd=open\tsrc=/ds/OkRhARdh47aXUw7Y\tdst=null\tperm=null\tproto=rpc",
        "Title": "X-Trace Task",
        "Host": "pinky19.mpi-sws.org",
        "HRT": 26962422440629871,
        "Timestamp": "1557746062380.730957",
        "TenantClass": 0,
        "Source": "FSNamesystem.java:8313",
        "ThreadID": 55,
        "ThreadName": "",
        "EventID": "18EDC5377C8ACD5B",
        "BaggageBytes": "[[248 5] [240 0] [0 90 153 63 147 254 105 85 81] [240 1] [0 81 156 86 218 146 9 89 108] [240 3] [0 2]]",
        "ProcessID": 2171
      },
      {
        "Cycles": 0,
        "Agent": "edu.brown.cs.systems.xtrace.logging.BaggageWrappers",
        "ProcessName": "Name",
        "TaskID": "5A993F93FE695551",
        "ParentEventID": [
          "08FD32D35D56DA61"
        ],
        "Label": "Forking current baggage with Baggage.fork()",
        "Title": "X-Trace Task",
        "Host": "pinky19.mpi-sws.org",
        "HRT": 26962422440458896,
        "Operation": "fork",
        "Timestamp": "1557746062380.559814",
        "TenantClass": 0,
        "Source": "Server.java:550",
        "ThreadID": 48,
        "ThreadName": "",
        "EventID": "F0D230E45C3EEE40",
        "BaggageBytes": "[[248 5] [240 0] [0 90 153 63 147 254 105 85 81] [240 1] [0 8 253 50 211 93 86 218 97] [240 3] [0 2]]",
        "ProcessID": 2171
      },
      {
        "Cycles": 0,
        "Agent": "Execution-CPU",
        "ProcessName": "Name",
        "TaskID": "5A993F93FE695551",
        "ParentEventID": [
          "7EF28CADB62D051A"
        ],
        "Label": "unset",
        "Title": "X-Trace Task",
        "Host": "pinky19.mpi-sws.org",
        "Duration": "286111",
        "HRT": 26962422440828704,
        "Operation": "unset",
        "Timestamp": "1557746062380.929688",
        "TenantClass": 0,
        "Source": "Server.java:1058",
        "ThreadID": 55,
        "ThreadName": "",
        "EventID": "B308B4562C12CC8F",
        "BaggageBytes": "[[248 5] [240 0] [0 90 153 63 147 254 105 85 81] [240 1] [0 126 242 140 173 182 45 5 26] [240 3] [0 2]]",
        "ProcessID": 2171
      },
      {
        "Cycles": 0,
        "Agent": "edu.brown.cs.systems.xtrace.logging.BaggageWrappers",
        "ProcessName": "Name",
        "TaskID": "5A993F93FE695551",
        "ParentEventID": [
          "18EDC5377C8ACD5B"
        ],
        "Label": "Forking current baggage with Baggage.fork()",
        "Title": "X-Trace Task",
        "Host": "pinky19.mpi-sws.org",
        "HRT": 26962422440697718,
        "Operation": "fork",
        "Timestamp": "1557746062380.798828",
        "TenantClass": 0,
        "Source": "Server.java:2398",
        "ThreadID": 55,
        "ThreadName": "",
        "EventID": "7EF28CADB62D051A",
        "BaggageBytes": "[[248 5] [240 0] [0 90 153 63 147 254 105 85 81] [240 1] [0 24 237 197 55 124 138 205 91] [240 3] [0 2]]",
        "ProcessID": 2171
      },
      {
        "Cycles": 0,
        "Agent": "Execution-CPU",
        "ProcessName": "Read",
        "TaskID": "5A993F93FE695551",
        "ParentEventID": [
          "7EF28CADB62D051A"
        ],
        "Label": "set",
        "Title": "X-Trace Task",
        "Host": "pinky19.mpi-sws.org",
        "HRT": 26962422440902270,
        "Operation": "set",
        "Timestamp": "1557746062380.990234",
        "TenantClass": 0,
        "Source": "Client.java:302",
        "ThreadID": 37,
        "ThreadName": "",
        "EventID": "9D188F8FB675F467",
        "ProcessID": 36430
      },
      {
        "Cycles": 0,
        "Agent": "Execution-CPU",
        "ProcessName": "Read",
        "TaskID": "5A993F93FE695551",
        "ParentEventID": [
          "9D188F8FB675F467"
        ],
        "Label": "unset",
        "Title": "X-Trace Task",
        "Host": "pinky19.mpi-sws.org",
        "Duration": "22650",
        "HRT": 26962422440957298,
        "Operation": "unset",
        "Timestamp": "1557746062381.045166",
        "TenantClass": 0,
        "Source": "Client.java:1168",
        "ThreadID": 37,
        "ThreadName": "",
        "EventID": "05277B6ED32CC1B7",
        "ProcessID": 36430
      },
      {
        "Cycles": 0,
        "Agent": "edu.brown.cs.systems.xtrace.logging.BaggageWrappers",
        "ProcessName": "Read",
        "TaskID": "5A993F93FE695551",
        "ParentEventID": [
          "E3A51305A77BA866",
          "05277B6ED32CC1B7"
        ],
        "Label": "Merged current baggage with other baggage",
        "Title": "X-Trace Task",
        "Host": "pinky19.mpi-sws.org",
        "HRT": 26962422441028076,
        "Operation": "join",
        "Timestamp": "1557746062381.115967",
        "TenantClass": 0,
        "Source": "Client.java:1545",
        "ThreadID": 1,
        "ThreadName": "",
        "EventID": "0A4E08CEC605BD2C",
        "ProcessID": 36430
      },
      {
        "Cycles": 0,
        "Agent": "org.apache.hadoop.ipc.Server",
        "ProcessName": "Name",
        "TaskID": "5A993F93FE695551",
        "ParentEventID": [
          "94218108175085BF"
        ],
        "Label": "getBlockLocations in org.apache.hadoop.hdfs.protocol.ClientProtocol",
        "Title": "X-Trace Task",
        "Host": "pinky19.mpi-sws.org",
        "HRT": 26962422440558434,
        "Timestamp": "1557746062380.659424",
        "TenantClass": 0,
        "Source": "ProtobufRpcEngine.java:601",
        "ThreadID": 55,
        "ThreadName": "",
        "EventID": "519C56DA9209596C",
        "BaggageBytes": "[[248 5] [240 0] [0 90 153 63 147 254 105 85 81] [240 1] [0 148 33 129 8 23 80 133 191] [240 3] [0 2]]",
        "ProcessID": 2171
      },
      {
        "Cycles": 0,
        "Agent": "edu.brown.cs.systems.xtrace.logging.BaggageWrappers",
        "ProcessName": "Read",
        "TaskID": "5A993F93FE695551",
        "ParentEventID": [
          "A67AE767525AA95E"
        ],
        "Label": "Forking current baggage with Baggage.fork()",
        "Title": "X-Trace Task",
        "Host": "pinky19.mpi-sws.org",
        "HRT": 26962422441329374,
        "Operation": "fork",
        "Timestamp": "1557746062381.417236",
        "TenantClass": 0,
        "Source": "DataTransferProtoUtil.java:94",
        "ThreadID": 1,
        "ThreadName": "",
        "EventID": "9798E83AB2029D41",
        "ProcessID": 36430
      },
      {
        "Cycles": 0,
        "Agent": "org.apache.hadoop.ipc.ProtobufRpcEngine",
        "ProcessName": "Read",
        "TaskID": "5A993F93FE695551",
        "ParentEventID": [
          "0A4E08CEC605BD2C"
        ],
        "Label": "org.apache.hadoop.hdfs.protocol.ClientProtocol.getBlockLocations completed",
        "Title": "X-Trace Task",
        "Host": "pinky19.mpi-sws.org",
        "HRT": 26962422441134889,
        "Timestamp": "1557746062381.222900",
        "TenantClass": 0,
        "Source": "ProtobufRpcEngine.java:275",
        "ThreadID": 1,
        "ThreadName": "",
        "EventID": "A67AE767525AA95E",
        "ProcessID": 36430
      },
      {
        "Cycles": 0,
        "Agent": "edu.brown.cs.systems.xtrace.logging.XTraceInit",
        "ProcessName": "Data",
        "TaskID": "5A993F93FE695551",
        "ParentEventID": [
          "0AD1D1F52B87292D"
        ],
        "Label": "Thread.setName: DataXceiver for client DFSClient_NONMAPREDUCE_778905418_1 at /139.19.171.63:36880 [Sending block BP-1633380353-139.19.171.63-1554193446451:blk_1073759707_18883]",
        "Title": "X-Trace Task",
        "Host": "pinky26.mpi-sws.org",
        "HRT": 47512079171813107,
        "Timestamp": "1557746062382.088379",
        "TenantClass": 0,
        "Source": "DataXceiver.java:168",
        "ThreadID": 8227,
        "ThreadName": "",
        "EventID": "36B9560CD3658500",
        "BaggageBytes": "[[248 5] [240 0] [0 90 153 63 147 254 105 85 81] [240 1] [0 10 209 209 245 43 135 41 45] [240 3] [0 2]]",
        "ProcessID": 17069
      },
      {
        "Cycles": 0,
        "Agent": "Execution-Sleep",
        "ProcessName": "Read",
        "TaskID": "5A993F93FE695551",
        "ParentEventID": [
          "E6BE73F93F5435A3"
        ],
        "Label": "waited",
        "Title": "X-Trace Task",
        "Host": "pinky19.mpi-sws.org",
        "Duration": "597258",
        "HRT": 26962422440996797,
        "Operation": "waited",
        "Timestamp": "1557746062381.084717",
        "TenantClass": 0,
        "Source": "Client.java:1537",
        "ThreadID": 1,
        "ThreadName": "",
        "EventID": "E3A51305A77BA866",
        "ProcessID": 36430
      },
      {
        "Cycles": 0,
        "Agent": "Execution-CPU",
        "ProcessName": "Data",
        "TaskID": "5A993F93FE695551",
        "ParentEventID": [
          "9798E83AB2029D41"
        ],
        "Label": "set",
        "Title": "X-Trace Task",
        "Host": "pinky26.mpi-sws.org",
        "HRT": 47512079171669968,
        "Operation": "set",
        "Timestamp": "1557746062381.945068",
        "TenantClass": 0,
        "Source": "Receiver.java:117",
        "ThreadID": 8227,
        "ThreadName": "",
        "EventID": "0AD1D1F52B87292D",
        "BaggageBytes": "[[248 5] [240 0] [0 90 153 63 147 254 105 85 81] [240 1] [0 151 152 232 58 178 2 157 65] [240 3] [0 2]]",
        "ProcessID": 17069
      },
      {
        "Cycles": 0,
        "Agent": "edu.brown.cs.systems.xtrace.logging.BaggageWrappers",
        "ProcessName": "Data",
        "TaskID": "5A993F93FE695551",
        "ParentEventID": [
          "36B9560CD3658500"
        ],
        "Label": "Forking current baggage with Baggage.fork()",
        "Title": "X-Trace Task",
        "Host": "pinky26.mpi-sws.org",
        "HRT": 47512079176941496,
        "Operation": "fork",
        "Timestamp": "1557746062387.216797",
        "TenantClass": 0,
        "Source": "DataXceiver.java:1257",
        "ThreadID": 8227,
        "ThreadName": "",
        "EventID": "03000DDAC501B63F",
        "BaggageBytes": "[[248 5] [240 0] [0 90 153 63 147 254 105 85 81] [240 1] [0 54 185 86 12 211 101 133 0] [240 3] [0 2]]",
        "ProcessID": 17069
      },
      {
        "Cycles": 0,
        "Agent": "edu.brown.cs.systems.xtrace.logging.BaggageWrappers",
        "ProcessName": "Data",
        "TaskID": "5A993F93FE695551",
        "ParentEventID": [
          "03000DDAC501B63F"
        ],
        "Label": "Forking current baggage with Baggage.fork()",
        "Title": "X-Trace Task",
        "Host": "pinky26.mpi-sws.org",
        "HRT": 47512079177190830,
        "Operation": "fork",
        "Timestamp": "1557746062387.466064",
        "TenantClass": 0,
        "Source": "PacketHeader.java:95",
        "ThreadID": 8227,
        "ThreadName": "",
        "EventID": "B4AE60D7CBD73B55",
        "BaggageBytes": "[[248 5] [240 0] [0 90 153 63 147 254 105 85 81] [240 1] [0 3 0 13 218 197 1 182 63] [240 3] [0 2]]",
        "ProcessID": 17069
      },
      {
        "Cycles": 0,
        "Agent": "Execution-Sleep",
        "ProcessName": "Read",
        "TaskID": "5A993F93FE695551",
        "ParentEventID": [
          "9798E83AB2029D41"
        ],
        "Label": "waited",
        "Title": "X-Trace Task",
        "Host": "pinky19.mpi-sws.org",
        "Duration": "5789192",
        "HRT": 26962422447291720,
        "Operation": "waited",
        "Timestamp": "1557746062387.379639",
        "TenantClass": 0,
        "Source": "SocketIOWithTimeout.java:335",
        "ThreadID": 1,
        "ThreadName": "",
        "EventID": "54A88FBDB6780D6B",
        "ProcessID": 36430
      },
      {
        "Cycles": 0,
        "Agent": "Execution-Sleep",
        "ProcessName": "Data",
        "TaskID": "5A993F93FE695551",
        "ParentEventID": [
          "B4AE60D7CBD73B55"
        ],
        "Label": "waited",
        "Title": "X-Trace Task",
        "Host": "pinky26.mpi-sws.org",
        "Duration": "6852",
        "HRT": 47512079177254506,
        "Operation": "waited",
        "Timestamp": "1557746062387.529785",
        "TenantClass": 0,
        "Source": "SocketIOWithTimeout.java:335",
        "ThreadID": 8227,
        "ThreadName": "",
        "EventID": "22B07FDE95595DBC",
        "BaggageBytes": "[[248 5] [240 0] [0 90 153 63 147 254 105 85 81] [240 1] [0 180 174 96 215 203 215 59 85] [240 3] [0 2]]",
        "ProcessID": 17069
      },
      {
        "Cycles": 0,
        "Agent": "edu.brown.cs.systems.xtrace.logging.BaggageWrappers",
        "ProcessName": "Read",
        "TaskID": "5A993F93FE695551",
        "ParentEventID": [
          "54A88FBDB6780D6B",
          "03000DDAC501B63F"
        ],
        "Label": "Merged current baggage with other baggage",
        "Title": "X-Trace Task",
        "Host": "pinky19.mpi-sws.org",
        "HRT": 26962422447439706,
        "Operation": "join",
        "Timestamp": "1557746062387.527588",
        "TenantClass": 0,
        "Source": "RemoteBlockReader2.java:429",
        "ThreadID": 1,
        "ThreadName": "",
        "EventID": "EDB1D26F21F810D1",
        "ProcessID": 36430
      },
      {
        "Cycles": 0,
        "Agent": "edu.brown.cs.systems.xtrace.logging.BaggageWrappers",
        "ProcessName": "Data",
        "TaskID": "5A993F93FE695551",
        "ParentEventID": [
          "22B07FDE95595DBC"
        ],
        "Label": "Forking current baggage with Baggage.fork()",
        "Title": "X-Trace Task",
        "Host": "pinky26.mpi-sws.org",
        "HRT": 47512079187033916,
        "Operation": "fork",
        "Timestamp": "1557746062397.309082",
        "TenantClass": 0,
        "Source": "PacketHeader.java:95",
        "ThreadID": 8227,
        "ThreadName": "",
        "EventID": "B2AF69EABEDFAE2C",
        "BaggageBytes": "[[248 5] [240 0] [0 90 153 63 147 254 105 85 81] [240 1] [0 34 176 127 222 149 89 93 188] [240 3] [0 2]]",
        "ProcessID": 17069
      },
      {
        "Cycles": 0,
        "Agent": "Execution-Sleep",
        "ProcessName": "Read",
        "TaskID": "5A993F93FE695551",
        "ParentEventID": [
          "EDB1D26F21F810D1"
        ],
        "Label": "waited",
        "Title": "X-Trace Task",
        "Host": "pinky19.mpi-sws.org",
        "Duration": "9731778",
        "HRT": 26962422457331876,
        "Operation": "waited",
        "Timestamp": "1557746062397.419922",
        "TenantClass": 0,
        "Source": "SocketIOWithTimeout.java:335",
        "ThreadID": 1,
        "ThreadName": "",
        "EventID": "3025AB448701916F",
        "ProcessID": 36430
      },
      {
        "Cycles": 0,
        "Agent": "edu.brown.cs.systems.xtrace.logging.BaggageWrappers",
        "ProcessName": "Read",
        "TaskID": "5A993F93FE695551",
        "ParentEventID": [
          "3025AB448701916F",
          "B4AE60D7CBD73B55"
        ],
        "Label": "Merged current baggage with other baggage",
        "Title": "X-Trace Task",
        "Host": "pinky19.mpi-sws.org",
        "HRT": 26962422457434680,
        "Operation": "join",
        "Timestamp": "1557746062397.522705",
        "TenantClass": 0,
        "Source": "PacketHeader.java:168",
        "ThreadID": 1,
        "ThreadName": "",
        "EventID": "4BF0D336BB22D7B4",
        "ProcessID": 36430
      },
      {
        "Cycles": 0,
        "Agent": "edu.brown.cs.systems.xtrace.logging.BaggageWrappers",
        "ProcessName": "Read",
        "TaskID": "5A993F93FE695551",
        "ParentEventID": [
          "B2AF69EABEDFAE2C",
          "4BF0D336BB22D7B4"
        ],
        "Label": "Merged current baggage with other baggage",
        "Title": "X-Trace Task",
        "Host": "pinky19.mpi-sws.org",
        "HRT": 26962422457546942,
        "Operation": "join",
        "Timestamp": "1557746062397.635010",
        "TenantClass": 0,
        "Source": "PacketHeader.java:168",
        "ThreadID": 1,
        "ThreadName": "",
        "EventID": "9E6082F680D5D913",
        "ProcessID": 36430
      },
      {
        "Cycles": 0,
        "Agent": "edu.brown.cs.systems.xtrace.logging.BaggageWrappers",
        "ProcessName": "Read",
        "TaskID": "5A993F93FE695551",
        "ParentEventID": [
          "9E6082F680D5D913"
        ],
        "Label": "Forking current baggage with Baggage.fork()",
        "Title": "X-Trace Task",
        "Host": "pinky19.mpi-sws.org",
        "HRT": 26962422457569915,
        "Operation": "fork",
        "Timestamp": "1557746062397.657959",
        "TenantClass": 0,
        "Source": "RemoteBlockReader2.java:361",
        "ThreadID": 1,
        "ThreadName": "",
        "EventID": "A97323205D6A2C65",
        "ProcessID": 36430
      },
      {
        "Cycles": 0,
        "Agent": "Execution-Sleep",
        "ProcessName": "Data",
        "TaskID": "5A993F93FE695551",
        "ParentEventID": [
          "B2AF69EABEDFAE2C"
        ],
        "Label": "waited",
        "Title": "X-Trace Task",
        "Host": "pinky26.mpi-sws.org",
        "Duration": "334978",
        "HRT": 47512079187571302,
        "Operation": "waited",
        "Timestamp": "1557746062397.846436",
        "TenantClass": 0,
        "Source": "SocketIOWithTimeout.java:335",
        "ThreadID": 8227,
        "ThreadName": "",
        "EventID": "755F6FC1E56ADFFE",
        "BaggageBytes": "[[248 5] [240 0] [0 90 153 63 147 254 105 85 81] [240 1] [0 178 175 105 234 190 223 174 44] [240 3] [0 2]]",
        "ProcessID": 17069
      },
      {
        "Cycles": 0,
        "Agent": "Execution-CPU",
        "ProcessName": "Data",
        "TaskID": "5A993F93FE695551",
        "ParentEventID": [
          "2C54DF30E2C0C357"
        ],
        "Label": "unset",
        "Title": "X-Trace Task",
        "Host": "pinky26.mpi-sws.org",
        "Duration": "16002891",
        "HRT": 47512079187728505,
        "Operation": "unset",
        "Timestamp": "1557746062398.003662",
        "TenantClass": 0,
        "Source": "DataXceiver.java:261",
        "ThreadID": 8227,
        "ThreadName": "",
        "EventID": "1FCA92C075573CC6",
        "BaggageBytes": "[[248 5] [240 0] [0 90 153 63 147 254 105 85 81] [240 1] [0 44 84 223 48 226 192 195 87] [240 3] [0 2]]",
        "ProcessID": 17069
      },
      {
        "Cycles": 0,
        "Agent": "edu.brown.cs.systems.xtrace.logging.BaggageWrappers",
        "ProcessName": "Data",
        "TaskID": "5A993F93FE695551",
        "ParentEventID": [
          "A97323205D6A2C65",
          "755F6FC1E56ADFFE"
        ],
        "Label": "Merged current baggage with other baggage",
        "Title": "X-Trace Task",
        "Host": "pinky26.mpi-sws.org",
        "HRT": 47512079187693495,
        "Operation": "join",
        "Timestamp": "1557746062397.968750",
        "TenantClass": 0,
        "Source": "DataXceiver.java:574",
        "ThreadID": 8227,
        "ThreadName": "",
        "EventID": "2C54DF30E2C0C357",
        "BaggageBytes": "[[248 5] [240 0] [0 90 153 63 147 254 105 85 81] [240 1] [0 169 115 35 32 93 106 44 101] [0 117 95 111 193 229 106 223 254] [240 3] [0 2]]",
        "ProcessID": 17069
      }
    ]
  }
]