[
  {
    "id": "8E2D8D9F735FCB1B",
    "reports": [
      {
        "Cycles": 0,
        "Agent": "Execution-CPU",
        "ProcessName": "Read",
        "TaskID": "8E2D8D9F735FCB1B",
        "ParentEventID": [
          "65797307BA346189"
        ],
        "Label": "unset",
        "Title": "X-Trace Task",
        "Host": "pinky19.mpi-sws.org",
        "Duration": "64579133",
        "HRT": 26962551432824894,
        "Operation": "unset",
        "Timestamp": "1557746191373.050293",
        "TenantClass": 0,
        "Source": "Client.java:1027",
        "ThreadID": 1,
        "ThreadName": "",
        "EventID": "1B7CF1D605BF3B78",
        "ProcessID": 36430
      },
      {
        "Cycles": 0,
        "Agent": "Execution-CPU",
        "ProcessName": "Read",
        "TaskID": "8E2D8D9F735FCB1B",
        "ParentEventID": [
          "1B7CF1D605BF3B78"
        ],
        "Label": "set",
        "Title": "X-Trace Task",
        "Host": "pinky19.mpi-sws.org",
        "HRT": 26962551432884787,
        "Operation": "set",
        "Timestamp": "1557746191373.110107",
        "TenantClass": 0,
        "Source": "Client.java:1032",
        "ThreadID": 41,
        "ThreadName": "",
        "EventID": "E1E6066278A3F2CD",
        "ProcessID": 36430
      },
      {
        "Cycles": 0,
        "Agent": "edu.brown.cs.systems.retro.benchmarks.hdfs_client.Reader",
        "ProcessName": "Read",
        "TaskID": "8E2D8D9F735FCB1B",
        "ParentEventID": [
          "0E365D0F3BD46080"
        ],
        "Label": "Reading file",
        "Title": "X-Trace Task",
        "Host": "pinky19.mpi-sws.org",
        "HRT": 26962551432745763,
        "Timestamp": "1557746191372.971191",
        "TenantClass": 0,
        "ThreadID": 1,
        "ThreadName": "",
        "EventID": "A09EF33152ECB7E2",
        "ProcessID": 36430
      },
      {
        "Cycles": 0,
        "Agent": "org.apache.hadoop.ipc.ProtobufRpcEngine",
        "ProcessName": "Read",
        "TaskID": "8E2D8D9F735FCB1B",
        "ParentEventID": [
          "A09EF33152ECB7E2"
        ],
        "Label": "Invoking org.apache.hadoop.hdfs.protocol.ClientProtocol.getBlockLocations",
        "Title": "X-Trace Task",
        "Host": "pinky19.mpi-sws.org",
        "HRT": 26962551432792986,
        "Timestamp": "1557746191373.018311",
        "TenantClass": 0,
        "Source": "ProtobufRpcEngine.java:228",
        "ThreadID": 1,
        "ThreadName": "",
        "EventID": "65797307BA346189",
        "ProcessID": 36430
      },
      {
        "Cycles": 0,
        "Agent": "edu.brown.cs.systems.xtrace.logging.BaggageWrappers",
        "ProcessName": "Read",
        "TaskID": "8E2D8D9F735FCB1B",
        "ParentEventID": [
          "E1E6066278A3F2CD"
        ],
        "Label": "Forking current baggage with Baggage.fork()",
        "Title": "X-Trace Task",
        "Host": "pinky19.mpi-sws.org",
        "HRT": 26962551432905667,
        "Operation": "fork",
        "Timestamp": "1557746191373.131104",
        "TenantClass": 0,
        "Source": "Client.java:1043",
        "ThreadID": 41,
        "ThreadName": "",
        "EventID": "8035E1D7026491BD",
        "ProcessID": 36430
      },
      {
        "Cycles": 0,
        "Agent": "Execution-CPU",
        "ProcessName": "Read",
        "TaskID": "8E2D8D9F735FCB1B",
        "ParentEventID": [
          "8035E1D7026491BD"
        ],
        "Label": "unset",
        "Title": "X-Trace Task",
        "Host": "pinky19.mpi-sws.org",
        "Duration": "67650",
        "HRT": 26962551432972517,
        "Operation": "unset",
        "Timestamp": "1557746191373.197998",
        "TenantClass": 0,
        "Source": "Client.java:1062",
        "ThreadID": 41,
        "ThreadName": "",
        "EventID": "8C78A2AA5DD8D8ED",
        "ProcessID": 36430
      },
      {
        "Cycles": 0,
        "Agent": "Execution-CPU",
        "ProcessName": "Read",
        "TaskID": "8E2D8D9F735FCB1B",
        "ParentEventID": [
          "8C78A2AA5DD8D8ED"
        ],
        "Label": "set",
        "Title": "X-Trace Task",
        "Host": "pinky19.mpi-sws.org",
        "HRT": 26962551432993697,
        "Operation": "set",
        "Timestamp": "1557746191373.218994",
        "TenantClass": 0,
        "Source": "Client.java:1104",
        "ThreadID": 1,
        "ThreadName": "",
        "EventID": "1F25FEF032A626FC",
        "ProcessID": 36430
      },
      {
        "Cycles": 0,
        "Agent": "Execution-CPU",
        "ProcessName": "Name",
        "TaskID": "8E2D8D9F735FCB1B",
        "ParentEventID": [
          "8035E1D7026491BD"
        ],
        "Label": "set",
        "Title": "X-Trace Task",
        "Host": "pinky19.mpi-sws.org",
        "HRT": 26962551433036103,
        "Operation": "set",
        "Timestamp": "1557746191373.354980",
        "TenantClass": 0,
        "Source": "Server.java:1840",
        "ThreadID": 48,
        "ThreadName": "",
        "EventID": "8BBE925F7F88E8AE",
        "BaggageBytes": "[[248 5] [240 0] [0 142 45 141 159 115 95 203 27] [240 1] [0 128 53 225 215 2 100 145 189] [240 3] [0 2]]",
        "ProcessID": 2171
      },
      {
        "Cycles": 0,
        "Agent": "Execution-CPU",
        "ProcessName": "Name",
        "TaskID": "8E2D8D9F735FCB1B",
        "ParentEventID": [
          "4DEEA67C4D71760A"
        ],
        "Label": "unset",
        "Title": "X-Trace Task",
        "Host": "pinky19.mpi-sws.org",
        "Duration": "24015",
        "HRT": 26962551433085637,
        "Operation": "unset",
        "Timestamp": "1557746191373.404541",
        "TenantClass": 0,
        "Source": "Server.java:1828",
        "ThreadID": 48,
        "ThreadName": "",
        "EventID": "0749A81914EEDEE2",
        "BaggageBytes": "[[248 5] [240 0] [0 142 45 141 159 115 95 203 27] [240 1] [0 77 238 166 124 77 113 118 10] [240 3] [0 2]]",
        "ProcessID": 2171
      },
      {
        "Cycles": 0,
        "Agent": "edu.brown.cs.systems.xtrace.logging.BaggageWrappers",
        "ProcessName": "Name",
        "TaskID": "8E2D8D9F735FCB1B",
        "ParentEventID": [
          "8BBE925F7F88E8AE"
        ],
        "Label": "Forking current baggage with Baggage.fork()",
        "Title": "X-Trace Task",
        "Host": "pinky19.mpi-sws.org",
        "HRT": 26962551433065544,
        "Operation": "fork",
        "Timestamp": "1557746191373.384521",
        "TenantClass": 0,
        "Source": "Server.java:550",
        "ThreadID": 48,
        "ThreadName": "",
        "EventID": "4DEEA67C4D71760A",
        "BaggageBytes": "[[248 5] [240 0] [0 142 45 141 159 115 95 203 27] [240 1] [0 139 190 146 95 127 136 232 174] [240 3] [0 2]]",
        "ProcessID": 2171
      },
      {
        "Cycles": 0,
        "Agent": "Execution-CPU",
        "ProcessName": "Name",
        "TaskID": "8E2D8D9F735FCB1B",
        "ParentEventID": [
          "4DEEA67C4D71760A"
        ],
        "Label": "set",
        "Title": "X-Trace Task",
        "Host": "pinky19.mpi-sws.org",
        "HRT": 26962551433095206,
        "Operation": "set",
        "Timestamp": "1557746191373.414062",
        "TenantClass": 0,
        "Source": "Server.java:2071",
        "ThreadID": 61,
        "ThreadName": "",
        "EventID": "5F03CEF632116A44",
        "BaggageBytes": "[[248 5] [240 0] [0 142 45 141 159 115 95 203 27] [240 1] [0 77 238 166 124 77 113 118 10] [240 3] [0 2]]",
        "ProcessID": 2171
      },
      {
        "Cycles": 0,
        "Agent": "org.apache.hadoop.hdfs.server.namenode.FSNamesystem.audit",
        "ProcessName": "Name",
        "TaskID": "8E2D8D9F735FCB1B",
        "ParentEventID": [
          "C62200854F188386"
        ],
        "Label": "allowed=true\tugi=plascas (auth:SIMPLE)\tip=/139.19.171.63\tcmd=open\tsrc=/ds/fWCC5wJyCCwiIVLQ\tdst=null\tperm=null\tproto=rpc",
        "Title": "X-Trace Task",
        "Host": "pinky19.mpi-sws.org",
        "HRT": 26962551433227422,
        "Timestamp": "1557746191373.546387",
        "TenantClass": 0,
        "Source": "FSNamesystem.java:8313",
        "ThreadID": 61,
        "ThreadName": "",
        "EventID": "5376A6D4E6A3BB52",
        "BaggageBytes": "[[248 5] [240 0] [0 142 45 141 159 115 95 203 27] [240 1] [0 198 34 0 133 79 24 131 134] [240 3] [0 2]]",
        "ProcessID": 2171
      },
      {
        "Cycles": 0,
        "Agent": "edu.brown.cs.systems.xtrace.logging.BaggageWrappers",
        "ProcessName": "Name",
        "TaskID": "8E2D8D9F735FCB1B",
        "ParentEventID": [
          "5376A6D4E6A3BB52"
        ],
        "Label": "Forking current baggage with Baggage.fork()",
        "Title": "X-Trace Task",
        "Host": "pinky19.mpi-sws.org",
        "HRT": 26962551433294604,
        "Operation": "fork",
        "Timestamp": "1557746191373.613525",
        "TenantClass": 0,
        "Source": "Server.java:2398",
        "ThreadID": 61,
        "ThreadName": "",
        "EventID": "1237545AE7A2C3B4",
        "BaggageBytes": "[[248 5] [240 0] [0 142 45 141 159 115 95 203 27] [240 1] [0 83 118 166 212 230 163 187 82] [240 3] [0 2]]",
        "ProcessID": 2171
      },
      {
        "Cycles": 0,
        "Agent": "org.apache.hadoop.ipc.Server",
        "ProcessName": "Name",
        "TaskID": "8E2D8D9F735FCB1B",
        "ParentEventID": [
          "5F03CEF632116A44"
        ],
        "Label": "getBlockLocations in org.apache.hadoop.hdfs.protocol.ClientProtocol",
        "Title": "X-Trace Task",
        "Host": "pinky19.mpi-sws.org",
        "HRT": 26962551433155785,
        "Timestamp": "1557746191373.474609",
        "TenantClass": 0,
        "Source": "ProtobufRpcEngine.java:601",
        "ThreadID": 61,
        "ThreadName": "",
        "EventID": "C62200854F188386",
        "BaggageBytes": "[[248 5] [240 0] [0 142 45 141 159 115 95 203 27] [240 1] [0 95 3 206 246 50 17 106 68] [240 3] [0 2]]",
        "ProcessID": 2171
      },
      {
        "Cycles": 0,
        "Agent": "Execution-CPU",
        "ProcessName": "Name",
        "TaskID": "8E2D8D9F735FCB1B",
        "ParentEventID": [
          "1237545AE7A2C3B4"
        ],
        "Label": "unset",
        "Title": "X-Trace Task",
        "Host": "pinky19.mpi-sws.org",
        "Duration": "339219",
        "HRT": 26962551433478548,
        "Operation": "unset",
        "Timestamp": "1557746191373.797363",
        "TenantClass": 0,
        "Source": "Server.java:1058",
        "ThreadID": 61,
        "ThreadName": "",
        "EventID": "0B9E936AA9483FE7",
        "BaggageBytes": "[[248 5] [240 0] [0 142 45 141 159 115 95 203 27] [240 1] [0 18 55 84 90 231 162 195 180] [240 3] [0 2]]",
        "ProcessID": 2171
      },
      {
        "Cycles": 0,
        "Agent": "Execution-CPU",
        "ProcessName": "Read",
        "TaskID": "8E2D8D9F735FCB1B",
        "ParentEventID": [
          "559AB30433B4EF71"
        ],
        "Label": "unset",
        "Title": "X-Trace Task",
        "Host": "pinky19.mpi-sws.org",
        "Duration": "38010",
        "HRT": 26962551433698475,
        "Operation": "unset",
        "Timestamp": "1557746191373.923828",
        "TenantClass": 0,
        "Source": "Client.java:1168",
        "ThreadID": 37,
        "ThreadName": "",
        "EventID": "A6C5226AE19FCA71",
        "ProcessID": 36430
      },
      {
        "Cycles": 0,
        "Agent": "Execution-CPU",
        "ProcessName": "Read",
        "TaskID": "8E2D8D9F735FCB1B",
        "ParentEventID": [
          "1237545AE7A2C3B4"
        ],
        "Label": "set",
        "Title": "X-Trace Task",
        "Host": "pinky19.mpi-sws.org",
        "HRT": 26962551433611892,
        "Operation": "set",
        "Timestamp": "1557746191373.837158",
        "TenantClass": 0,
        "Source": "Client.java:302",
        "ThreadID": 37,
        "ThreadName": "",
        "EventID": "559AB30433B4EF71",
        "ProcessID": 36430
      },
      {
        "Cycles": 0,
        "Agent": "Execution-Sleep",
        "ProcessName": "Read",
        "TaskID": "8E2D8D9F735FCB1B",
        "ParentEventID": [
          "1F25FEF032A626FC"
        ],
        "Label": "waited",
        "Title": "X-Trace Task",
        "Host": "pinky19.mpi-sws.org",
        "Duration": "800721",
        "HRT": 26962551433806347,
        "Operation": "waited",
        "Timestamp": "1557746191374.031738",
        "TenantClass": 0,
        "Source": "Client.java:1537",
        "ThreadID": 1,
        "ThreadName": "",
        "EventID": "6FA89C5EEDDA08E8",
        "ProcessID": 36430
      },
      {
        "Cycles": 0,
        "Agent": "edu.brown.cs.systems.xtrace.logging.BaggageWrappers",
        "ProcessName": "Read",
        "TaskID": "8E2D8D9F735FCB1B",
        "ParentEventID": [
          "A6C5226AE19FCA71",
          "6FA89C5EEDDA08E8"
        ],
        "Label": "Merged current baggage with other baggage",
        "Title": "X-Trace Task",
        "Host": "pinky19.mpi-sws.org",
        "HRT": 26962551433827801,
        "Operation": "join",
        "Timestamp": "1557746191374.053223",
        "TenantClass": 0,
        "Source": "Client.java:1545",
        "ThreadID": 1,
        "ThreadName": "",
        "EventID": "E52D8A68D2A8050B",
        "ProcessID": 36430
      },
      {
        "Cycles": 0,
        "Agent": "org.apache.hadoop.ipc.ProtobufRpcEngine",
        "ProcessName": "Read",
        "TaskID": "8E2D8D9F735FCB1B",
        "ParentEventID": [
          "E52D8A68D2A8050B"
        ],
        "Label": "org.apache.hadoop.hdfs.protocol.ClientProtocol.getBlockLocations completed",
        "Title": "X-Trace Task",
        "Host": "pinky19.mpi-sws.org",
        "HRT": 26962551433896162,
        "Timestamp": "1557746191374.121582",
        "TenantClass": 0,
        "Source": "ProtobufRpcEngine.java:275",
        "ThreadID": 1,
        "ThreadName": "",
        "EventID": "C282C6E97BD92D53",
        "ProcessID": 36430
      },
      {
        "Cycles": 0,
        "Agent": "edu.brown.cs.systems.xtrace.logging.BaggageWrappers",
        "ProcessName": "Read",
        "TaskID": "8E2D8D9F735FCB1B",
        "ParentEventID": [
          "C282C6E97BD92D53"
        ],
        "Label": "Forking current baggage with Baggage.fork()",
        "Title": "X-Trace Task",
        "Host": "pinky19.mpi-sws.org",
        "HRT": 26962551433990619,
        "Operation": "fork",
        "Timestamp": "1557746191374.216064",
        "TenantClass": 0,
        "Source": "DataTransferProtoUtil.java:94",
        "ThreadID": 1,
        "ThreadName": "",
        "EventID": "F477428204A09872",
        "ProcessID": 36430
      },
      {
        "Cycles": 0,
        "Agent": "edu.brown.cs.systems.xtrace.logging.XTraceInit",
        "ProcessName": "Data",
        "TaskID": "8E2D8D9F735FCB1B",
        "ParentEventID": [
          "FBC20D9850B9DBA3"
        ],
        "Label": "Thread.setName: DataXceiver for client DFSClient_NONMAPREDUCE_778905418_1 at /139.19.171.63:43130 [Sending block BP-1633380353-139.19.171.63-1554193446451:blk_1073761675_20851]",
        "Title": "X-Trace Task",
        "Host": "pinky19.mpi-sws.org",
        "HRT": 26962551434155111,
        "Timestamp": "1557746191374.391113",
        "TenantClass": 0,
        "Source": "DataXceiver.java:168",
        "ThreadID": 36633,
        "ThreadName": "",
        "EventID": "F99DF35637698B10",
        "BaggageBytes": "[[248 5] [240 0] [0 142 45 141 159 115 95 203 27] [240 1] [0 251 194 13 152 80 185 219 163] [240 3] [0 2]]",
        "ProcessID": 2319
      },
      {
        "Cycles": 0,
        "Agent": "Execution-CPU",
        "ProcessName": "Data",
        "TaskID": "8E2D8D9F735FCB1B",
        "ParentEventID": [
          "F477428204A09872"
        ],
        "Label": "set",
        "Title": "X-Trace Task",
        "Host": "pinky19.mpi-sws.org",
        "HRT": 26962551434121475,
        "Operation": "set",
        "Timestamp": "1557746191374.357422",
        "TenantClass": 0,
        "Source": "Receiver.java:117",
        "ThreadID": 36633,
        "ThreadName": "",
        "EventID": "FBC20D9850B9DBA3",
        "BaggageBytes": "[[248 5] [240 0] [0 142 45 141 159 115 95 203 27] [240 1] [0 244 119 66 130 4 160 152 114] [240 3] [0 2]]",
        "ProcessID": 2319
      },
      {
        "Cycles": 0,
        "Agent": "edu.brown.cs.systems.xtrace.logging.BaggageWrappers",
        "ProcessName": "Data",
        "TaskID": "8E2D8D9F735FCB1B",
        "ParentEventID": [
          "F99DF35637698B10"
        ],
        "Label": "Forking current baggage with Baggage.fork()",
        "Title": "X-Trace Task",
        "Host": "pinky19.mpi-sws.org",
        "HRT": 26962551434244301,
        "Operation": "fork",
        "Timestamp": "1557746191374.480225",
        "TenantClass": 0,
        "Source": "DataXceiver.java:1257",
        "ThreadID": 36633,
        "ThreadName": "",
        "EventID": "600471B0BE70FD01",
        "BaggageBytes": "[[248 5] [240 0] [0 142 45 141 159 115 95 203 27] [240 1] [0 249 157 243 86 55 105 139 16] [240 3] [0 2]]",
        "ProcessID": 2319
      },
      {
        "Cycles": 0,
        "Agent": "Execution-Sleep",
        "ProcessName": "Read",
        "TaskID": "8E2D8D9F735FCB1B",
        "ParentEventID": [
          "F477428204A09872"
        ],
        "Label": "waited",
        "Title": "X-Trace Task",
        "Host": "pinky19.mpi-sws.org",
        "Duration": "215597",
        "HRT": 26962551434308789,
        "Operation": "waited",
        "Timestamp": "1557746191374.534180",
        "TenantClass": 0,
        "Source": "SocketIOWithTimeout.java:335",
        "ThreadID": 1,
        "ThreadName": "",
        "EventID": "F6A14AC57BACDAC4",
        "ProcessID": 36430
      },
      {
        "Cycles": 0,
        "Agent": "edu.brown.cs.systems.xtrace.logging.BaggageWrappers",
        "ProcessName": "Data",
        "TaskID": "8E2D8D9F735FCB1B",
        "ParentEventID": [
          "600471B0BE70FD01"
        ],
        "Label": "Forking current baggage with Baggage.fork()",
        "Title": "X-Trace Task",
        "Host": "pinky19.mpi-sws.org",
        "HRT": 26962551434309888,
        "Operation": "fork",
        "Timestamp": "1557746191374.545898",
        "TenantClass": 0,
        "Source": "PacketHeader.java:95",
        "ThreadID": 36633,
        "ThreadName": "",
        "EventID": "A80BA38E197A1267",
        "BaggageBytes": "[[248 5] [240 0] [0 142 45 141 159 115 95 203 27] [240 1] [0 96 4 113 176 190 112 253 1] [240 3] [0 2]]",
        "ProcessID": 2319
      },
      {
        "Cycles": 0,
        "Agent": "edu.brown.cs.systems.xtrace.logging.BaggageWrappers",
        "ProcessName": "Read",
        "TaskID": "8E2D8D9F735FCB1B",
        "ParentEventID": [
          "600471B0BE70FD01",
          "F6A14AC57BACDAC4"
        ],
        "Label": "Merged current baggage with other baggage",
        "Title": "X-Trace Task",
        "Host": "pinky19.mpi-sws.org",
        "HRT": 26962551434388707,
        "Operation": "join",
        "Timestamp": "1557746191374.614014",
        "TenantClass": 0,
        "Source": "RemoteBlockReader2.java:429",
        "ThreadID": 1,
        "ThreadName": "",
        "EventID": "DE0901903A216A4A",
        "ProcessID": 36430
      },
      {
        "Cycles": 0,
        "Agent": "edu.brown.cs.systems.xtrace.logging.BaggageWrappers",
        "ProcessName": "Data",
        "TaskID": "8E2D8D9F735FCB1B",
        "ParentEventID": [
          "11B97006785CB6C4"
        ],
        "Label": "Forking current baggage with Baggage.fork()",
        "Title": "X-Trace Task",
        "Host": "pinky19.mpi-sws.org",
        "HRT": 26962551434469227,
        "Operation": "fork",
        "Timestamp": "1557746191374.705078",
        "TenantClass": 0,
        "Source": "PacketHeader.java:95",
        "ThreadID": 36633,
        "ThreadName": "",
        "EventID": "01020F80999844F8",
        "BaggageBytes": "[[248 5] [240 0] [0 142 45 141 159 115 95 203 27] [240 1] [0 17 185 112 6 120 92 182 196] [240 3] [0 2]]",
        "ProcessID": 2319
      },
      {
        "Cycles": 0,
        "Agent": "Execution-Sleep",
        "ProcessName": "Data",
        "TaskID": "8E2D8D9F735FCB1B",
        "ParentEventID": [
          "A80BA38E197A1267"
        ],
        "Label": "waited",
        "Title": "X-Trace Task",
        "Host": "pinky19.mpi-sws.org",
        "Duration": "4620",
        "HRT": 26962551434383036,
        "Operation": "waited",
        "Timestamp": "1557746191374.618896",
        "TenantClass": 0,
        "Source": "SocketIOWithTimeout.java:335",
        "ThreadID": 36633,
        "ThreadName": "",
        "EventID": "11B97006785CB6C4",
        "BaggageBytes": "[[248 5] [240 0] [0 142 45 141 159 115 95 203 27] [240 1] [0 168 11 163 142 25 122 18 103] [240 3] [0 2]]",
        "ProcessID": 2319
      },
      {
        "Cycles": 0,
        "Agent": "edu.brown.cs.systems.xtrace.logging.BaggageWrappers",
        "ProcessName": "Read",
        "TaskID": "8E2D8D9F735FCB1B",
        "ParentEventID": [
          "DE0901903A216A4A",
          "A80BA38E197A1267"
        ],
        "Label": "Merged current baggage with other baggage",
        "Title": "X-Trace Task",
        "Host": "pinky19.mpi-sws.org",
        "HRT": 26962551434482167,
        "Operation": "join",
        "Timestamp": "1557746191374.707520",
        "TenantClass": 0,
        "Source": "PacketHeader.java:168",
        "ThreadID": 1,
        "ThreadName": "",
        "EventID": "D96933FACA042C41",
        "ProcessID": 36430
      },
      {
        "Cycles": 0,
        "Agent": "edu.brown.cs.systems.xtrace.logging.BaggageWrappers",
        "ProcessName": "Read",
        "TaskID": "8E2D8D9F735FCB1B",
        "ParentEventID": [
          "01020F80999844F8",
          "21B890C7FD505FB9"
        ],
        "Label": "Merged current baggage with other baggage",
        "Title": "X-Trace Task",
        "Host": "pinky19.mpi-sws.org",
        "HRT": 26962551434606043,
        "Operation": "join",
        "Timestamp": "1557746191374.831543",
        "TenantClass": 0,
        "Source": "PacketHeader.java:168",
        "ThreadID": 1,
        "ThreadName": "",
        "EventID": "C4FD91AFA5DF0AED",
        "ProcessID": 36430
      },
      {
        "Cycles": 0,
        "Agent": "Execution-Sleep",
        "ProcessName": "Read",
        "TaskID": "8E2D8D9F735FCB1B",
        "ParentEventID": [
          "D96933FACA042C41"
        ],
        "Label": "waited",
        "Title": "X-Trace Task",
        "Host": "pinky19.mpi-sws.org",
        "Duration": "5206",
        "HRT": 26962551434534425,
        "Operation": "waited",
        "Timestamp": "1557746191374.759766",
        "TenantClass": 0,
        "Source": "SocketIOWithTimeout.java:335",
        "ThreadID": 1,
        "ThreadName": "",
        "EventID": "21B890C7FD505FB9",
        "ProcessID": 36430
      },
      {
        "Cycles": 0,
        "Agent": "edu.brown.cs.systems.xtrace.logging.BaggageWrappers",
        "ProcessName": "Read",
        "TaskID": "8E2D8D9F735FCB1B",
        "ParentEventID": [
          "C4FD91AFA5DF0AED"
        ],
        "Label": "Forking current baggage with Baggage.fork()",
        "Title": "X-Trace Task",
        "Host": "pinky19.mpi-sws.org",
        "HRT": 26962551434617774,
        "Operation": "fork",
        "Timestamp": "1557746191374.843262",
        "TenantClass": 0,
        "Source": "RemoteBlockReader2.java:361",
        "ThreadID": 1,
        "ThreadName": "",
        "EventID": "B8A21009125CED27",
        "ProcessID": 36430
      },
      {
        "Cycles": 0,
        "Agent": "edu.brown.cs.systems.xtrace.logging.BaggageWrappers",
        "ProcessName": "Data",
        "TaskID": "8E2D8D9F735FCB1B",
        "ParentEventID": [
          "98BB8E9F0C39F778",
          "B8A21009125CED27"
        ],
        "Label": "Merged current baggage with other baggage",
        "Title": "X-Trace Task",
        "Host": "pinky19.mpi-sws.org",
        "HRT": 26962551434733692,
        "Operation": "join",
        "Timestamp": "1557746191374.969727",
        "TenantClass": 0,
        "Source": "DataXceiver.java:574",
        "ThreadID": 36633,
        "ThreadName": "",
        "EventID": "1657E932F1CEF6EA",
        "BaggageBytes": "[[248 5] [240 0] [0 142 45 141 159 115 95 203 27] [240 1] [0 152 187 142 159 12 57 247 120] [0 184 162 16 9 18 92 237 39] [240 3] [0 2]]",
        "ProcessID": 2319
      },
      {
        "Cycles": 0,
        "Agent": "Execution-CPU",
        "ProcessName": "Data",
        "TaskID": "8E2D8D9F735FCB1B",
        "ParentEventID": [
          "1657E932F1CEF6EA"
        ],
        "Label": "unset",
        "Title": "X-Trace Task",
        "Host": "pinky19.mpi-sws.org",
        "Duration": "616872",
        "HRT": 26962551434762571,
        "Operation": "unset",
        "Timestamp": "1557746191374.998535",
        "TenantClass": 0,
        "Source": "DataXceiver.java:261",
        "ThreadID": 36633,
        "ThreadName": "",
        "EventID": "B5638797C62AA57E",
        "BaggageBytes": "[[248 5] [240 0] [0 142 45 141 159 115 95 203 27] [240 1] [0 22 87 233 50 241 206 246 234] [240 3] [0 2]]",
        "ProcessID": 2319
      },
      {
        "Cycles": 0,
        "Agent": "Execution-Sleep",
        "ProcessName": "Data",
        "TaskID": "8E2D8D9F735FCB1B",
        "ParentEventID": [
          "01020F80999844F8"
        ],
        "Label": "waited",
        "Title": "X-Trace Task",
        "Host": "pinky19.mpi-sws.org",
        "Duration": "98137",
        "HRT": 26962551434673595,
        "Operation": "waited",
        "Timestamp": "1557746191374.909668",
        "TenantClass": 0,
        "Source": "SocketIOWithTimeout.java:335",
        "ThreadID": 36633,
        "ThreadName": "",
        "EventID": "98BB8E9F0C39F778",
        "BaggageBytes": "[[248 5] [240 0] [0 142 45 141 159 115 95 203 27] [240 1] [0 1 2 15 128 153 152 68 248] [240 3] [0 2]]",
        "ProcessID": 2319
      },
      {
        "Cycles": 0,
        "Agent": "edu.brown.cs.systems.retro.benchmarks.hdfs_client.Reader",
        "ProcessName": "Read",
        "TaskID": "8E2D8D9F735FCB1B",
        "ParentEventID": [
          "0"
        ],
        "Label": "Reading file",
        "Title": "X-Trace Task",
        "Host": "pinky19.mpi-sws.org",
        "HRT": 26962551432726826,
        "Timestamp": "1557746191372.952148",
        "TenantClass": 0,
        "ThreadID": 1,
        "ThreadName": "",
        "EventID": "0E365D0F3BD46080",
        "ProcessID": 36430,
        "Tag": [
          "reader_10kb",
          "Read Size: 10240"
        ]
      }
    ]
  }
]