[
  {
    "id": "D4EC1574BFC9E7EE",
    "reports": [
      {
        "Cycles": 0,
        "Agent": "Execution-CPU",
        "ProcessName": "Read",
        "TaskID": "D4EC1574BFC9E7EE",
        "ParentEventID": [
          "8B7975BD010F048A"
        ],
        "Label": "unset",
        "Title": "X-Trace Task",
        "Host": "pinky19.mpi-sws.org",
        "Duration": "21334402",
        "HRT": 25491922366044124,
        "Operation": "unset",
        "Timestamp": "1556275562306.195312",
        "TenantClass": 0,
        "Source": "Client.java:1027",
        "ThreadID": 1,
        "ThreadName": "",
        "EventID": "D0E256A9B21D2507",
        "ProcessID": 21035
      },
      {
        "Cycles": 0,
        "Agent": "Execution-CPU",
        "ProcessName": "Read",
        "TaskID": "D4EC1574BFC9E7EE",
        "ParentEventID": [
          "D0E256A9B21D2507"
        ],
        "Label": "set",
        "Title": "X-Trace Task",
        "Host": "pinky19.mpi-sws.org",
        "HRT": 25491922366065698,
        "Operation": "set",
        "Timestamp": "1556275562306.216797",
        "TenantClass": 0,
        "Source": "Client.java:1032",
        "ThreadID": 41,
        "ThreadName": "",
        "EventID": "D34066CFAC4796FC",
        "ProcessID": 21035
      },
      {
        "Cycles": 0,
        "Agent": "org.apache.hadoop.ipc.ProtobufRpcEngine",
        "ProcessName": "Read",
        "TaskID": "D4EC1574BFC9E7EE",
        "ParentEventID": [
          "07D8F8BEB7F114B3"
        ],
        "Label": "Invoking org.apache.hadoop.hdfs.protocol.ClientProtocol.getBlockLocations",
        "Title": "X-Trace Task",
        "Host": "pinky19.mpi-sws.org",
        "HRT": 25491922366027584,
        "Timestamp": "1556275562306.178711",
        "TenantClass": 0,
        "Source": "ProtobufRpcEngine.java:228",
        "ThreadID": 1,
        "ThreadName": "",
        "EventID": "8B7975BD010F048A",
        "ProcessID": 21035
      },
      {
        "Cycles": 0,
        "Agent": "edu.brown.cs.systems.retro.benchmarks.hdfs_client.Reader",
        "ProcessName": "Read",
        "TaskID": "D4EC1574BFC9E7EE",
        "ParentEventID": [
          "497C6D18BD6DDE95"
        ],
        "Label": "Reading file",
        "Title": "X-Trace Task",
        "Host": "pinky19.mpi-sws.org",
        "HRT": 25491922365996500,
        "Timestamp": "1556275562306.147705",
        "TenantClass": 0,
        "ThreadID": 1,
        "ThreadName": "",
        "EventID": "07D8F8BEB7F114B3",
        "ProcessID": 21035
      },
      {
        "Cycles": 0,
        "Agent": "edu.brown.cs.systems.xtrace.logging.BaggageWrappers",
        "ProcessName": "Read",
        "TaskID": "D4EC1574BFC9E7EE",
        "ParentEventID": [
          "D34066CFAC4796FC"
        ],
        "Label": "Forking current baggage with Baggage.fork()",
        "Title": "X-Trace Task",
        "Host": "pinky19.mpi-sws.org",
        "HRT": 25491922366081015,
        "Operation": "fork",
        "Timestamp": "1556275562306.232178",
        "TenantClass": 0,
        "Source": "Client.java:1043",
        "ThreadID": 41,
        "ThreadName": "",
        "EventID": "DA9D781C8784CA87",
        "ProcessID": 21035
      },
      {
        "Cycles": 0,
        "Agent": "Execution-CPU",
        "ProcessName": "Read",
        "TaskID": "D4EC1574BFC9E7EE",
        "ParentEventID": [
          "DA9D781C8784CA87"
        ],
        "Label": "unset",
        "Title": "X-Trace Task",
        "Host": "pinky19.mpi-sws.org",
        "Duration": "75381",
        "HRT": 25491922366155200,
        "Operation": "unset",
        "Timestamp": "1556275562306.306396",
        "TenantClass": 0,
        "Source": "Client.java:1062",
        "ThreadID": 41,
        "ThreadName": "",
        "EventID": "B1A2C359FF260A51",
        "ProcessID": 21035
      },
      {
        "Cycles": 0,
        "Agent": "Execution-CPU",
        "ProcessName": "Read",
        "TaskID": "D4EC1574BFC9E7EE",
        "ParentEventID": [
          "B1A2C359FF260A51"
        ],
        "Label": "set",
        "Title": "X-Trace Task",
        "Host": "pinky19.mpi-sws.org",
        "HRT": 25491922366176234,
        "Operation": "set",
        "Timestamp": "1556275562306.327393",
        "TenantClass": 0,
        "Source": "Client.java:1104",
        "ThreadID": 1,
        "ThreadName": "",
        "EventID": "D2D0E8F23E9D43C1",
        "ProcessID": 21035
      },
      {
        "Cycles": 0,
        "Agent": "edu.brown.cs.systems.xtrace.logging.BaggageWrappers",
        "ProcessName": "Name",
        "TaskID": "D4EC1574BFC9E7EE",
        "ParentEventID": [
          "617190F9EC4EEA23"
        ],
        "Label": "Forking current baggage with Baggage.fork()",
        "Title": "X-Trace Task",
        "Host": "pinky19.mpi-sws.org",
        "HRT": 25491922366233251,
        "Operation": "fork",
        "Timestamp": "1556275562306.392578",
        "TenantClass": 0,
        "Source": "Server.java:550",
        "ThreadID": 48,
        "ThreadName": "",
        "EventID": "F20161F43956382A",
        "BaggageBytes": "[[248 5] [240 0] [0 212 236 21 116 191 201 231 238] [240 1] [0 97 113 144 249 236 78 234 35] [240 3] [0 2]]",
        "ProcessID": 2171
      },
      {
        "Cycles": 0,
        "Agent": "Execution-CPU",
        "ProcessName": "Name",
        "TaskID": "D4EC1574BFC9E7EE",
        "ParentEventID": [
          "DA9D781C8784CA87"
        ],
        "Label": "set",
        "Title": "X-Trace Task",
        "Host": "pinky19.mpi-sws.org",
        "HRT": 25491922366206757,
        "Operation": "set",
        "Timestamp": "1556275562306.365967",
        "TenantClass": 0,
        "Source": "Server.java:1840",
        "ThreadID": 48,
        "ThreadName": "",
        "EventID": "617190F9EC4EEA23",
        "BaggageBytes": "[[248 5] [240 0] [0 212 236 21 116 191 201 231 238] [240 1] [0 218 157 120 28 135 132 202 135] [240 3] [0 2]]",
        "ProcessID": 2171
      },
      {
        "Cycles": 0,
        "Agent": "Execution-CPU",
        "ProcessName": "Name",
        "TaskID": "D4EC1574BFC9E7EE",
        "ParentEventID": [
          "F20161F43956382A"
        ],
        "Label": "unset",
        "Title": "X-Trace Task",
        "Host": "pinky19.mpi-sws.org",
        "Duration": "25143",
        "HRT": 25491922366255773,
        "Operation": "unset",
        "Timestamp": "1556275562306.415039",
        "TenantClass": 0,
        "Source": "Server.java:1828",
        "ThreadID": 48,
        "ThreadName": "",
        "EventID": "066EDDF3BC960949",
        "BaggageBytes": "[[248 5] [240 0] [0 212 236 21 116 191 201 231 238] [240 1] [0 242 1 97 244 57 86 56 42] [240 3] [0 2]]",
        "ProcessID": 2171
      },
      {
        "Cycles": 0,
        "Agent": "org.apache.hadoop.ipc.Server",
        "ProcessName": "Name",
        "TaskID": "D4EC1574BFC9E7EE",
        "ParentEventID": [
          "5C364A66ACE66CC6"
        ],
        "Label": "getBlockLocations in org.apache.hadoop.hdfs.protocol.ClientProtocol",
        "Title": "X-Trace Task",
        "Host": "pinky19.mpi-sws.org",
        "HRT": 25491922366297455,
        "Timestamp": "1556275562306.456787",
        "TenantClass": 0,
        "Source": "ProtobufRpcEngine.java:601",
        "ThreadID": 59,
        "ThreadName": "",
        "EventID": "6A1F58F5BFBC9644",
        "BaggageBytes": "[[248 5] [240 0] [0 212 236 21 116 191 201 231 238] [240 1] [0 92 54 74 102 172 230 108 198] [240 3] [0 2]]",
        "ProcessID": 2171
      },
      {
        "Cycles": 0,
        "Agent": "Execution-CPU",
        "ProcessName": "Name",
        "TaskID": "D4EC1574BFC9E7EE",
        "ParentEventID": [
          "F20161F43956382A"
        ],
        "Label": "set",
        "Title": "X-Trace Task",
        "Host": "pinky19.mpi-sws.org",
        "HRT": 25491922366263486,
        "Operation": "set",
        "Timestamp": "1556275562306.422607",
        "TenantClass": 0,
        "Source": "Server.java:2071",
        "ThreadID": 59,
        "ThreadName": "",
        "EventID": "5C364A66ACE66CC6",
        "BaggageBytes": "[[248 5] [240 0] [0 212 236 21 116 191 201 231 238] [240 1] [0 242 1 97 244 57 86 56 42] [240 3] [0 2]]",
        "ProcessID": 2171
      },
      {
        "Cycles": 0,
        "Agent": "org.apache.hadoop.hdfs.server.namenode.FSNamesystem.audit",
        "ProcessName": "Name",
        "TaskID": "D4EC1574BFC9E7EE",
        "ParentEventID": [
          "6A1F58F5BFBC9644"
        ],
        "Label": "allowed=true\tugi=plascas (auth:SIMPLE)\tip=/139.19.171.63\tcmd=open\tsrc=/ds/yXFhw6dx2tGw8xOV\tdst=null\tperm=null\tproto=rpc",
        "Title": "X-Trace Task",
        "Host": "pinky19.mpi-sws.org",
        "HRT": 25491922366348432,
        "Timestamp": "1556275562306.507568",
        "TenantClass": 0,
        "Source": "FSNamesystem.java:8313",
        "ThreadID": 59,
        "ThreadName": "",
        "EventID": "3C9CFD46B390BD3F",
        "BaggageBytes": "[[248 5] [240 0] [0 212 236 21 116 191 201 231 238] [240 1] [0 106 31 88 245 191 188 150 68] [240 3] [0 2]]",
        "ProcessID": 2171
      },
      {
        "Cycles": 0,
        "Agent": "Execution-CPU",
        "ProcessName": "Name",
        "TaskID": "D4EC1574BFC9E7EE",
        "ParentEventID": [
          "13117FFDD7CDAA9F"
        ],
        "Label": "unset",
        "Title": "X-Trace Task",
        "Host": "pinky19.mpi-sws.org",
        "Duration": "206885",
        "HRT": 25491922366493696,
        "Operation": "unset",
        "Timestamp": "1556275562306.652832",
        "TenantClass": 0,
        "Source": "Server.java:1058",
        "ThreadID": 59,
        "ThreadName": "",
        "EventID": "54748EB8FEE57EE4",
        "BaggageBytes": "[[248 5] [240 0] [0 212 236 21 116 191 201 231 238] [240 1] [0 19 17 127 253 215 205 170 159] [240 3] [0 2]]",
        "ProcessID": 2171
      },
      {
        "Cycles": 0,
        "Agent": "Execution-CPU",
        "ProcessName": "Read",
        "TaskID": "D4EC1574BFC9E7EE",
        "ParentEventID": [
          "13117FFDD7CDAA9F"
        ],
        "Label": "set",
        "Title": "X-Trace Task",
        "Host": "pinky19.mpi-sws.org",
        "HRT": 25491922366532794,
        "Operation": "set",
        "Timestamp": "1556275562306.683838",
        "TenantClass": 0,
        "Source": "Client.java:302",
        "ThreadID": 37,
        "ThreadName": "",
        "EventID": "919BD09AB55A0E62",
        "ProcessID": 21035
      },
      {
        "Cycles": 0,
        "Agent": "edu.brown.cs.systems.xtrace.logging.BaggageWrappers",
        "ProcessName": "Name",
        "TaskID": "D4EC1574BFC9E7EE",
        "ParentEventID": [
          "3C9CFD46B390BD3F"
        ],
        "Label": "Forking current baggage with Baggage.fork()",
        "Title": "X-Trace Task",
        "Host": "pinky19.mpi-sws.org",
        "HRT": 25491922366390975,
        "Operation": "fork",
        "Timestamp": "1556275562306.550293",
        "TenantClass": 0,
        "Source": "Server.java:2398",
        "ThreadID": 59,
        "ThreadName": "",
        "EventID": "13117FFDD7CDAA9F",
        "BaggageBytes": "[[248 5] [240 0] [0 212 236 21 116 191 201 231 238] [240 1] [0 60 156 253 70 179 144 189 63] [240 3] [0 2]]",
        "ProcessID": 2171
      },
      {
        "Cycles": 0,
        "Agent": "Execution-CPU",
        "ProcessName": "Read",
        "TaskID": "D4EC1574BFC9E7EE",
        "ParentEventID": [
          "919BD09AB55A0E62"
        ],
        "Label": "unset",
        "Title": "X-Trace Task",
        "Host": "pinky19.mpi-sws.org",
        "Duration": "5199",
        "HRT": 25491922366550177,
        "Operation": "unset",
        "Timestamp": "1556275562306.701416",
        "TenantClass": 0,
        "Source": "Client.java:1168",
        "ThreadID": 37,
        "ThreadName": "",
        "EventID": "E61210923387B207",
        "ProcessID": 21035
      },
      {
        "Cycles": 0,
        "Agent": "edu.brown.cs.systems.xtrace.logging.BaggageWrappers",
        "ProcessName": "Read",
        "TaskID": "D4EC1574BFC9E7EE",
        "ParentEventID": [
          "216A994F1FE70A72",
          "E61210923387B207"
        ],
        "Label": "Merged current baggage with other baggage",
        "Title": "X-Trace Task",
        "Host": "pinky19.mpi-sws.org",
        "HRT": 25491922366619036,
        "Operation": "join",
        "Timestamp": "1556275562306.770264",
        "TenantClass": 0,
        "Source": "Client.java:1545",
        "ThreadID": 1,
        "ThreadName": "",
        "EventID": "E91130DBA69D7887",
        "ProcessID": 21035
      },
      {
        "Cycles": 0,
        "Agent": "Execution-Sleep",
        "ProcessName": "Read",
        "TaskID": "D4EC1574BFC9E7EE",
        "ParentEventID": [
          "D2D0E8F23E9D43C1"
        ],
        "Label": "waited",
        "Title": "X-Trace Task",
        "Host": "pinky19.mpi-sws.org",
        "Duration": "406310",
        "HRT": 25491922366591650,
        "Operation": "waited",
        "Timestamp": "1556275562306.742676",
        "TenantClass": 0,
        "Source": "Client.java:1537",
        "ThreadID": 1,
        "ThreadName": "",
        "EventID": "216A994F1FE70A72",
        "ProcessID": 21035
      },
      {
        "Cycles": 0,
        "Agent": "org.apache.hadoop.ipc.ProtobufRpcEngine",
        "ProcessName": "Read",
        "TaskID": "D4EC1574BFC9E7EE",
        "ParentEventID": [
          "E91130DBA69D7887"
        ],
        "Label": "org.apache.hadoop.hdfs.protocol.ClientProtocol.getBlockLocations completed",
        "Title": "X-Trace Task",
        "Host": "pinky19.mpi-sws.org",
        "HRT": 25491922366676370,
        "Timestamp": "1556275562306.827393",
        "TenantClass": 0,
        "Source": "ProtobufRpcEngine.java:275",
        "ThreadID": 1,
        "ThreadName": "",
        "EventID": "20326131CFEDE45B",
        "ProcessID": 21035
      },
      {
        "Cycles": 0,
        "Agent": "Execution-CPU",
        "ProcessName": "Data",
        "TaskID": "D4EC1574BFC9E7EE",
        "ParentEventID": [
          "156BEF49EE7AF898"
        ],
        "Label": "set",
        "Title": "X-Trace Task",
        "Host": "pinky19.mpi-sws.org",
        "HRT": 25491922366894357,
        "Operation": "set",
        "Timestamp": "1556275562307.037598",
        "TenantClass": 0,
        "Source": "Receiver.java:117",
        "ThreadID": 9602,
        "ThreadName": "",
        "EventID": "957990E6D9E419F2",
        "BaggageBytes": "[[248 5] [240 0] [0 212 236 21 116 191 201 231 238] [240 1] [0 21 107 239 73 238 122 248 152] [240 3] [0 2]]",
        "ProcessID": 2319
      },
      {
        "Cycles": 0,
        "Agent": "edu.brown.cs.systems.xtrace.logging.BaggageWrappers",
        "ProcessName": "Read",
        "TaskID": "D4EC1574BFC9E7EE",
        "ParentEventID": [
          "20326131CFEDE45B"
        ],
        "Label": "Forking current baggage with Baggage.fork()",
        "Title": "X-Trace Task",
        "Host": "pinky19.mpi-sws.org",
        "HRT": 25491922366744683,
        "Operation": "fork",
        "Timestamp": "1556275562306.895752",
        "TenantClass": 0,
        "Source": "DataTransferProtoUtil.java:94",
        "ThreadID": 1,
        "ThreadName": "",
        "EventID": "156BEF49EE7AF898",
        "ProcessID": 21035
      },
      {
        "Cycles": 0,
        "Agent": "edu.brown.cs.systems.xtrace.logging.XTraceInit",
        "ProcessName": "Data",
        "TaskID": "D4EC1574BFC9E7EE",
        "ParentEventID": [
          "957990E6D9E419F2"
        ],
        "Label": "Thread.setName: DataXceiver for client DFSClient_NONMAPREDUCE_1377588049_1 at /139.19.171.63:36074 [Sending block BP-1633380353-139.19.171.63-1554193446451:blk_1073763779_22955]",
        "Title": "X-Trace Task",
        "Host": "pinky19.mpi-sws.org",
        "HRT": 25491922366929714,
        "Timestamp": "1556275562307.072998",
        "TenantClass": 0,
        "Source": "DataXceiver.java:168",
        "ThreadID": 9602,
        "ThreadName": "",
        "EventID": "9C031498C8FA1387",
        "BaggageBytes": "[[248 5] [240 0] [0 212 236 21 116 191 201 231 238] [240 1] [0 149 121 144 230 217 228 25 242] [240 3] [0 2]]",
        "ProcessID": 2319
      },
      {
        "Cycles": 0,
        "Agent": "edu.brown.cs.systems.xtrace.logging.BaggageWrappers",
        "ProcessName": "Data",
        "TaskID": "D4EC1574BFC9E7EE",
        "ParentEventID": [
          "A16DD729577523D0"
        ],
        "Label": "Forking current baggage with Baggage.fork()",
        "Title": "X-Trace Task",
        "Host": "pinky19.mpi-sws.org",
        "HRT": 25491922367064909,
        "Operation": "fork",
        "Timestamp": "1556275562307.208252",
        "TenantClass": 0,
        "Source": "PacketHeader.java:95",
        "ThreadID": 9602,
        "ThreadName": "",
        "EventID": "CBD508D1CA7111D4",
        "BaggageBytes": "[[248 5] [240 0] [0 212 236 21 116 191 201 231 238] [240 1] [0 161 109 215 41 87 117 35 208] [240 3] [0 2]]",
        "ProcessID": 2319
      },
      {
        "Cycles": 0,
        "Agent": "edu.brown.cs.systems.xtrace.logging.BaggageWrappers",
        "ProcessName": "Data",
        "TaskID": "D4EC1574BFC9E7EE",
        "ParentEventID": [
          "9C031498C8FA1387"
        ],
        "Label": "Forking current baggage with Baggage.fork()",
        "Title": "X-Trace Task",
        "Host": "pinky19.mpi-sws.org",
        "HRT": 25491922367003413,
        "Operation": "fork",
        "Timestamp": "1556275562307.146729",
        "TenantClass": 0,
        "Source": "DataXceiver.java:1257",
        "ThreadID": 9602,
        "ThreadName": "",
        "EventID": "A16DD729577523D0",
        "BaggageBytes": "[[248 5] [240 0] [0 212 236 21 116 191 201 231 238] [240 1] [0 156 3 20 152 200 250 19 135] [240 3] [0 2]]",
        "ProcessID": 2319
      },
      {
        "Cycles": 0,
        "Agent": "Execution-Sleep",
        "ProcessName": "Read",
        "TaskID": "D4EC1574BFC9E7EE",
        "ParentEventID": [
          "156BEF49EE7AF898"
        ],
        "Label": "waited",
        "Title": "X-Trace Task",
        "Host": "pinky19.mpi-sws.org",
        "Duration": "242875",
        "HRT": 25491922367078184,
        "Operation": "waited",
        "Timestamp": "1556275562307.229248",
        "TenantClass": 0,
        "Source": "SocketIOWithTimeout.java:335",
        "ThreadID": 1,
        "ThreadName": "",
        "EventID": "C7304CC637EF8709",
        "ProcessID": 21035
      },
      {
        "Cycles": 0,
        "Agent": "Execution-Sleep",
        "ProcessName": "Data",
        "TaskID": "D4EC1574BFC9E7EE",
        "ParentEventID": [
          "CBD508D1CA7111D4"
        ],
        "Label": "waited",
        "Title": "X-Trace Task",
        "Host": "pinky19.mpi-sws.org",
        "Duration": "3972",
        "HRT": 25491922367125473,
        "Operation": "waited",
        "Timestamp": "1556275562307.268799",
        "TenantClass": 0,
        "Source": "SocketIOWithTimeout.java:335",
        "ThreadID": 9602,
        "ThreadName": "",
        "EventID": "3D8846D253B67793",
        "BaggageBytes": "[[248 5] [240 0] [0 212 236 21 116 191 201 231 238] [240 1] [0 203 213 8 209 202 113 17 212] [240 3] [0 2]]",
        "ProcessID": 2319
      },
      {
        "Cycles": 0,
        "Agent": "edu.brown.cs.systems.xtrace.logging.BaggageWrappers",
        "ProcessName": "Read",
        "TaskID": "D4EC1574BFC9E7EE",
        "ParentEventID": [
          "A16DD729577523D0",
          "C7304CC637EF8709"
        ],
        "Label": "Merged current baggage with other baggage",
        "Title": "X-Trace Task",
        "Host": "pinky19.mpi-sws.org",
        "HRT": 25491922367145915,
        "Operation": "join",
        "Timestamp": "1556275562307.297119",
        "TenantClass": 0,
        "Source": "RemoteBlockReader2.java:429",
        "ThreadID": 1,
        "ThreadName": "",
        "EventID": "02BCCC5631093F56",
        "ProcessID": 21035
      },
      {
        "Cycles": 0,
        "Agent": "edu.brown.cs.systems.xtrace.logging.BaggageWrappers",
        "ProcessName": "Read",
        "TaskID": "D4EC1574BFC9E7EE",
        "ParentEventID": [
          "02BCCC5631093F56",
          "CBD508D1CA7111D4"
        ],
        "Label": "Merged current baggage with other baggage",
        "Title": "X-Trace Task",
        "Host": "pinky19.mpi-sws.org",
        "HRT": 25491922367208034,
        "Operation": "join",
        "Timestamp": "1556275562307.359131",
        "TenantClass": 0,
        "Source": "PacketHeader.java:168",
        "ThreadID": 1,
        "ThreadName": "",
        "EventID": "A13D4153190CDC2C",
        "ProcessID": 21035
      },
      {
        "Cycles": 0,
        "Agent": "edu.brown.cs.systems.xtrace.logging.BaggageWrappers",
        "ProcessName": "Data",
        "TaskID": "D4EC1574BFC9E7EE",
        "ParentEventID": [
          "3D8846D253B67793"
        ],
        "Label": "Forking current baggage with Baggage.fork()",
        "Title": "X-Trace Task",
        "Host": "pinky19.mpi-sws.org",
        "HRT": 25491922367184132,
        "Operation": "fork",
        "Timestamp": "1556275562307.327393",
        "TenantClass": 0,
        "Source": "PacketHeader.java:95",
        "ThreadID": 9602,
        "ThreadName": "",
        "EventID": "5B975A72991DBF04",
        "BaggageBytes": "[[248 5] [240 0] [0 212 236 21 116 191 201 231 238] [240 1] [0 61 136 70 210 83 182 119 147] [240 3] [0 2]]",
        "ProcessID": 2319
      },
      {
        "Cycles": 0,
        "Agent": "edu.brown.cs.systems.xtrace.logging.BaggageWrappers",
        "ProcessName": "Read",
        "TaskID": "D4EC1574BFC9E7EE",
        "ParentEventID": [
          "5B975A72991DBF04",
          "A13D4153190CDC2C"
        ],
        "Label": "Merged current baggage with other baggage",
        "Title": "X-Trace Task",
        "Host": "pinky19.mpi-sws.org",
        "HRT": 25491922367260907,
        "Operation": "join",
        "Timestamp": "1556275562307.412109",
        "TenantClass": 0,
        "Source": "PacketHeader.java:168",
        "ThreadID": 1,
        "ThreadName": "",
        "EventID": "EF202D19E5FC7870",
        "ProcessID": 21035
      },
      {
        "Cycles": 0,
        "Agent": "Execution-Sleep",
        "ProcessName": "Data",
        "TaskID": "D4EC1574BFC9E7EE",
        "ParentEventID": [
          "5B975A72991DBF04"
        ],
        "Label": "waited",
        "Title": "X-Trace Task",
        "Host": "pinky19.mpi-sws.org",
        "Duration": "48521",
        "HRT": 25491922367311969,
        "Operation": "waited",
        "Timestamp": "1556275562307.455322",
        "TenantClass": 0,
        "Source": "SocketIOWithTimeout.java:335",
        "ThreadID": 9602,
        "ThreadName": "",
        "EventID": "2096284BD656A9E9",
        "BaggageBytes": "[[248 5] [240 0] [0 212 236 21 116 191 201 231 238] [240 1] [0 91 151 90 114 153 29 191 4] [240 3] [0 2]]",
        "ProcessID": 2319
      },
      {
        "Cycles": 0,
        "Agent": "edu.brown.cs.systems.xtrace.logging.BaggageWrappers",
        "ProcessName": "Read",
        "TaskID": "D4EC1574BFC9E7EE",
        "ParentEventID": [
          "EF202D19E5FC7870"
        ],
        "Label": "Forking current baggage with Baggage.fork()",
        "Title": "X-Trace Task",
        "Host": "pinky19.mpi-sws.org",
        "HRT": 25491922367269644,
        "Operation": "fork",
        "Timestamp": "1556275562307.420898",
        "TenantClass": 0,
        "Source": "RemoteBlockReader2.java:361",
        "ThreadID": 1,
        "ThreadName": "",
        "EventID": "693F412E18E02D29",
        "ProcessID": 21035
      },
      {
        "Cycles": 0,
        "Agent": "edu.brown.cs.systems.xtrace.logging.BaggageWrappers",
        "ProcessName": "Data",
        "TaskID": "D4EC1574BFC9E7EE",
        "ParentEventID": [
          "2096284BD656A9E9",
          "693F412E18E02D29"
        ],
        "Label": "Merged current baggage with other baggage",
        "Title": "X-Trace Task",
        "Host": "pinky19.mpi-sws.org",
        "HRT": 25491922367362654,
        "Operation": "join",
        "Timestamp": "1556275562307.505859",
        "TenantClass": 0,
        "Source": "DataXceiver.java:574",
        "ThreadID": 9602,
        "ThreadName": "",
        "EventID": "2AAE4D99B639704A",
        "BaggageBytes": "[[248 5] [240 0] [0 212 236 21 116 191 201 231 238] [240 1] [0 32 150 40 75 214 86 169 233] [0 105 63 65 46 24 224 45 41] [240 3] [0 2]]",
        "ProcessID": 2319
      },
      {
        "Cycles": 0,
        "Agent": "Execution-CPU",
        "ProcessName": "Data",
        "TaskID": "D4EC1574BFC9E7EE",
        "ParentEventID": [
          "2AAE4D99B639704A"
        ],
        "Label": "unset",
        "Title": "X-Trace Task",
        "Host": "pinky19.mpi-sws.org",
        "Duration": "463348",
        "HRT": 25491922367382842,
        "Operation": "unset",
        "Timestamp": "1556275562307.526123",
        "TenantClass": 0,
        "Source": "DataXceiver.java:261",
        "ThreadID": 9602,
        "ThreadName": "",
        "EventID": "82BA1FDB55491AA3",
        "BaggageBytes": "[[248 5] [240 0] [0 212 236 21 116 191 201 231 238] [240 1] [0 42 174 77 153 182 57 112 74] [240 3] [0 2]]",
        "ProcessID": 2319
      },
      {
        "Cycles": 0,
        "Agent": "edu.brown.cs.systems.retro.benchmarks.hdfs_client.Reader",
        "ProcessName": "Read",
        "TaskID": "D4EC1574BFC9E7EE",
        "ParentEventID": [
          "0"
        ],
        "Label": "Reading file",
        "Title": "X-Trace Task",
        "Host": "pinky19.mpi-sws.org",
        "HRT": 25491922365985539,
        "Timestamp": "1556275562306.136719",
        "TenantClass": 0,
        "ThreadID": 1,
        "ThreadName": "",
        "EventID": "497C6D18BD6DDE95",
        "ProcessID": 21035,
        "Tag": [
          "reader_1kb",
          "Read Size: 1024"
        ]
      }
    ]
  }
]