[
  {
    "id": "E065543094F6B3D1",
    "reports": [
      {
        "Cycles": 0,
        "Agent": "org.apache.hadoop.ipc.ProtobufRpcEngine",
        "ProcessName": "Read",
        "TaskID": "E065543094F6B3D1",
        "ParentEventID": [
          "329BEAD9F6D56896"
        ],
        "Label": "Invoking org.apache.hadoop.hdfs.protocol.ClientProtocol.getBlockLocations",
        "Title": "X-Trace Task",
        "Host": "pinky19.mpi-sws.org",
        "HRT": 26966761136067493,
        "Timestamp": "1557750401076.415771",
        "TenantClass": 0,
        "Source": "ProtobufRpcEngine.java:228",
        "ThreadID": 1,
        "ThreadName": "",
        "EventID": "51EFF33B28FFC629",
        "ProcessID": 2801
      },
      {
        "Cycles": 0,
        "Agent": "edu.brown.cs.systems.retro.benchmarks.hdfs_client.Reader",
        "ProcessName": "Read",
        "TaskID": "E065543094F6B3D1",
        "ParentEventID": [
          "7736109BABAA7D00"
        ],
        "Label": "Reading file",
        "Title": "X-Trace Task",
        "Host": "pinky19.mpi-sws.org",
        "HRT": 26966761136040887,
        "Timestamp": "1557750401076.389160",
        "TenantClass": 0,
        "ThreadID": 1,
        "ThreadName": "",
        "EventID": "329BEAD9F6D56896",
        "ProcessID": 2801
      },
      {
        "Cycles": 0,
        "Agent": "Execution-CPU",
        "ProcessName": "Read",
        "TaskID": "E065543094F6B3D1",
        "ParentEventID": [
          "51EFF33B28FFC629"
        ],
        "Label": "unset",
        "Title": "X-Trace Task",
        "Host": "pinky19.mpi-sws.org",
        "Duration": "22651620",
        "HRT": 26966761136088351,
        "Operation": "unset",
        "Timestamp": "1557750401076.436523",
        "TenantClass": 0,
        "Source": "Client.java:1027",
        "ThreadID": 1,
        "ThreadName": "",
        "EventID": "EDF98774D869C139",
        "ProcessID": 2801
      },
      {
        "Cycles": 0,
        "Agent": "Execution-CPU",
        "ProcessName": "Read",
        "TaskID": "E065543094F6B3D1",
        "ParentEventID": [
          "EDF98774D869C139"
        ],
        "Label": "set",
        "Title": "X-Trace Task",
        "Host": "pinky19.mpi-sws.org",
        "HRT": 26966761136113951,
        "Operation": "set",
        "Timestamp": "1557750401076.462158",
        "TenantClass": 0,
        "Source": "Client.java:1032",
        "ThreadID": 41,
        "ThreadName": "",
        "EventID": "C8B112B0457364DF",
        "ProcessID": 2801
      },
      {
        "Cycles": 0,
        "Agent": "edu.brown.cs.systems.xtrace.logging.BaggageWrappers",
        "ProcessName": "Read",
        "TaskID": "E065543094F6B3D1",
        "ParentEventID": [
          "C8B112B0457364DF"
        ],
        "Label": "Forking current baggage with Baggage.fork()",
        "Title": "X-Trace Task",
        "Host": "pinky19.mpi-sws.org",
        "HRT": 26966761136131717,
        "Operation": "fork",
        "Timestamp": "1557750401076.479980",
        "TenantClass": 0,
        "Source": "Client.java:1043",
        "ThreadID": 41,
        "ThreadName": "",
        "EventID": "3F1D8F6B9B36EB79",
        "ProcessID": 2801
      },
      {
        "Cycles": 0,
        "Agent": "Execution-CPU",
        "ProcessName": "Read",
        "TaskID": "E065543094F6B3D1",
        "ParentEventID": [
          "3F1D8F6B9B36EB79"
        ],
        "Label": "unset",
        "Title": "X-Trace Task",
        "Host": "pinky19.mpi-sws.org",
        "Duration": "76588",
        "HRT": 26966761136206039,
        "Operation": "unset",
        "Timestamp": "1557750401076.554199",
        "TenantClass": 0,
        "Source": "Client.java:1062",
        "ThreadID": 41,
        "ThreadName": "",
        "EventID": "E61DB21FA89C1B19",
        "ProcessID": 2801
      },
      {
        "Cycles": 0,
        "Agent": "Execution-CPU",
        "ProcessName": "Name",
        "TaskID": "E065543094F6B3D1",
        "ParentEventID": [
          "3F1D8F6B9B36EB79"
        ],
        "Label": "set",
        "Title": "X-Trace Task",
        "Host": "pinky19.mpi-sws.org",
        "HRT": 26966761136266250,
        "Operation": "set",
        "Timestamp": "1557750401076.622314",
        "TenantClass": 0,
        "Source": "Server.java:1840",
        "ThreadID": 48,
        "ThreadName": "",
        "EventID": "C1B4E7D344ABA4E2",
        "BaggageBytes": "[[248 5] [240 0] [0 224 101 84 48 148 246 179 209] [240 1] [0 63 29 143 107 155 54 235 121] [240 3] [0 2]]",
        "ProcessID": 2171
      },
      {
        "Cycles": 0,
        "Agent": "edu.brown.cs.systems.xtrace.logging.BaggageWrappers",
        "ProcessName": "Name",
        "TaskID": "E065543094F6B3D1",
        "ParentEventID": [
          "C1B4E7D344ABA4E2"
        ],
        "Label": "Forking current baggage with Baggage.fork()",
        "Title": "X-Trace Task",
        "Host": "pinky19.mpi-sws.org",
        "HRT": 26966761136296884,
        "Operation": "fork",
        "Timestamp": "1557750401076.652832",
        "TenantClass": 0,
        "Source": "Server.java:550",
        "ThreadID": 48,
        "ThreadName": "",
        "EventID": "F088795289D15E42",
        "BaggageBytes": "[[248 5] [240 0] [0 224 101 84 48 148 246 179 209] [240 1] [0 193 180 231 211 68 171 164 226] [240 3] [0 2]]",
        "ProcessID": 2171
      },
      {
        "Cycles": 0,
        "Agent": "Execution-CPU",
        "ProcessName": "Name",
        "TaskID": "E065543094F6B3D1",
        "ParentEventID": [
          "F088795289D15E42"
        ],
        "Label": "unset",
        "Title": "X-Trace Task",
        "Host": "pinky19.mpi-sws.org",
        "Duration": "26493",
        "HRT": 26966761136319313,
        "Operation": "unset",
        "Timestamp": "1557750401076.675293",
        "TenantClass": 0,
        "Source": "Server.java:1828",
        "ThreadID": 48,
        "ThreadName": "",
        "EventID": "A9B64B77607466BA",
        "BaggageBytes": "[[248 5] [240 0] [0 224 101 84 48 148 246 179 209] [240 1] [0 240 136 121 82 137 209 94 66] [240 3] [0 2]]",
        "ProcessID": 2171
      },
      {
        "Cycles": 0,
        "Agent": "Execution-CPU",
        "ProcessName": "Name",
        "TaskID": "E065543094F6B3D1",
        "ParentEventID": [
          "F088795289D15E42"
        ],
        "Label": "set",
        "Title": "X-Trace Task",
        "Host": "pinky19.mpi-sws.org",
        "HRT": 26966761136328780,
        "Operation": "set",
        "Timestamp": "1557750401076.684814",
        "TenantClass": 0,
        "Source": "Server.java:2071",
        "ThreadID": 56,
        "ThreadName": "",
        "EventID": "CCE183C5EB541569",
        "BaggageBytes": "[[248 5] [240 0] [0 224 101 84 48 148 246 179 209] [240 1] [0 240 136 121 82 137 209 94 66] [240 3] [0 2]]",
        "ProcessID": 2171
      },
      {
        "Cycles": 0,
        "Agent": "Execution-CPU",
        "ProcessName": "Read",
        "TaskID": "E065543094F6B3D1",
        "ParentEventID": [
          "E61DB21FA89C1B19"
        ],
        "Label": "set",
        "Title": "X-Trace Task",
        "Host": "pinky19.mpi-sws.org",
        "HRT": 26966761136227116,
        "Operation": "set",
        "Timestamp": "1557750401076.575195",
        "TenantClass": 0,
        "Source": "Client.java:1104",
        "ThreadID": 1,
        "ThreadName": "",
        "EventID": "CFD081B20B7190C0",
        "ProcessID": 2801
      },
      {
        "Cycles": 0,
        "Agent": "org.apache.hadoop.ipc.Server",
        "ProcessName": "Name",
        "TaskID": "E065543094F6B3D1",
        "ParentEventID": [
          "CCE183C5EB541569"
        ],
        "Label": "getBlockLocations in org.apache.hadoop.hdfs.protocol.ClientProtocol",
        "Title": "X-Trace Task",
        "Host": "pinky19.mpi-sws.org",
        "HRT": 26966761136366218,
        "Timestamp": "1557750401076.722168",
        "TenantClass": 0,
        "Source": "ProtobufRpcEngine.java:601",
        "ThreadID": 56,
        "ThreadName": "",
        "EventID": "FA87B87DC4D789C6",
        "BaggageBytes": "[[248 5] [240 0] [0 224 101 84 48 148 246 179 209] [240 1] [0 204 225 131 197 235 84 21 105] [240 3] [0 2]]",
        "ProcessID": 2171
      },
      {
        "Cycles": 0,
        "Agent": "edu.brown.cs.systems.xtrace.logging.BaggageWrappers",
        "ProcessName": "Name",
        "TaskID": "E065543094F6B3D1",
        "ParentEventID": [
          "6FDF68E59305EF42"
        ],
        "Label": "Forking current baggage with Baggage.fork()",
        "Title": "X-Trace Task",
        "Host": "pinky19.mpi-sws.org",
        "HRT": 26966761136460265,
        "Operation": "fork",
        "Timestamp": "1557750401076.816162",
        "TenantClass": 0,
        "Source": "Server.java:2398",
        "ThreadID": 56,
        "ThreadName": "",
        "EventID": "002672334C2AC419",
        "BaggageBytes": "[[248 5] [240 0] [0 224 101 84 48 148 246 179 209] [240 1] [0 111 223 104 229 147 5 239 66] [240 3] [0 2]]",
        "ProcessID": 2171
      },
      {
        "Cycles": 0,
        "Agent": "Execution-CPU",
        "ProcessName": "Name",
        "TaskID": "E065543094F6B3D1",
        "ParentEventID": [
          "002672334C2AC419"
        ],
        "Label": "unset",
        "Title": "X-Trace Task",
        "Host": "pinky19.mpi-sws.org",
        "Duration": "210381",
        "HRT": 26966761136564269,
        "Operation": "unset",
        "Timestamp": "1557750401076.920166",
        "TenantClass": 0,
        "Source": "Server.java:1058",
        "ThreadID": 56,
        "ThreadName": "",
        "EventID": "CE1D1933DC06DC4D",
        "BaggageBytes": "[[248 5] [240 0] [0 224 101 84 48 148 246 179 209] [240 1] [0 0 38 114 51 76 42 196 25] [240 3] [0 2]]",
        "ProcessID": 2171
      },
      {
        "Cycles": 0,
        "Agent": "org.apache.hadoop.hdfs.server.namenode.FSNamesystem.audit",
        "ProcessName": "Name",
        "TaskID": "E065543094F6B3D1",
        "ParentEventID": [
          "FA87B87DC4D789C6"
        ],
        "Label": "allowed=true\tugi=plascas (auth:SIMPLE)\tip=/139.19.171.63\tcmd=open\tsrc=/ds/AyXzT06dIixO0kfo\tdst=null\tperm=null\tproto=rpc",
        "Title": "X-Trace Task",
        "Host": "pinky19.mpi-sws.org",
        "HRT": 26966761136413295,
        "Timestamp": "1557750401076.769287",
        "TenantClass": 0,
        "Source": "FSNamesystem.java:8313",
        "ThreadID": 56,
        "ThreadName": "",
        "EventID": "6FDF68E59305EF42",
        "BaggageBytes": "[[248 5] [240 0] [0 224 101 84 48 148 246 179 209] [240 1] [0 250 135 184 125 196 215 137 198] [240 3] [0 2]]",
        "ProcessID": 2171
      },
      {
        "Cycles": 0,
        "Agent": "Execution-CPU",
        "ProcessName": "Read",
        "TaskID": "E065543094F6B3D1",
        "ParentEventID": [
          "002672334C2AC419"
        ],
        "Label": "set",
        "Title": "X-Trace Task",
        "Host": "pinky19.mpi-sws.org",
        "HRT": 26966761136610336,
        "Operation": "set",
        "Timestamp": "1557750401076.958496",
        "TenantClass": 0,
        "Source": "Client.java:302",
        "ThreadID": 40,
        "ThreadName": "",
        "EventID": "9D0CCB420C28FFB6",
        "ProcessID": 2801
      },
      {
        "Cycles": 0,
        "Agent": "Execution-Sleep",
        "ProcessName": "Read",
        "TaskID": "E065543094F6B3D1",
        "ParentEventID": [
          "CFD081B20B7190C0"
        ],
        "Label": "waited",
        "Title": "X-Trace Task",
        "Host": "pinky19.mpi-sws.org",
        "Duration": "411280",
        "HRT": 26966761136647227,
        "Operation": "waited",
        "Timestamp": "1557750401076.995361",
        "TenantClass": 0,
        "Source": "Client.java:1537",
        "ThreadID": 1,
        "ThreadName": "",
        "EventID": "4BFDFF1E181919F8",
        "ProcessID": 2801
      },
      {
        "Cycles": 0,
        "Agent": "Execution-CPU",
        "ProcessName": "Read",
        "TaskID": "E065543094F6B3D1",
        "ParentEventID": [
          "9D0CCB420C28FFB6"
        ],
        "Label": "unset",
        "Title": "X-Trace Task",
        "Host": "pinky19.mpi-sws.org",
        "Duration": "5345",
        "HRT": 26966761136629798,
        "Operation": "unset",
        "Timestamp": "1557750401076.978027",
        "TenantClass": 0,
        "Source": "Client.java:1168",
        "ThreadID": 40,
        "ThreadName": "",
        "EventID": "64E160DF95D25F73",
        "ProcessID": 2801
      },
      {
        "Cycles": 0,
        "Agent": "edu.brown.cs.systems.xtrace.logging.BaggageWrappers",
        "ProcessName": "Read",
        "TaskID": "E065543094F6B3D1",
        "ParentEventID": [
          "4BFDFF1E181919F8",
          "64E160DF95D25F73"
        ],
        "Label": "Merged current baggage with other baggage",
        "Title": "X-Trace Task",
        "Host": "pinky19.mpi-sws.org",
        "HRT": 26966761136666062,
        "Operation": "join",
        "Timestamp": "1557750401077.014160",
        "TenantClass": 0,
        "Source": "Client.java:1545",
        "ThreadID": 1,
        "ThreadName": "",
        "EventID": "7E6D1B9FA1F7558B",
        "ProcessID": 2801
      },
      {
        "Cycles": 0,
        "Agent": "Execution-Sleep",
        "ProcessName": "Read",
        "TaskID": "E065543094F6B3D1",
        "ParentEventID": [
          "B9F74F17490CC033"
        ],
        "Label": "waited",
        "Title": "X-Trace Task",
        "Host": "pinky19.mpi-sws.org",
        "Duration": "177093",
        "HRT": 26966761136953937,
        "Operation": "waited",
        "Timestamp": "1557750401077.302246",
        "TenantClass": 0,
        "Source": "SocketIOWithTimeout.java:335",
        "ThreadID": 1,
        "ThreadName": "",
        "EventID": "E989974E4AF6A064",
        "ProcessID": 2801
      },
      {
        "Cycles": 0,
        "Agent": "org.apache.hadoop.ipc.ProtobufRpcEngine",
        "ProcessName": "Read",
        "TaskID": "E065543094F6B3D1",
        "ParentEventID": [
          "7E6D1B9FA1F7558B"
        ],
        "Label": "org.apache.hadoop.hdfs.protocol.ClientProtocol.getBlockLocations completed",
        "Title": "X-Trace Task",
        "Host": "pinky19.mpi-sws.org",
        "HRT": 26966761136703404,
        "Timestamp": "1557750401077.051514",
        "TenantClass": 0,
        "Source": "ProtobufRpcEngine.java:275",
        "ThreadID": 1,
        "ThreadName": "",
        "EventID": "B9F74F17490CC033",
        "ProcessID": 2801
      },
      {
        "Cycles": 0,
        "Agent": "edu.brown.cs.systems.xtrace.logging.BaggageWrappers",
        "ProcessName": "Read",
        "TaskID": "E065543094F6B3D1",
        "ParentEventID": [
          "E989974E4AF6A064"
        ],
        "Label": "Forking current baggage with Baggage.fork()",
        "Title": "X-Trace Task",
        "Host": "pinky19.mpi-sws.org",
        "HRT": 26966761136995780,
        "Operation": "fork",
        "Timestamp": "1557750401077.343994",
        "TenantClass": 0,
        "Source": "DataTransferProtoUtil.java:94",
        "ThreadID": 1,
        "ThreadName": "",
        "EventID": "D196E22C60C1ADC1",
        "ProcessID": 2801
      },
      {
        "Cycles": 0,
        "Agent": "edu.brown.cs.systems.xtrace.logging.XTraceInit",
        "ProcessName": "Data",
        "TaskID": "E065543094F6B3D1",
        "ParentEventID": [
          "F27D3DBAB302CD6B"
        ],
        "Label": "Thread.setName: DataXceiver for client DFSClient_NONMAPREDUCE_310321604_1 at /139.19.171.63:56466 [Sending block BP-1633380353-139.19.171.63-1554193446451:blk_1073756883_16059]",
        "Title": "X-Trace Task",
        "Host": "pinky20.mpi-sws.org",
        "HRT": 6569965496718270,
        "Timestamp": "1557750401077.879639",
        "TenantClass": 0,
        "Source": "DataXceiver.java:168",
        "ThreadID": 15281,
        "ThreadName": "",
        "EventID": "0ACA6825981CE2BF",
        "BaggageBytes": "[[248 5] [240 0] [0 224 101 84 48 148 246 179 209] [240 1] [0 242 125 61 186 179 2 205 107] [240 3] [0 2]]",
        "ProcessID": 13111
      },
      {
        "Cycles": 0,
        "Agent": "Execution-CPU",
        "ProcessName": "Data",
        "TaskID": "E065543094F6B3D1",
        "ParentEventID": [
          "D196E22C60C1ADC1"
        ],
        "Label": "set",
        "Title": "X-Trace Task",
        "Host": "pinky20.mpi-sws.org",
        "HRT": 6569965496612776,
        "Operation": "set",
        "Timestamp": "1557750401077.774170",
        "TenantClass": 0,
        "Source": "Receiver.java:117",
        "ThreadID": 15281,
        "ThreadName": "",
        "EventID": "F27D3DBAB302CD6B",
        "BaggageBytes": "[[248 5] [240 0] [0 224 101 84 48 148 246 179 209] [240 1] [0 209 150 226 44 96 193 173 193] [240 3] [0 2]]",
        "ProcessID": 13111
      },
      {
        "Cycles": 0,
        "Agent": "edu.brown.cs.systems.xtrace.logging.BaggageWrappers",
        "ProcessName": "Data",
        "TaskID": "E065543094F6B3D1",
        "ParentEventID": [
          "0ACA6825981CE2BF"
        ],
        "Label": "Forking current baggage with Baggage.fork()",
        "Title": "X-Trace Task",
        "Host": "pinky20.mpi-sws.org",
        "HRT": 6569965496931683,
        "Operation": "fork",
        "Timestamp": "1557750401078.093018",
        "TenantClass": 0,
        "Source": "DataXceiver.java:1257",
        "ThreadID": 15281,
        "ThreadName": "",
        "EventID": "FFAA6DAF535E483C",
        "BaggageBytes": "[[248 5] [240 0] [0 224 101 84 48 148 246 179 209] [240 1] [0 10 202 104 37 152 28 226 191] [240 3] [0 2]]",
        "ProcessID": 13111
      },
      {
        "Cycles": 0,
        "Agent": "Execution-Sleep",
        "ProcessName": "Read",
        "TaskID": "E065543094F6B3D1",
        "ParentEventID": [
          "D196E22C60C1ADC1"
        ],
        "Label": "waited",
        "Title": "X-Trace Task",
        "Host": "pinky19.mpi-sws.org",
        "Duration": "923734",
        "HRT": 26966761137983422,
        "Operation": "waited",
        "Timestamp": "1557750401078.331543",
        "TenantClass": 0,
        "Source": "SocketIOWithTimeout.java:335",
        "ThreadID": 1,
        "ThreadName": "",
        "EventID": "F5C440DB269F25D5",
        "ProcessID": 2801
      },
      {
        "Cycles": 0,
        "Agent": "edu.brown.cs.systems.xtrace.logging.BaggageWrappers",
        "ProcessName": "Data",
        "TaskID": "E065543094F6B3D1",
        "ParentEventID": [
          "FFAA6DAF535E483C"
        ],
        "Label": "Forking current baggage with Baggage.fork()",
        "Title": "X-Trace Task",
        "Host": "pinky20.mpi-sws.org",
        "HRT": 6569965497090437,
        "Operation": "fork",
        "Timestamp": "1557750401078.251709",
        "TenantClass": 0,
        "Source": "PacketHeader.java:95",
        "ThreadID": 15281,
        "ThreadName": "",
        "EventID": "A29EBD5E6EF7FB5F",
        "BaggageBytes": "[[248 5] [240 0] [0 224 101 84 48 148 246 179 209] [240 1] [0 255 170 109 175 83 94 72 60] [240 3] [0 2]]",
        "ProcessID": 13111
      },
      {
        "Cycles": 0,
        "Agent": "edu.brown.cs.systems.xtrace.logging.BaggageWrappers",
        "ProcessName": "Read",
        "TaskID": "E065543094F6B3D1",
        "ParentEventID": [
          "F5C440DB269F25D5",
          "FFAA6DAF535E483C"
        ],
        "Label": "Merged current baggage with other baggage",
        "Title": "X-Trace Task",
        "Host": "pinky19.mpi-sws.org",
        "HRT": 26966761138053878,
        "Operation": "join",
        "Timestamp": "1557750401078.402100",
        "TenantClass": 0,
        "Source": "RemoteBlockReader2.java:429",
        "ThreadID": 1,
        "ThreadName": "",
        "EventID": "29255A7A1C660438",
        "ProcessID": 2801
      },
      {
        "Cycles": 0,
        "Agent": "Execution-Sleep",
        "ProcessName": "Read",
        "TaskID": "E065543094F6B3D1",
        "ParentEventID": [
          "29255A7A1C660438"
        ],
        "Label": "waited",
        "Title": "X-Trace Task",
        "Host": "pinky19.mpi-sws.org",
        "Duration": "21800",
        "HRT": 26966761138117134,
        "Operation": "waited",
        "Timestamp": "1557750401078.465332",
        "TenantClass": 0,
        "Source": "SocketIOWithTimeout.java:335",
        "ThreadID": 1,
        "ThreadName": "",
        "EventID": "DD7E47F54F100A80",
        "ProcessID": 2801
      },
      {
        "Cycles": 0,
        "Agent": "Execution-Sleep",
        "ProcessName": "Data",
        "TaskID": "E065543094F6B3D1",
        "ParentEventID": [
          "A29EBD5E6EF7FB5F"
        ],
        "Label": "waited",
        "Title": "X-Trace Task",
        "Host": "pinky20.mpi-sws.org",
        "Duration": "13830",
        "HRT": 6569965497247117,
        "Operation": "waited",
        "Timestamp": "1557750401078.408447",
        "TenantClass": 0,
        "Source": "SocketIOWithTimeout.java:335",
        "ThreadID": 15281,
        "ThreadName": "",
        "EventID": "5294AD761838801A",
        "BaggageBytes": "[[248 5] [240 0] [0 224 101 84 48 148 246 179 209] [240 1] [0 162 158 189 94 110 247 251 95] [240 3] [0 2]]",
        "ProcessID": 13111
      },
      {
        "Cycles": 0,
        "Agent": "Execution-Sleep",
        "ProcessName": "Read",
        "TaskID": "E065543094F6B3D1",
        "ParentEventID": [
          "DD7E47F54F100A80"
        ],
        "Label": "waited",
        "Title": "X-Trace Task",
        "Host": "pinky19.mpi-sws.org",
        "Duration": "335426",
        "HRT": 26966761138505932,
        "Operation": "waited",
        "Timestamp": "1557750401078.854004",
        "TenantClass": 0,
        "Source": "SocketIOWithTimeout.java:335",
        "ThreadID": 1,
        "ThreadName": "",
        "EventID": "E8397F047E7DABDE",
        "ProcessID": 2801
      },
      {
        "Cycles": 0,
        "Agent": "edu.brown.cs.systems.xtrace.logging.BaggageWrappers",
        "ProcessName": "Data",
        "TaskID": "E065543094F6B3D1",
        "ParentEventID": [
          "5294AD761838801A"
        ],
        "Label": "Forking current baggage with Baggage.fork()",
        "Title": "X-Trace Task",
        "Host": "pinky20.mpi-sws.org",
        "HRT": 6569965497425131,
        "Operation": "fork",
        "Timestamp": "1557750401078.586426",
        "TenantClass": 0,
        "Source": "PacketHeader.java:95",
        "ThreadID": 15281,
        "ThreadName": "",
        "EventID": "AF5120DB500A9AFB",
        "BaggageBytes": "[[248 5] [240 0] [0 224 101 84 48 148 246 179 209] [240 1] [0 82 148 173 118 24 56 128 26] [240 3] [0 2]]",
        "ProcessID": 13111
      },
      {
        "Cycles": 0,
        "Agent": "Execution-Sleep",
        "ProcessName": "Read",
        "TaskID": "E065543094F6B3D1",
        "ParentEventID": [
          "E8397F047E7DABDE"
        ],
        "Label": "waited",
        "Title": "X-Trace Task",
        "Host": "pinky19.mpi-sws.org",
        "Duration": "238083",
        "HRT": 26966761138795343,
        "Operation": "waited",
        "Timestamp": "1557750401079.143555",
        "TenantClass": 0,
        "Source": "SocketIOWithTimeout.java:335",
        "ThreadID": 1,
        "ThreadName": "",
        "EventID": "D42EE8646311C96A",
        "ProcessID": 2801
      },
      {
        "Cycles": 0,
        "Agent": "edu.brown.cs.systems.xtrace.logging.BaggageWrappers",
        "ProcessName": "Read",
        "TaskID": "E065543094F6B3D1",
        "ParentEventID": [
          "0D463DB655D8C75C",
          "A29EBD5E6EF7FB5F"
        ],
        "Label": "Merged current baggage with other baggage",
        "Title": "X-Trace Task",
        "Host": "pinky19.mpi-sws.org",
        "HRT": 26966761139072080,
        "Operation": "join",
        "Timestamp": "1557750401079.420166",
        "TenantClass": 0,
        "Source": "PacketHeader.java:168",
        "ThreadID": 1,
        "ThreadName": "",
        "EventID": "AB3665B77530B0CD",
        "ProcessID": 2801
      },
      {
        "Cycles": 0,
        "Agent": "Execution-Sleep",
        "ProcessName": "Read",
        "TaskID": "E065543094F6B3D1",
        "ParentEventID": [
          "D42EE8646311C96A"
        ],
        "Label": "waited",
        "Title": "X-Trace Task",
        "Host": "pinky19.mpi-sws.org",
        "Duration": "143134",
        "HRT": 26966761139000541,
        "Operation": "waited",
        "Timestamp": "1557750401079.348633",
        "TenantClass": 0,
        "Source": "SocketIOWithTimeout.java:335",
        "ThreadID": 1,
        "ThreadName": "",
        "EventID": "0D463DB655D8C75C",
        "ProcessID": 2801
      },
      {
        "Cycles": 0,
        "Agent": "edu.brown.cs.systems.xtrace.logging.BaggageWrappers",
        "ProcessName": "Read",
        "TaskID": "E065543094F6B3D1",
        "ParentEventID": [
          "AB3665B77530B0CD",
          "AF5120DB500A9AFB"
        ],
        "Label": "Merged current baggage with other baggage",
        "Title": "X-Trace Task",
        "Host": "pinky19.mpi-sws.org",
        "HRT": 26966761139165960,
        "Operation": "join",
        "Timestamp": "1557750401079.514160",
        "TenantClass": 0,
        "Source": "PacketHeader.java:168",
        "ThreadID": 1,
        "ThreadName": "",
        "EventID": "F37849A737D12EB2",
        "ProcessID": 2801
      },
      {
        "Cycles": 0,
        "Agent": "edu.brown.cs.systems.xtrace.logging.BaggageWrappers",
        "ProcessName": "Read",
        "TaskID": "E065543094F6B3D1",
        "ParentEventID": [
          "8B729D1EC141D82D"
        ],
        "Label": "Forking current baggage with Baggage.fork()",
        "Title": "X-Trace Task",
        "Host": "pinky19.mpi-sws.org",
        "HRT": 26966761139226752,
        "Operation": "fork",
        "Timestamp": "1557750401079.574951",
        "TenantClass": 0,
        "Source": "DataTransferProtoUtil.java:94",
        "ThreadID": 1,
        "ThreadName": "",
        "EventID": "43D8D99E7CF0256B",
        "ProcessID": 2801
      },
      {
        "Cycles": 0,
        "Agent": "edu.brown.cs.systems.xtrace.logging.BaggageWrappers",
        "ProcessName": "Read",
        "TaskID": "E065543094F6B3D1",
        "ParentEventID": [
          "F37849A737D12EB2"
        ],
        "Label": "Forking current baggage with Baggage.fork()",
        "Title": "X-Trace Task",
        "Host": "pinky19.mpi-sws.org",
        "HRT": 26966761139174523,
        "Operation": "fork",
        "Timestamp": "1557750401079.522705",
        "TenantClass": 0,
        "Source": "RemoteBlockReader2.java:361",
        "ThreadID": 1,
        "ThreadName": "",
        "EventID": "8B729D1EC141D82D",
        "ProcessID": 2801
      },
      {
        "Cycles": 0,
        "Agent": "Execution-Sleep",
        "ProcessName": "Data",
        "TaskID": "E065543094F6B3D1",
        "ParentEventID": [
          "AF5120DB500A9AFB"
        ],
        "Label": "waited",
        "Title": "X-Trace Task",
        "Host": "pinky20.mpi-sws.org",
        "Duration": "784331",
        "HRT": 6569965498401972,
        "Operation": "waited",
        "Timestamp": "1557750401079.563232",
        "TenantClass": 0,
        "Source": "SocketIOWithTimeout.java:335",
        "ThreadID": 15281,
        "ThreadName": "",
        "EventID": "65898A115F012810",
        "BaggageBytes": "[[248 5] [240 0] [0 224 101 84 48 148 246 179 209] [240 1] [0 175 81 32 219 80 10 154 251] [240 3] [0 2]]",
        "ProcessID": 13111
      },
      {
        "Cycles": 0,
        "Agent": "edu.brown.cs.systems.xtrace.logging.BaggageWrappers",
        "ProcessName": "Data",
        "TaskID": "E065543094F6B3D1",
        "ParentEventID": [
          "65898A115F012810",
          "8B729D1EC141D82D"
        ],
        "Label": "Merged current baggage with other baggage",
        "Title": "X-Trace Task",
        "Host": "pinky20.mpi-sws.org",
        "HRT": 6569965498641932,
        "Operation": "join",
        "Timestamp": "1557750401079.803223",
        "TenantClass": 0,
        "Source": "DataXceiver.java:574",
        "ThreadID": 15281,
        "ThreadName": "",
        "EventID": "EA1FF8B02C431D4D",
        "BaggageBytes": "[[248 5] [240 0] [0 224 101 84 48 148 246 179 209] [240 1] [0 139 114 157 30 193 65 216 45] [0 101 137 138 17 95 1 40 16] [240 3] [0 2]]",
        "ProcessID": 13111
      },
      {
        "Cycles": 0,
        "Agent": "Execution-CPU",
        "ProcessName": "Data",
        "TaskID": "E065543094F6B3D1",
        "ParentEventID": [
          "EA1FF8B02C431D4D"
        ],
        "Label": "unset",
        "Title": "X-Trace Task",
        "Host": "pinky20.mpi-sws.org",
        "Duration": "2043742",
        "HRT": 6569965498727992,
        "Operation": "unset",
        "Timestamp": "1557750401079.889404",
        "TenantClass": 0,
        "Source": "DataXceiver.java:261",
        "ThreadID": 15281,
        "ThreadName": "",
        "EventID": "AA872C7839FC9883",
        "BaggageBytes": "[[248 5] [240 0] [0 224 101 84 48 148 246 179 209] [240 1] [0 234 31 248 176 44 67 29 77] [240 3] [0 2]]",
        "ProcessID": 13111
      },
      {
        "Cycles": 0,
        "Agent": "edu.brown.cs.systems.xtrace.logging.XTraceInit",
        "ProcessName": "Data",
        "TaskID": "E065543094F6B3D1",
        "ParentEventID": [
          "2B29417230B52C28"
        ],
        "Label": "Thread.setName: DataXceiver for client DFSClient_NONMAPREDUCE_310321604_1 at /139.19.171.63:56466 [Sending block BP-1633380353-139.19.171.63-1554193446451:blk_1073756883_16059]",
        "Title": "X-Trace Task",
        "Host": "pinky20.mpi-sws.org",
        "HRT": 6569965498902032,
        "Timestamp": "1557750401080.063477",
        "TenantClass": 0,
        "Source": "DataXceiver.java:168",
        "ThreadID": 15281,
        "ThreadName": "",
        "EventID": "96397ABD4F014383",
        "BaggageBytes": "[[248 5] [240 0] [0 224 101 84 48 148 246 179 209] [240 1] [0 43 41 65 114 48 181 44 40] [240 3] [0 2]]",
        "ProcessID": 13111
      },
      {
        "Cycles": 0,
        "Agent": "Execution-CPU",
        "ProcessName": "Data",
        "TaskID": "E065543094F6B3D1",
        "ParentEventID": [
          "43D8D99E7CF0256B"
        ],
        "Label": "set",
        "Title": "X-Trace Task",
        "Host": "pinky20.mpi-sws.org",
        "HRT": 6569965498803929,
        "Operation": "set",
        "Timestamp": "1557750401079.965332",
        "TenantClass": 0,
        "Source": "Receiver.java:117",
        "ThreadID": 15281,
        "ThreadName": "",
        "EventID": "2B29417230B52C28",
        "BaggageBytes": "[[248 5] [240 0] [0 224 101 84 48 148 246 179 209] [240 1] [0 67 216 217 158 124 240 37 107] [240 3] [0 2]]",
        "ProcessID": 13111
      },
      {
        "Cycles": 0,
        "Agent": "edu.brown.cs.systems.xtrace.logging.BaggageWrappers",
        "ProcessName": "Data",
        "TaskID": "E065543094F6B3D1",
        "ParentEventID": [
          "96397ABD4F014383"
        ],
        "Label": "Forking current baggage with Baggage.fork()",
        "Title": "X-Trace Task",
        "Host": "pinky20.mpi-sws.org",
        "HRT": 6569965499132156,
        "Operation": "fork",
        "Timestamp": "1557750401080.293457",
        "TenantClass": 0,
        "Source": "DataXceiver.java:1257",
        "ThreadID": 15281,
        "ThreadName": "",
        "EventID": "8C088DFA3859BDF0",
        "BaggageBytes": "[[248 5] [240 0] [0 224 101 84 48 148 246 179 209] [240 1] [0 150 57 122 189 79 1 67 131] [240 3] [0 2]]",
        "ProcessID": 13111
      },
      {
        "Cycles": 0,
        "Agent": "edu.brown.cs.systems.xtrace.logging.BaggageWrappers",
        "ProcessName": "Read",
        "TaskID": "E065543094F6B3D1",
        "ParentEventID": [
          "8C088DFA3859BDF0",
          "79705199A8F8E3A8"
        ],
        "Label": "Merged current baggage with other baggage",
        "Title": "X-Trace Task",
        "Host": "pinky19.mpi-sws.org",
        "HRT": 26966761140225605,
        "Operation": "join",
        "Timestamp": "1557750401080.573730",
        "TenantClass": 0,
        "Source": "RemoteBlockReader2.java:429",
        "ThreadID": 1,
        "ThreadName": "",
        "EventID": "F7FF4AD7037CC011",
        "ProcessID": 2801
      },
      {
        "Cycles": 0,
        "Agent": "Execution-Sleep",
        "ProcessName": "Read",
        "TaskID": "E065543094F6B3D1",
        "ParentEventID": [
          "43D8D99E7CF0256B"
        ],
        "Label": "waited",
        "Title": "X-Trace Task",
        "Host": "pinky19.mpi-sws.org",
        "Duration": "886994",
        "HRT": 26966761140173473,
        "Operation": "waited",
        "Timestamp": "1557750401080.521729",
        "TenantClass": 0,
        "Source": "SocketIOWithTimeout.java:335",
        "ThreadID": 1,
        "ThreadName": "",
        "EventID": "79705199A8F8E3A8",
        "ProcessID": 2801
      },
      {
        "Cycles": 0,
        "Agent": "Execution-Sleep",
        "ProcessName": "Read",
        "TaskID": "E065543094F6B3D1",
        "ParentEventID": [
          "F7FF4AD7037CC011"
        ],
        "Label": "waited",
        "Title": "X-Trace Task",
        "Host": "pinky19.mpi-sws.org",
        "Duration": "76686",
        "HRT": 26966761140337102,
        "Operation": "waited",
        "Timestamp": "1557750401080.685303",
        "TenantClass": 0,
        "Source": "SocketIOWithTimeout.java:335",
        "ThreadID": 1,
        "ThreadName": "",
        "EventID": "3A229652ABC62892",
        "ProcessID": 2801
      },
      {
        "Cycles": 0,
        "Agent": "edu.brown.cs.systems.xtrace.logging.BaggageWrappers",
        "ProcessName": "Data",
        "TaskID": "E065543094F6B3D1",
        "ParentEventID": [
          "8C088DFA3859BDF0"
        ],
        "Label": "Forking current baggage with Baggage.fork()",
        "Title": "X-Trace Task",
        "Host": "pinky20.mpi-sws.org",
        "HRT": 6569965499315696,
        "Operation": "fork",
        "Timestamp": "1557750401080.477051",
        "TenantClass": 0,
        "Source": "PacketHeader.java:95",
        "ThreadID": 15281,
        "ThreadName": "",
        "EventID": "B845A770FAA79A63",
        "BaggageBytes": "[[248 5] [240 0] [0 224 101 84 48 148 246 179 209] [240 1] [0 140 8 141 250 56 89 189 240] [240 3] [0 2]]",
        "ProcessID": 13111
      },
      {
        "Cycles": 0,
        "Agent": "Execution-Sleep",
        "ProcessName": "Data",
        "TaskID": "E065543094F6B3D1",
        "ParentEventID": [
          "B845A770FAA79A63"
        ],
        "Label": "waited",
        "Title": "X-Trace Task",
        "Host": "pinky20.mpi-sws.org",
        "Duration": "11940",
        "HRT": 6569965499478986,
        "Operation": "waited",
        "Timestamp": "1557750401080.640381",
        "TenantClass": 0,
        "Source": "SocketIOWithTimeout.java:335",
        "ThreadID": 15281,
        "ThreadName": "",
        "EventID": "67EEBF69412C074C",
        "BaggageBytes": "[[248 5] [240 0] [0 224 101 84 48 148 246 179 209] [240 1] [0 184 69 167 112 250 167 154 99] [240 3] [0 2]]",
        "ProcessID": 13111
      },
      {
        "Cycles": 0,
        "Agent": "Execution-Sleep",
        "ProcessName": "Read",
        "TaskID": "E065543094F6B3D1",
        "ParentEventID": [
          "3A229652ABC62892"
        ],
        "Label": "waited",
        "Title": "X-Trace Task",
        "Host": "pinky19.mpi-sws.org",
        "Duration": "356722",
        "HRT": 26966761140771792,
        "Operation": "waited",
        "Timestamp": "1557750401081.119873",
        "TenantClass": 0,
        "Source": "SocketIOWithTimeout.java:335",
        "ThreadID": 1,
        "ThreadName": "",
        "EventID": "88F3AC074E86ACE2",
        "ProcessID": 2801
      },
      {
        "Cycles": 0,
        "Agent": "edu.brown.cs.systems.xtrace.logging.BaggageWrappers",
        "ProcessName": "Data",
        "TaskID": "E065543094F6B3D1",
        "ParentEventID": [
          "67EEBF69412C074C"
        ],
        "Label": "Forking current baggage with Baggage.fork()",
        "Title": "X-Trace Task",
        "Host": "pinky20.mpi-sws.org",
        "HRT": 6569965499711027,
        "Operation": "fork",
        "Timestamp": "1557750401080.872314",
        "TenantClass": 0,
        "Source": "PacketHeader.java:95",
        "ThreadID": 15281,
        "ThreadName": "",
        "EventID": "83B4D345AE1A388B",
        "BaggageBytes": "[[248 5] [240 0] [0 224 101 84 48 148 246 179 209] [240 1] [0 103 238 191 105 65 44 7 76] [240 3] [0 2]]",
        "ProcessID": 13111
      },
      {
        "Cycles": 0,
        "Agent": "Execution-Sleep",
        "ProcessName": "Read",
        "TaskID": "E065543094F6B3D1",
        "ParentEventID": [
          "88F3AC074E86ACE2"
        ],
        "Label": "waited",
        "Title": "X-Trace Task",
        "Host": "pinky19.mpi-sws.org",
        "Duration": "162772",
        "HRT": 26966761140979602,
        "Operation": "waited",
        "Timestamp": "1557750401081.327881",
        "TenantClass": 0,
        "Source": "SocketIOWithTimeout.java:335",
        "ThreadID": 1,
        "ThreadName": "",
        "EventID": "58BBFB48619A0741",
        "ProcessID": 2801
      },
      {
        "Cycles": 0,
        "Agent": "Execution-Sleep",
        "ProcessName": "Data",
        "TaskID": "E065543094F6B3D1",
        "ParentEventID": [
          "83B4D345AE1A388B"
        ],
        "Label": "waited",
        "Title": "X-Trace Task",
        "Host": "pinky20.mpi-sws.org",
        "Duration": "159277",
        "HRT": 6569965499988337,
        "Operation": "waited",
        "Timestamp": "1557750401081.149658",
        "TenantClass": 0,
        "Source": "SocketIOWithTimeout.java:335",
        "ThreadID": 15281,
        "ThreadName": "",
        "EventID": "A72EB96C27B75419",
        "BaggageBytes": "[[248 5] [240 0] [0 224 101 84 48 148 246 179 209] [240 1] [0 131 180 211 69 174 26 56 139] [240 3] [0 2]]",
        "ProcessID": 13111
      },
      {
        "Cycles": 0,
        "Agent": "Execution-Sleep",
        "ProcessName": "Read",
        "TaskID": "E065543094F6B3D1",
        "ParentEventID": [
          "58BBFB48619A0741"
        ],
        "Label": "waited",
        "Title": "X-Trace Task",
        "Host": "pinky19.mpi-sws.org",
        "Duration": "92598",
        "HRT": 26966761141139909,
        "Operation": "waited",
        "Timestamp": "1557750401081.488037",
        "TenantClass": 0,
        "Source": "SocketIOWithTimeout.java:335",
        "ThreadID": 1,
        "ThreadName": "",
        "EventID": "DE80749BC10853C3",
        "ProcessID": 2801
      },
      {
        "Cycles": 0,
        "Agent": "edu.brown.cs.systems.xtrace.logging.BaggageWrappers",
        "ProcessName": "Read",
        "TaskID": "E065543094F6B3D1",
        "ParentEventID": [
          "DE80749BC10853C3",
          "B845A770FAA79A63"
        ],
        "Label": "Merged current baggage with other baggage",
        "Title": "X-Trace Task",
        "Host": "pinky19.mpi-sws.org",
        "HRT": 26966761141176268,
        "Operation": "join",
        "Timestamp": "1557750401081.524414",
        "TenantClass": 0,
        "Source": "PacketHeader.java:168",
        "ThreadID": 1,
        "ThreadName": "",
        "EventID": "09DB602C9CA38E24",
        "ProcessID": 2801
      },
      {
        "Cycles": 0,
        "Agent": "Execution-Sleep",
        "ProcessName": "Data",
        "TaskID": "E065543094F6B3D1",
        "ParentEventID": [
          "3434A4F5523D678B"
        ],
        "Label": "waited",
        "Title": "X-Trace Task",
        "Host": "pinky20.mpi-sws.org",
        "Duration": "9980",
        "HRT": 6569965500355704,
        "Operation": "waited",
        "Timestamp": "1557750401081.517090",
        "TenantClass": 0,
        "Source": "SocketIOWithTimeout.java:335",
        "ThreadID": 15281,
        "ThreadName": "",
        "EventID": "922A96C074F4FBA1",
        "BaggageBytes": "[[248 5] [240 0] [0 224 101 84 48 148 246 179 209] [240 1] [0 52 52 164 245 82 61 103 139] [240 3] [0 2]]",
        "ProcessID": 13111
      },
      {
        "Cycles": 0,
        "Agent": "edu.brown.cs.systems.xtrace.logging.BaggageWrappers",
        "ProcessName": "Data",
        "TaskID": "E065543094F6B3D1",
        "ParentEventID": [
          "A72EB96C27B75419"
        ],
        "Label": "Forking current baggage with Baggage.fork()",
        "Title": "X-Trace Task",
        "Host": "pinky20.mpi-sws.org",
        "HRT": 6569965500173357,
        "Operation": "fork",
        "Timestamp": "1557750401081.334717",
        "TenantClass": 0,
        "Source": "PacketHeader.java:95",
        "ThreadID": 15281,
        "ThreadName": "",
        "EventID": "3434A4F5523D678B",
        "BaggageBytes": "[[248 5] [240 0] [0 224 101 84 48 148 246 179 209] [240 1] [0 167 46 185 108 39 183 84 25] [240 3] [0 2]]",
        "ProcessID": 13111
      },
      {
        "Cycles": 0,
        "Agent": "Execution-CPU",
        "ProcessName": "Data",
        "TaskID": "E065543094F6B3D1",
        "ParentEventID": [
          "922A96C074F4FBA1"
        ],
        "Label": "unset",
        "Title": "X-Trace Task",
        "Host": "pinky20.mpi-sws.org",
        "Duration": "1844863",
        "HRT": 6569965500722135,
        "Operation": "unset",
        "Timestamp": "1557750401081.883545",
        "TenantClass": 0,
        "Source": "DataXceiver.java:261",
        "ThreadID": 15281,
        "ThreadName": "",
        "EventID": "16EEFB6186C25074",
        "BaggageBytes": "[[248 5] [240 0] [0 224 101 84 48 148 246 179 209] [240 1] [0 146 42 150 192 116 244 251 161] [240 3] [0 2]]",
        "ProcessID": 13111
      },
      {
        "Cycles": 0,
        "Agent": "edu.brown.cs.systems.retro.benchmarks.hdfs_client.Reader",
        "ProcessName": "Read",
        "TaskID": "E065543094F6B3D1",
        "ParentEventID": [
          "0"
        ],
        "Label": "Reading file",
        "Title": "X-Trace Task",
        "Host": "pinky19.mpi-sws.org",
        "HRT": 26966761136025022,
        "Timestamp": "1557750401076.373291",
        "TenantClass": 0,
        "ThreadID": 1,
        "ThreadName": "",
        "EventID": "7736109BABAA7D00",
        "ProcessID": 2801,
        "Tag": [
          "reader_100kb",
          "Read Size: 102400"
        ]
      }
    ]
  }
]