[
  {
    "id": "5524298B4DAFAEA0",
    "reports": [
      {
        "Cycles": 0,
        "Agent": "edu.brown.cs.systems.retro.benchmarks.hdfs_client.Reader",
        "ProcessName": "Read",
        "TaskID": "5524298B4DAFAEA0",
        "ParentEventID": [
          "AE02581A59FDBF6D"
        ],
        "Label": "Reading file",
        "Title": "X-Trace Task",
        "Host": "pinky19.mpi-sws.org",
        "HRT": 26962499573379474,
        "Timestamp": "1557746139513.384521",
        "TenantClass": 0,
        "ThreadID": 1,
        "ThreadName": "",
        "EventID": "BBF6E873E396FDFF",
        "ProcessID": 36430
      },
      {
        "Cycles": 0,
        "Agent": "Execution-CPU",
        "ProcessName": "Read",
        "TaskID": "5524298B4DAFAEA0",
        "ParentEventID": [
          "D36182FDC440DA93"
        ],
        "Label": "unset",
        "Title": "X-Trace Task",
        "Host": "pinky19.mpi-sws.org",
        "Duration": "22486921",
        "HRT": 26962499573495493,
        "Operation": "unset",
        "Timestamp": "1557746139513.500488",
        "TenantClass": 0,
        "Source": "Client.java:1027",
        "ThreadID": 1,
        "ThreadName": "",
        "EventID": "8FED545515CC2CDD",
        "ProcessID": 36430
      },
      {
        "Cycles": 0,
        "Agent": "Execution-CPU",
        "ProcessName": "Read",
        "TaskID": "5524298B4DAFAEA0",
        "ParentEventID": [
          "8FED545515CC2CDD"
        ],
        "Label": "set",
        "Title": "X-Trace Task",
        "Host": "pinky19.mpi-sws.org",
        "HRT": 26962499573548751,
        "Operation": "set",
        "Timestamp": "1557746139513.553711",
        "TenantClass": 0,
        "Source": "Client.java:1032",
        "ThreadID": 41,
        "ThreadName": "",
        "EventID": "DF547DFA42076BA6",
        "ProcessID": 36430
      },
      {
        "Cycles": 0,
        "Agent": "org.apache.hadoop.ipc.ProtobufRpcEngine",
        "ProcessName": "Read",
        "TaskID": "5524298B4DAFAEA0",
        "ParentEventID": [
          "BBF6E873E396FDFF"
        ],
        "Label": "Invoking org.apache.hadoop.hdfs.protocol.ClientProtocol.getBlockLocations",
        "Title": "X-Trace Task",
        "Host": "pinky19.mpi-sws.org",
        "HRT": 26962499573457928,
        "Timestamp": "1557746139513.462891",
        "TenantClass": 0,
        "Source": "ProtobufRpcEngine.java:228",
        "ThreadID": 1,
        "ThreadName": "",
        "EventID": "D36182FDC440DA93",
        "ProcessID": 36430
      },
      {
        "Cycles": 0,
        "Agent": "Execution-CPU",
        "ProcessName": "Read",
        "TaskID": "5524298B4DAFAEA0",
        "ParentEventID": [
          "A09BFBC2FE7F9A4A"
        ],
        "Label": "unset",
        "Title": "X-Trace Task",
        "Host": "pinky19.mpi-sws.org",
        "Duration": "70731",
        "HRT": 26962499573638558,
        "Operation": "unset",
        "Timestamp": "1557746139513.643555",
        "TenantClass": 0,
        "Source": "Client.java:1062",
        "ThreadID": 41,
        "ThreadName": "",
        "EventID": "2B2720177B84997D",
        "ProcessID": 36430
      },
      {
        "Cycles": 0,
        "Agent": "edu.brown.cs.systems.xtrace.logging.BaggageWrappers",
        "ProcessName": "Read",
        "TaskID": "5524298B4DAFAEA0",
        "ParentEventID": [
          "DF547DFA42076BA6"
        ],
        "Label": "Forking current baggage with Baggage.fork()",
        "Title": "X-Trace Task",
        "Host": "pinky19.mpi-sws.org",
        "HRT": 26962499573567942,
        "Operation": "fork",
        "Timestamp": "1557746139513.572998",
        "TenantClass": 0,
        "Source": "Client.java:1043",
        "ThreadID": 41,
        "ThreadName": "",
        "EventID": "A09BFBC2FE7F9A4A",
        "ProcessID": 36430
      },
      {
        "Cycles": 0,
        "Agent": "Execution-CPU",
        "ProcessName": "Read",
        "TaskID": "5524298B4DAFAEA0",
        "ParentEventID": [
          "2B2720177B84997D"
        ],
        "Label": "set",
        "Title": "X-Trace Task",
        "Host": "pinky19.mpi-sws.org",
        "HRT": 26962499573663708,
        "Operation": "set",
        "Timestamp": "1557746139513.668701",
        "TenantClass": 0,
        "Source": "Client.java:1104",
        "ThreadID": 1,
        "ThreadName": "",
        "EventID": "09FBEC3ECB120B03",
        "ProcessID": 36430
      },
      {
        "Cycles": 0,
        "Agent": "edu.brown.cs.systems.xtrace.logging.BaggageWrappers",
        "ProcessName": "Name",
        "TaskID": "5524298B4DAFAEA0",
        "ParentEventID": [
          "E593DF5214C27B49"
        ],
        "Label": "Forking current baggage with Baggage.fork()",
        "Title": "X-Trace Task",
        "Host": "pinky19.mpi-sws.org",
        "HRT": 26962499573728553,
        "Operation": "fork",
        "Timestamp": "1557746139513.746094",
        "TenantClass": 0,
        "Source": "Server.java:550",
        "ThreadID": 48,
        "ThreadName": "",
        "EventID": "588A5B367F72C0FE",
        "BaggageBytes": "[[248 5] [240 0] [0 85 36 41 139 77 175 174 160] [240 1] [0 229 147 223 82 20 194 123 73] [240 3] [0 2]]",
        "ProcessID": 2171
      },
      {
        "Cycles": 0,
        "Agent": "Execution-CPU",
        "ProcessName": "Name",
        "TaskID": "5524298B4DAFAEA0",
        "ParentEventID": [
          "588A5B367F72C0FE"
        ],
        "Label": "unset",
        "Title": "X-Trace Task",
        "Host": "pinky19.mpi-sws.org",
        "Duration": "23309",
        "HRT": 26962499573748030,
        "Operation": "unset",
        "Timestamp": "1557746139513.765625",
        "TenantClass": 0,
        "Source": "Server.java:1828",
        "ThreadID": 48,
        "ThreadName": "",
        "EventID": "EFE587A1343733FF",
        "BaggageBytes": "[[248 5] [240 0] [0 85 36 41 139 77 175 174 160] [240 1] [0 88 138 91 54 127 114 192 254] [240 3] [0 2]]",
        "ProcessID": 2171
      },
      {
        "Cycles": 0,
        "Agent": "Execution-CPU",
        "ProcessName": "Name",
        "TaskID": "5524298B4DAFAEA0",
        "ParentEventID": [
          "588A5B367F72C0FE"
        ],
        "Label": "set",
        "Title": "X-Trace Task",
        "Host": "pinky19.mpi-sws.org",
        "HRT": 26962499573763732,
        "Operation": "set",
        "Timestamp": "1557746139513.781250",
        "TenantClass": 0,
        "Source": "Server.java:2071",
        "ThreadID": 56,
        "ThreadName": "",
        "EventID": "419EEBE5366043A6",
        "BaggageBytes": "[[248 5] [240 0] [0 85 36 41 139 77 175 174 160] [240 1] [0 88 138 91 54 127 114 192 254] [240 3] [0 2]]",
        "ProcessID": 2171
      },
      {
        "Cycles": 0,
        "Agent": "org.apache.hadoop.ipc.Server",
        "ProcessName": "Name",
        "TaskID": "5524298B4DAFAEA0",
        "ParentEventID": [
          "419EEBE5366043A6"
        ],
        "Label": "getBlockLocations in org.apache.hadoop.hdfs.protocol.ClientProtocol",
        "Title": "X-Trace Task",
        "Host": "pinky19.mpi-sws.org",
        "HRT": 26962499573799857,
        "Timestamp": "1557746139513.817383",
        "TenantClass": 0,
        "Source": "ProtobufRpcEngine.java:601",
        "ThreadID": 56,
        "ThreadName": "",
        "EventID": "CFAAA5C04CFEC3AD",
        "BaggageBytes": "[[248 5] [240 0] [0 85 36 41 139 77 175 174 160] [240 1] [0 65 158 235 229 54 96 67 166] [240 3] [0 2]]",
        "ProcessID": 2171
      },
      {
        "Cycles": 0,
        "Agent": "org.apache.hadoop.hdfs.server.namenode.FSNamesystem.audit",
        "ProcessName": "Name",
        "TaskID": "5524298B4DAFAEA0",
        "ParentEventID": [
          "CFAAA5C04CFEC3AD"
        ],
        "Label": "allowed=true\tugi=plascas (auth:SIMPLE)\tip=/139.19.171.63\tcmd=open\tsrc=/ds/ZeWs3J2HRDhDH9Wn\tdst=null\tperm=null\tproto=rpc",
        "Title": "X-Trace Task",
        "Host": "pinky19.mpi-sws.org",
        "HRT": 26962499573848923,
        "Timestamp": "1557746139513.866455",
        "TenantClass": 0,
        "Source": "FSNamesystem.java:8313",
        "ThreadID": 56,
        "ThreadName": "",
        "EventID": "A1823EB1094815D8",
        "BaggageBytes": "[[248 5] [240 0] [0 85 36 41 139 77 175 174 160] [240 1] [0 207 170 165 192 76 254 195 173] [240 3] [0 2]]",
        "ProcessID": 2171
      },
      {
        "Cycles": 0,
        "Agent": "Execution-CPU",
        "ProcessName": "Name",
        "TaskID": "5524298B4DAFAEA0",
        "ParentEventID": [
          "A09BFBC2FE7F9A4A"
        ],
        "Label": "set",
        "Title": "X-Trace Task",
        "Host": "pinky19.mpi-sws.org",
        "HRT": 26962499573700279,
        "Operation": "set",
        "Timestamp": "1557746139513.718018",
        "TenantClass": 0,
        "Source": "Server.java:1840",
        "ThreadID": 48,
        "ThreadName": "",
        "EventID": "E593DF5214C27B49",
        "BaggageBytes": "[[248 5] [240 0] [0 85 36 41 139 77 175 174 160] [240 1] [0 160 155 251 194 254 127 154 74] [240 3] [0 2]]",
        "ProcessID": 2171
      },
      {
        "Cycles": 0,
        "Agent": "edu.brown.cs.systems.xtrace.logging.BaggageWrappers",
        "ProcessName": "Name",
        "TaskID": "5524298B4DAFAEA0",
        "ParentEventID": [
          "A1823EB1094815D8"
        ],
        "Label": "Forking current baggage with Baggage.fork()",
        "Title": "X-Trace Task",
        "Host": "pinky19.mpi-sws.org",
        "HRT": 26962499573907187,
        "Operation": "fork",
        "Timestamp": "1557746139513.924805",
        "TenantClass": 0,
        "Source": "Server.java:2398",
        "ThreadID": 56,
        "ThreadName": "",
        "EventID": "93678EC2EA9792AB",
        "BaggageBytes": "[[248 5] [240 0] [0 85 36 41 139 77 175 174 160] [240 1] [0 161 130 62 177 9 72 21 216] [240 3] [0 2]]",
        "ProcessID": 2171
      },
      {
        "Cycles": 0,
        "Agent": "Execution-CPU",
        "ProcessName": "Read",
        "TaskID": "5524298B4DAFAEA0",
        "ParentEventID": [
          "93678EC2EA9792AB"
        ],
        "Label": "set",
        "Title": "X-Trace Task",
        "Host": "pinky19.mpi-sws.org",
        "HRT": 26962499574064726,
        "Operation": "set",
        "Timestamp": "1557746139514.069580",
        "TenantClass": 0,
        "Source": "Client.java:302",
        "ThreadID": 37,
        "ThreadName": "",
        "EventID": "538A7F59B095E441",
        "ProcessID": 36430
      },
      {
        "Cycles": 0,
        "Agent": "Execution-CPU",
        "ProcessName": "Name",
        "TaskID": "5524298B4DAFAEA0",
        "ParentEventID": [
          "93678EC2EA9792AB"
        ],
        "Label": "unset",
        "Title": "X-Trace Task",
        "Host": "pinky19.mpi-sws.org",
        "Duration": "223993",
        "HRT": 26962499574012844,
        "Operation": "unset",
        "Timestamp": "1557746139514.030518",
        "TenantClass": 0,
        "Source": "Server.java:1058",
        "ThreadID": 56,
        "ThreadName": "",
        "EventID": "DD0B8CABDB45F717",
        "BaggageBytes": "[[248 5] [240 0] [0 85 36 41 139 77 175 174 160] [240 1] [0 147 103 142 194 234 151 146 171] [240 3] [0 2]]",
        "ProcessID": 2171
      },
      {
        "Cycles": 0,
        "Agent": "Execution-CPU",
        "ProcessName": "Read",
        "TaskID": "5524298B4DAFAEA0",
        "ParentEventID": [
          "538A7F59B095E441"
        ],
        "Label": "unset",
        "Title": "X-Trace Task",
        "Host": "pinky19.mpi-sws.org",
        "Duration": "12158",
        "HRT": 26962499574098097,
        "Operation": "unset",
        "Timestamp": "1557746139514.103027",
        "TenantClass": 0,
        "Source": "Client.java:1168",
        "ThreadID": 37,
        "ThreadName": "",
        "EventID": "30FAEDAA41D831CF",
        "ProcessID": 36430
      },
      {
        "Cycles": 0,
        "Agent": "Execution-Sleep",
        "ProcessName": "Read",
        "TaskID": "5524298B4DAFAEA0",
        "ParentEventID": [
          "09FBEC3ECB120B03"
        ],
        "Label": "waited",
        "Title": "X-Trace Task",
        "Host": "pinky19.mpi-sws.org",
        "Duration": "440562",
        "HRT": 26962499574117853,
        "Operation": "waited",
        "Timestamp": "1557746139514.122803",
        "TenantClass": 0,
        "Source": "Client.java:1537",
        "ThreadID": 1,
        "ThreadName": "",
        "EventID": "4D8FDB5AAEC9FE73",
        "ProcessID": 36430
      },
      {
        "Cycles": 0,
        "Agent": "edu.brown.cs.systems.xtrace.logging.BaggageWrappers",
        "ProcessName": "Read",
        "TaskID": "5524298B4DAFAEA0",
        "ParentEventID": [
          "4D8FDB5AAEC9FE73",
          "30FAEDAA41D831CF"
        ],
        "Label": "Merged current baggage with other baggage",
        "Title": "X-Trace Task",
        "Host": "pinky19.mpi-sws.org",
        "HRT": 26962499574134347,
        "Operation": "join",
        "Timestamp": "1557746139514.139404",
        "TenantClass": 0,
        "Source": "Client.java:1545",
        "ThreadID": 1,
        "ThreadName": "",
        "EventID": "330F80F720E3DA2B",
        "ProcessID": 36430
      },
      {
        "Cycles": 0,
        "Agent": "org.apache.hadoop.ipc.ProtobufRpcEngine",
        "ProcessName": "Read",
        "TaskID": "5524298B4DAFAEA0",
        "ParentEventID": [
          "330F80F720E3DA2B"
        ],
        "Label": "org.apache.hadoop.hdfs.protocol.ClientProtocol.getBlockLocations completed",
        "Title": "X-Trace Task",
        "Host": "pinky19.mpi-sws.org",
        "HRT": 26962499574183108,
        "Timestamp": "1557746139514.187988",
        "TenantClass": 0,
        "Source": "ProtobufRpcEngine.java:275",
        "ThreadID": 1,
        "ThreadName": "",
        "EventID": "05CF1D17DB0DB233",
        "ProcessID": 36430
      },
      {
        "Cycles": 0,
        "Agent": "Execution-CPU",
        "ProcessName": "Data",
        "TaskID": "5524298B4DAFAEA0",
        "ParentEventID": [
          "AD819621A0629929"
        ],
        "Label": "set",
        "Title": "X-Trace Task",
        "Host": "pinky25.mpi-sws.org",
        "HRT": 47511604816196855,
        "Operation": "set",
        "Timestamp": "1557746139514.610840",
        "TenantClass": 0,
        "Source": "Receiver.java:117",
        "ThreadID": 14040,
        "ThreadName": "",
        "EventID": "A193C7DEFCD64F73",
        "BaggageBytes": "[[248 5] [240 0] [0 85 36 41 139 77 175 174 160] [240 1] [0 173 129 150 33 160 98 153 41] [240 3] [0 2]]",
        "ProcessID": 28198
      },
      {
        "Cycles": 0,
        "Agent": "edu.brown.cs.systems.xtrace.logging.BaggageWrappers",
        "ProcessName": "Read",
        "TaskID": "5524298B4DAFAEA0",
        "ParentEventID": [
          "05CF1D17DB0DB233"
        ],
        "Label": "Forking current baggage with Baggage.fork()",
        "Title": "X-Trace Task",
        "Host": "pinky19.mpi-sws.org",
        "HRT": 26962499574266706,
        "Operation": "fork",
        "Timestamp": "1557746139514.271729",
        "TenantClass": 0,
        "Source": "DataTransferProtoUtil.java:94",
        "ThreadID": 1,
        "ThreadName": "",
        "EventID": "AD819621A0629929",
        "ProcessID": 36430
      },
      {
        "Cycles": 0,
        "Agent": "edu.brown.cs.systems.xtrace.logging.XTraceInit",
        "ProcessName": "Data",
        "TaskID": "5524298B4DAFAEA0",
        "ParentEventID": [
          "A193C7DEFCD64F73"
        ],
        "Label": "Thread.setName: DataXceiver for client DFSClient_NONMAPREDUCE_778905418_1 at /139.19.171.63:41180 [Sending block BP-1633380353-139.19.171.63-1554193446451:blk_1073760531_19707]",
        "Title": "X-Trace Task",
        "Host": "pinky25.mpi-sws.org",
        "HRT": 47511604816276660,
        "Timestamp": "1557746139514.690674",
        "TenantClass": 0,
        "Source": "DataXceiver.java:168",
        "ThreadID": 14040,
        "ThreadName": "",
        "EventID": "A271FC5818DBC813",
        "BaggageBytes": "[[248 5] [240 0] [0 85 36 41 139 77 175 174 160] [240 1] [0 161 147 199 222 252 214 79 115] [240 3] [0 2]]",
        "ProcessID": 28198
      },
      {
        "Cycles": 0,
        "Agent": "Execution-Sleep",
        "ProcessName": "Read",
        "TaskID": "5524298B4DAFAEA0",
        "ParentEventID": [
          "AD819621A0629929"
        ],
        "Label": "waited",
        "Title": "X-Trace Task",
        "Host": "pinky19.mpi-sws.org",
        "Duration": "581923",
        "HRT": 26962499574936566,
        "Operation": "waited",
        "Timestamp": "1557746139514.941406",
        "TenantClass": 0,
        "Source": "SocketIOWithTimeout.java:335",
        "ThreadID": 1,
        "ThreadName": "",
        "EventID": "BFD5000602EB56BE",
        "ProcessID": 36430
      },
      {
        "Cycles": 0,
        "Agent": "edu.brown.cs.systems.xtrace.logging.BaggageWrappers",
        "ProcessName": "Data",
        "TaskID": "5524298B4DAFAEA0",
        "ParentEventID": [
          "A271FC5818DBC813"
        ],
        "Label": "Forking current baggage with Baggage.fork()",
        "Title": "X-Trace Task",
        "Host": "pinky25.mpi-sws.org",
        "HRT": 47511604816435995,
        "Operation": "fork",
        "Timestamp": "1557746139514.849854",
        "TenantClass": 0,
        "Source": "DataXceiver.java:1257",
        "ThreadID": 14040,
        "ThreadName": "",
        "EventID": "918D74EA1240E4B1",
        "BaggageBytes": "[[248 5] [240 0] [0 85 36 41 139 77 175 174 160] [240 1] [0 162 113 252 88 24 219 200 19] [240 3] [0 2]]",
        "ProcessID": 28198
      },
      {
        "Cycles": 0,
        "Agent": "edu.brown.cs.systems.xtrace.logging.BaggageWrappers",
        "ProcessName": "Data",
        "TaskID": "5524298B4DAFAEA0",
        "ParentEventID": [
          "918D74EA1240E4B1"
        ],
        "Label": "Forking current baggage with Baggage.fork()",
        "Title": "X-Trace Task",
        "Host": "pinky25.mpi-sws.org",
        "HRT": 47511604816531691,
        "Operation": "fork",
        "Timestamp": "1557746139514.945557",
        "TenantClass": 0,
        "Source": "PacketHeader.java:95",
        "ThreadID": 14040,
        "ThreadName": "",
        "EventID": "5C1A280FCDCBCD1E",
        "BaggageBytes": "[[248 5] [240 0] [0 85 36 41 139 77 175 174 160] [240 1] [0 145 141 116 234 18 64 228 177] [240 3] [0 2]]",
        "ProcessID": 28198
      },
      {
        "Cycles": 0,
        "Agent": "Execution-Sleep",
        "ProcessName": "Data",
        "TaskID": "5524298B4DAFAEA0",
        "ParentEventID": [
          "5C1A280FCDCBCD1E"
        ],
        "Label": "waited",
        "Title": "X-Trace Task",
        "Host": "pinky25.mpi-sws.org",
        "Duration": "7155",
        "HRT": 47511604816628768,
        "Operation": "waited",
        "Timestamp": "1557746139515.042725",
        "TenantClass": 0,
        "Source": "SocketIOWithTimeout.java:335",
        "ThreadID": 14040,
        "ThreadName": "",
        "EventID": "F95FEB089FF534A7",
        "BaggageBytes": "[[248 5] [240 0] [0 85 36 41 139 77 175 174 160] [240 1] [0 92 26 40 15 205 203 205 30] [240 3] [0 2]]",
        "ProcessID": 28198
      },
      {
        "Cycles": 0,
        "Agent": "edu.brown.cs.systems.xtrace.logging.BaggageWrappers",
        "ProcessName": "Read",
        "TaskID": "5524298B4DAFAEA0",
        "ParentEventID": [
          "BFD5000602EB56BE",
          "918D74EA1240E4B1"
        ],
        "Label": "Merged current baggage with other baggage",
        "Title": "X-Trace Task",
        "Host": "pinky19.mpi-sws.org",
        "HRT": 26962499575029603,
        "Operation": "join",
        "Timestamp": "1557746139515.034668",
        "TenantClass": 0,
        "Source": "RemoteBlockReader2.java:429",
        "ThreadID": 1,
        "ThreadName": "",
        "EventID": "A6B42D5FA1BC2894",
        "ProcessID": 36430
      },
      {
        "Cycles": 0,
        "Agent": "edu.brown.cs.systems.xtrace.logging.BaggageWrappers",
        "ProcessName": "Data",
        "TaskID": "5524298B4DAFAEA0",
        "ParentEventID": [
          "F95FEB089FF534A7"
        ],
        "Label": "Forking current baggage with Baggage.fork()",
        "Title": "X-Trace Task",
        "Host": "pinky25.mpi-sws.org",
        "HRT": 47511604816727615,
        "Operation": "fork",
        "Timestamp": "1557746139515.141602",
        "TenantClass": 0,
        "Source": "PacketHeader.java:95",
        "ThreadID": 14040,
        "ThreadName": "",
        "EventID": "DA32240BBB774EF3",
        "BaggageBytes": "[[248 5] [240 0] [0 85 36 41 139 77 175 174 160] [240 1] [0 249 95 235 8 159 245 52 167] [240 3] [0 2]]",
        "ProcessID": 28198
      },
      {
        "Cycles": 0,
        "Agent": "edu.brown.cs.systems.xtrace.logging.BaggageWrappers",
        "ProcessName": "Read",
        "TaskID": "5524298B4DAFAEA0",
        "ParentEventID": [
          "A92238695D0D9A38",
          "5C1A280FCDCBCD1E"
        ],
        "Label": "Merged current baggage with other baggage",
        "Title": "X-Trace Task",
        "Host": "pinky19.mpi-sws.org",
        "HRT": 26962499575322603,
        "Operation": "join",
        "Timestamp": "1557746139515.327637",
        "TenantClass": 0,
        "Source": "PacketHeader.java:168",
        "ThreadID": 1,
        "ThreadName": "",
        "EventID": "3FCB57977A98D058",
        "ProcessID": 36430
      },
      {
        "Cycles": 0,
        "Agent": "Execution-Sleep",
        "ProcessName": "Read",
        "TaskID": "5524298B4DAFAEA0",
        "ParentEventID": [
          "A6B42D5FA1BC2894"
        ],
        "Label": "waited",
        "Title": "X-Trace Task",
        "Host": "pinky19.mpi-sws.org",
        "Duration": "121974",
        "HRT": 26962499575251760,
        "Operation": "waited",
        "Timestamp": "1557746139515.256592",
        "TenantClass": 0,
        "Source": "SocketIOWithTimeout.java:335",
        "ThreadID": 1,
        "ThreadName": "",
        "EventID": "A92238695D0D9A38",
        "ProcessID": 36430
      },
      {
        "Cycles": 0,
        "Agent": "edu.brown.cs.systems.xtrace.logging.BaggageWrappers",
        "ProcessName": "Read",
        "TaskID": "5524298B4DAFAEA0",
        "ParentEventID": [
          "DA32240BBB774EF3",
          "3FCB57977A98D058"
        ],
        "Label": "Merged current baggage with other baggage",
        "Title": "X-Trace Task",
        "Host": "pinky19.mpi-sws.org",
        "HRT": 26962499575383521,
        "Operation": "join",
        "Timestamp": "1557746139515.388428",
        "TenantClass": 0,
        "Source": "PacketHeader.java:168",
        "ThreadID": 1,
        "ThreadName": "",
        "EventID": "EDC62AE3E47EA3AB",
        "ProcessID": 36430
      },
      {
        "Cycles": 0,
        "Agent": "Execution-Sleep",
        "ProcessName": "Data",
        "TaskID": "5524298B4DAFAEA0",
        "ParentEventID": [
          "DA32240BBB774EF3"
        ],
        "Label": "waited",
        "Title": "X-Trace Task",
        "Host": "pinky25.mpi-sws.org",
        "Duration": "213254",
        "HRT": 47511604817076747,
        "Operation": "waited",
        "Timestamp": "1557746139515.490723",
        "TenantClass": 0,
        "Source": "SocketIOWithTimeout.java:335",
        "ThreadID": 14040,
        "ThreadName": "",
        "EventID": "0519D0E03E6D0B9C",
        "BaggageBytes": "[[248 5] [240 0] [0 85 36 41 139 77 175 174 160] [240 1] [0 218 50 36 11 187 119 78 243] [240 3] [0 2]]",
        "ProcessID": 28198
      },
      {
        "Cycles": 0,
        "Agent": "edu.brown.cs.systems.xtrace.logging.BaggageWrappers",
        "ProcessName": "Data",
        "TaskID": "5524298B4DAFAEA0",
        "ParentEventID": [
          "0519D0E03E6D0B9C",
          "1ACD4A0F6A9A8220"
        ],
        "Label": "Merged current baggage with other baggage",
        "Title": "X-Trace Task",
        "Host": "pinky25.mpi-sws.org",
        "HRT": 47511604817171960,
        "Operation": "join",
        "Timestamp": "1557746139515.585938",
        "TenantClass": 0,
        "Source": "DataXceiver.java:574",
        "ThreadID": 14040,
        "ThreadName": "",
        "EventID": "7A50468BB3416402",
        "BaggageBytes": "[[248 5] [240 0] [0 85 36 41 139 77 175 174 160] [240 1] [0 5 25 208 224 62 109 11 156] [0 26 205 74 15 106 154 130 32] [240 3] [0 2]]",
        "ProcessID": 28198
      },
      {
        "Cycles": 0,
        "Agent": "Execution-CPU",
        "ProcessName": "Data",
        "TaskID": "5524298B4DAFAEA0",
        "ParentEventID": [
          "7A50468BB3416402"
        ],
        "Label": "unset",
        "Title": "X-Trace Task",
        "Host": "pinky25.mpi-sws.org",
        "Duration": "952397",
        "HRT": 47511604817206062,
        "Operation": "unset",
        "Timestamp": "1557746139515.620117",
        "TenantClass": 0,
        "Source": "DataXceiver.java:261",
        "ThreadID": 14040,
        "ThreadName": "",
        "EventID": "8DF082F2ED8C8620",
        "BaggageBytes": "[[248 5] [240 0] [0 85 36 41 139 77 175 174 160] [240 1] [0 122 80 70 139 179 65 100 2] [240 3] [0 2]]",
        "ProcessID": 28198
      },
      {
        "Cycles": 0,
        "Agent": "edu.brown.cs.systems.xtrace.logging.BaggageWrappers",
        "ProcessName": "Read",
        "TaskID": "5524298B4DAFAEA0",
        "ParentEventID": [
          "EDC62AE3E47EA3AB"
        ],
        "Label": "Forking current baggage with Baggage.fork()",
        "Title": "X-Trace Task",
        "Host": "pinky19.mpi-sws.org",
        "HRT": 26962499575395931,
        "Operation": "fork",
        "Timestamp": "1557746139515.400879",
        "TenantClass": 0,
        "Source": "RemoteBlockReader2.java:361",
        "ThreadID": 1,
        "ThreadName": "",
        "EventID": "1ACD4A0F6A9A8220",
        "ProcessID": 36430
      },
      {
        "Cycles": 0,
        "Agent": "edu.brown.cs.systems.retro.benchmarks.hdfs_client.Reader",
        "ProcessName": "Read",
        "TaskID": "5524298B4DAFAEA0",
        "ParentEventID": [
          "0"
        ],
        "Label": "Reading file",
        "Title": "X-Trace Task",
        "Host": "pinky19.mpi-sws.org",
        "HRT": 26962499573349246,
        "Timestamp": "1557746139513.354248",
        "TenantClass": 0,
        "ThreadID": 1,
        "ThreadName": "",
        "EventID": "AE02581A59FDBF6D",
        "ProcessID": 36430,
        "Tag": [
          "reader_10kb",
          "Read Size: 10240"
        ]
      }
    ]
  }
]