[
  {
    "id": "FD6E68527734D5BC",
    "reports": [
      {
        "Cycles": 0,
        "Agent": "Execution-CPU",
        "ProcessName": "Read",
        "TaskID": "FD6E68527734D5BC",
        "ParentEventID": [
          "3F386FA620885C9C"
        ],
        "Label": "unset",
        "Title": "X-Trace Task",
        "Host": "pinky19.mpi-sws.org",
        "Duration": "21308098",
        "HRT": 25491840575483817,
        "Operation": "unset",
        "Timestamp": "1556275480515.632812",
        "TenantClass": 0,
        "Source": "Client.java:1027",
        "ThreadID": 1,
        "ThreadName": "",
        "EventID": "CD3BB75EC46BAA72",
        "ProcessID": 21035
      },
      {
        "Cycles": 0,
        "Agent": "org.apache.hadoop.ipc.ProtobufRpcEngine",
        "ProcessName": "Read",
        "TaskID": "FD6E68527734D5BC",
        "ParentEventID": [
          "C7D5EA90AE53A8ED"
        ],
        "Label": "Invoking org.apache.hadoop.hdfs.protocol.ClientProtocol.getBlockLocations",
        "Title": "X-Trace Task",
        "Host": "pinky19.mpi-sws.org",
        "HRT": 25491840575459471,
        "Timestamp": "1556275480515.608643",
        "TenantClass": 0,
        "Source": "ProtobufRpcEngine.java:228",
        "ThreadID": 1,
        "ThreadName": "",
        "EventID": "3F386FA620885C9C",
        "ProcessID": 21035
      },
      {
        "Cycles": 0,
        "Agent": "edu.brown.cs.systems.retro.benchmarks.hdfs_client.Reader",
        "ProcessName": "Read",
        "TaskID": "FD6E68527734D5BC",
        "ParentEventID": [
          "613CBFB59FFB5869"
        ],
        "Label": "Reading file",
        "Title": "X-Trace Task",
        "Host": "pinky19.mpi-sws.org",
        "HRT": 25491840575425793,
        "Timestamp": "1556275480515.574951",
        "TenantClass": 0,
        "ThreadID": 1,
        "ThreadName": "",
        "EventID": "C7D5EA90AE53A8ED",
        "ProcessID": 21035
      },
      {
        "Cycles": 0,
        "Agent": "edu.brown.cs.systems.xtrace.logging.BaggageWrappers",
        "ProcessName": "Read",
        "TaskID": "FD6E68527734D5BC",
        "ParentEventID": [
          "D3B9AA4BCCF12ABF"
        ],
        "Label": "Forking current baggage with Baggage.fork()",
        "Title": "X-Trace Task",
        "Host": "pinky19.mpi-sws.org",
        "HRT": 25491840575529295,
        "Operation": "fork",
        "Timestamp": "1556275480515.678467",
        "TenantClass": 0,
        "Source": "Client.java:1043",
        "ThreadID": 41,
        "ThreadName": "",
        "EventID": "3DCDA54C2E06192A",
        "ProcessID": 21035
      },
      {
        "Cycles": 0,
        "Agent": "Execution-CPU",
        "ProcessName": "Read",
        "TaskID": "FD6E68527734D5BC",
        "ParentEventID": [
          "CD3BB75EC46BAA72"
        ],
        "Label": "set",
        "Title": "X-Trace Task",
        "Host": "pinky19.mpi-sws.org",
        "HRT": 25491840575510376,
        "Operation": "set",
        "Timestamp": "1556275480515.659424",
        "TenantClass": 0,
        "Source": "Client.java:1032",
        "ThreadID": 41,
        "ThreadName": "",
        "EventID": "D3B9AA4BCCF12ABF",
        "ProcessID": 21035
      },
      {
        "Cycles": 0,
        "Agent": "Execution-CPU",
        "ProcessName": "Read",
        "TaskID": "FD6E68527734D5BC",
        "ParentEventID": [
          "3DCDA54C2E06192A"
        ],
        "Label": "unset",
        "Title": "X-Trace Task",
        "Host": "pinky19.mpi-sws.org",
        "Duration": "72364",
        "HRT": 25491840575600748,
        "Operation": "unset",
        "Timestamp": "1556275480515.749756",
        "TenantClass": 0,
        "Source": "Client.java:1062",
        "ThreadID": 41,
        "ThreadName": "",
        "EventID": "928C7D5D8004B0E2",
        "ProcessID": 21035
      },
      {
        "Cycles": 0,
        "Agent": "Execution-CPU",
        "ProcessName": "Read",
        "TaskID": "FD6E68527734D5BC",
        "ParentEventID": [
          "928C7D5D8004B0E2"
        ],
        "Label": "set",
        "Title": "X-Trace Task",
        "Host": "pinky19.mpi-sws.org",
        "HRT": 25491840575625156,
        "Operation": "set",
        "Timestamp": "1556275480515.774170",
        "TenantClass": 0,
        "Source": "Client.java:1104",
        "ThreadID": 1,
        "ThreadName": "",
        "EventID": "4E5FE32362AAB3F3",
        "ProcessID": 21035
      },
      {
        "Cycles": 0,
        "Agent": "edu.brown.cs.systems.xtrace.logging.BaggageWrappers",
        "ProcessName": "Name",
        "TaskID": "FD6E68527734D5BC",
        "ParentEventID": [
          "F7E4E62233AB85D8"
        ],
        "Label": "Forking current baggage with Baggage.fork()",
        "Title": "X-Trace Task",
        "Host": "pinky19.mpi-sws.org",
        "HRT": 25491840575663913,
        "Operation": "fork",
        "Timestamp": "1556275480515.834473",
        "TenantClass": 0,
        "Source": "Server.java:550",
        "ThreadID": 48,
        "ThreadName": "",
        "EventID": "23BF9F100DD1B23F",
        "BaggageBytes": "[[248 5] [240 0] [0 253 110 104 82 119 52 213 188] [240 1] [0 247 228 230 34 51 171 133 216] [240 3] [0 2]]",
        "ProcessID": 2171
      },
      {
        "Cycles": 0,
        "Agent": "Execution-CPU",
        "ProcessName": "Name",
        "TaskID": "FD6E68527734D5BC",
        "ParentEventID": [
          "23BF9F100DD1B23F"
        ],
        "Label": "unset",
        "Title": "X-Trace Task",
        "Host": "pinky19.mpi-sws.org",
        "Duration": "18663",
        "HRT": 25491840575680187,
        "Operation": "unset",
        "Timestamp": "1556275480515.850586",
        "TenantClass": 0,
        "Source": "Server.java:1828",
        "ThreadID": 48,
        "ThreadName": "",
        "EventID": "422B95648C672EAE",
        "BaggageBytes": "[[248 5] [240 0] [0 253 110 104 82 119 52 213 188] [240 1] [0 35 191 159 16 13 209 178 63] [240 3] [0 2]]",
        "ProcessID": 2171
      },
      {
        "Cycles": 0,
        "Agent": "Execution-CPU",
        "ProcessName": "Name",
        "TaskID": "FD6E68527734D5BC",
        "ParentEventID": [
          "3DCDA54C2E06192A"
        ],
        "Label": "set",
        "Title": "X-Trace Task",
        "Host": "pinky19.mpi-sws.org",
        "HRT": 25491840575643344,
        "Operation": "set",
        "Timestamp": "1556275480515.813721",
        "TenantClass": 0,
        "Source": "Server.java:1840",
        "ThreadID": 48,
        "ThreadName": "",
        "EventID": "F7E4E62233AB85D8",
        "BaggageBytes": "[[248 5] [240 0] [0 253 110 104 82 119 52 213 188] [240 1] [0 61 205 165 76 46 6 25 42] [240 3] [0 2]]",
        "ProcessID": 2171
      },
      {
        "Cycles": 0,
        "Agent": "org.apache.hadoop.ipc.Server",
        "ProcessName": "Name",
        "TaskID": "FD6E68527734D5BC",
        "ParentEventID": [
          "F537FC3CF64EA6C3"
        ],
        "Label": "getBlockLocations in org.apache.hadoop.hdfs.protocol.ClientProtocol",
        "Title": "X-Trace Task",
        "Host": "pinky19.mpi-sws.org",
        "HRT": 25491840575723235,
        "Timestamp": "1556275480515.893555",
        "TenantClass": 0,
        "Source": "ProtobufRpcEngine.java:601",
        "ThreadID": 57,
        "ThreadName": "",
        "EventID": "743860A8133C41C0",
        "BaggageBytes": "[[248 5] [240 0] [0 253 110 104 82 119 52 213 188] [240 1] [0 245 55 252 60 246 78 166 195] [240 3] [0 2]]",
        "ProcessID": 2171
      },
      {
        "Cycles": 0,
        "Agent": "Execution-CPU",
        "ProcessName": "Name",
        "TaskID": "FD6E68527734D5BC",
        "ParentEventID": [
          "23BF9F100DD1B23F"
        ],
        "Label": "set",
        "Title": "X-Trace Task",
        "Host": "pinky19.mpi-sws.org",
        "HRT": 25491840575688960,
        "Operation": "set",
        "Timestamp": "1556275480515.859375",
        "TenantClass": 0,
        "Source": "Server.java:2071",
        "ThreadID": 57,
        "ThreadName": "",
        "EventID": "F537FC3CF64EA6C3",
        "BaggageBytes": "[[248 5] [240 0] [0 253 110 104 82 119 52 213 188] [240 1] [0 35 191 159 16 13 209 178 63] [240 3] [0 2]]",
        "ProcessID": 2171
      },
      {
        "Cycles": 0,
        "Agent": "org.apache.hadoop.hdfs.server.namenode.FSNamesystem.audit",
        "ProcessName": "Name",
        "TaskID": "FD6E68527734D5BC",
        "ParentEventID": [
          "743860A8133C41C0"
        ],
        "Label": "allowed=true\tugi=plascas (auth:SIMPLE)\tip=/139.19.171.63\tcmd=open\tsrc=/ds/Q8JMyDzrnwJ6Srid\tdst=null\tperm=null\tproto=rpc",
        "Title": "X-Trace Task",
        "Host": "pinky19.mpi-sws.org",
        "HRT": 25491840575769865,
        "Timestamp": "1556275480515.940186",
        "TenantClass": 0,
        "Source": "FSNamesystem.java:8313",
        "ThreadID": 57,
        "ThreadName": "",
        "EventID": "B15A2EA38FA3ED06",
        "BaggageBytes": "[[248 5] [240 0] [0 253 110 104 82 119 52 213 188] [240 1] [0 116 56 96 168 19 60 65 192] [240 3] [0 2]]",
        "ProcessID": 2171
      },
      {
        "Cycles": 0,
        "Agent": "Execution-CPU",
        "ProcessName": "Name",
        "TaskID": "FD6E68527734D5BC",
        "ParentEventID": [
          "B1A60627432A83C8"
        ],
        "Label": "unset",
        "Title": "X-Trace Task",
        "Host": "pinky19.mpi-sws.org",
        "Duration": "204718",
        "HRT": 25491840575916879,
        "Operation": "unset",
        "Timestamp": "1556275480516.087402",
        "TenantClass": 0,
        "Source": "Server.java:1058",
        "ThreadID": 57,
        "ThreadName": "",
        "EventID": "C3BA1124564816C2",
        "BaggageBytes": "[[248 5] [240 0] [0 253 110 104 82 119 52 213 188] [240 1] [0 177 166 6 39 67 42 131 200] [240 3] [0 2]]",
        "ProcessID": 2171
      },
      {
        "Cycles": 0,
        "Agent": "Execution-CPU",
        "ProcessName": "Read",
        "TaskID": "FD6E68527734D5BC",
        "ParentEventID": [
          "B1A60627432A83C8"
        ],
        "Label": "set",
        "Title": "X-Trace Task",
        "Host": "pinky19.mpi-sws.org",
        "HRT": 25491840575972393,
        "Operation": "set",
        "Timestamp": "1556275480516.121582",
        "TenantClass": 0,
        "Source": "Client.java:302",
        "ThreadID": 37,
        "ThreadName": "",
        "EventID": "33819698216C6A17",
        "ProcessID": 21035
      },
      {
        "Cycles": 0,
        "Agent": "edu.brown.cs.systems.xtrace.logging.BaggageWrappers",
        "ProcessName": "Name",
        "TaskID": "FD6E68527734D5BC",
        "ParentEventID": [
          "B15A2EA38FA3ED06"
        ],
        "Label": "Forking current baggage with Baggage.fork()",
        "Title": "X-Trace Task",
        "Host": "pinky19.mpi-sws.org",
        "HRT": 25491840575815727,
        "Operation": "fork",
        "Timestamp": "1556275480515.986084",
        "TenantClass": 0,
        "Source": "Server.java:2398",
        "ThreadID": 57,
        "ThreadName": "",
        "EventID": "B1A60627432A83C8",
        "BaggageBytes": "[[248 5] [240 0] [0 253 110 104 82 119 52 213 188] [240 1] [0 177 90 46 163 143 163 237 6] [240 3] [0 2]]",
        "ProcessID": 2171
      },
      {
        "Cycles": 0,
        "Agent": "Execution-CPU",
        "ProcessName": "Read",
        "TaskID": "FD6E68527734D5BC",
        "ParentEventID": [
          "33819698216C6A17"
        ],
        "Label": "unset",
        "Title": "X-Trace Task",
        "Host": "pinky19.mpi-sws.org",
        "Duration": "9810",
        "HRT": 25491840575996789,
        "Operation": "unset",
        "Timestamp": "1556275480516.145752",
        "TenantClass": 0,
        "Source": "Client.java:1168",
        "ThreadID": 37,
        "ThreadName": "",
        "EventID": "18049592D33F3080",
        "ProcessID": 21035
      },
      {
        "Cycles": 0,
        "Agent": "Execution-Sleep",
        "ProcessName": "Read",
        "TaskID": "FD6E68527734D5BC",
        "ParentEventID": [
          "4E5FE32362AAB3F3"
        ],
        "Label": "waited",
        "Title": "X-Trace Task",
        "Host": "pinky19.mpi-sws.org",
        "Duration": "381834",
        "HRT": 25491840576017093,
        "Operation": "waited",
        "Timestamp": "1556275480516.166260",
        "TenantClass": 0,
        "Source": "Client.java:1537",
        "ThreadID": 1,
        "ThreadName": "",
        "EventID": "C14654040CF86368",
        "ProcessID": 21035
      },
      {
        "Cycles": 0,
        "Agent": "edu.brown.cs.systems.xtrace.logging.BaggageWrappers",
        "ProcessName": "Read",
        "TaskID": "FD6E68527734D5BC",
        "ParentEventID": [
          "C14654040CF86368",
          "18049592D33F3080"
        ],
        "Label": "Merged current baggage with other baggage",
        "Title": "X-Trace Task",
        "Host": "pinky19.mpi-sws.org",
        "HRT": 25491840576039311,
        "Operation": "join",
        "Timestamp": "1556275480516.188477",
        "TenantClass": 0,
        "Source": "Client.java:1545",
        "ThreadID": 1,
        "ThreadName": "",
        "EventID": "08CD2B10ABE6CB6F",
        "ProcessID": 21035
      },
      {
        "Cycles": 0,
        "Agent": "org.apache.hadoop.ipc.ProtobufRpcEngine",
        "ProcessName": "Read",
        "TaskID": "FD6E68527734D5BC",
        "ParentEventID": [
          "08CD2B10ABE6CB6F"
        ],
        "Label": "org.apache.hadoop.hdfs.protocol.ClientProtocol.getBlockLocations completed",
        "Title": "X-Trace Task",
        "Host": "pinky19.mpi-sws.org",
        "HRT": 25491840576078487,
        "Timestamp": "1556275480516.227539",
        "TenantClass": 0,
        "Source": "ProtobufRpcEngine.java:275",
        "ThreadID": 1,
        "ThreadName": "",
        "EventID": "2B77147C6A721C0B",
        "ProcessID": 21035
      },
      {
        "Cycles": 0,
        "Agent": "Execution-CPU",
        "ProcessName": "Data",
        "TaskID": "FD6E68527734D5BC",
        "ParentEventID": [
          "85F289FBB9C2459A"
        ],
        "Label": "set",
        "Title": "X-Trace Task",
        "Host": "pinky19.mpi-sws.org",
        "HRT": 25491840576271415,
        "Operation": "set",
        "Timestamp": "1556275480516.415771",
        "TenantClass": 0,
        "Source": "Receiver.java:117",
        "ThreadID": 9602,
        "ThreadName": "",
        "EventID": "963C061464AC05A2",
        "BaggageBytes": "[[248 5] [240 0] [0 253 110 104 82 119 52 213 188] [240 1] [0 133 242 137 251 185 194 69 154] [240 3] [0 2]]",
        "ProcessID": 2319
      },
      {
        "Cycles": 0,
        "Agent": "edu.brown.cs.systems.xtrace.logging.BaggageWrappers",
        "ProcessName": "Read",
        "TaskID": "FD6E68527734D5BC",
        "ParentEventID": [
          "2B77147C6A721C0B"
        ],
        "Label": "Forking current baggage with Baggage.fork()",
        "Title": "X-Trace Task",
        "Host": "pinky19.mpi-sws.org",
        "HRT": 25491840576145690,
        "Operation": "fork",
        "Timestamp": "1556275480516.294678",
        "TenantClass": 0,
        "Source": "DataTransferProtoUtil.java:94",
        "ThreadID": 1,
        "ThreadName": "",
        "EventID": "85F289FBB9C2459A",
        "ProcessID": 21035
      },
      {
        "Cycles": 0,
        "Agent": "edu.brown.cs.systems.xtrace.logging.XTraceInit",
        "ProcessName": "Data",
        "TaskID": "FD6E68527734D5BC",
        "ParentEventID": [
          "963C061464AC05A2"
        ],
        "Label": "Thread.setName: DataXceiver for client DFSClient_NONMAPREDUCE_1377588049_1 at /139.19.171.63:36074 [Sending block BP-1633380353-139.19.171.63-1554193446451:blk_1073755899_15075]",
        "Title": "X-Trace Task",
        "Host": "pinky19.mpi-sws.org",
        "HRT": 25491840576301235,
        "Timestamp": "1556275480516.445801",
        "TenantClass": 0,
        "Source": "DataXceiver.java:168",
        "ThreadID": 9602,
        "ThreadName": "",
        "EventID": "C7B41833AB885BB8",
        "BaggageBytes": "[[248 5] [240 0] [0 253 110 104 82 119 52 213 188] [240 1] [0 150 60 6 20 100 172 5 162] [240 3] [0 2]]",
        "ProcessID": 2319
      },
      {
        "Cycles": 0,
        "Agent": "Execution-Sleep",
        "ProcessName": "Read",
        "TaskID": "FD6E68527734D5BC",
        "ParentEventID": [
          "85F289FBB9C2459A"
        ],
        "Label": "waited",
        "Title": "X-Trace Task",
        "Host": "pinky19.mpi-sws.org",
        "Duration": "202351",
        "HRT": 25491840576448809,
        "Operation": "waited",
        "Timestamp": "1556275480516.597900",
        "TenantClass": 0,
        "Source": "SocketIOWithTimeout.java:335",
        "ThreadID": 1,
        "ThreadName": "",
        "EventID": "F8678C6CF8C0B4D3",
        "ProcessID": 21035
      },
      {
        "Cycles": 0,
        "Agent": "edu.brown.cs.systems.xtrace.logging.BaggageWrappers",
        "ProcessName": "Data",
        "TaskID": "FD6E68527734D5BC",
        "ParentEventID": [
          "C7B41833AB885BB8"
        ],
        "Label": "Forking current baggage with Baggage.fork()",
        "Title": "X-Trace Task",
        "Host": "pinky19.mpi-sws.org",
        "HRT": 25491840576383258,
        "Operation": "fork",
        "Timestamp": "1556275480516.527588",
        "TenantClass": 0,
        "Source": "DataXceiver.java:1257",
        "ThreadID": 9602,
        "ThreadName": "",
        "EventID": "274963C4F7C8BF25",
        "BaggageBytes": "[[248 5] [240 0] [0 253 110 104 82 119 52 213 188] [240 1] [0 199 180 24 51 171 136 91 184] [240 3] [0 2]]",
        "ProcessID": 2319
      },
      {
        "Cycles": 0,
        "Agent": "edu.brown.cs.systems.xtrace.logging.BaggageWrappers",
        "ProcessName": "Data",
        "TaskID": "FD6E68527734D5BC",
        "ParentEventID": [
          "274963C4F7C8BF25"
        ],
        "Label": "Forking current baggage with Baggage.fork()",
        "Title": "X-Trace Task",
        "Host": "pinky19.mpi-sws.org",
        "HRT": 25491840576448588,
        "Operation": "fork",
        "Timestamp": "1556275480516.593018",
        "TenantClass": 0,
        "Source": "PacketHeader.java:95",
        "ThreadID": 9602,
        "ThreadName": "",
        "EventID": "24C1B7E00A8695CC",
        "BaggageBytes": "[[248 5] [240 0] [0 253 110 104 82 119 52 213 188] [240 1] [0 39 73 99 196 247 200 191 37] [240 3] [0 2]]",
        "ProcessID": 2319
      },
      {
        "Cycles": 0,
        "Agent": "Execution-Sleep",
        "ProcessName": "Data",
        "TaskID": "FD6E68527734D5BC",
        "ParentEventID": [
          "24C1B7E00A8695CC"
        ],
        "Label": "waited",
        "Title": "X-Trace Task",
        "Host": "pinky19.mpi-sws.org",
        "Duration": "5201",
        "HRT": 25491840576525528,
        "Operation": "waited",
        "Timestamp": "1556275480516.669922",
        "TenantClass": 0,
        "Source": "SocketIOWithTimeout.java:335",
        "ThreadID": 9602,
        "ThreadName": "",
        "EventID": "7ED46A2FDF9D27B1",
        "BaggageBytes": "[[248 5] [240 0] [0 253 110 104 82 119 52 213 188] [240 1] [0 36 193 183 224 10 134 149 204] [240 3] [0 2]]",
        "ProcessID": 2319
      },
      {
        "Cycles": 0,
        "Agent": "edu.brown.cs.systems.xtrace.logging.BaggageWrappers",
        "ProcessName": "Read",
        "TaskID": "FD6E68527734D5BC",
        "ParentEventID": [
          "F8678C6CF8C0B4D3",
          "274963C4F7C8BF25"
        ],
        "Label": "Merged current baggage with other baggage",
        "Title": "X-Trace Task",
        "Host": "pinky19.mpi-sws.org",
        "HRT": 25491840576532161,
        "Operation": "join",
        "Timestamp": "1556275480516.681152",
        "TenantClass": 0,
        "Source": "RemoteBlockReader2.java:429",
        "ThreadID": 1,
        "ThreadName": "",
        "EventID": "43CF7D008221E2AC",
        "ProcessID": 21035
      },
      {
        "Cycles": 0,
        "Agent": "edu.brown.cs.systems.xtrace.logging.BaggageWrappers",
        "ProcessName": "Read",
        "TaskID": "FD6E68527734D5BC",
        "ParentEventID": [
          "43CF7D008221E2AC",
          "24C1B7E00A8695CC"
        ],
        "Label": "Merged current baggage with other baggage",
        "Title": "X-Trace Task",
        "Host": "pinky19.mpi-sws.org",
        "HRT": 25491840576632616,
        "Operation": "join",
        "Timestamp": "1556275480516.781738",
        "TenantClass": 0,
        "Source": "PacketHeader.java:168",
        "ThreadID": 1,
        "ThreadName": "",
        "EventID": "189522DD0CDC22EA",
        "ProcessID": 21035
      },
      {
        "Cycles": 0,
        "Agent": "edu.brown.cs.systems.xtrace.logging.BaggageWrappers",
        "ProcessName": "Read",
        "TaskID": "FD6E68527734D5BC",
        "ParentEventID": [
          "C8482D4CF7F2690A",
          "189522DD0CDC22EA"
        ],
        "Label": "Merged current baggage with other baggage",
        "Title": "X-Trace Task",
        "Host": "pinky19.mpi-sws.org",
        "HRT": 25491840576697080,
        "Operation": "join",
        "Timestamp": "1556275480516.846191",
        "TenantClass": 0,
        "Source": "PacketHeader.java:168",
        "ThreadID": 1,
        "ThreadName": "",
        "EventID": "28EB01BFE7C03CF7",
        "ProcessID": 21035
      },
      {
        "Cycles": 0,
        "Agent": "edu.brown.cs.systems.xtrace.logging.BaggageWrappers",
        "ProcessName": "Data",
        "TaskID": "FD6E68527734D5BC",
        "ParentEventID": [
          "7ED46A2FDF9D27B1"
        ],
        "Label": "Forking current baggage with Baggage.fork()",
        "Title": "X-Trace Task",
        "Host": "pinky19.mpi-sws.org",
        "HRT": 25491840576596280,
        "Operation": "fork",
        "Timestamp": "1556275480516.740723",
        "TenantClass": 0,
        "Source": "PacketHeader.java:95",
        "ThreadID": 9602,
        "ThreadName": "",
        "EventID": "C8482D4CF7F2690A",
        "BaggageBytes": "[[248 5] [240 0] [0 253 110 104 82 119 52 213 188] [240 1] [0 126 212 106 47 223 157 39 177] [240 3] [0 2]]",
        "ProcessID": 2319
      },
      {
        "Cycles": 0,
        "Agent": "edu.brown.cs.systems.xtrace.logging.BaggageWrappers",
        "ProcessName": "Read",
        "TaskID": "FD6E68527734D5BC",
        "ParentEventID": [
          "28EB01BFE7C03CF7"
        ],
        "Label": "Forking current baggage with Baggage.fork()",
        "Title": "X-Trace Task",
        "Host": "pinky19.mpi-sws.org",
        "HRT": 25491840576707235,
        "Operation": "fork",
        "Timestamp": "1556275480516.856201",
        "TenantClass": 0,
        "Source": "RemoteBlockReader2.java:361",
        "ThreadID": 1,
        "ThreadName": "",
        "EventID": "3A739AAE22B459BD",
        "ProcessID": 21035
      },
      {
        "Cycles": 0,
        "Agent": "edu.brown.cs.systems.xtrace.logging.BaggageWrappers",
        "ProcessName": "Data",
        "TaskID": "FD6E68527734D5BC",
        "ParentEventID": [
          "3A739AAE22B459BD",
          "178BAFCE8B823DA0"
        ],
        "Label": "Merged current baggage with other baggage",
        "Title": "X-Trace Task",
        "Host": "pinky19.mpi-sws.org",
        "HRT": 25491840576816993,
        "Operation": "join",
        "Timestamp": "1556275480516.961426",
        "TenantClass": 0,
        "Source": "DataXceiver.java:574",
        "ThreadID": 9602,
        "ThreadName": "",
        "EventID": "A4E175F949CB255E",
        "BaggageBytes": "[[248 5] [240 0] [0 253 110 104 82 119 52 213 188] [240 1] [0 23 139 175 206 139 130 61 160] [0 58 115 154 174 34 180 89 189] [240 3] [0 2]]",
        "ProcessID": 2319
      },
      {
        "Cycles": 0,
        "Agent": "Execution-Sleep",
        "ProcessName": "Data",
        "TaskID": "FD6E68527734D5BC",
        "ParentEventID": [
          "C8482D4CF7F2690A"
        ],
        "Label": "waited",
        "Title": "X-Trace Task",
        "Host": "pinky19.mpi-sws.org",
        "Duration": "54115",
        "HRT": 25491840576754249,
        "Operation": "waited",
        "Timestamp": "1556275480516.898682",
        "TenantClass": 0,
        "Source": "SocketIOWithTimeout.java:335",
        "ThreadID": 9602,
        "ThreadName": "",
        "EventID": "178BAFCE8B823DA0",
        "BaggageBytes": "[[248 5] [240 0] [0 253 110 104 82 119 52 213 188] [240 1] [0 200 72 45 76 247 242 105 10] [240 3] [0 2]]",
        "ProcessID": 2319
      },
      {
        "Cycles": 0,
        "Agent": "Execution-CPU",
        "ProcessName": "Data",
        "TaskID": "FD6E68527734D5BC",
        "ParentEventID": [
          "A4E175F949CB255E"
        ],
        "Label": "unset",
        "Title": "X-Trace Task",
        "Host": "pinky19.mpi-sws.org",
        "Duration": "554935",
        "HRT": 25491840576847086,
        "Operation": "unset",
        "Timestamp": "1556275480516.991455",
        "TenantClass": 0,
        "Source": "DataXceiver.java:261",
        "ThreadID": 9602,
        "ThreadName": "",
        "EventID": "9098B61BC02A7B0A",
        "BaggageBytes": "[[248 5] [240 0] [0 253 110 104 82 119 52 213 188] [240 1] [0 164 225 117 249 73 203 37 94] [240 3] [0 2]]",
        "ProcessID": 2319
      },
      {
        "Cycles": 0,
        "Agent": "edu.brown.cs.systems.retro.benchmarks.hdfs_client.Reader",
        "ProcessName": "Read",
        "TaskID": "FD6E68527734D5BC",
        "ParentEventID": [
          "0"
        ],
        "Label": "Reading file",
        "Title": "X-Trace Task",
        "Host": "pinky19.mpi-sws.org",
        "HRT": 25491840575412892,
        "Timestamp": "1556275480515.562012",
        "TenantClass": 0,
        "ThreadID": 1,
        "ThreadName": "",
        "EventID": "613CBFB59FFB5869",
        "ProcessID": 21035,
        "Tag": [
          "reader_1kb",
          "Read Size: 1024"
        ]
      }
    ]
  }
]