[
  {
    "id": "21F5BFFB8017B0E9",
    "reports": [
      {
        "Cycles": 0,
        "Agent": "Execution-CPU",
        "ProcessName": "Read",
        "TaskID": "21F5BFFB8017B0E9",
        "ParentEventID": [
          "3472ADBAEC0C90AE"
        ],
        "Label": "unset",
        "Title": "X-Trace Task",
        "Host": "pinky19.mpi-sws.org",
        "Duration": "21347313",
        "HRT": 25491817654960990,
        "Operation": "unset",
        "Timestamp": "1556275457595.199951",
        "TenantClass": 0,
        "Source": "Client.java:1027",
        "ThreadID": 1,
        "ThreadName": "",
        "EventID": "ED1C512986B2D0C0",
        "ProcessID": 21035
      },
      {
        "Cycles": 0,
        "Agent": "org.apache.hadoop.ipc.ProtobufRpcEngine",
        "ProcessName": "Read",
        "TaskID": "21F5BFFB8017B0E9",
        "ParentEventID": [
          "CA4CAEA797ABC37A"
        ],
        "Label": "Invoking org.apache.hadoop.hdfs.protocol.ClientProtocol.getBlockLocations",
        "Title": "X-Trace Task",
        "Host": "pinky19.mpi-sws.org",
        "HRT": 25491817654929508,
        "Timestamp": "1556275457595.168457",
        "TenantClass": 0,
        "Source": "ProtobufRpcEngine.java:228",
        "ThreadID": 1,
        "ThreadName": "",
        "EventID": "3472ADBAEC0C90AE",
        "ProcessID": 21035
      },
      {
        "Cycles": 0,
        "Agent": "edu.brown.cs.systems.retro.benchmarks.hdfs_client.Reader",
        "ProcessName": "Read",
        "TaskID": "21F5BFFB8017B0E9",
        "ParentEventID": [
          "038B2C5BBEBBF93F"
        ],
        "Label": "Reading file",
        "Title": "X-Trace Task",
        "Host": "pinky19.mpi-sws.org",
        "HRT": 25491817654866574,
        "Timestamp": "1556275457595.105469",
        "TenantClass": 0,
        "ThreadID": 1,
        "ThreadName": "",
        "EventID": "CA4CAEA797ABC37A",
        "ProcessID": 21035
      },
      {
        "Cycles": 0,
        "Agent": "Execution-CPU",
        "ProcessName": "Read",
        "TaskID": "21F5BFFB8017B0E9",
        "ParentEventID": [
          "ED1C512986B2D0C0"
        ],
        "Label": "set",
        "Title": "X-Trace Task",
        "Host": "pinky19.mpi-sws.org",
        "HRT": 25491817654991271,
        "Operation": "set",
        "Timestamp": "1556275457595.230225",
        "TenantClass": 0,
        "Source": "Client.java:1032",
        "ThreadID": 41,
        "ThreadName": "",
        "EventID": "CEE2977E0F86851A",
        "ProcessID": 21035
      },
      {
        "Cycles": 0,
        "Agent": "edu.brown.cs.systems.xtrace.logging.BaggageWrappers",
        "ProcessName": "Read",
        "TaskID": "21F5BFFB8017B0E9",
        "ParentEventID": [
          "CEE2977E0F86851A"
        ],
        "Label": "Forking current baggage with Baggage.fork()",
        "Title": "X-Trace Task",
        "Host": "pinky19.mpi-sws.org",
        "HRT": 25491817655015518,
        "Operation": "fork",
        "Timestamp": "1556275457595.254395",
        "TenantClass": 0,
        "Source": "Client.java:1043",
        "ThreadID": 41,
        "ThreadName": "",
        "EventID": "7F86BE82E0F11A9F",
        "ProcessID": 21035
      },
      {
        "Cycles": 0,
        "Agent": "Execution-CPU",
        "ProcessName": "Read",
        "TaskID": "21F5BFFB8017B0E9",
        "ParentEventID": [
          "7F86BE82E0F11A9F"
        ],
        "Label": "unset",
        "Title": "X-Trace Task",
        "Host": "pinky19.mpi-sws.org",
        "Duration": "66364",
        "HRT": 25491817655081130,
        "Operation": "unset",
        "Timestamp": "1556275457595.320068",
        "TenantClass": 0,
        "Source": "Client.java:1062",
        "ThreadID": 41,
        "ThreadName": "",
        "EventID": "6369FE898A1B4DA5",
        "ProcessID": 21035
      },
      {
        "Cycles": 0,
        "Agent": "Execution-CPU",
        "ProcessName": "Name",
        "TaskID": "21F5BFFB8017B0E9",
        "ParentEventID": [
          "7F86BE82E0F11A9F"
        ],
        "Label": "set",
        "Title": "X-Trace Task",
        "Host": "pinky19.mpi-sws.org",
        "HRT": 25491817655155901,
        "Operation": "set",
        "Timestamp": "1556275457595.407715",
        "TenantClass": 0,
        "Source": "Server.java:1840",
        "ThreadID": 48,
        "ThreadName": "",
        "EventID": "BDBB5CE424A4A70B",
        "BaggageBytes": "[[248 5] [240 0] [0 33 245 191 251 128 23 176 233] [240 1] [0 127 134 190 130 224 241 26 159] [240 3] [0 2]]",
        "ProcessID": 2171
      },
      {
        "Cycles": 0,
        "Agent": "Execution-CPU",
        "ProcessName": "Read",
        "TaskID": "21F5BFFB8017B0E9",
        "ParentEventID": [
          "6369FE898A1B4DA5"
        ],
        "Label": "set",
        "Title": "X-Trace Task",
        "Host": "pinky19.mpi-sws.org",
        "HRT": 25491817655105765,
        "Operation": "set",
        "Timestamp": "1556275457595.344727",
        "TenantClass": 0,
        "Source": "Client.java:1104",
        "ThreadID": 1,
        "ThreadName": "",
        "EventID": "A13607CE98C35BF7",
        "ProcessID": 21035
      },
      {
        "Cycles": 0,
        "Agent": "edu.brown.cs.systems.xtrace.logging.BaggageWrappers",
        "ProcessName": "Name",
        "TaskID": "21F5BFFB8017B0E9",
        "ParentEventID": [
          "BDBB5CE424A4A70B"
        ],
        "Label": "Forking current baggage with Baggage.fork()",
        "Title": "X-Trace Task",
        "Host": "pinky19.mpi-sws.org",
        "HRT": 25491817655181401,
        "Operation": "fork",
        "Timestamp": "1556275457595.433350",
        "TenantClass": 0,
        "Source": "Server.java:550",
        "ThreadID": 48,
        "ThreadName": "",
        "EventID": "70D8BEEF1157D487",
        "BaggageBytes": "[[248 5] [240 0] [0 33 245 191 251 128 23 176 233] [240 1] [0 189 187 92 228 36 164 167 11] [240 3] [0 2]]",
        "ProcessID": 2171
      },
      {
        "Cycles": 0,
        "Agent": "Execution-CPU",
        "ProcessName": "Name",
        "TaskID": "21F5BFFB8017B0E9",
        "ParentEventID": [
          "70D8BEEF1157D487"
        ],
        "Label": "unset",
        "Title": "X-Trace Task",
        "Host": "pinky19.mpi-sws.org",
        "Duration": "22052",
        "HRT": 25491817655200059,
        "Operation": "unset",
        "Timestamp": "1556275457595.451904",
        "TenantClass": 0,
        "Source": "Server.java:1828",
        "ThreadID": 48,
        "ThreadName": "",
        "EventID": "CC1782407D9638B1",
        "BaggageBytes": "[[248 5] [240 0] [0 33 245 191 251 128 23 176 233] [240 1] [0 112 216 190 239 17 87 212 135] [240 3] [0 2]]",
        "ProcessID": 2171
      },
      {
        "Cycles": 0,
        "Agent": "org.apache.hadoop.ipc.Server",
        "ProcessName": "Name",
        "TaskID": "21F5BFFB8017B0E9",
        "ParentEventID": [
          "0BFB23904A46CBBC"
        ],
        "Label": "getBlockLocations in org.apache.hadoop.hdfs.protocol.ClientProtocol",
        "Title": "X-Trace Task",
        "Host": "pinky19.mpi-sws.org",
        "HRT": 25491817655242373,
        "Timestamp": "1556275457595.494141",
        "TenantClass": 0,
        "Source": "ProtobufRpcEngine.java:601",
        "ThreadID": 55,
        "ThreadName": "",
        "EventID": "655AEEAC2DB29696",
        "BaggageBytes": "[[248 5] [240 0] [0 33 245 191 251 128 23 176 233] [240 1] [0 11 251 35 144 74 70 203 188] [240 3] [0 2]]",
        "ProcessID": 2171
      },
      {
        "Cycles": 0,
        "Agent": "org.apache.hadoop.hdfs.server.namenode.FSNamesystem.audit",
        "ProcessName": "Name",
        "TaskID": "21F5BFFB8017B0E9",
        "ParentEventID": [
          "655AEEAC2DB29696"
        ],
        "Label": "allowed=true\tugi=plascas (auth:SIMPLE)\tip=/139.19.171.63\tcmd=open\tsrc=/ds/3q4aLtFy1dUBw6T9\tdst=null\tperm=null\tproto=rpc",
        "Title": "X-Trace Task",
        "Host": "pinky19.mpi-sws.org",
        "HRT": 25491817655294561,
        "Timestamp": "1556275457595.546387",
        "TenantClass": 0,
        "Source": "FSNamesystem.java:8313",
        "ThreadID": 55,
        "ThreadName": "",
        "EventID": "94EE695908EE3791",
        "BaggageBytes": "[[248 5] [240 0] [0 33 245 191 251 128 23 176 233] [240 1] [0 101 90 238 172 45 178 150 150] [240 3] [0 2]]",
        "ProcessID": 2171
      },
      {
        "Cycles": 0,
        "Agent": "edu.brown.cs.systems.xtrace.logging.BaggageWrappers",
        "ProcessName": "Name",
        "TaskID": "21F5BFFB8017B0E9",
        "ParentEventID": [
          "94EE695908EE3791"
        ],
        "Label": "Forking current baggage with Baggage.fork()",
        "Title": "X-Trace Task",
        "Host": "pinky19.mpi-sws.org",
        "HRT": 25491817655344207,
        "Operation": "fork",
        "Timestamp": "1556275457595.595947",
        "TenantClass": 0,
        "Source": "Server.java:2398",
        "ThreadID": 55,
        "ThreadName": "",
        "EventID": "5DEE0EEE21FBFBD1",
        "BaggageBytes": "[[248 5] [240 0] [0 33 245 191 251 128 23 176 233] [240 1] [0 148 238 105 89 8 238 55 145] [240 3] [0 2]]",
        "ProcessID": 2171
      },
      {
        "Cycles": 0,
        "Agent": "Execution-CPU",
        "ProcessName": "Name",
        "TaskID": "21F5BFFB8017B0E9",
        "ParentEventID": [
          "70D8BEEF1157D487"
        ],
        "Label": "set",
        "Title": "X-Trace Task",
        "Host": "pinky19.mpi-sws.org",
        "HRT": 25491817655207259,
        "Operation": "set",
        "Timestamp": "1556275457595.459229",
        "TenantClass": 0,
        "Source": "Server.java:2071",
        "ThreadID": 55,
        "ThreadName": "",
        "EventID": "0BFB23904A46CBBC",
        "BaggageBytes": "[[248 5] [240 0] [0 33 245 191 251 128 23 176 233] [240 1] [0 112 216 190 239 17 87 212 135] [240 3] [0 2]]",
        "ProcessID": 2171
      },
      {
        "Cycles": 0,
        "Agent": "Execution-CPU",
        "ProcessName": "Name",
        "TaskID": "21F5BFFB8017B0E9",
        "ParentEventID": [
          "5DEE0EEE21FBFBD1"
        ],
        "Label": "unset",
        "Title": "X-Trace Task",
        "Host": "pinky19.mpi-sws.org",
        "Duration": "232346",
        "HRT": 25491817655460967,
        "Operation": "unset",
        "Timestamp": "1556275457595.712891",
        "TenantClass": 0,
        "Source": "Server.java:1058",
        "ThreadID": 55,
        "ThreadName": "",
        "EventID": "3C9061D8B152AF8E",
        "BaggageBytes": "[[248 5] [240 0] [0 33 245 191 251 128 23 176 233] [240 1] [0 93 238 14 238 33 251 251 209] [240 3] [0 2]]",
        "ProcessID": 2171
      },
      {
        "Cycles": 0,
        "Agent": "Execution-CPU",
        "ProcessName": "Read",
        "TaskID": "21F5BFFB8017B0E9",
        "ParentEventID": [
          "5DEE0EEE21FBFBD1"
        ],
        "Label": "set",
        "Title": "X-Trace Task",
        "Host": "pinky19.mpi-sws.org",
        "HRT": 25491817655510429,
        "Operation": "set",
        "Timestamp": "1556275457595.749268",
        "TenantClass": 0,
        "Source": "Client.java:302",
        "ThreadID": 37,
        "ThreadName": "",
        "EventID": "B17A69671C77BC2F",
        "ProcessID": 21035
      },
      {
        "Cycles": 0,
        "Agent": "Execution-Sleep",
        "ProcessName": "Read",
        "TaskID": "21F5BFFB8017B0E9",
        "ParentEventID": [
          "A13607CE98C35BF7"
        ],
        "Label": "waited",
        "Title": "X-Trace Task",
        "Host": "pinky19.mpi-sws.org",
        "Duration": "437839",
        "HRT": 25491817655555899,
        "Operation": "waited",
        "Timestamp": "1556275457595.794678",
        "TenantClass": 0,
        "Source": "Client.java:1537",
        "ThreadID": 1,
        "ThreadName": "",
        "EventID": "630461FECC5425C4",
        "ProcessID": 21035
      },
      {
        "Cycles": 0,
        "Agent": "Execution-CPU",
        "ProcessName": "Read",
        "TaskID": "21F5BFFB8017B0E9",
        "ParentEventID": [
          "B17A69671C77BC2F"
        ],
        "Label": "unset",
        "Title": "X-Trace Task",
        "Host": "pinky19.mpi-sws.org",
        "Duration": "10672",
        "HRT": 25491817655536791,
        "Operation": "unset",
        "Timestamp": "1556275457595.775635",
        "TenantClass": 0,
        "Source": "Client.java:1168",
        "ThreadID": 37,
        "ThreadName": "",
        "EventID": "CE3D1B60E521D6F1",
        "ProcessID": 21035
      },
      {
        "Cycles": 0,
        "Agent": "edu.brown.cs.systems.xtrace.logging.BaggageWrappers",
        "ProcessName": "Read",
        "TaskID": "21F5BFFB8017B0E9",
        "ParentEventID": [
          "630461FECC5425C4",
          "CE3D1B60E521D6F1"
        ],
        "Label": "Merged current baggage with other baggage",
        "Title": "X-Trace Task",
        "Host": "pinky19.mpi-sws.org",
        "HRT": 25491817655578708,
        "Operation": "join",
        "Timestamp": "1556275457595.817627",
        "TenantClass": 0,
        "Source": "Client.java:1545",
        "ThreadID": 1,
        "ThreadName": "",
        "EventID": "6981362C2C95749C",
        "ProcessID": 21035
      },
      {
        "Cycles": 0,
        "Agent": "org.apache.hadoop.ipc.ProtobufRpcEngine",
        "ProcessName": "Read",
        "TaskID": "21F5BFFB8017B0E9",
        "ParentEventID": [
          "6981362C2C95749C"
        ],
        "Label": "org.apache.hadoop.hdfs.protocol.ClientProtocol.getBlockLocations completed",
        "Title": "X-Trace Task",
        "Host": "pinky19.mpi-sws.org",
        "HRT": 25491817655658144,
        "Timestamp": "1556275457595.896973",
        "TenantClass": 0,
        "Source": "ProtobufRpcEngine.java:275",
        "ThreadID": 1,
        "ThreadName": "",
        "EventID": "C5A4DFA3BDBA1E56",
        "ProcessID": 21035
      },
      {
        "Cycles": 0,
        "Agent": "edu.brown.cs.systems.xtrace.logging.BaggageWrappers",
        "ProcessName": "Read",
        "TaskID": "21F5BFFB8017B0E9",
        "ParentEventID": [
          "C5A4DFA3BDBA1E56"
        ],
        "Label": "Forking current baggage with Baggage.fork()",
        "Title": "X-Trace Task",
        "Host": "pinky19.mpi-sws.org",
        "HRT": 25491817655752916,
        "Operation": "fork",
        "Timestamp": "1556275457595.991699",
        "TenantClass": 0,
        "Source": "DataTransferProtoUtil.java:94",
        "ThreadID": 1,
        "ThreadName": "",
        "EventID": "07FE8763CFA6C9B7",
        "ProcessID": 21035
      },
      {
        "Cycles": 0,
        "Agent": "edu.brown.cs.systems.xtrace.logging.XTraceInit",
        "ProcessName": "Data",
        "TaskID": "21F5BFFB8017B0E9",
        "ParentEventID": [
          "C52019F5A7ABB079"
        ],
        "Label": "Thread.setName: DataXceiver for client DFSClient_NONMAPREDUCE_1377588049_1 at /139.19.171.63:34128 [Sending block BP-1633380353-139.19.171.63-1554193446451:blk_1073765844_25020]",
        "Title": "X-Trace Task",
        "Host": "pinky25.mpi-sws.org",
        "HRT": 46040922898710011,
        "Timestamp": "1556275457596.214600",
        "TenantClass": 0,
        "Source": "DataXceiver.java:168",
        "ThreadID": 5334,
        "ThreadName": "",
        "EventID": "A75FA90ABB140E80",
        "BaggageBytes": "[[248 5] [240 0] [0 33 245 191 251 128 23 176 233] [240 1] [0 197 32 25 245 167 171 176 121] [240 3] [0 2]]",
        "ProcessID": 28198
      },
      {
        "Cycles": 0,
        "Agent": "Execution-CPU",
        "ProcessName": "Data",
        "TaskID": "21F5BFFB8017B0E9",
        "ParentEventID": [
          "07FE8763CFA6C9B7"
        ],
        "Label": "set",
        "Title": "X-Trace Task",
        "Host": "pinky25.mpi-sws.org",
        "HRT": 46040922898643493,
        "Operation": "set",
        "Timestamp": "1556275457596.147949",
        "TenantClass": 0,
        "Source": "Receiver.java:117",
        "ThreadID": 5334,
        "ThreadName": "",
        "EventID": "C52019F5A7ABB079",
        "BaggageBytes": "[[248 5] [240 0] [0 33 245 191 251 128 23 176 233] [240 1] [0 7 254 135 99 207 166 201 183] [240 3] [0 2]]",
        "ProcessID": 28198
      },
      {
        "Cycles": 0,
        "Agent": "edu.brown.cs.systems.xtrace.logging.BaggageWrappers",
        "ProcessName": "Data",
        "TaskID": "21F5BFFB8017B0E9",
        "ParentEventID": [
          "A75FA90ABB140E80"
        ],
        "Label": "Forking current baggage with Baggage.fork()",
        "Title": "X-Trace Task",
        "Host": "pinky25.mpi-sws.org",
        "HRT": 46040922898844676,
        "Operation": "fork",
        "Timestamp": "1556275457596.349121",
        "TenantClass": 0,
        "Source": "DataXceiver.java:1257",
        "ThreadID": 5334,
        "ThreadName": "",
        "EventID": "1D651A3E13EDFEAF",
        "BaggageBytes": "[[248 5] [240 0] [0 33 245 191 251 128 23 176 233] [240 1] [0 167 95 169 10 187 20 14 128] [240 3] [0 2]]",
        "ProcessID": 28198
      },
      {
        "Cycles": 0,
        "Agent": "Execution-Sleep",
        "ProcessName": "Read",
        "TaskID": "21F5BFFB8017B0E9",
        "ParentEventID": [
          "07FE8763CFA6C9B7"
        ],
        "Label": "waited",
        "Title": "X-Trace Task",
        "Host": "pinky19.mpi-sws.org",
        "Duration": "408397",
        "HRT": 25491817656247618,
        "Operation": "waited",
        "Timestamp": "1556275457596.486572",
        "TenantClass": 0,
        "Source": "SocketIOWithTimeout.java:335",
        "ThreadID": 1,
        "ThreadName": "",
        "EventID": "05B0CD57703DBBAB",
        "ProcessID": 21035
      },
      {
        "Cycles": 0,
        "Agent": "edu.brown.cs.systems.xtrace.logging.BaggageWrappers",
        "ProcessName": "Data",
        "TaskID": "21F5BFFB8017B0E9",
        "ParentEventID": [
          "1D651A3E13EDFEAF"
        ],
        "Label": "Forking current baggage with Baggage.fork()",
        "Title": "X-Trace Task",
        "Host": "pinky25.mpi-sws.org",
        "HRT": 46040922898942824,
        "Operation": "fork",
        "Timestamp": "1556275457596.447266",
        "TenantClass": 0,
        "Source": "PacketHeader.java:95",
        "ThreadID": 5334,
        "ThreadName": "",
        "EventID": "89C6D85756141B91",
        "BaggageBytes": "[[248 5] [240 0] [0 33 245 191 251 128 23 176 233] [240 1] [0 29 101 26 62 19 237 254 175] [240 3] [0 2]]",
        "ProcessID": 28198
      },
      {
        "Cycles": 0,
        "Agent": "edu.brown.cs.systems.xtrace.logging.BaggageWrappers",
        "ProcessName": "Read",
        "TaskID": "21F5BFFB8017B0E9",
        "ParentEventID": [
          "05B0CD57703DBBAB",
          "1D651A3E13EDFEAF"
        ],
        "Label": "Merged current baggage with other baggage",
        "Title": "X-Trace Task",
        "Host": "pinky19.mpi-sws.org",
        "HRT": 25491817656327061,
        "Operation": "join",
        "Timestamp": "1556275457596.565918",
        "TenantClass": 0,
        "Source": "RemoteBlockReader2.java:429",
        "ThreadID": 1,
        "ThreadName": "",
        "EventID": "4540EA642D7814D0",
        "ProcessID": 21035
      },
      {
        "Cycles": 0,
        "Agent": "Execution-Sleep",
        "ProcessName": "Data",
        "TaskID": "21F5BFFB8017B0E9",
        "ParentEventID": [
          "89C6D85756141B91"
        ],
        "Label": "waited",
        "Title": "X-Trace Task",
        "Host": "pinky25.mpi-sws.org",
        "Duration": "5785",
        "HRT": 46040922899042989,
        "Operation": "waited",
        "Timestamp": "1556275457596.547607",
        "TenantClass": 0,
        "Source": "SocketIOWithTimeout.java:335",
        "ThreadID": 5334,
        "ThreadName": "",
        "EventID": "DFA95421C10D5B1F",
        "BaggageBytes": "[[248 5] [240 0] [0 33 245 191 251 128 23 176 233] [240 1] [0 137 198 216 87 86 20 27 145] [240 3] [0 2]]",
        "ProcessID": 28198
      },
      {
        "Cycles": 0,
        "Agent": "Execution-Sleep",
        "ProcessName": "Read",
        "TaskID": "21F5BFFB8017B0E9",
        "ParentEventID": [
          "4540EA642D7814D0"
        ],
        "Label": "waited",
        "Title": "X-Trace Task",
        "Host": "pinky19.mpi-sws.org",
        "Duration": "38832",
        "HRT": 25491817656449711,
        "Operation": "waited",
        "Timestamp": "1556275457596.688721",
        "TenantClass": 0,
        "Source": "SocketIOWithTimeout.java:335",
        "ThreadID": 1,
        "ThreadName": "",
        "EventID": "107C3045FD939398",
        "ProcessID": 21035
      },
      {
        "Cycles": 0,
        "Agent": "edu.brown.cs.systems.xtrace.logging.BaggageWrappers",
        "ProcessName": "Read",
        "TaskID": "21F5BFFB8017B0E9",
        "ParentEventID": [
          "107C3045FD939398",
          "89C6D85756141B91"
        ],
        "Label": "Merged current baggage with other baggage",
        "Title": "X-Trace Task",
        "Host": "pinky19.mpi-sws.org",
        "HRT": 25491817656492057,
        "Operation": "join",
        "Timestamp": "1556275457596.730957",
        "TenantClass": 0,
        "Source": "PacketHeader.java:168",
        "ThreadID": 1,
        "ThreadName": "",
        "EventID": "9B93DAD20EB8898D",
        "ProcessID": 21035
      },
      {
        "Cycles": 0,
        "Agent": "edu.brown.cs.systems.xtrace.logging.BaggageWrappers",
        "ProcessName": "Data",
        "TaskID": "21F5BFFB8017B0E9",
        "ParentEventID": [
          "DFA95421C10D5B1F"
        ],
        "Label": "Forking current baggage with Baggage.fork()",
        "Title": "X-Trace Task",
        "Host": "pinky25.mpi-sws.org",
        "HRT": 46040922899140153,
        "Operation": "fork",
        "Timestamp": "1556275457596.644775",
        "TenantClass": 0,
        "Source": "PacketHeader.java:95",
        "ThreadID": 5334,
        "ThreadName": "",
        "EventID": "02DF5248C9B806C2",
        "BaggageBytes": "[[248 5] [240 0] [0 33 245 191 251 128 23 176 233] [240 1] [0 223 169 84 33 193 13 91 31] [240 3] [0 2]]",
        "ProcessID": 28198
      },
      {
        "Cycles": 0,
        "Agent": "edu.brown.cs.systems.xtrace.logging.BaggageWrappers",
        "ProcessName": "Read",
        "TaskID": "21F5BFFB8017B0E9",
        "ParentEventID": [
          "9B93DAD20EB8898D",
          "02DF5248C9B806C2"
        ],
        "Label": "Merged current baggage with other baggage",
        "Title": "X-Trace Task",
        "Host": "pinky19.mpi-sws.org",
        "HRT": 25491817656540079,
        "Operation": "join",
        "Timestamp": "1556275457596.779053",
        "TenantClass": 0,
        "Source": "PacketHeader.java:168",
        "ThreadID": 1,
        "ThreadName": "",
        "EventID": "FD0EB295C7CBE96F",
        "ProcessID": 21035
      },
      {
        "Cycles": 0,
        "Agent": "edu.brown.cs.systems.xtrace.logging.BaggageWrappers",
        "ProcessName": "Read",
        "TaskID": "21F5BFFB8017B0E9",
        "ParentEventID": [
          "FD0EB295C7CBE96F"
        ],
        "Label": "Forking current baggage with Baggage.fork()",
        "Title": "X-Trace Task",
        "Host": "pinky19.mpi-sws.org",
        "HRT": 25491817656552316,
        "Operation": "fork",
        "Timestamp": "1556275457596.791260",
        "TenantClass": 0,
        "Source": "RemoteBlockReader2.java:361",
        "ThreadID": 1,
        "ThreadName": "",
        "EventID": "3CFB070007307D49",
        "ProcessID": 21035
      },
      {
        "Cycles": 0,
        "Agent": "Execution-Sleep",
        "ProcessName": "Data",
        "TaskID": "21F5BFFB8017B0E9",
        "ParentEventID": [
          "02DF5248C9B806C2"
        ],
        "Label": "waited",
        "Title": "X-Trace Task",
        "Host": "pinky25.mpi-sws.org",
        "Duration": "37199",
        "HRT": 46040922899332602,
        "Operation": "waited",
        "Timestamp": "1556275457596.837158",
        "TenantClass": 0,
        "Source": "SocketIOWithTimeout.java:335",
        "ThreadID": 5334,
        "ThreadName": "",
        "EventID": "0B50068A9A057F07",
        "BaggageBytes": "[[248 5] [240 0] [0 33 245 191 251 128 23 176 233] [240 1] [0 2 223 82 72 201 184 6 194] [240 3] [0 2]]",
        "ProcessID": 28198
      },
      {
        "Cycles": 0,
        "Agent": "Execution-CPU",
        "ProcessName": "Data",
        "TaskID": "21F5BFFB8017B0E9",
        "ParentEventID": [
          "556489063D6E9E96"
        ],
        "Label": "unset",
        "Title": "X-Trace Task",
        "Host": "pinky25.mpi-sws.org",
        "Duration": "781516",
        "HRT": 46040922899470107,
        "Operation": "unset",
        "Timestamp": "1556275457596.974609",
        "TenantClass": 0,
        "Source": "DataXceiver.java:261",
        "ThreadID": 5334,
        "ThreadName": "",
        "EventID": "AE5DE67F7639CF28",
        "BaggageBytes": "[[248 5] [240 0] [0 33 245 191 251 128 23 176 233] [240 1] [0 85 100 137 6 61 110 158 150] [240 3] [0 2]]",
        "ProcessID": 28198
      },
      {
        "Cycles": 0,
        "Agent": "edu.brown.cs.systems.xtrace.logging.BaggageWrappers",
        "ProcessName": "Data",
        "TaskID": "21F5BFFB8017B0E9",
        "ParentEventID": [
          "0B50068A9A057F07",
          "3CFB070007307D49"
        ],
        "Label": "Merged current baggage with other baggage",
        "Title": "X-Trace Task",
        "Host": "pinky25.mpi-sws.org",
        "HRT": 46040922899421193,
        "Operation": "join",
        "Timestamp": "1556275457596.925781",
        "TenantClass": 0,
        "Source": "DataXceiver.java:574",
        "ThreadID": 5334,
        "ThreadName": "",
        "EventID": "556489063D6E9E96",
        "BaggageBytes": "[[248 5] [240 0] [0 33 245 191 251 128 23 176 233] [240 1] [0 11 80 6 138 154 5 127 7] [0 60 251 7 0 7 48 125 73] [240 3] [0 2]]",
        "ProcessID": 28198
      },
      {
        "Cycles": 0,
        "Agent": "edu.brown.cs.systems.retro.benchmarks.hdfs_client.Reader",
        "ProcessName": "Read",
        "TaskID": "21F5BFFB8017B0E9",
        "ParentEventID": [
          "0"
        ],
        "Label": "Reading file",
        "Title": "X-Trace Task",
        "Host": "pinky19.mpi-sws.org",
        "HRT": 25491817654846853,
        "Timestamp": "1556275457595.085693",
        "TenantClass": 0,
        "ThreadID": 1,
        "ThreadName": "",
        "EventID": "038B2C5BBEBBF93F",
        "ProcessID": 21035,
        "Tag": [
          "reader_1kb",
          "Read Size: 1024"
        ]
      }
    ]
  }
]