[
  {
    "id": "906C01BAF06C8919",
    "reports": [
      {
        "Cycles": 0,
        "Agent": "Execution-CPU",
        "ProcessName": "Read",
        "TaskID": "906C01BAF06C8919",
        "ParentEventID": [
          "C3DEE2F251939E6E"
        ],
        "Label": "unset",
        "Title": "X-Trace Task",
        "Host": "pinky19.mpi-sws.org",
        "Duration": "22224566",
        "HRT": 26962660399132171,
        "Operation": "unset",
        "Timestamp": "1557746300340.414551",
        "TenantClass": 0,
        "Source": "Client.java:1027",
        "ThreadID": 1,
        "ThreadName": "",
        "EventID": "E1F59F244113E807",
        "ProcessID": 36430
      },
      {
        "Cycles": 0,
        "Agent": "Execution-CPU",
        "ProcessName": "Read",
        "TaskID": "906C01BAF06C8919",
        "ParentEventID": [
          "E1F59F244113E807"
        ],
        "Label": "set",
        "Title": "X-Trace Task",
        "Host": "pinky19.mpi-sws.org",
        "HRT": 26962660399181541,
        "Operation": "set",
        "Timestamp": "1557746300340.463867",
        "TenantClass": 0,
        "Source": "Client.java:1032",
        "ThreadID": 41,
        "ThreadName": "",
        "EventID": "165C5FABE3D49C52",
        "ProcessID": 36430
      },
      {
        "Cycles": 0,
        "Agent": "edu.brown.cs.systems.xtrace.logging.BaggageWrappers",
        "ProcessName": "Read",
        "TaskID": "906C01BAF06C8919",
        "ParentEventID": [
          "165C5FABE3D49C52"
        ],
        "Label": "Forking current baggage with Baggage.fork()",
        "Title": "X-Trace Task",
        "Host": "pinky19.mpi-sws.org",
        "HRT": 26962660399200175,
        "Operation": "fork",
        "Timestamp": "1557746300340.482422",
        "TenantClass": 0,
        "Source": "Client.java:1043",
        "ThreadID": 41,
        "ThreadName": "",
        "EventID": "8D1DCF3B8C957722",
        "ProcessID": 36430
      },
      {
        "Cycles": 0,
        "Agent": "Execution-CPU",
        "ProcessName": "Read",
        "TaskID": "906C01BAF06C8919",
        "ParentEventID": [
          "8D1DCF3B8C957722"
        ],
        "Label": "unset",
        "Title": "X-Trace Task",
        "Host": "pinky19.mpi-sws.org",
        "Duration": "67816",
        "HRT": 26962660399267245,
        "Operation": "unset",
        "Timestamp": "1557746300340.549561",
        "TenantClass": 0,
        "Source": "Client.java:1062",
        "ThreadID": 41,
        "ThreadName": "",
        "EventID": "C6D291C292C4C350",
        "ProcessID": 36430
      },
      {
        "Cycles": 0,
        "Agent": "org.apache.hadoop.ipc.ProtobufRpcEngine",
        "ProcessName": "Read",
        "TaskID": "906C01BAF06C8919",
        "ParentEventID": [
          "816A405CF45F9585"
        ],
        "Label": "Invoking org.apache.hadoop.hdfs.protocol.ClientProtocol.getBlockLocations",
        "Title": "X-Trace Task",
        "Host": "pinky19.mpi-sws.org",
        "HRT": 26962660399111962,
        "Timestamp": "1557746300340.394287",
        "TenantClass": 0,
        "Source": "ProtobufRpcEngine.java:228",
        "ThreadID": 1,
        "ThreadName": "",
        "EventID": "C3DEE2F251939E6E",
        "ProcessID": 36430
      },
      {
        "Cycles": 0,
        "Agent": "edu.brown.cs.systems.retro.benchmarks.hdfs_client.Reader",
        "ProcessName": "Read",
        "TaskID": "906C01BAF06C8919",
        "ParentEventID": [
          "3553436E74731B77"
        ],
        "Label": "Reading file",
        "Title": "X-Trace Task",
        "Host": "pinky19.mpi-sws.org",
        "HRT": 26962660399082887,
        "Timestamp": "1557746300340.365234",
        "TenantClass": 0,
        "ThreadID": 1,
        "ThreadName": "",
        "EventID": "816A405CF45F9585",
        "ProcessID": 36430
      },
      {
        "Cycles": 0,
        "Agent": "Execution-CPU",
        "ProcessName": "Read",
        "TaskID": "906C01BAF06C8919",
        "ParentEventID": [
          "C6D291C292C4C350"
        ],
        "Label": "set",
        "Title": "X-Trace Task",
        "Host": "pinky19.mpi-sws.org",
        "HRT": 26962660399291522,
        "Operation": "set",
        "Timestamp": "1557746300340.573730",
        "TenantClass": 0,
        "Source": "Client.java:1104",
        "ThreadID": 1,
        "ThreadName": "",
        "EventID": "487A750A69790512",
        "ProcessID": 36430
      },
      {
        "Cycles": 0,
        "Agent": "Execution-CPU",
        "ProcessName": "Name",
        "TaskID": "906C01BAF06C8919",
        "ParentEventID": [
          "8D1DCF3B8C957722"
        ],
        "Label": "set",
        "Title": "X-Trace Task",
        "Host": "pinky19.mpi-sws.org",
        "HRT": 26962660399344987,
        "Operation": "set",
        "Timestamp": "1557746300340.620605",
        "TenantClass": 0,
        "Source": "Server.java:1840",
        "ThreadID": 48,
        "ThreadName": "",
        "EventID": "F60248B27439DD2D",
        "BaggageBytes": "[[248 5] [240 0] [0 144 108 1 186 240 108 137 25] [240 1] [0 141 29 207 59 140 149 119 34] [240 3] [0 2]]",
        "ProcessID": 2171
      },
      {
        "Cycles": 0,
        "Agent": "Execution-CPU",
        "ProcessName": "Name",
        "TaskID": "906C01BAF06C8919",
        "ParentEventID": [
          "53202C752C5ED381"
        ],
        "Label": "unset",
        "Title": "X-Trace Task",
        "Host": "pinky19.mpi-sws.org",
        "Duration": "24092",
        "HRT": 26962660399395049,
        "Operation": "unset",
        "Timestamp": "1557746300340.670654",
        "TenantClass": 0,
        "Source": "Server.java:1828",
        "ThreadID": 48,
        "ThreadName": "",
        "EventID": "26386B72A6B8801E",
        "BaggageBytes": "[[248 5] [240 0] [0 144 108 1 186 240 108 137 25] [240 1] [0 83 32 44 117 44 94 211 129] [240 3] [0 2]]",
        "ProcessID": 2171
      },
      {
        "Cycles": 0,
        "Agent": "Execution-CPU",
        "ProcessName": "Name",
        "TaskID": "906C01BAF06C8919",
        "ParentEventID": [
          "53202C752C5ED381"
        ],
        "Label": "set",
        "Title": "X-Trace Task",
        "Host": "pinky19.mpi-sws.org",
        "HRT": 26962660399401575,
        "Operation": "set",
        "Timestamp": "1557746300340.677246",
        "TenantClass": 0,
        "Source": "Server.java:2071",
        "ThreadID": 63,
        "ThreadName": "",
        "EventID": "003FBDC630BB6F1C",
        "BaggageBytes": "[[248 5] [240 0] [0 144 108 1 186 240 108 137 25] [240 1] [0 83 32 44 117 44 94 211 129] [240 3] [0 2]]",
        "ProcessID": 2171
      },
      {
        "Cycles": 0,
        "Agent": "edu.brown.cs.systems.xtrace.logging.BaggageWrappers",
        "ProcessName": "Name",
        "TaskID": "906C01BAF06C8919",
        "ParentEventID": [
          "F60248B27439DD2D"
        ],
        "Label": "Forking current baggage with Baggage.fork()",
        "Title": "X-Trace Task",
        "Host": "pinky19.mpi-sws.org",
        "HRT": 26962660399375066,
        "Operation": "fork",
        "Timestamp": "1557746300340.650635",
        "TenantClass": 0,
        "Source": "Server.java:550",
        "ThreadID": 48,
        "ThreadName": "",
        "EventID": "53202C752C5ED381",
        "BaggageBytes": "[[248 5] [240 0] [0 144 108 1 186 240 108 137 25] [240 1] [0 246 2 72 178 116 57 221 45] [240 3] [0 2]]",
        "ProcessID": 2171
      },
      {
        "Cycles": 0,
        "Agent": "org.apache.hadoop.ipc.Server",
        "ProcessName": "Name",
        "TaskID": "906C01BAF06C8919",
        "ParentEventID": [
          "003FBDC630BB6F1C"
        ],
        "Label": "getBlockLocations in org.apache.hadoop.hdfs.protocol.ClientProtocol",
        "Title": "X-Trace Task",
        "Host": "pinky19.mpi-sws.org",
        "HRT": 26962660399426795,
        "Timestamp": "1557746300340.702393",
        "TenantClass": 0,
        "Source": "ProtobufRpcEngine.java:601",
        "ThreadID": 63,
        "ThreadName": "",
        "EventID": "3D5D8E7AB092307D",
        "BaggageBytes": "[[248 5] [240 0] [0 144 108 1 186 240 108 137 25] [240 1] [0 0 63 189 198 48 187 111 28] [240 3] [0 2]]",
        "ProcessID": 2171
      },
      {
        "Cycles": 0,
        "Agent": "edu.brown.cs.systems.xtrace.logging.BaggageWrappers",
        "ProcessName": "Name",
        "TaskID": "906C01BAF06C8919",
        "ParentEventID": [
          "6F33C145C9C99A8F"
        ],
        "Label": "Forking current baggage with Baggage.fork()",
        "Title": "X-Trace Task",
        "Host": "pinky19.mpi-sws.org",
        "HRT": 26962660399507150,
        "Operation": "fork",
        "Timestamp": "1557746300340.782715",
        "TenantClass": 0,
        "Source": "Server.java:2398",
        "ThreadID": 63,
        "ThreadName": "",
        "EventID": "C923B89ED17BCF03",
        "BaggageBytes": "[[248 5] [240 0] [0 144 108 1 186 240 108 137 25] [240 1] [0 111 51 193 69 201 201 154 143] [240 3] [0 2]]",
        "ProcessID": 2171
      },
      {
        "Cycles": 0,
        "Agent": "Execution-CPU",
        "ProcessName": "Name",
        "TaskID": "906C01BAF06C8919",
        "ParentEventID": [
          "C923B89ED17BCF03"
        ],
        "Label": "unset",
        "Title": "X-Trace Task",
        "Host": "pinky19.mpi-sws.org",
        "Duration": "181613",
        "HRT": 26962660399598895,
        "Operation": "unset",
        "Timestamp": "1557746300340.874512",
        "TenantClass": 0,
        "Source": "Server.java:1058",
        "ThreadID": 63,
        "ThreadName": "",
        "EventID": "3D56E0E618F42E3D",
        "BaggageBytes": "[[248 5] [240 0] [0 144 108 1 186 240 108 137 25] [240 1] [0 201 35 184 158 209 123 207 3] [240 3] [0 2]]",
        "ProcessID": 2171
      },
      {
        "Cycles": 0,
        "Agent": "Execution-CPU",
        "ProcessName": "Read",
        "TaskID": "906C01BAF06C8919",
        "ParentEventID": [
          "C923B89ED17BCF03"
        ],
        "Label": "set",
        "Title": "X-Trace Task",
        "Host": "pinky19.mpi-sws.org",
        "HRT": 26962660399638461,
        "Operation": "set",
        "Timestamp": "1557746300340.920654",
        "TenantClass": 0,
        "Source": "Client.java:302",
        "ThreadID": 37,
        "ThreadName": "",
        "EventID": "CFC36528ECDB977C",
        "ProcessID": 36430
      },
      {
        "Cycles": 0,
        "Agent": "Execution-CPU",
        "ProcessName": "Read",
        "TaskID": "906C01BAF06C8919",
        "ParentEventID": [
          "CFC36528ECDB977C"
        ],
        "Label": "unset",
        "Title": "X-Trace Task",
        "Host": "pinky19.mpi-sws.org",
        "Duration": "4321",
        "HRT": 26962660399654396,
        "Operation": "unset",
        "Timestamp": "1557746300340.936768",
        "TenantClass": 0,
        "Source": "Client.java:1168",
        "ThreadID": 37,
        "ThreadName": "",
        "EventID": "F8DC58A42AC5F931",
        "ProcessID": 36430
      },
      {
        "Cycles": 0,
        "Agent": "Execution-Sleep",
        "ProcessName": "Read",
        "TaskID": "906C01BAF06C8919",
        "ParentEventID": [
          "487A750A69790512"
        ],
        "Label": "waited",
        "Title": "X-Trace Task",
        "Host": "pinky19.mpi-sws.org",
        "Duration": "383859",
        "HRT": 26962660399686829,
        "Operation": "waited",
        "Timestamp": "1557746300340.968994",
        "TenantClass": 0,
        "Source": "Client.java:1537",
        "ThreadID": 1,
        "ThreadName": "",
        "EventID": "D03D41341A6184D0",
        "ProcessID": 36430
      },
      {
        "Cycles": 0,
        "Agent": "org.apache.hadoop.hdfs.server.namenode.FSNamesystem.audit",
        "ProcessName": "Name",
        "TaskID": "906C01BAF06C8919",
        "ParentEventID": [
          "3D5D8E7AB092307D"
        ],
        "Label": "allowed=true\tugi=plascas (auth:SIMPLE)\tip=/139.19.171.63\tcmd=open\tsrc=/ds/hcImzg2pKLo7DlAq\tdst=null\tperm=null\tproto=rpc",
        "Title": "X-Trace Task",
        "Host": "pinky19.mpi-sws.org",
        "HRT": 26962660399466419,
        "Timestamp": "1557746300340.741943",
        "TenantClass": 0,
        "Source": "FSNamesystem.java:8313",
        "ThreadID": 63,
        "ThreadName": "",
        "EventID": "6F33C145C9C99A8F",
        "BaggageBytes": "[[248 5] [240 0] [0 144 108 1 186 240 108 137 25] [240 1] [0 61 93 142 122 176 146 48 125] [240 3] [0 2]]",
        "ProcessID": 2171
      },
      {
        "Cycles": 0,
        "Agent": "edu.brown.cs.systems.xtrace.logging.BaggageWrappers",
        "ProcessName": "Read",
        "TaskID": "906C01BAF06C8919",
        "ParentEventID": [
          "F8DC58A42AC5F931",
          "D03D41341A6184D0"
        ],
        "Label": "Merged current baggage with other baggage",
        "Title": "X-Trace Task",
        "Host": "pinky19.mpi-sws.org",
        "HRT": 26962660399705206,
        "Operation": "join",
        "Timestamp": "1557746300340.987549",
        "TenantClass": 0,
        "Source": "Client.java:1545",
        "ThreadID": 1,
        "ThreadName": "",
        "EventID": "22FCA982A759EB9C",
        "ProcessID": 36430
      },
      {
        "Cycles": 0,
        "Agent": "org.apache.hadoop.ipc.ProtobufRpcEngine",
        "ProcessName": "Read",
        "TaskID": "906C01BAF06C8919",
        "ParentEventID": [
          "22FCA982A759EB9C"
        ],
        "Label": "org.apache.hadoop.hdfs.protocol.ClientProtocol.getBlockLocations completed",
        "Title": "X-Trace Task",
        "Host": "pinky19.mpi-sws.org",
        "HRT": 26962660399759513,
        "Timestamp": "1557746300341.041748",
        "TenantClass": 0,
        "Source": "ProtobufRpcEngine.java:275",
        "ThreadID": 1,
        "ThreadName": "",
        "EventID": "9FE2D56B92388D74",
        "ProcessID": 36430
      },
      {
        "Cycles": 0,
        "Agent": "Execution-CPU",
        "ProcessName": "Data",
        "TaskID": "906C01BAF06C8919",
        "ParentEventID": [
          "D03049776086C716"
        ],
        "Label": "set",
        "Title": "X-Trace Task",
        "Host": "pinky21.mpi-sws.org",
        "HRT": 10808970106432618,
        "Operation": "set",
        "Timestamp": "1557746300341.444580",
        "TenantClass": 0,
        "Source": "Receiver.java:117",
        "ThreadID": 14875,
        "ThreadName": "",
        "EventID": "8FCC1D268BA541E7",
        "BaggageBytes": "[[248 5] [240 0] [0 144 108 1 186 240 108 137 25] [240 1] [0 208 48 73 119 96 134 199 22] [240 3] [0 2]]",
        "ProcessID": 20775
      },
      {
        "Cycles": 0,
        "Agent": "edu.brown.cs.systems.xtrace.logging.XTraceInit",
        "ProcessName": "Data",
        "TaskID": "906C01BAF06C8919",
        "ParentEventID": [
          "8FCC1D268BA541E7"
        ],
        "Label": "Thread.setName: DataXceiver for client DFSClient_NONMAPREDUCE_778905418_1 at /139.19.171.63:35320 [Sending block BP-1633380353-139.19.171.63-1554193446451:blk_1073760195_19371]",
        "Title": "X-Trace Task",
        "Host": "pinky21.mpi-sws.org",
        "HRT": 10808970106533165,
        "Timestamp": "1557746300341.545166",
        "TenantClass": 0,
        "Source": "DataXceiver.java:168",
        "ThreadID": 14875,
        "ThreadName": "",
        "EventID": "A75F4E5766889AAA",
        "BaggageBytes": "[[248 5] [240 0] [0 144 108 1 186 240 108 137 25] [240 1] [0 143 204 29 38 139 165 65 231] [240 3] [0 2]]",
        "ProcessID": 20775
      },
      {
        "Cycles": 0,
        "Agent": "edu.brown.cs.systems.xtrace.logging.BaggageWrappers",
        "ProcessName": "Read",
        "TaskID": "906C01BAF06C8919",
        "ParentEventID": [
          "9FE2D56B92388D74"
        ],
        "Label": "Forking current baggage with Baggage.fork()",
        "Title": "X-Trace Task",
        "Host": "pinky19.mpi-sws.org",
        "HRT": 26962660399827349,
        "Operation": "fork",
        "Timestamp": "1557746300341.109619",
        "TenantClass": 0,
        "Source": "DataTransferProtoUtil.java:94",
        "ThreadID": 1,
        "ThreadName": "",
        "EventID": "D03049776086C716",
        "ProcessID": 36430
      },
      {
        "Cycles": 0,
        "Agent": "edu.brown.cs.systems.xtrace.logging.BaggageWrappers",
        "ProcessName": "Data",
        "TaskID": "906C01BAF06C8919",
        "ParentEventID": [
          "A75F4E5766889AAA"
        ],
        "Label": "Forking current baggage with Baggage.fork()",
        "Title": "X-Trace Task",
        "Host": "pinky21.mpi-sws.org",
        "HRT": 10808970106764506,
        "Operation": "fork",
        "Timestamp": "1557746300341.776611",
        "TenantClass": 0,
        "Source": "DataXceiver.java:1257",
        "ThreadID": 14875,
        "ThreadName": "",
        "EventID": "C6C44B147D97A1EF",
        "BaggageBytes": "[[248 5] [240 0] [0 144 108 1 186 240 108 137 25] [240 1] [0 167 95 78 87 102 136 154 170] [240 3] [0 2]]",
        "ProcessID": 20775
      },
      {
        "Cycles": 0,
        "Agent": "Execution-Sleep",
        "ProcessName": "Read",
        "TaskID": "906C01BAF06C8919",
        "ParentEventID": [
          "D03049776086C716"
        ],
        "Label": "waited",
        "Title": "X-Trace Task",
        "Host": "pinky19.mpi-sws.org",
        "Duration": "736905",
        "HRT": 26962660400645848,
        "Operation": "waited",
        "Timestamp": "1557746300341.928223",
        "TenantClass": 0,
        "Source": "SocketIOWithTimeout.java:335",
        "ThreadID": 1,
        "ThreadName": "",
        "EventID": "C8E25FA6238B183F",
        "ProcessID": 36430
      },
      {
        "Cycles": 0,
        "Agent": "edu.brown.cs.systems.xtrace.logging.BaggageWrappers",
        "ProcessName": "Data",
        "TaskID": "906C01BAF06C8919",
        "ParentEventID": [
          "C6C44B147D97A1EF"
        ],
        "Label": "Forking current baggage with Baggage.fork()",
        "Title": "X-Trace Task",
        "Host": "pinky21.mpi-sws.org",
        "HRT": 10808970106946103,
        "Operation": "fork",
        "Timestamp": "1557746300341.958008",
        "TenantClass": 0,
        "Source": "PacketHeader.java:95",
        "ThreadID": 14875,
        "ThreadName": "",
        "EventID": "C31A9034E334801E",
        "BaggageBytes": "[[248 5] [240 0] [0 144 108 1 186 240 108 137 25] [240 1] [0 198 196 75 20 125 151 161 239] [240 3] [0 2]]",
        "ProcessID": 20775
      },
      {
        "Cycles": 0,
        "Agent": "edu.brown.cs.systems.xtrace.logging.BaggageWrappers",
        "ProcessName": "Read",
        "TaskID": "906C01BAF06C8919",
        "ParentEventID": [
          "C8E25FA6238B183F",
          "C6C44B147D97A1EF"
        ],
        "Label": "Merged current baggage with other baggage",
        "Title": "X-Trace Task",
        "Host": "pinky19.mpi-sws.org",
        "HRT": 26962660400735679,
        "Operation": "join",
        "Timestamp": "1557746300342.017822",
        "TenantClass": 0,
        "Source": "RemoteBlockReader2.java:429",
        "ThreadID": 1,
        "ThreadName": "",
        "EventID": "951052D99056A52C",
        "ProcessID": 36430
      },
      {
        "Cycles": 0,
        "Agent": "Execution-Sleep",
        "ProcessName": "Data",
        "TaskID": "906C01BAF06C8919",
        "ParentEventID": [
          "C31A9034E334801E"
        ],
        "Label": "waited",
        "Title": "X-Trace Task",
        "Host": "pinky21.mpi-sws.org",
        "Duration": "11593",
        "HRT": 10808970107118300,
        "Operation": "waited",
        "Timestamp": "1557746300342.130371",
        "TenantClass": 0,
        "Source": "SocketIOWithTimeout.java:335",
        "ThreadID": 14875,
        "ThreadName": "",
        "EventID": "D8406FE63AB7D938",
        "BaggageBytes": "[[248 5] [240 0] [0 144 108 1 186 240 108 137 25] [240 1] [0 195 26 144 52 227 52 128 30] [240 3] [0 2]]",
        "ProcessID": 20775
      },
      {
        "Cycles": 0,
        "Agent": "edu.brown.cs.systems.xtrace.logging.BaggageWrappers",
        "ProcessName": "Data",
        "TaskID": "906C01BAF06C8919",
        "ParentEventID": [
          "D8406FE63AB7D938"
        ],
        "Label": "Forking current baggage with Baggage.fork()",
        "Title": "X-Trace Task",
        "Host": "pinky21.mpi-sws.org",
        "HRT": 10808970107313214,
        "Operation": "fork",
        "Timestamp": "1557746300342.325195",
        "TenantClass": 0,
        "Source": "PacketHeader.java:95",
        "ThreadID": 14875,
        "ThreadName": "",
        "EventID": "FF8E8C68BD906088",
        "BaggageBytes": "[[248 5] [240 0] [0 144 108 1 186 240 108 137 25] [240 1] [0 216 64 111 230 58 183 217 56] [240 3] [0 2]]",
        "ProcessID": 20775
      },
      {
        "Cycles": 0,
        "Agent": "Execution-Sleep",
        "ProcessName": "Read",
        "TaskID": "906C01BAF06C8919",
        "ParentEventID": [
          "951052D99056A52C"
        ],
        "Label": "waited",
        "Title": "X-Trace Task",
        "Host": "pinky19.mpi-sws.org",
        "Duration": "291819",
        "HRT": 26962660401132463,
        "Operation": "waited",
        "Timestamp": "1557746300342.414795",
        "TenantClass": 0,
        "Source": "SocketIOWithTimeout.java:335",
        "ThreadID": 1,
        "ThreadName": "",
        "EventID": "BBD2BF5153BAA37D",
        "ProcessID": 36430
      },
      {
        "Cycles": 0,
        "Agent": "edu.brown.cs.systems.xtrace.logging.BaggageWrappers",
        "ProcessName": "Read",
        "TaskID": "906C01BAF06C8919",
        "ParentEventID": [
          "C31A9034E334801E",
          "BBD2BF5153BAA37D"
        ],
        "Label": "Merged current baggage with other baggage",
        "Title": "X-Trace Task",
        "Host": "pinky19.mpi-sws.org",
        "HRT": 26962660401222625,
        "Operation": "join",
        "Timestamp": "1557746300342.504883",
        "TenantClass": 0,
        "Source": "PacketHeader.java:168",
        "ThreadID": 1,
        "ThreadName": "",
        "EventID": "C9684E07DCEEC898",
        "ProcessID": 36430
      },
      {
        "Cycles": 0,
        "Agent": "edu.brown.cs.systems.xtrace.logging.BaggageWrappers",
        "ProcessName": "Read",
        "TaskID": "906C01BAF06C8919",
        "ParentEventID": [
          "FF8E8C68BD906088",
          "C9684E07DCEEC898"
        ],
        "Label": "Merged current baggage with other baggage",
        "Title": "X-Trace Task",
        "Host": "pinky19.mpi-sws.org",
        "HRT": 26962660401291288,
        "Operation": "join",
        "Timestamp": "1557746300342.573486",
        "TenantClass": 0,
        "Source": "PacketHeader.java:168",
        "ThreadID": 1,
        "ThreadName": "",
        "EventID": "A9FDEA0F05405FF2",
        "ProcessID": 36430
      },
      {
        "Cycles": 0,
        "Agent": "Execution-Sleep",
        "ProcessName": "Data",
        "TaskID": "906C01BAF06C8919",
        "ParentEventID": [
          "FF8E8C68BD906088"
        ],
        "Label": "waited",
        "Title": "X-Trace Task",
        "Host": "pinky21.mpi-sws.org",
        "Duration": "127007",
        "HRT": 10808970107680042,
        "Operation": "waited",
        "Timestamp": "1557746300342.692139",
        "TenantClass": 0,
        "Source": "SocketIOWithTimeout.java:335",
        "ThreadID": 14875,
        "ThreadName": "",
        "EventID": "8B549D4940D7718C",
        "BaggageBytes": "[[248 5] [240 0] [0 144 108 1 186 240 108 137 25] [240 1] [0 255 142 140 104 189 144 96 136] [240 3] [0 2]]",
        "ProcessID": 20775
      },
      {
        "Cycles": 0,
        "Agent": "edu.brown.cs.systems.xtrace.logging.BaggageWrappers",
        "ProcessName": "Data",
        "TaskID": "906C01BAF06C8919",
        "ParentEventID": [
          "C0CDCA0D823D59EA",
          "8B549D4940D7718C"
        ],
        "Label": "Merged current baggage with other baggage",
        "Title": "X-Trace Task",
        "Host": "pinky21.mpi-sws.org",
        "HRT": 10808970107813192,
        "Operation": "join",
        "Timestamp": "1557746300342.825195",
        "TenantClass": 0,
        "Source": "DataXceiver.java:574",
        "ThreadID": 14875,
        "ThreadName": "",
        "EventID": "5566A3E30679074A",
        "BaggageBytes": "[[248 5] [240 0] [0 144 108 1 186 240 108 137 25] [240 1] [0 139 84 157 73 64 215 113 140] [0 192 205 202 13 130 61 89 234] [240 3] [0 2]]",
        "ProcessID": 20775
      },
      {
        "Cycles": 0,
        "Agent": "edu.brown.cs.systems.xtrace.logging.BaggageWrappers",
        "ProcessName": "Read",
        "TaskID": "906C01BAF06C8919",
        "ParentEventID": [
          "A9FDEA0F05405FF2"
        ],
        "Label": "Forking current baggage with Baggage.fork()",
        "Title": "X-Trace Task",
        "Host": "pinky19.mpi-sws.org",
        "HRT": 26962660401301632,
        "Operation": "fork",
        "Timestamp": "1557746300342.583984",
        "TenantClass": 0,
        "Source": "RemoteBlockReader2.java:361",
        "ThreadID": 1,
        "ThreadName": "",
        "EventID": "C0CDCA0D823D59EA",
        "ProcessID": 36430
      },
      {
        "Cycles": 0,
        "Agent": "Execution-CPU",
        "ProcessName": "Data",
        "TaskID": "906C01BAF06C8919",
        "ParentEventID": [
          "5566A3E30679074A"
        ],
        "Label": "unset",
        "Title": "X-Trace Task",
        "Host": "pinky21.mpi-sws.org",
        "Duration": "1358653",
        "HRT": 10808970107864239,
        "Operation": "unset",
        "Timestamp": "1557746300342.876221",
        "TenantClass": 0,
        "Source": "DataXceiver.java:261",
        "ThreadID": 14875,
        "ThreadName": "",
        "EventID": "21A0752F67DD3361",
        "BaggageBytes": "[[248 5] [240 0] [0 144 108 1 186 240 108 137 25] [240 1] [0 85 102 163 227 6 121 7 74] [240 3] [0 2]]",
        "ProcessID": 20775
      },
      {
        "Cycles": 0,
        "Agent": "edu.brown.cs.systems.retro.benchmarks.hdfs_client.Reader",
        "ProcessName": "Read",
        "TaskID": "906C01BAF06C8919",
        "ParentEventID": [
          "0"
        ],
        "Label": "Reading file",
        "Title": "X-Trace Task",
        "Host": "pinky19.mpi-sws.org",
        "HRT": 26962660399069891,
        "Timestamp": "1557746300340.352051",
        "TenantClass": 0,
        "ThreadID": 1,
        "ThreadName": "",
        "EventID": "3553436E74731B77",
        "ProcessID": 36430,
        "Tag": [
          "reader_10kb",
          "Read Size: 10240"
        ]
      }
    ]
  }
]