[
  {
    "id": "C95DC2D8633CFB29",
    "reports": [
      {
        "Cycles": 0,
        "Agent": "edu.brown.cs.systems.retro.benchmarks.hdfs_client.Reader",
        "ProcessName": "Read",
        "TaskID": "C95DC2D8633CFB29",
        "ParentEventID": [
          "0"
        ],
        "Label": "Reading file",
        "Title": "X-Trace Task",
        "Host": "pinky19.mpi-sws.org",
        "HRT": 25491743151092228,
        "Timestamp": "1556275383091.600098",
        "TenantClass": 0,
        "ThreadID": 1,
        "ThreadName": "",
        "EventID": "811FF475CA2A7F4C",
        "ProcessID": 21035,
        "Tag": [
          "reader_1kb",
          "Read Size: 1024"
        ]
      },
      {
        "Cycles": 0,
        "Agent": "edu.brown.cs.systems.retro.benchmarks.hdfs_client.Reader",
        "ProcessName": "Read",
        "TaskID": "C95DC2D8633CFB29",
        "ParentEventID": [
          "811FF475CA2A7F4C"
        ],
        "Label": "Reading file",
        "Title": "X-Trace Task",
        "Host": "pinky19.mpi-sws.org",
        "HRT": 25491743151105978,
        "Timestamp": "1556275383091.613770",
        "TenantClass": 0,
        "ThreadID": 1,
        "ThreadName": "",
        "EventID": "220058947BD38E28",
        "ProcessID": 21035
      },
      {
        "Cycles": 0,
        "Agent": "org.apache.hadoop.ipc.ProtobufRpcEngine",
        "ProcessName": "Read",
        "TaskID": "C95DC2D8633CFB29",
        "ParentEventID": [
          "220058947BD38E28"
        ],
        "Label": "Invoking org.apache.hadoop.hdfs.protocol.ClientProtocol.getBlockLocations",
        "Title": "X-Trace Task",
        "Host": "pinky19.mpi-sws.org",
        "HRT": 25491743151149400,
        "Timestamp": "1556275383091.657227",
        "TenantClass": 0,
        "Source": "ProtobufRpcEngine.java:228",
        "ThreadID": 1,
        "ThreadName": "",
        "EventID": "D7267F21FCDC4660",
        "ProcessID": 21035
      },
      {
        "Cycles": 0,
        "Agent": "Execution-CPU",
        "ProcessName": "Read",
        "TaskID": "C95DC2D8633CFB29",
        "ParentEventID": [
          "D7267F21FCDC4660"
        ],
        "Label": "unset",
        "Title": "X-Trace Task",
        "Host": "pinky19.mpi-sws.org",
        "Duration": "22712376",
        "HRT": 25491743151200744,
        "Operation": "unset",
        "Timestamp": "1556275383091.708496",
        "TenantClass": 0,
        "Source": "Client.java:1027",
        "ThreadID": 1,
        "ThreadName": "",
        "EventID": "E2BA412F3ECD4656",
        "ProcessID": 21035
      },
      {
        "Cycles": 0,
        "Agent": "edu.brown.cs.systems.xtrace.logging.BaggageWrappers",
        "ProcessName": "Read",
        "TaskID": "C95DC2D8633CFB29",
        "ParentEventID": [
          "611A18216D149599"
        ],
        "Label": "Forking current baggage with Baggage.fork()",
        "Title": "X-Trace Task",
        "Host": "pinky19.mpi-sws.org",
        "HRT": 25491743151250889,
        "Operation": "fork",
        "Timestamp": "1556275383091.758545",
        "TenantClass": 0,
        "Source": "Client.java:1043",
        "ThreadID": 41,
        "ThreadName": "",
        "EventID": "398958AF31CF86A8",
        "ProcessID": 21035
      },
      {
        "Cycles": 0,
        "Agent": "Execution-CPU",
        "ProcessName": "Read",
        "TaskID": "C95DC2D8633CFB29",
        "ParentEventID": [
          "398958AF31CF86A8"
        ],
        "Label": "unset",
        "Title": "X-Trace Task",
        "Host": "pinky19.mpi-sws.org",
        "Duration": "104191",
        "HRT": 25491743151353062,
        "Operation": "unset",
        "Timestamp": "1556275383091.860840",
        "TenantClass": 0,
        "Source": "Client.java:1062",
        "ThreadID": 41,
        "ThreadName": "",
        "EventID": "3A4FBB5F7C9618E0",
        "ProcessID": 21035
      },
      {
        "Cycles": 0,
        "Agent": "Execution-CPU",
        "ProcessName": "Read",
        "TaskID": "C95DC2D8633CFB29",
        "ParentEventID": [
          "3A4FBB5F7C9618E0"
        ],
        "Label": "set",
        "Title": "X-Trace Task",
        "Host": "pinky19.mpi-sws.org",
        "HRT": 25491743151411948,
        "Operation": "set",
        "Timestamp": "1556275383091.919678",
        "TenantClass": 0,
        "Source": "Client.java:1104",
        "ThreadID": 1,
        "ThreadName": "",
        "EventID": "20B9B2D8BCC55B94",
        "ProcessID": 21035
      },
      {
        "Cycles": 0,
        "Agent": "Execution-CPU",
        "ProcessName": "Read",
        "TaskID": "C95DC2D8633CFB29",
        "ParentEventID": [
          "E2BA412F3ECD4656"
        ],
        "Label": "set",
        "Title": "X-Trace Task",
        "Host": "pinky19.mpi-sws.org",
        "HRT": 25491743151236584,
        "Operation": "set",
        "Timestamp": "1556275383091.744385",
        "TenantClass": 0,
        "Source": "Client.java:1032",
        "ThreadID": 41,
        "ThreadName": "",
        "EventID": "611A18216D149599",
        "ProcessID": 21035
      },
      {
        "Cycles": 0,
        "Agent": "Execution-CPU",
        "ProcessName": "Name",
        "TaskID": "C95DC2D8633CFB29",
        "ParentEventID": [
          "D8DEF68B2B8C22D8"
        ],
        "Label": "unset",
        "Title": "X-Trace Task",
        "Host": "pinky19.mpi-sws.org",
        "Duration": "34618",
        "HRT": 25491743151472838,
        "Operation": "unset",
        "Timestamp": "1556275383091.963135",
        "TenantClass": 0,
        "Source": "Server.java:1828",
        "ThreadID": 48,
        "ThreadName": "",
        "EventID": "1B9E7BFC166973DF",
        "BaggageBytes": "[[248 5] [240 0] [0 201 93 194 216 99 60 251 41] [240 1] [0 216 222 246 139 43 140 34 216] [240 3] [0 2]]",
        "ProcessID": 2171
      },
      {
        "Cycles": 0,
        "Agent": "Execution-CPU",
        "ProcessName": "Name",
        "TaskID": "C95DC2D8633CFB29",
        "ParentEventID": [
          "D8DEF68B2B8C22D8"
        ],
        "Label": "set",
        "Title": "X-Trace Task",
        "Host": "pinky19.mpi-sws.org",
        "HRT": 25491743151502471,
        "Operation": "set",
        "Timestamp": "1556275383091.992676",
        "TenantClass": 0,
        "Source": "Server.java:2071",
        "ThreadID": 60,
        "ThreadName": "",
        "EventID": "6728A80D37A1C1F0",
        "BaggageBytes": "[[248 5] [240 0] [0 201 93 194 216 99 60 251 41] [240 1] [0 216 222 246 139 43 140 34 216] [240 3] [0 2]]",
        "ProcessID": 2171
      },
      {
        "Cycles": 0,
        "Agent": "edu.brown.cs.systems.xtrace.logging.BaggageWrappers",
        "ProcessName": "Name",
        "TaskID": "C95DC2D8633CFB29",
        "ParentEventID": [
          "A577AC44C1CFC560"
        ],
        "Label": "Forking current baggage with Baggage.fork()",
        "Title": "X-Trace Task",
        "Host": "pinky19.mpi-sws.org",
        "HRT": 25491743151442173,
        "Operation": "fork",
        "Timestamp": "1556275383091.932373",
        "TenantClass": 0,
        "Source": "Server.java:550",
        "ThreadID": 48,
        "ThreadName": "",
        "EventID": "D8DEF68B2B8C22D8",
        "BaggageBytes": "[[248 5] [240 0] [0 201 93 194 216 99 60 251 41] [240 1] [0 165 119 172 68 193 207 197 96] [240 3] [0 2]]",
        "ProcessID": 2171
      },
      {
        "Cycles": 0,
        "Agent": "org.apache.hadoop.ipc.Server",
        "ProcessName": "Name",
        "TaskID": "C95DC2D8633CFB29",
        "ParentEventID": [
          "6728A80D37A1C1F0"
        ],
        "Label": "getBlockLocations in org.apache.hadoop.hdfs.protocol.ClientProtocol",
        "Title": "X-Trace Task",
        "Host": "pinky19.mpi-sws.org",
        "HRT": 25491743151544979,
        "Timestamp": "1556275383092.035156",
        "TenantClass": 0,
        "Source": "ProtobufRpcEngine.java:601",
        "ThreadID": 60,
        "ThreadName": "",
        "EventID": "4514155DBD38EE31",
        "BaggageBytes": "[[248 5] [240 0] [0 201 93 194 216 99 60 251 41] [240 1] [0 103 40 168 13 55 161 193 240] [240 3] [0 2]]",
        "ProcessID": 2171
      },
      {
        "Cycles": 0,
        "Agent": "edu.brown.cs.systems.xtrace.logging.BaggageWrappers",
        "ProcessName": "Name",
        "TaskID": "C95DC2D8633CFB29",
        "ParentEventID": [
          "FAEFD32121B47202"
        ],
        "Label": "Forking current baggage with Baggage.fork()",
        "Title": "X-Trace Task",
        "Host": "pinky19.mpi-sws.org",
        "HRT": 25491743151662753,
        "Operation": "fork",
        "Timestamp": "1556275383092.153076",
        "TenantClass": 0,
        "Source": "Server.java:2398",
        "ThreadID": 60,
        "ThreadName": "",
        "EventID": "83E61283D9AB1A9C",
        "BaggageBytes": "[[248 5] [240 0] [0 201 93 194 216 99 60 251 41] [240 1] [0 250 239 211 33 33 180 114 2] [240 3] [0 2]]",
        "ProcessID": 2171
      },
      {
        "Cycles": 0,
        "Agent": "Execution-CPU",
        "ProcessName": "Name",
        "TaskID": "C95DC2D8633CFB29",
        "ParentEventID": [
          "398958AF31CF86A8"
        ],
        "Label": "set",
        "Title": "X-Trace Task",
        "Host": "pinky19.mpi-sws.org",
        "HRT": 25491743151407931,
        "Operation": "set",
        "Timestamp": "1556275383091.898193",
        "TenantClass": 0,
        "Source": "Server.java:1840",
        "ThreadID": 48,
        "ThreadName": "",
        "EventID": "A577AC44C1CFC560",
        "BaggageBytes": "[[248 5] [240 0] [0 201 93 194 216 99 60 251 41] [240 1] [0 57 137 88 175 49 207 134 168] [240 3] [0 2]]",
        "ProcessID": 2171
      },
      {
        "Cycles": 0,
        "Agent": "Execution-CPU",
        "ProcessName": "Name",
        "TaskID": "C95DC2D8633CFB29",
        "ParentEventID": [
          "83E61283D9AB1A9C"
        ],
        "Label": "unset",
        "Title": "X-Trace Task",
        "Host": "pinky19.mpi-sws.org",
        "Duration": "243211",
        "HRT": 25491743151774709,
        "Operation": "unset",
        "Timestamp": "1556275383092.264893",
        "TenantClass": 0,
        "Source": "Server.java:1058",
        "ThreadID": 60,
        "ThreadName": "",
        "EventID": "157733347098EBB1",
        "BaggageBytes": "[[248 5] [240 0] [0 201 93 194 216 99 60 251 41] [240 1] [0 131 230 18 131 217 171 26 156] [240 3] [0 2]]",
        "ProcessID": 2171
      },
      {
        "Cycles": 0,
        "Agent": "Execution-CPU",
        "ProcessName": "Read",
        "TaskID": "C95DC2D8633CFB29",
        "ParentEventID": [
          "04B6B05085CD0E9E"
        ],
        "Label": "unset",
        "Title": "X-Trace Task",
        "Host": "pinky19.mpi-sws.org",
        "Duration": "20413",
        "HRT": 25491743151867194,
        "Operation": "unset",
        "Timestamp": "1556275383092.375000",
        "TenantClass": 0,
        "Source": "Client.java:1168",
        "ThreadID": 37,
        "ThreadName": "",
        "EventID": "EEEBB0D31F1809E7",
        "ProcessID": 21035
      },
      {
        "Cycles": 0,
        "Agent": "Execution-Sleep",
        "ProcessName": "Read",
        "TaskID": "C95DC2D8633CFB29",
        "ParentEventID": [
          "20B9B2D8BCC55B94"
        ],
        "Label": "waited",
        "Title": "X-Trace Task",
        "Host": "pinky19.mpi-sws.org",
        "Duration": "474226",
        "HRT": 25491743151894931,
        "Operation": "waited",
        "Timestamp": "1556275383092.402588",
        "TenantClass": 0,
        "Source": "Client.java:1537",
        "ThreadID": 1,
        "ThreadName": "",
        "EventID": "A5AFD239451624B7",
        "ProcessID": 21035
      },
      {
        "Cycles": 0,
        "Agent": "Execution-CPU",
        "ProcessName": "Read",
        "TaskID": "C95DC2D8633CFB29",
        "ParentEventID": [
          "83E61283D9AB1A9C"
        ],
        "Label": "set",
        "Title": "X-Trace Task",
        "Host": "pinky19.mpi-sws.org",
        "HRT": 25491743151832251,
        "Operation": "set",
        "Timestamp": "1556275383092.340088",
        "TenantClass": 0,
        "Source": "Client.java:302",
        "ThreadID": 37,
        "ThreadName": "",
        "EventID": "04B6B05085CD0E9E",
        "ProcessID": 21035
      },
      {
        "Cycles": 0,
        "Agent": "org.apache.hadoop.hdfs.server.namenode.FSNamesystem.audit",
        "ProcessName": "Name",
        "TaskID": "C95DC2D8633CFB29",
        "ParentEventID": [
          "4514155DBD38EE31"
        ],
        "Label": "allowed=true\tugi=plascas (auth:SIMPLE)\tip=/139.19.171.63\tcmd=open\tsrc=/ds/4gNEWsd5U01W7HIy\tdst=null\tperm=null\tproto=rpc",
        "Title": "X-Trace Task",
        "Host": "pinky19.mpi-sws.org",
        "HRT": 25491743151594371,
        "Timestamp": "1556275383092.084717",
        "TenantClass": 0,
        "Source": "FSNamesystem.java:8313",
        "ThreadID": 60,
        "ThreadName": "",
        "EventID": "FAEFD32121B47202",
        "BaggageBytes": "[[248 5] [240 0] [0 201 93 194 216 99 60 251 41] [240 1] [0 69 20 21 93 189 56 238 49] [240 3] [0 2]]",
        "ProcessID": 2171
      },
      {
        "Cycles": 0,
        "Agent": "edu.brown.cs.systems.xtrace.logging.BaggageWrappers",
        "ProcessName": "Read",
        "TaskID": "C95DC2D8633CFB29",
        "ParentEventID": [
          "A5AFD239451624B7",
          "EEEBB0D31F1809E7"
        ],
        "Label": "Merged current baggage with other baggage",
        "Title": "X-Trace Task",
        "Host": "pinky19.mpi-sws.org",
        "HRT": 25491743151910725,
        "Operation": "join",
        "Timestamp": "1556275383092.418457",
        "TenantClass": 0,
        "Source": "Client.java:1545",
        "ThreadID": 1,
        "ThreadName": "",
        "EventID": "1DB34D0ACDE136D4",
        "ProcessID": 21035
      },
      {
        "Cycles": 0,
        "Agent": "Execution-CPU",
        "ProcessName": "Data",
        "TaskID": "C95DC2D8633CFB29",
        "ParentEventID": [
          "9E85C156818EFD4F"
        ],
        "Label": "set",
        "Title": "X-Trace Task",
        "Host": "pinky20.mpi-sws.org",
        "HRT": 5094947512058268,
        "Operation": "set",
        "Timestamp": "1556275383093.218506",
        "TenantClass": 0,
        "Source": "Receiver.java:117",
        "ThreadID": 5400,
        "ThreadName": "",
        "EventID": "7627B05AE33D6244",
        "BaggageBytes": "[[248 5] [240 0] [0 201 93 194 216 99 60 251 41] [240 1] [0 158 133 193 86 129 142 253 79] [240 3] [0 2]]",
        "ProcessID": 13111
      },
      {
        "Cycles": 0,
        "Agent": "edu.brown.cs.systems.xtrace.logging.BaggageWrappers",
        "ProcessName": "Read",
        "TaskID": "C95DC2D8633CFB29",
        "ParentEventID": [
          "BBDA98A68861B0B6"
        ],
        "Label": "Forking current baggage with Baggage.fork()",
        "Title": "X-Trace Task",
        "Host": "pinky19.mpi-sws.org",
        "HRT": 25491743152083939,
        "Operation": "fork",
        "Timestamp": "1556275383092.591797",
        "TenantClass": 0,
        "Source": "DataTransferProtoUtil.java:94",
        "ThreadID": 1,
        "ThreadName": "",
        "EventID": "9E85C156818EFD4F",
        "ProcessID": 21035
      },
      {
        "Cycles": 0,
        "Agent": "edu.brown.cs.systems.xtrace.logging.XTraceInit",
        "ProcessName": "Data",
        "TaskID": "C95DC2D8633CFB29",
        "ParentEventID": [
          "7627B05AE33D6244"
        ],
        "Label": "Thread.setName: DataXceiver for client DFSClient_NONMAPREDUCE_1377588049_1 at /139.19.171.63:32854 [Sending block BP-1633380353-139.19.171.63-1554193446451:blk_1073767830_27006]",
        "Title": "X-Trace Task",
        "Host": "pinky20.mpi-sws.org",
        "HRT": 5094947512168915,
        "Timestamp": "1556275383093.329102",
        "TenantClass": 0,
        "Source": "DataXceiver.java:168",
        "ThreadID": 5400,
        "ThreadName": "",
        "EventID": "F6AB6AD4DD0BD11B",
        "BaggageBytes": "[[248 5] [240 0] [0 201 93 194 216 99 60 251 41] [240 1] [0 118 39 176 90 227 61 98 68] [240 3] [0 2]]",
        "ProcessID": 13111
      },
      {
        "Cycles": 0,
        "Agent": "edu.brown.cs.systems.xtrace.logging.BaggageWrappers",
        "ProcessName": "Data",
        "TaskID": "C95DC2D8633CFB29",
        "ParentEventID": [
          "F6AB6AD4DD0BD11B"
        ],
        "Label": "Forking current baggage with Baggage.fork()",
        "Title": "X-Trace Task",
        "Host": "pinky20.mpi-sws.org",
        "HRT": 5094947512421759,
        "Operation": "fork",
        "Timestamp": "1556275383093.582031",
        "TenantClass": 0,
        "Source": "DataXceiver.java:1257",
        "ThreadID": 5400,
        "ThreadName": "",
        "EventID": "A7E9DCC0FD5C87C8",
        "BaggageBytes": "[[248 5] [240 0] [0 201 93 194 216 99 60 251 41] [240 1] [0 246 171 106 212 221 11 209 27] [240 3] [0 2]]",
        "ProcessID": 13111
      },
      {
        "Cycles": 0,
        "Agent": "edu.brown.cs.systems.xtrace.logging.BaggageWrappers",
        "ProcessName": "Data",
        "TaskID": "C95DC2D8633CFB29",
        "ParentEventID": [
          "A7E9DCC0FD5C87C8"
        ],
        "Label": "Forking current baggage with Baggage.fork()",
        "Title": "X-Trace Task",
        "Host": "pinky20.mpi-sws.org",
        "HRT": 5094947512612902,
        "Operation": "fork",
        "Timestamp": "1556275383093.772949",
        "TenantClass": 0,
        "Source": "PacketHeader.java:95",
        "ThreadID": 5400,
        "ThreadName": "",
        "EventID": "BF88E089A110F150",
        "BaggageBytes": "[[248 5] [240 0] [0 201 93 194 216 99 60 251 41] [240 1] [0 167 233 220 192 253 92 135 200] [240 3] [0 2]]",
        "ProcessID": 13111
      },
      {
        "Cycles": 0,
        "Agent": "org.apache.hadoop.ipc.ProtobufRpcEngine",
        "ProcessName": "Read",
        "TaskID": "C95DC2D8633CFB29",
        "ParentEventID": [
          "1DB34D0ACDE136D4"
        ],
        "Label": "org.apache.hadoop.hdfs.protocol.ClientProtocol.getBlockLocations completed",
        "Title": "X-Trace Task",
        "Host": "pinky19.mpi-sws.org",
        "HRT": 25491743151979702,
        "Timestamp": "1556275383092.487549",
        "TenantClass": 0,
        "Source": "ProtobufRpcEngine.java:275",
        "ThreadID": 1,
        "ThreadName": "",
        "EventID": "BBDA98A68861B0B6",
        "ProcessID": 21035
      },
      {
        "Cycles": 0,
        "Agent": "edu.brown.cs.systems.xtrace.logging.BaggageWrappers",
        "ProcessName": "Read",
        "TaskID": "C95DC2D8633CFB29",
        "ParentEventID": [
          "A7E9DCC0FD5C87C8",
          "5A8BA4423FD5B748"
        ],
        "Label": "Merged current baggage with other baggage",
        "Title": "X-Trace Task",
        "Host": "pinky19.mpi-sws.org",
        "HRT": 25491743153113676,
        "Operation": "join",
        "Timestamp": "1556275383093.621338",
        "TenantClass": 0,
        "Source": "RemoteBlockReader2.java:429",
        "ThreadID": 1,
        "ThreadName": "",
        "EventID": "F958EB5DB823849B",
        "ProcessID": 21035
      },
      {
        "Cycles": 0,
        "Agent": "Execution-Sleep",
        "ProcessName": "Read",
        "TaskID": "C95DC2D8633CFB29",
        "ParentEventID": [
          "F958EB5DB823849B"
        ],
        "Label": "waited",
        "Title": "X-Trace Task",
        "Host": "pinky19.mpi-sws.org",
        "Duration": "136544",
        "HRT": 25491743153384837,
        "Operation": "waited",
        "Timestamp": "1556275383093.892578",
        "TenantClass": 0,
        "Source": "SocketIOWithTimeout.java:335",
        "ThreadID": 1,
        "ThreadName": "",
        "EventID": "C898D3C7ED4476EE",
        "ProcessID": 21035
      },
      {
        "Cycles": 0,
        "Agent": "Execution-Sleep",
        "ProcessName": "Read",
        "TaskID": "C95DC2D8633CFB29",
        "ParentEventID": [
          "9E85C156818EFD4F"
        ],
        "Label": "waited",
        "Title": "X-Trace Task",
        "Host": "pinky19.mpi-sws.org",
        "Duration": "766044",
        "HRT": 25491743152993993,
        "Operation": "waited",
        "Timestamp": "1556275383093.501709",
        "TenantClass": 0,
        "Source": "SocketIOWithTimeout.java:335",
        "ThreadID": 1,
        "ThreadName": "",
        "EventID": "5A8BA4423FD5B748",
        "ProcessID": 21035
      },
      {
        "Cycles": 0,
        "Agent": "edu.brown.cs.systems.xtrace.logging.BaggageWrappers",
        "ProcessName": "Read",
        "TaskID": "C95DC2D8633CFB29",
        "ParentEventID": [
          "C898D3C7ED4476EE",
          "BF88E089A110F150"
        ],
        "Label": "Merged current baggage with other baggage",
        "Title": "X-Trace Task",
        "Host": "pinky19.mpi-sws.org",
        "HRT": 25491743153442826,
        "Operation": "join",
        "Timestamp": "1556275383093.950684",
        "TenantClass": 0,
        "Source": "PacketHeader.java:168",
        "ThreadID": 1,
        "ThreadName": "",
        "EventID": "38AA1334A1BEEC22",
        "ProcessID": 21035
      },
      {
        "Cycles": 0,
        "Agent": "edu.brown.cs.systems.xtrace.logging.BaggageWrappers",
        "ProcessName": "Read",
        "TaskID": "C95DC2D8633CFB29",
        "ParentEventID": [
          "1F450B726D549916",
          "38AA1334A1BEEC22"
        ],
        "Label": "Merged current baggage with other baggage",
        "Title": "X-Trace Task",
        "Host": "pinky19.mpi-sws.org",
        "HRT": 25491743153557870,
        "Operation": "join",
        "Timestamp": "1556275383094.065674",
        "TenantClass": 0,
        "Source": "PacketHeader.java:168",
        "ThreadID": 1,
        "ThreadName": "",
        "EventID": "606325528B7469EE",
        "ProcessID": 21035
      },
      {
        "Cycles": 0,
        "Agent": "edu.brown.cs.systems.xtrace.logging.BaggageWrappers",
        "ProcessName": "Data",
        "TaskID": "C95DC2D8633CFB29",
        "ParentEventID": [
          "B370B1D1E180EABB"
        ],
        "Label": "Forking current baggage with Baggage.fork()",
        "Title": "X-Trace Task",
        "Host": "pinky20.mpi-sws.org",
        "HRT": 5094947512960213,
        "Operation": "fork",
        "Timestamp": "1556275383094.120361",
        "TenantClass": 0,
        "Source": "PacketHeader.java:95",
        "ThreadID": 5400,
        "ThreadName": "",
        "EventID": "1F450B726D549916",
        "BaggageBytes": "[[248 5] [240 0] [0 201 93 194 216 99 60 251 41] [240 1] [0 179 112 177 209 225 128 234 187] [240 3] [0 2]]",
        "ProcessID": 13111
      },
      {
        "Cycles": 0,
        "Agent": "edu.brown.cs.systems.xtrace.logging.BaggageWrappers",
        "ProcessName": "Read",
        "TaskID": "C95DC2D8633CFB29",
        "ParentEventID": [
          "606325528B7469EE"
        ],
        "Label": "Forking current baggage with Baggage.fork()",
        "Title": "X-Trace Task",
        "Host": "pinky19.mpi-sws.org",
        "HRT": 25491743153573568,
        "Operation": "fork",
        "Timestamp": "1556275383094.081299",
        "TenantClass": 0,
        "Source": "RemoteBlockReader2.java:361",
        "ThreadID": 1,
        "ThreadName": "",
        "EventID": "79D7F84C18BBA084",
        "ProcessID": 21035
      },
      {
        "Cycles": 0,
        "Agent": "Execution-Sleep",
        "ProcessName": "Data",
        "TaskID": "C95DC2D8633CFB29",
        "ParentEventID": [
          "1F450B726D549916"
        ],
        "Label": "waited",
        "Title": "X-Trace Task",
        "Host": "pinky20.mpi-sws.org",
        "Duration": "106177",
        "HRT": 5094947513301983,
        "Operation": "waited",
        "Timestamp": "1556275383094.462158",
        "TenantClass": 0,
        "Source": "SocketIOWithTimeout.java:335",
        "ThreadID": 5400,
        "ThreadName": "",
        "EventID": "4EFA7BFD24455A64",
        "BaggageBytes": "[[248 5] [240 0] [0 201 93 194 216 99 60 251 41] [240 1] [0 31 69 11 114 109 84 153 22] [240 3] [0 2]]",
        "ProcessID": 13111
      },
      {
        "Cycles": 0,
        "Agent": "Execution-CPU",
        "ProcessName": "Data",
        "TaskID": "C95DC2D8633CFB29",
        "ParentEventID": [
          "C07F1F27679603C1"
        ],
        "Label": "unset",
        "Title": "X-Trace Task",
        "Host": "pinky20.mpi-sws.org",
        "Duration": "1363889",
        "HRT": 5094947513493000,
        "Operation": "unset",
        "Timestamp": "1556275383094.653076",
        "TenantClass": 0,
        "Source": "DataXceiver.java:261",
        "ThreadID": 5400,
        "ThreadName": "",
        "EventID": "69A8D4C4EA9DDC4C",
        "BaggageBytes": "[[248 5] [240 0] [0 201 93 194 216 99 60 251 41] [240 1] [0 192 127 31 39 103 150 3 193] [240 3] [0 2]]",
        "ProcessID": 13111
      },
      {
        "Cycles": 0,
        "Agent": "Execution-Sleep",
        "ProcessName": "Data",
        "TaskID": "C95DC2D8633CFB29",
        "ParentEventID": [
          "BF88E089A110F150"
        ],
        "Label": "waited",
        "Title": "X-Trace Task",
        "Host": "pinky20.mpi-sws.org",
        "Duration": "15220",
        "HRT": 5094947512773262,
        "Operation": "waited",
        "Timestamp": "1556275383093.933350",
        "TenantClass": 0,
        "Source": "SocketIOWithTimeout.java:335",
        "ThreadID": 5400,
        "ThreadName": "",
        "EventID": "B370B1D1E180EABB",
        "BaggageBytes": "[[248 5] [240 0] [0 201 93 194 216 99 60 251 41] [240 1] [0 191 136 224 137 161 16 241 80] [240 3] [0 2]]",
        "ProcessID": 13111
      },
      {
        "Cycles": 0,
        "Agent": "edu.brown.cs.systems.xtrace.logging.BaggageWrappers",
        "ProcessName": "Data",
        "TaskID": "C95DC2D8633CFB29",
        "ParentEventID": [
          "4EFA7BFD24455A64",
          "79D7F84C18BBA084"
        ],
        "Label": "Merged current baggage with other baggage",
        "Title": "X-Trace Task",
        "Host": "pinky20.mpi-sws.org",
        "HRT": 5094947513447387,
        "Operation": "join",
        "Timestamp": "1556275383094.607666",
        "TenantClass": 0,
        "Source": "DataXceiver.java:574",
        "ThreadID": 5400,
        "ThreadName": "",
        "EventID": "C07F1F27679603C1",
        "BaggageBytes": "[[248 5] [240 0] [0 201 93 194 216 99 60 251 41] [240 1] [0 78 250 123 253 36 69 90 100] [0 121 215 248 76 24 187 160 132] [240 3] [0 2]]",
        "ProcessID": 13111
      }
    ]
  }
]