[
  {
    "id": "CAE0013936F02A29",
    "reports": [
      {
        "Cycles": 0,
        "Agent": "org.apache.hadoop.ipc.ProtobufRpcEngine",
        "ProcessName": "Read",
        "TaskID": "CAE0013936F02A29",
        "ParentEventID": [
          "2E3C661AA428AF77"
        ],
        "Label": "Invoking org.apache.hadoop.hdfs.protocol.ClientProtocol.getBlockLocations",
        "Title": "X-Trace Task",
        "Host": "pinky19.mpi-sws.org",
        "HRT": 26962660819818266,
        "Timestamp": "1557746300759.760254",
        "TenantClass": 0,
        "Source": "ProtobufRpcEngine.java:228",
        "ThreadID": 1,
        "ThreadName": "",
        "EventID": "F6CD61E35170E3C2",
        "ProcessID": 36430
      },
      {
        "Cycles": 0,
        "Agent": "edu.brown.cs.systems.retro.benchmarks.hdfs_client.Reader",
        "ProcessName": "Read",
        "TaskID": "CAE0013936F02A29",
        "ParentEventID": [
          "E19C6F3EBF5C9F05"
        ],
        "Label": "Reading file",
        "Title": "X-Trace Task",
        "Host": "pinky19.mpi-sws.org",
        "HRT": 26962660819790814,
        "Timestamp": "1557746300759.732910",
        "TenantClass": 0,
        "ThreadID": 1,
        "ThreadName": "",
        "EventID": "2E3C661AA428AF77",
        "ProcessID": 36430
      },
      {
        "Cycles": 0,
        "Agent": "Execution-CPU",
        "ProcessName": "Read",
        "TaskID": "CAE0013936F02A29",
        "ParentEventID": [
          "F6CD61E35170E3C2"
        ],
        "Label": "unset",
        "Title": "X-Trace Task",
        "Host": "pinky19.mpi-sws.org",
        "Duration": "22135509",
        "HRT": 26962660819837162,
        "Operation": "unset",
        "Timestamp": "1557746300759.779297",
        "TenantClass": 0,
        "Source": "Client.java:1027",
        "ThreadID": 1,
        "ThreadName": "",
        "EventID": "C17DE56026EFABDB",
        "ProcessID": 36430
      },
      {
        "Cycles": 0,
        "Agent": "Execution-CPU",
        "ProcessName": "Read",
        "TaskID": "CAE0013936F02A29",
        "ParentEventID": [
          "C17DE56026EFABDB"
        ],
        "Label": "set",
        "Title": "X-Trace Task",
        "Host": "pinky19.mpi-sws.org",
        "HRT": 26962660819883846,
        "Operation": "set",
        "Timestamp": "1557746300759.825928",
        "TenantClass": 0,
        "Source": "Client.java:1032",
        "ThreadID": 41,
        "ThreadName": "",
        "EventID": "40BA801DFBA9F147",
        "ProcessID": 36430
      },
      {
        "Cycles": 0,
        "Agent": "edu.brown.cs.systems.xtrace.logging.BaggageWrappers",
        "ProcessName": "Read",
        "TaskID": "CAE0013936F02A29",
        "ParentEventID": [
          "40BA801DFBA9F147"
        ],
        "Label": "Forking current baggage with Baggage.fork()",
        "Title": "X-Trace Task",
        "Host": "pinky19.mpi-sws.org",
        "HRT": 26962660819902489,
        "Operation": "fork",
        "Timestamp": "1557746300759.844482",
        "TenantClass": 0,
        "Source": "Client.java:1043",
        "ThreadID": 41,
        "ThreadName": "",
        "EventID": "F59E546ACDC5A817",
        "ProcessID": 36430
      },
      {
        "Cycles": 0,
        "Agent": "Execution-CPU",
        "ProcessName": "Read",
        "TaskID": "CAE0013936F02A29",
        "ParentEventID": [
          "F59E546ACDC5A817"
        ],
        "Label": "unset",
        "Title": "X-Trace Task",
        "Host": "pinky19.mpi-sws.org",
        "Duration": "65886",
        "HRT": 26962660819968427,
        "Operation": "unset",
        "Timestamp": "1557746300759.910400",
        "TenantClass": 0,
        "Source": "Client.java:1062",
        "ThreadID": 41,
        "ThreadName": "",
        "EventID": "3481B0F370F0FB1E",
        "ProcessID": 36430
      },
      {
        "Cycles": 0,
        "Agent": "Execution-CPU",
        "ProcessName": "Read",
        "TaskID": "CAE0013936F02A29",
        "ParentEventID": [
          "3481B0F370F0FB1E"
        ],
        "Label": "set",
        "Title": "X-Trace Task",
        "Host": "pinky19.mpi-sws.org",
        "HRT": 26962660819991926,
        "Operation": "set",
        "Timestamp": "1557746300759.934082",
        "TenantClass": 0,
        "Source": "Client.java:1104",
        "ThreadID": 1,
        "ThreadName": "",
        "EventID": "F6832B023889AFD7",
        "ProcessID": 36430
      },
      {
        "Cycles": 0,
        "Agent": "edu.brown.cs.systems.xtrace.logging.BaggageWrappers",
        "ProcessName": "Name",
        "TaskID": "CAE0013936F02A29",
        "ParentEventID": [
          "C1281C556B6B7001"
        ],
        "Label": "Forking current baggage with Baggage.fork()",
        "Title": "X-Trace Task",
        "Host": "pinky19.mpi-sws.org",
        "HRT": 26962660820083515,
        "Operation": "fork",
        "Timestamp": "1557746300760.028320",
        "TenantClass": 0,
        "Source": "Server.java:550",
        "ThreadID": 48,
        "ThreadName": "",
        "EventID": "5A2069AEB4157086",
        "BaggageBytes": "[[248 5] [240 0] [0 202 224 1 57 54 240 42 41] [240 1] [0 193 40 28 85 107 107 112 1] [240 3] [0 2]]",
        "ProcessID": 2171
      },
      {
        "Cycles": 0,
        "Agent": "Execution-CPU",
        "ProcessName": "Name",
        "TaskID": "CAE0013936F02A29",
        "ParentEventID": [
          "F59E546ACDC5A817"
        ],
        "Label": "set",
        "Title": "X-Trace Task",
        "Host": "pinky19.mpi-sws.org",
        "HRT": 26962660820053586,
        "Operation": "set",
        "Timestamp": "1557746300759.998535",
        "TenantClass": 0,
        "Source": "Server.java:1840",
        "ThreadID": 48,
        "ThreadName": "",
        "EventID": "C1281C556B6B7001",
        "BaggageBytes": "[[248 5] [240 0] [0 202 224 1 57 54 240 42 41] [240 1] [0 245 158 84 106 205 197 168 23] [240 3] [0 2]]",
        "ProcessID": 2171
      },
      {
        "Cycles": 0,
        "Agent": "Execution-CPU",
        "ProcessName": "Name",
        "TaskID": "CAE0013936F02A29",
        "ParentEventID": [
          "5A2069AEB4157086"
        ],
        "Label": "unset",
        "Title": "X-Trace Task",
        "Host": "pinky19.mpi-sws.org",
        "Duration": "23673",
        "HRT": 26962660820103132,
        "Operation": "unset",
        "Timestamp": "1557746300760.048096",
        "TenantClass": 0,
        "Source": "Server.java:1828",
        "ThreadID": 48,
        "ThreadName": "",
        "EventID": "992ABCD6FD91944C",
        "BaggageBytes": "[[248 5] [240 0] [0 202 224 1 57 54 240 42 41] [240 1] [0 90 32 105 174 180 21 112 134] [240 3] [0 2]]",
        "ProcessID": 2171
      },
      {
        "Cycles": 0,
        "Agent": "Execution-CPU",
        "ProcessName": "Name",
        "TaskID": "CAE0013936F02A29",
        "ParentEventID": [
          "5A2069AEB4157086"
        ],
        "Label": "set",
        "Title": "X-Trace Task",
        "Host": "pinky19.mpi-sws.org",
        "HRT": 26962660820110738,
        "Operation": "set",
        "Timestamp": "1557746300760.055664",
        "TenantClass": 0,
        "Source": "Server.java:2071",
        "ThreadID": 56,
        "ThreadName": "",
        "EventID": "56FDD021DEE96301",
        "BaggageBytes": "[[248 5] [240 0] [0 202 224 1 57 54 240 42 41] [240 1] [0 90 32 105 174 180 21 112 134] [240 3] [0 2]]",
        "ProcessID": 2171
      },
      {
        "Cycles": 0,
        "Agent": "org.apache.hadoop.ipc.Server",
        "ProcessName": "Name",
        "TaskID": "CAE0013936F02A29",
        "ParentEventID": [
          "56FDD021DEE96301"
        ],
        "Label": "getBlockLocations in org.apache.hadoop.hdfs.protocol.ClientProtocol",
        "Title": "X-Trace Task",
        "Host": "pinky19.mpi-sws.org",
        "HRT": 26962660820150260,
        "Timestamp": "1557746300760.095215",
        "TenantClass": 0,
        "Source": "ProtobufRpcEngine.java:601",
        "ThreadID": 56,
        "ThreadName": "",
        "EventID": "DA625E3ED2CE66F4",
        "BaggageBytes": "[[248 5] [240 0] [0 202 224 1 57 54 240 42 41] [240 1] [0 86 253 208 33 222 233 99 1] [240 3] [0 2]]",
        "ProcessID": 2171
      },
      {
        "Cycles": 0,
        "Agent": "edu.brown.cs.systems.xtrace.logging.BaggageWrappers",
        "ProcessName": "Name",
        "TaskID": "CAE0013936F02A29",
        "ParentEventID": [
          "12F82BB190492F0B"
        ],
        "Label": "Forking current baggage with Baggage.fork()",
        "Title": "X-Trace Task",
        "Host": "pinky19.mpi-sws.org",
        "HRT": 26962660822449149,
        "Operation": "fork",
        "Timestamp": "1557746300762.394043",
        "TenantClass": 0,
        "Source": "Server.java:2398",
        "ThreadID": 56,
        "ThreadName": "",
        "EventID": "1B81FD44858085E9",
        "BaggageBytes": "[[248 5] [240 0] [0 202 224 1 57 54 240 42 41] [240 1] [0 18 248 43 177 144 73 47 11] [240 3] [0 2]]",
        "ProcessID": 2171
      },
      {
        "Cycles": 0,
        "Agent": "org.apache.hadoop.hdfs.server.namenode.FSNamesystem.audit",
        "ProcessName": "Name",
        "TaskID": "CAE0013936F02A29",
        "ParentEventID": [
          "DA625E3ED2CE66F4"
        ],
        "Label": "allowed=true\tugi=plascas (auth:SIMPLE)\tip=/139.19.171.63\tcmd=open\tsrc=/ds/ex9zVgvFF9A7Xibq\tdst=null\tperm=null\tproto=rpc",
        "Title": "X-Trace Task",
        "Host": "pinky19.mpi-sws.org",
        "HRT": 26962660822402830,
        "Timestamp": "1557746300762.347656",
        "TenantClass": 0,
        "Source": "FSNamesystem.java:8313",
        "ThreadID": 56,
        "ThreadName": "",
        "EventID": "12F82BB190492F0B",
        "BaggageBytes": "[[248 5] [240 0] [0 202 224 1 57 54 240 42 41] [240 1] [0 218 98 94 62 210 206 102 244] [240 3] [0 2]]",
        "ProcessID": 2171
      },
      {
        "Cycles": 0,
        "Agent": "Execution-CPU",
        "ProcessName": "Name",
        "TaskID": "CAE0013936F02A29",
        "ParentEventID": [
          "1B81FD44858085E9"
        ],
        "Label": "unset",
        "Title": "X-Trace Task",
        "Host": "pinky19.mpi-sws.org",
        "Duration": "2423053",
        "HRT": 26962660822560537,
        "Operation": "unset",
        "Timestamp": "1557746300762.505371",
        "TenantClass": 0,
        "Source": "Server.java:1058",
        "ThreadID": 56,
        "ThreadName": "",
        "EventID": "6FB15B9D2EC41006",
        "BaggageBytes": "[[248 5] [240 0] [0 202 224 1 57 54 240 42 41] [240 1] [0 27 129 253 68 133 128 133 233] [240 3] [0 2]]",
        "ProcessID": 2171
      },
      {
        "Cycles": 0,
        "Agent": "Execution-CPU",
        "ProcessName": "Read",
        "TaskID": "CAE0013936F02A29",
        "ParentEventID": [
          "1B81FD44858085E9"
        ],
        "Label": "set",
        "Title": "X-Trace Task",
        "Host": "pinky19.mpi-sws.org",
        "HRT": 26962660822606001,
        "Operation": "set",
        "Timestamp": "1557746300762.548096",
        "TenantClass": 0,
        "Source": "Client.java:302",
        "ThreadID": 37,
        "ThreadName": "",
        "EventID": "6BB641CC1927F894",
        "ProcessID": 36430
      },
      {
        "Cycles": 0,
        "Agent": "Execution-CPU",
        "ProcessName": "Read",
        "TaskID": "CAE0013936F02A29",
        "ParentEventID": [
          "6BB641CC1927F894"
        ],
        "Label": "unset",
        "Title": "X-Trace Task",
        "Host": "pinky19.mpi-sws.org",
        "Duration": "5371",
        "HRT": 26962660822625165,
        "Operation": "unset",
        "Timestamp": "1557746300762.567139",
        "TenantClass": 0,
        "Source": "Client.java:1168",
        "ThreadID": 37,
        "ThreadName": "",
        "EventID": "A870C01DF6A0AFF1",
        "ProcessID": 36430
      },
      {
        "Cycles": 0,
        "Agent": "Execution-Sleep",
        "ProcessName": "Read",
        "TaskID": "CAE0013936F02A29",
        "ParentEventID": [
          "F6832B023889AFD7"
        ],
        "Label": "waited",
        "Title": "X-Trace Task",
        "Host": "pinky19.mpi-sws.org",
        "Duration": "2639838",
        "HRT": 26962660822646087,
        "Operation": "waited",
        "Timestamp": "1557746300762.588135",
        "TenantClass": 0,
        "Source": "Client.java:1537",
        "ThreadID": 1,
        "ThreadName": "",
        "EventID": "F8852168627DF69C",
        "ProcessID": 36430
      },
      {
        "Cycles": 0,
        "Agent": "edu.brown.cs.systems.xtrace.logging.BaggageWrappers",
        "ProcessName": "Read",
        "TaskID": "CAE0013936F02A29",
        "ParentEventID": [
          "F8852168627DF69C",
          "A870C01DF6A0AFF1"
        ],
        "Label": "Merged current baggage with other baggage",
        "Title": "X-Trace Task",
        "Host": "pinky19.mpi-sws.org",
        "HRT": 26962660822665867,
        "Operation": "join",
        "Timestamp": "1557746300762.607910",
        "TenantClass": 0,
        "Source": "Client.java:1545",
        "ThreadID": 1,
        "ThreadName": "",
        "EventID": "40B40002333DF4EE",
        "ProcessID": 36430
      },
      {
        "Cycles": 0,
        "Agent": "org.apache.hadoop.ipc.ProtobufRpcEngine",
        "ProcessName": "Read",
        "TaskID": "CAE0013936F02A29",
        "ParentEventID": [
          "40B40002333DF4EE"
        ],
        "Label": "org.apache.hadoop.hdfs.protocol.ClientProtocol.getBlockLocations completed",
        "Title": "X-Trace Task",
        "Host": "pinky19.mpi-sws.org",
        "HRT": 26962660822704433,
        "Timestamp": "1557746300762.646484",
        "TenantClass": 0,
        "Source": "ProtobufRpcEngine.java:275",
        "ThreadID": 1,
        "ThreadName": "",
        "EventID": "FBED5613819C23F3",
        "ProcessID": 36430
      },
      {
        "Cycles": 0,
        "Agent": "edu.brown.cs.systems.xtrace.logging.BaggageWrappers",
        "ProcessName": "Read",
        "TaskID": "CAE0013936F02A29",
        "ParentEventID": [
          "FBED5613819C23F3"
        ],
        "Label": "Forking current baggage with Baggage.fork()",
        "Title": "X-Trace Task",
        "Host": "pinky19.mpi-sws.org",
        "HRT": 26962660822759243,
        "Operation": "fork",
        "Timestamp": "1557746300762.701416",
        "TenantClass": 0,
        "Source": "DataTransferProtoUtil.java:94",
        "ThreadID": 1,
        "ThreadName": "",
        "EventID": "FAE8EF8F27D68DC9",
        "ProcessID": 36430
      },
      {
        "Cycles": 0,
        "Agent": "Execution-CPU",
        "ProcessName": "Data",
        "TaskID": "CAE0013936F02A29",
        "ParentEventID": [
          "FAE8EF8F27D68DC9"
        ],
        "Label": "set",
        "Title": "X-Trace Task",
        "Host": "pinky21.mpi-sws.org",
        "HRT": 10808970529370333,
        "Operation": "set",
        "Timestamp": "1557746300763.030029",
        "TenantClass": 0,
        "Source": "Receiver.java:117",
        "ThreadID": 14875,
        "ThreadName": "",
        "EventID": "E94736DDB946A26B",
        "BaggageBytes": "[[248 5] [240 0] [0 202 224 1 57 54 240 42 41] [240 1] [0 250 232 239 143 39 214 141 201] [240 3] [0 2]]",
        "ProcessID": 20775
      },
      {
        "Cycles": 0,
        "Agent": "edu.brown.cs.systems.xtrace.logging.XTraceInit",
        "ProcessName": "Data",
        "TaskID": "CAE0013936F02A29",
        "ParentEventID": [
          "E94736DDB946A26B"
        ],
        "Label": "Thread.setName: DataXceiver for client DFSClient_NONMAPREDUCE_778905418_1 at /139.19.171.63:35320 [Sending block BP-1633380353-139.19.171.63-1554193446451:blk_1073767902_27078]",
        "Title": "X-Trace Task",
        "Host": "pinky21.mpi-sws.org",
        "HRT": 10808970529470877,
        "Timestamp": "1557746300763.130615",
        "TenantClass": 0,
        "Source": "DataXceiver.java:168",
        "ThreadID": 14875,
        "ThreadName": "",
        "EventID": "0A31164B21691C7D",
        "BaggageBytes": "[[248 5] [240 0] [0 202 224 1 57 54 240 42 41] [240 1] [0 233 71 54 221 185 70 162 107] [240 3] [0 2]]",
        "ProcessID": 20775
      },
      {
        "Cycles": 0,
        "Agent": "edu.brown.cs.systems.retro.benchmarks.hdfs_client.Reader",
        "ProcessName": "Read",
        "TaskID": "CAE0013936F02A29",
        "ParentEventID": [
          "0"
        ],
        "Label": "Reading file",
        "Title": "X-Trace Task",
        "Host": "pinky19.mpi-sws.org",
        "HRT": 26962660819779058,
        "Timestamp": "1557746300759.721191",
        "TenantClass": 0,
        "ThreadID": 1,
        "ThreadName": "",
        "EventID": "E19C6F3EBF5C9F05",
        "ProcessID": 36430,
        "Tag": [
          "reader_10kb",
          "Read Size: 10240"
        ]
      },
      {
        "Cycles": 0,
        "Agent": "edu.brown.cs.systems.xtrace.logging.BaggageWrappers",
        "ProcessName": "Data",
        "TaskID": "CAE0013936F02A29",
        "ParentEventID": [
          "0A31164B21691C7D"
        ],
        "Label": "Forking current baggage with Baggage.fork()",
        "Title": "X-Trace Task",
        "Host": "pinky21.mpi-sws.org",
        "HRT": 10808970557159346,
        "Operation": "fork",
        "Timestamp": "1557746300790.819092",
        "TenantClass": 0,
        "Source": "DataXceiver.java:1257",
        "ThreadID": 14875,
        "ThreadName": "",
        "EventID": "E98C397CB9A47ED0",
        "BaggageBytes": "[[248 5] [240 0] [0 202 224 1 57 54 240 42 41] [240 1] [0 10 49 22 75 33 105 28 125] [240 3] [0 2]]",
        "ProcessID": 20775
      },
      {
        "Cycles": 0,
        "Agent": "Execution-Sleep",
        "ProcessName": "Read",
        "TaskID": "CAE0013936F02A29",
        "ParentEventID": [
          "FAE8EF8F27D68DC9"
        ],
        "Label": "waited",
        "Title": "X-Trace Task",
        "Host": "pinky19.mpi-sws.org",
        "Duration": "28138226",
        "HRT": 26962660850973371,
        "Operation": "waited",
        "Timestamp": "1557746300790.915527",
        "TenantClass": 0,
        "Source": "SocketIOWithTimeout.java:335",
        "ThreadID": 1,
        "ThreadName": "",
        "EventID": "104D2317BE54FB84",
        "ProcessID": 36430
      },
      {
        "Cycles": 0,
        "Agent": "edu.brown.cs.systems.xtrace.logging.BaggageWrappers",
        "ProcessName": "Data",
        "TaskID": "CAE0013936F02A29",
        "ParentEventID": [
          "E98C397CB9A47ED0"
        ],
        "Label": "Forking current baggage with Baggage.fork()",
        "Title": "X-Trace Task",
        "Host": "pinky21.mpi-sws.org",
        "HRT": 10808970557233955,
        "Operation": "fork",
        "Timestamp": "1557746300790.893799",
        "TenantClass": 0,
        "Source": "PacketHeader.java:95",
        "ThreadID": 14875,
        "ThreadName": "",
        "EventID": "8E022A45F0F81492",
        "BaggageBytes": "[[248 5] [240 0] [0 202 224 1 57 54 240 42 41] [240 1] [0 233 140 57 124 185 164 126 208] [240 3] [0 2]]",
        "ProcessID": 20775
      },
      {
        "Cycles": 0,
        "Agent": "Execution-Sleep",
        "ProcessName": "Data",
        "TaskID": "CAE0013936F02A29",
        "ParentEventID": [
          "8E022A45F0F81492"
        ],
        "Label": "waited",
        "Title": "X-Trace Task",
        "Host": "pinky21.mpi-sws.org",
        "Duration": "4741",
        "HRT": 10808970557307469,
        "Operation": "waited",
        "Timestamp": "1557746300790.967285",
        "TenantClass": 0,
        "Source": "SocketIOWithTimeout.java:335",
        "ThreadID": 14875,
        "ThreadName": "",
        "EventID": "F503B24962DEF37A",
        "BaggageBytes": "[[248 5] [240 0] [0 202 224 1 57 54 240 42 41] [240 1] [0 142 2 42 69 240 248 20 146] [240 3] [0 2]]",
        "ProcessID": 20775
      },
      {
        "Cycles": 0,
        "Agent": "edu.brown.cs.systems.xtrace.logging.BaggageWrappers",
        "ProcessName": "Read",
        "TaskID": "CAE0013936F02A29",
        "ParentEventID": [
          "E98C397CB9A47ED0",
          "104D2317BE54FB84"
        ],
        "Label": "Merged current baggage with other baggage",
        "Title": "X-Trace Task",
        "Host": "pinky19.mpi-sws.org",
        "HRT": 26962660851095734,
        "Operation": "join",
        "Timestamp": "1557746300791.037842",
        "TenantClass": 0,
        "Source": "RemoteBlockReader2.java:429",
        "ThreadID": 1,
        "ThreadName": "",
        "EventID": "EBD590D49D2196F6",
        "ProcessID": 36430
      },
      {
        "Cycles": 0,
        "Agent": "edu.brown.cs.systems.xtrace.logging.BaggageWrappers",
        "ProcessName": "Data",
        "TaskID": "CAE0013936F02A29",
        "ParentEventID": [
          "F503B24962DEF37A"
        ],
        "Label": "Forking current baggage with Baggage.fork()",
        "Title": "X-Trace Task",
        "Host": "pinky21.mpi-sws.org",
        "HRT": 10808970566764680,
        "Operation": "fork",
        "Timestamp": "1557746300800.424561",
        "TenantClass": 0,
        "Source": "PacketHeader.java:95",
        "ThreadID": 14875,
        "ThreadName": "",
        "EventID": "5634AAA964990CAC",
        "BaggageBytes": "[[248 5] [240 0] [0 202 224 1 57 54 240 42 41] [240 1] [0 245 3 178 73 98 222 243 122] [240 3] [0 2]]",
        "ProcessID": 20775
      },
      {
        "Cycles": 0,
        "Agent": "Execution-Sleep",
        "ProcessName": "Read",
        "TaskID": "CAE0013936F02A29",
        "ParentEventID": [
          "EBD590D49D2196F6"
        ],
        "Label": "waited",
        "Title": "X-Trace Task",
        "Host": "pinky19.mpi-sws.org",
        "Duration": "9418871",
        "HRT": 26962660860610528,
        "Operation": "waited",
        "Timestamp": "1557746300800.552490",
        "TenantClass": 0,
        "Source": "SocketIOWithTimeout.java:335",
        "ThreadID": 1,
        "ThreadName": "",
        "EventID": "199791745131310D",
        "ProcessID": 36430
      },
      {
        "Cycles": 0,
        "Agent": "edu.brown.cs.systems.xtrace.logging.BaggageWrappers",
        "ProcessName": "Read",
        "TaskID": "CAE0013936F02A29",
        "ParentEventID": [
          "199791745131310D",
          "8E022A45F0F81492"
        ],
        "Label": "Merged current baggage with other baggage",
        "Title": "X-Trace Task",
        "Host": "pinky19.mpi-sws.org",
        "HRT": 26962660860686161,
        "Operation": "join",
        "Timestamp": "1557746300800.628174",
        "TenantClass": 0,
        "Source": "PacketHeader.java:168",
        "ThreadID": 1,
        "ThreadName": "",
        "EventID": "5235FCED58A3B1A5",
        "ProcessID": 36430
      },
      {
        "Cycles": 0,
        "Agent": "edu.brown.cs.systems.xtrace.logging.BaggageWrappers",
        "ProcessName": "Read",
        "TaskID": "CAE0013936F02A29",
        "ParentEventID": [
          "5235FCED58A3B1A5",
          "5634AAA964990CAC"
        ],
        "Label": "Merged current baggage with other baggage",
        "Title": "X-Trace Task",
        "Host": "pinky19.mpi-sws.org",
        "HRT": 26962660860762007,
        "Operation": "join",
        "Timestamp": "1557746300800.704102",
        "TenantClass": 0,
        "Source": "PacketHeader.java:168",
        "ThreadID": 1,
        "ThreadName": "",
        "EventID": "218D4FCC4DCC4401",
        "ProcessID": 36430
      },
      {
        "Cycles": 0,
        "Agent": "edu.brown.cs.systems.xtrace.logging.BaggageWrappers",
        "ProcessName": "Read",
        "TaskID": "CAE0013936F02A29",
        "ParentEventID": [
          "218D4FCC4DCC4401"
        ],
        "Label": "Forking current baggage with Baggage.fork()",
        "Title": "X-Trace Task",
        "Host": "pinky19.mpi-sws.org",
        "HRT": 26962660860772782,
        "Operation": "fork",
        "Timestamp": "1557746300800.714844",
        "TenantClass": 0,
        "Source": "RemoteBlockReader2.java:361",
        "ThreadID": 1,
        "ThreadName": "",
        "EventID": "AE4FC7053FE42B47",
        "ProcessID": 36430
      },
      {
        "Cycles": 0,
        "Agent": "Execution-Sleep",
        "ProcessName": "Data",
        "TaskID": "CAE0013936F02A29",
        "ParentEventID": [
          "5634AAA964990CAC"
        ],
        "Label": "waited",
        "Title": "X-Trace Task",
        "Host": "pinky21.mpi-sws.org",
        "Duration": "340709",
        "HRT": 10808970567206091,
        "Operation": "waited",
        "Timestamp": "1557746300800.865967",
        "TenantClass": 0,
        "Source": "SocketIOWithTimeout.java:335",
        "ThreadID": 14875,
        "ThreadName": "",
        "EventID": "61ECAED3BA883269",
        "BaggageBytes": "[[248 5] [240 0] [0 202 224 1 57 54 240 42 41] [240 1] [0 86 52 170 169 100 153 12 172] [240 3] [0 2]]",
        "ProcessID": 20775
      },
      {
        "Cycles": 0,
        "Agent": "edu.brown.cs.systems.xtrace.logging.BaggageWrappers",
        "ProcessName": "Data",
        "TaskID": "CAE0013936F02A29",
        "ParentEventID": [
          "AE4FC7053FE42B47",
          "61ECAED3BA883269"
        ],
        "Label": "Merged current baggage with other baggage",
        "Title": "X-Trace Task",
        "Host": "pinky21.mpi-sws.org",
        "HRT": 10808970567273588,
        "Operation": "join",
        "Timestamp": "1557746300800.933350",
        "TenantClass": 0,
        "Source": "DataXceiver.java:574",
        "ThreadID": 14875,
        "ThreadName": "",
        "EventID": "7E086B7801AC0ADC",
        "BaggageBytes": "[[248 5] [240 0] [0 202 224 1 57 54 240 42 41] [240 1] [0 174 79 199 5 63 228 43 71] [0 97 236 174 211 186 136 50 105] [240 3] [0 2]]",
        "ProcessID": 20775
      },
      {
        "Cycles": 0,
        "Agent": "Execution-CPU",
        "ProcessName": "Data",
        "TaskID": "CAE0013936F02A29",
        "ParentEventID": [
          "7E086B7801AC0ADC"
        ],
        "Label": "unset",
        "Title": "X-Trace Task",
        "Host": "pinky21.mpi-sws.org",
        "Duration": "37858165",
        "HRT": 10808970567299579,
        "Operation": "unset",
        "Timestamp": "1557746300800.959473",
        "TenantClass": 0,
        "Source": "DataXceiver.java:261",
        "ThreadID": 14875,
        "ThreadName": "",
        "EventID": "ACC4BDF5F270E2C0",
        "BaggageBytes": "[[248 5] [240 0] [0 202 224 1 57 54 240 42 41] [240 1] [0 126 8 107 120 1 172 10 220] [240 3] [0 2]]",
        "ProcessID": 20775
      }
    ]
  }
]