[
  {
    "id": "BC88E7A9CB91D717",
    "reports": [
      {
        "Cycles": 0,
        "Agent": "Execution-CPU",
        "ProcessName": "Read",
        "TaskID": "BC88E7A9CB91D717",
        "ParentEventID": [
          "15C3D9A3E22D0618"
        ],
        "Label": "unset",
        "Title": "X-Trace Task",
        "Host": "pinky19.mpi-sws.org",
        "Duration": "22168481",
        "HRT": 26962620006087356,
        "Operation": "unset",
        "Timestamp": "1557746259946.247070",
        "TenantClass": 0,
        "Source": "Client.java:1027",
        "ThreadID": 1,
        "ThreadName": "",
        "EventID": "333DBACF04F7C113",
        "ProcessID": 36430
      },
      {
        "Cycles": 0,
        "Agent": "edu.brown.cs.systems.retro.benchmarks.hdfs_client.Reader",
        "ProcessName": "Read",
        "TaskID": "BC88E7A9CB91D717",
        "ParentEventID": [
          "C899385099C45CFB"
        ],
        "Label": "Reading file",
        "Title": "X-Trace Task",
        "Host": "pinky19.mpi-sws.org",
        "HRT": 26962620006045505,
        "Timestamp": "1557746259946.205322",
        "TenantClass": 0,
        "ThreadID": 1,
        "ThreadName": "",
        "EventID": "27A6BD81056277FD",
        "ProcessID": 36430
      },
      {
        "Cycles": 0,
        "Agent": "org.apache.hadoop.ipc.ProtobufRpcEngine",
        "ProcessName": "Read",
        "TaskID": "BC88E7A9CB91D717",
        "ParentEventID": [
          "27A6BD81056277FD"
        ],
        "Label": "Invoking org.apache.hadoop.hdfs.protocol.ClientProtocol.getBlockLocations",
        "Title": "X-Trace Task",
        "Host": "pinky19.mpi-sws.org",
        "HRT": 26962620006070375,
        "Timestamp": "1557746259946.230225",
        "TenantClass": 0,
        "Source": "ProtobufRpcEngine.java:228",
        "ThreadID": 1,
        "ThreadName": "",
        "EventID": "15C3D9A3E22D0618",
        "ProcessID": 36430
      },
      {
        "Cycles": 0,
        "Agent": "edu.brown.cs.systems.xtrace.logging.BaggageWrappers",
        "ProcessName": "Read",
        "TaskID": "BC88E7A9CB91D717",
        "ParentEventID": [
          "B2AB4709468A25FE"
        ],
        "Label": "Forking current baggage with Baggage.fork()",
        "Title": "X-Trace Task",
        "Host": "pinky19.mpi-sws.org",
        "HRT": 26962620006138263,
        "Operation": "fork",
        "Timestamp": "1557746259946.298096",
        "TenantClass": 0,
        "Source": "Client.java:1043",
        "ThreadID": 41,
        "ThreadName": "",
        "EventID": "23D2D722FB84FCAA",
        "ProcessID": 36430
      },
      {
        "Cycles": 0,
        "Agent": "Execution-CPU",
        "ProcessName": "Read",
        "TaskID": "BC88E7A9CB91D717",
        "ParentEventID": [
          "333DBACF04F7C113"
        ],
        "Label": "set",
        "Title": "X-Trace Task",
        "Host": "pinky19.mpi-sws.org",
        "HRT": 26962620006124162,
        "Operation": "set",
        "Timestamp": "1557746259946.283936",
        "TenantClass": 0,
        "Source": "Client.java:1032",
        "ThreadID": 41,
        "ThreadName": "",
        "EventID": "B2AB4709468A25FE",
        "ProcessID": 36430
      },
      {
        "Cycles": 0,
        "Agent": "Execution-CPU",
        "ProcessName": "Read",
        "TaskID": "BC88E7A9CB91D717",
        "ParentEventID": [
          "23D2D722FB84FCAA"
        ],
        "Label": "unset",
        "Title": "X-Trace Task",
        "Host": "pinky19.mpi-sws.org",
        "Duration": "59822",
        "HRT": 26962620006198265,
        "Operation": "unset",
        "Timestamp": "1557746259946.358154",
        "TenantClass": 0,
        "Source": "Client.java:1062",
        "ThreadID": 41,
        "ThreadName": "",
        "EventID": "8F9C2B5FF0CDDCDD",
        "ProcessID": 36430
      },
      {
        "Cycles": 0,
        "Agent": "Execution-CPU",
        "ProcessName": "Read",
        "TaskID": "BC88E7A9CB91D717",
        "ParentEventID": [
          "8F9C2B5FF0CDDCDD"
        ],
        "Label": "set",
        "Title": "X-Trace Task",
        "Host": "pinky19.mpi-sws.org",
        "HRT": 26962620006220679,
        "Operation": "set",
        "Timestamp": "1557746259946.380371",
        "TenantClass": 0,
        "Source": "Client.java:1104",
        "ThreadID": 1,
        "ThreadName": "",
        "EventID": "C0286A7B9538AB17",
        "ProcessID": 36430
      },
      {
        "Cycles": 0,
        "Agent": "edu.brown.cs.systems.xtrace.logging.BaggageWrappers",
        "ProcessName": "Name",
        "TaskID": "BC88E7A9CB91D717",
        "ParentEventID": [
          "B4107F8F4317C19B"
        ],
        "Label": "Forking current baggage with Baggage.fork()",
        "Title": "X-Trace Task",
        "Host": "pinky19.mpi-sws.org",
        "HRT": 26962620006309709,
        "Operation": "fork",
        "Timestamp": "1557746259946.482666",
        "TenantClass": 0,
        "Source": "Server.java:550",
        "ThreadID": 48,
        "ThreadName": "",
        "EventID": "E13C093EC71F9A43",
        "BaggageBytes": "[[248 5] [240 0] [0 188 136 231 169 203 145 215 23] [240 1] [0 180 16 127 143 67 23 193 155] [240 3] [0 2]]",
        "ProcessID": 2171
      },
      {
        "Cycles": 0,
        "Agent": "Execution-CPU",
        "ProcessName": "Name",
        "TaskID": "BC88E7A9CB91D717",
        "ParentEventID": [
          "23D2D722FB84FCAA"
        ],
        "Label": "set",
        "Title": "X-Trace Task",
        "Host": "pinky19.mpi-sws.org",
        "HRT": 26962620006277741,
        "Operation": "set",
        "Timestamp": "1557746259946.450684",
        "TenantClass": 0,
        "Source": "Server.java:1840",
        "ThreadID": 48,
        "ThreadName": "",
        "EventID": "B4107F8F4317C19B",
        "BaggageBytes": "[[248 5] [240 0] [0 188 136 231 169 203 145 215 23] [240 1] [0 35 210 215 34 251 132 252 170] [240 3] [0 2]]",
        "ProcessID": 2171
      },
      {
        "Cycles": 0,
        "Agent": "Execution-CPU",
        "ProcessName": "Name",
        "TaskID": "BC88E7A9CB91D717",
        "ParentEventID": [
          "E13C093EC71F9A43"
        ],
        "Label": "unset",
        "Title": "X-Trace Task",
        "Host": "pinky19.mpi-sws.org",
        "Duration": "33747",
        "HRT": 26962620006338828,
        "Operation": "unset",
        "Timestamp": "1557746259946.511719",
        "TenantClass": 0,
        "Source": "Server.java:1828",
        "ThreadID": 48,
        "ThreadName": "",
        "EventID": "1381EB450DD354D4",
        "BaggageBytes": "[[248 5] [240 0] [0 188 136 231 169 203 145 215 23] [240 1] [0 225 60 9 62 199 31 154 67] [240 3] [0 2]]",
        "ProcessID": 2171
      },
      {
        "Cycles": 0,
        "Agent": "Execution-CPU",
        "ProcessName": "Name",
        "TaskID": "BC88E7A9CB91D717",
        "ParentEventID": [
          "E13C093EC71F9A43"
        ],
        "Label": "set",
        "Title": "X-Trace Task",
        "Host": "pinky19.mpi-sws.org",
        "HRT": 26962620006345589,
        "Operation": "set",
        "Timestamp": "1557746259946.518555",
        "TenantClass": 0,
        "Source": "Server.java:2071",
        "ThreadID": 56,
        "ThreadName": "",
        "EventID": "70360513CB007F23",
        "BaggageBytes": "[[248 5] [240 0] [0 188 136 231 169 203 145 215 23] [240 1] [0 225 60 9 62 199 31 154 67] [240 3] [0 2]]",
        "ProcessID": 2171
      },
      {
        "Cycles": 0,
        "Agent": "org.apache.hadoop.ipc.Server",
        "ProcessName": "Name",
        "TaskID": "BC88E7A9CB91D717",
        "ParentEventID": [
          "70360513CB007F23"
        ],
        "Label": "getBlockLocations in org.apache.hadoop.hdfs.protocol.ClientProtocol",
        "Title": "X-Trace Task",
        "Host": "pinky19.mpi-sws.org",
        "HRT": 26962620006378620,
        "Timestamp": "1557746259946.551514",
        "TenantClass": 0,
        "Source": "ProtobufRpcEngine.java:601",
        "ThreadID": 56,
        "ThreadName": "",
        "EventID": "1618F33D7003512D",
        "BaggageBytes": "[[248 5] [240 0] [0 188 136 231 169 203 145 215 23] [240 1] [0 112 54 5 19 203 0 127 35] [240 3] [0 2]]",
        "ProcessID": 2171
      },
      {
        "Cycles": 0,
        "Agent": "edu.brown.cs.systems.xtrace.logging.BaggageWrappers",
        "ProcessName": "Name",
        "TaskID": "BC88E7A9CB91D717",
        "ParentEventID": [
          "6C0D84122058BEE9"
        ],
        "Label": "Forking current baggage with Baggage.fork()",
        "Title": "X-Trace Task",
        "Host": "pinky19.mpi-sws.org",
        "HRT": 26962620006470309,
        "Operation": "fork",
        "Timestamp": "1557746259946.643311",
        "TenantClass": 0,
        "Source": "Server.java:2398",
        "ThreadID": 56,
        "ThreadName": "",
        "EventID": "FE4FFD6C5DC63B31",
        "BaggageBytes": "[[248 5] [240 0] [0 188 136 231 169 203 145 215 23] [240 1] [0 108 13 132 18 32 88 190 233] [240 3] [0 2]]",
        "ProcessID": 2171
      },
      {
        "Cycles": 0,
        "Agent": "org.apache.hadoop.hdfs.server.namenode.FSNamesystem.audit",
        "ProcessName": "Name",
        "TaskID": "BC88E7A9CB91D717",
        "ParentEventID": [
          "1618F33D7003512D"
        ],
        "Label": "allowed=true\tugi=plascas (auth:SIMPLE)\tip=/139.19.171.63\tcmd=open\tsrc=/ds/xjlk209UwlLZgnAQ\tdst=null\tperm=null\tproto=rpc",
        "Title": "X-Trace Task",
        "Host": "pinky19.mpi-sws.org",
        "HRT": 26962620006425716,
        "Timestamp": "1557746259946.598633",
        "TenantClass": 0,
        "Source": "FSNamesystem.java:8313",
        "ThreadID": 56,
        "ThreadName": "",
        "EventID": "6C0D84122058BEE9",
        "BaggageBytes": "[[248 5] [240 0] [0 188 136 231 169 203 145 215 23] [240 1] [0 22 24 243 61 112 3 81 45] [240 3] [0 2]]",
        "ProcessID": 2171
      },
      {
        "Cycles": 0,
        "Agent": "Execution-CPU",
        "ProcessName": "Name",
        "TaskID": "BC88E7A9CB91D717",
        "ParentEventID": [
          "FE4FFD6C5DC63B31"
        ],
        "Label": "unset",
        "Title": "X-Trace Task",
        "Host": "pinky19.mpi-sws.org",
        "Duration": "206767",
        "HRT": 26962620006573769,
        "Operation": "unset",
        "Timestamp": "1557746259946.746826",
        "TenantClass": 0,
        "Source": "Server.java:1058",
        "ThreadID": 56,
        "ThreadName": "",
        "EventID": "817772FC62B19AFD",
        "BaggageBytes": "[[248 5] [240 0] [0 188 136 231 169 203 145 215 23] [240 1] [0 254 79 253 108 93 198 59 49] [240 3] [0 2]]",
        "ProcessID": 2171
      },
      {
        "Cycles": 0,
        "Agent": "Execution-CPU",
        "ProcessName": "Read",
        "TaskID": "BC88E7A9CB91D717",
        "ParentEventID": [
          "67CC02D88AA79D1F"
        ],
        "Label": "unset",
        "Title": "X-Trace Task",
        "Host": "pinky19.mpi-sws.org",
        "Duration": "5032",
        "HRT": 26962620006652083,
        "Operation": "unset",
        "Timestamp": "1557746259946.811768",
        "TenantClass": 0,
        "Source": "Client.java:1168",
        "ThreadID": 37,
        "ThreadName": "",
        "EventID": "5763BED7E47676B6",
        "ProcessID": 36430
      },
      {
        "Cycles": 0,
        "Agent": "Execution-CPU",
        "ProcessName": "Read",
        "TaskID": "BC88E7A9CB91D717",
        "ParentEventID": [
          "FE4FFD6C5DC63B31"
        ],
        "Label": "set",
        "Title": "X-Trace Task",
        "Host": "pinky19.mpi-sws.org",
        "HRT": 26962620006636017,
        "Operation": "set",
        "Timestamp": "1557746259946.795898",
        "TenantClass": 0,
        "Source": "Client.java:302",
        "ThreadID": 37,
        "ThreadName": "",
        "EventID": "67CC02D88AA79D1F",
        "ProcessID": 36430
      },
      {
        "Cycles": 0,
        "Agent": "Execution-Sleep",
        "ProcessName": "Read",
        "TaskID": "BC88E7A9CB91D717",
        "ParentEventID": [
          "C0286A7B9538AB17"
        ],
        "Label": "waited",
        "Title": "X-Trace Task",
        "Host": "pinky19.mpi-sws.org",
        "Duration": "437879",
        "HRT": 26962620006667680,
        "Operation": "waited",
        "Timestamp": "1557746259946.827393",
        "TenantClass": 0,
        "Source": "Client.java:1537",
        "ThreadID": 1,
        "ThreadName": "",
        "EventID": "65F198A64D516915",
        "ProcessID": 36430
      },
      {
        "Cycles": 0,
        "Agent": "edu.brown.cs.systems.xtrace.logging.BaggageWrappers",
        "ProcessName": "Read",
        "TaskID": "BC88E7A9CB91D717",
        "ParentEventID": [
          "65F198A64D516915",
          "5763BED7E47676B6"
        ],
        "Label": "Merged current baggage with other baggage",
        "Title": "X-Trace Task",
        "Host": "pinky19.mpi-sws.org",
        "HRT": 26962620006678128,
        "Operation": "join",
        "Timestamp": "1557746259946.837891",
        "TenantClass": 0,
        "Source": "Client.java:1545",
        "ThreadID": 1,
        "ThreadName": "",
        "EventID": "EC01A70A4EEDE430",
        "ProcessID": 36430
      },
      {
        "Cycles": 0,
        "Agent": "org.apache.hadoop.ipc.ProtobufRpcEngine",
        "ProcessName": "Read",
        "TaskID": "BC88E7A9CB91D717",
        "ParentEventID": [
          "EC01A70A4EEDE430"
        ],
        "Label": "org.apache.hadoop.hdfs.protocol.ClientProtocol.getBlockLocations completed",
        "Title": "X-Trace Task",
        "Host": "pinky19.mpi-sws.org",
        "HRT": 26962620006712390,
        "Timestamp": "1557746259946.872070",
        "TenantClass": 0,
        "Source": "ProtobufRpcEngine.java:275",
        "ThreadID": 1,
        "ThreadName": "",
        "EventID": "EFFB2BF20C40C6D2",
        "ProcessID": 36430
      },
      {
        "Cycles": 0,
        "Agent": "Execution-CPU",
        "ProcessName": "Data",
        "TaskID": "BC88E7A9CB91D717",
        "ParentEventID": [
          "4A7D2ECF9F354301"
        ],
        "Label": "set",
        "Title": "X-Trace Task",
        "Host": "pinky21.mpi-sws.org",
        "HRT": 10808929713359113,
        "Operation": "set",
        "Timestamp": "1557746259947.235596",
        "TenantClass": 0,
        "Source": "Receiver.java:117",
        "ThreadID": 14875,
        "ThreadName": "",
        "EventID": "7DC52E8F6634701B",
        "BaggageBytes": "[[248 5] [240 0] [0 188 136 231 169 203 145 215 23] [240 1] [0 74 125 46 207 159 53 67 1] [240 3] [0 2]]",
        "ProcessID": 20775
      },
      {
        "Cycles": 0,
        "Agent": "edu.brown.cs.systems.xtrace.logging.BaggageWrappers",
        "ProcessName": "Read",
        "TaskID": "BC88E7A9CB91D717",
        "ParentEventID": [
          "EFFB2BF20C40C6D2"
        ],
        "Label": "Forking current baggage with Baggage.fork()",
        "Title": "X-Trace Task",
        "Host": "pinky19.mpi-sws.org",
        "HRT": 26962620006767985,
        "Operation": "fork",
        "Timestamp": "1557746259946.927734",
        "TenantClass": 0,
        "Source": "DataTransferProtoUtil.java:94",
        "ThreadID": 1,
        "ThreadName": "",
        "EventID": "4A7D2ECF9F354301",
        "ProcessID": 36430
      },
      {
        "Cycles": 0,
        "Agent": "edu.brown.cs.systems.xtrace.logging.XTraceInit",
        "ProcessName": "Data",
        "TaskID": "BC88E7A9CB91D717",
        "ParentEventID": [
          "7DC52E8F6634701B"
        ],
        "Label": "Thread.setName: DataXceiver for client DFSClient_NONMAPREDUCE_778905418_1 at /139.19.171.63:35320 [Sending block BP-1633380353-139.19.171.63-1554193446451:blk_1073764916_24092]",
        "Title": "X-Trace Task",
        "Host": "pinky21.mpi-sws.org",
        "HRT": 10808929713461350,
        "Timestamp": "1557746259947.337646",
        "TenantClass": 0,
        "Source": "DataXceiver.java:168",
        "ThreadID": 14875,
        "ThreadName": "",
        "EventID": "E4911626C8ED016A",
        "BaggageBytes": "[[248 5] [240 0] [0 188 136 231 169 203 145 215 23] [240 1] [0 125 197 46 143 102 52 112 27] [240 3] [0 2]]",
        "ProcessID": 20775
      },
      {
        "Cycles": 0,
        "Agent": "Execution-Sleep",
        "ProcessName": "Read",
        "TaskID": "BC88E7A9CB91D717",
        "ParentEventID": [
          "4A7D2ECF9F354301"
        ],
        "Label": "waited",
        "Title": "X-Trace Task",
        "Host": "pinky19.mpi-sws.org",
        "Duration": "732782",
        "HRT": 26962620007571688,
        "Operation": "waited",
        "Timestamp": "1557746259947.731445",
        "TenantClass": 0,
        "Source": "SocketIOWithTimeout.java:335",
        "ThreadID": 1,
        "ThreadName": "",
        "EventID": "8BCD70117C988E57",
        "ProcessID": 36430
      },
      {
        "Cycles": 0,
        "Agent": "edu.brown.cs.systems.xtrace.logging.BaggageWrappers",
        "ProcessName": "Data",
        "TaskID": "BC88E7A9CB91D717",
        "ParentEventID": [
          "E4911626C8ED016A"
        ],
        "Label": "Forking current baggage with Baggage.fork()",
        "Title": "X-Trace Task",
        "Host": "pinky21.mpi-sws.org",
        "HRT": 10808929713692797,
        "Operation": "fork",
        "Timestamp": "1557746259947.569092",
        "TenantClass": 0,
        "Source": "DataXceiver.java:1257",
        "ThreadID": 14875,
        "ThreadName": "",
        "EventID": "2A5F78E4489DA194",
        "BaggageBytes": "[[248 5] [240 0] [0 188 136 231 169 203 145 215 23] [240 1] [0 228 145 22 38 200 237 1 106] [240 3] [0 2]]",
        "ProcessID": 20775
      },
      {
        "Cycles": 0,
        "Agent": "edu.brown.cs.systems.xtrace.logging.BaggageWrappers",
        "ProcessName": "Read",
        "TaskID": "BC88E7A9CB91D717",
        "ParentEventID": [
          "2A5F78E4489DA194",
          "8BCD70117C988E57"
        ],
        "Label": "Merged current baggage with other baggage",
        "Title": "X-Trace Task",
        "Host": "pinky19.mpi-sws.org",
        "HRT": 26962620007627673,
        "Operation": "join",
        "Timestamp": "1557746259947.787354",
        "TenantClass": 0,
        "Source": "RemoteBlockReader2.java:429",
        "ThreadID": 1,
        "ThreadName": "",
        "EventID": "F528B8246204A234",
        "ProcessID": 36430
      },
      {
        "Cycles": 0,
        "Agent": "edu.brown.cs.systems.xtrace.logging.BaggageWrappers",
        "ProcessName": "Data",
        "TaskID": "BC88E7A9CB91D717",
        "ParentEventID": [
          "2A5F78E4489DA194"
        ],
        "Label": "Forking current baggage with Baggage.fork()",
        "Title": "X-Trace Task",
        "Host": "pinky21.mpi-sws.org",
        "HRT": 10808929713875061,
        "Operation": "fork",
        "Timestamp": "1557746259947.751465",
        "TenantClass": 0,
        "Source": "PacketHeader.java:95",
        "ThreadID": 14875,
        "ThreadName": "",
        "EventID": "A2EA63B222394E4B",
        "BaggageBytes": "[[248 5] [240 0] [0 188 136 231 169 203 145 215 23] [240 1] [0 42 95 120 228 72 157 161 148] [240 3] [0 2]]",
        "ProcessID": 20775
      },
      {
        "Cycles": 0,
        "Agent": "Execution-Sleep",
        "ProcessName": "Read",
        "TaskID": "BC88E7A9CB91D717",
        "ParentEventID": [
          "F528B8246204A234"
        ],
        "Label": "waited",
        "Title": "X-Trace Task",
        "Host": "pinky19.mpi-sws.org",
        "Duration": "71141",
        "HRT": 26962620007736349,
        "Operation": "waited",
        "Timestamp": "1557746259947.896240",
        "TenantClass": 0,
        "Source": "SocketIOWithTimeout.java:335",
        "ThreadID": 1,
        "ThreadName": "",
        "EventID": "25F5DBF85966F5F0",
        "ProcessID": 36430
      },
      {
        "Cycles": 0,
        "Agent": "Execution-Sleep",
        "ProcessName": "Data",
        "TaskID": "BC88E7A9CB91D717",
        "ParentEventID": [
          "A2EA63B222394E4B"
        ],
        "Label": "waited",
        "Title": "X-Trace Task",
        "Host": "pinky21.mpi-sws.org",
        "Duration": "11693",
        "HRT": 10808929714044448,
        "Operation": "waited",
        "Timestamp": "1557746259947.920898",
        "TenantClass": 0,
        "Source": "SocketIOWithTimeout.java:335",
        "ThreadID": 14875,
        "ThreadName": "",
        "EventID": "0608007C1DDF19E3",
        "BaggageBytes": "[[248 5] [240 0] [0 188 136 231 169 203 145 215 23] [240 1] [0 162 234 99 178 34 57 78 75] [240 3] [0 2]]",
        "ProcessID": 20775
      },
      {
        "Cycles": 0,
        "Agent": "Execution-Sleep",
        "ProcessName": "Read",
        "TaskID": "BC88E7A9CB91D717",
        "ParentEventID": [
          "25F5DBF85966F5F0"
        ],
        "Label": "waited",
        "Title": "X-Trace Task",
        "Host": "pinky19.mpi-sws.org",
        "Duration": "262520",
        "HRT": 26962620008062994,
        "Operation": "waited",
        "Timestamp": "1557746259948.222656",
        "TenantClass": 0,
        "Source": "SocketIOWithTimeout.java:335",
        "ThreadID": 1,
        "ThreadName": "",
        "EventID": "75EB19D225A4CD71",
        "ProcessID": 36430
      },
      {
        "Cycles": 0,
        "Agent": "edu.brown.cs.systems.xtrace.logging.BaggageWrappers",
        "ProcessName": "Data",
        "TaskID": "BC88E7A9CB91D717",
        "ParentEventID": [
          "0608007C1DDF19E3"
        ],
        "Label": "Forking current baggage with Baggage.fork()",
        "Title": "X-Trace Task",
        "Host": "pinky21.mpi-sws.org",
        "HRT": 10808929714247225,
        "Operation": "fork",
        "Timestamp": "1557746259948.123535",
        "TenantClass": 0,
        "Source": "PacketHeader.java:95",
        "ThreadID": 14875,
        "ThreadName": "",
        "EventID": "CF67E19691CA2036",
        "BaggageBytes": "[[248 5] [240 0] [0 188 136 231 169 203 145 215 23] [240 1] [0 6 8 0 124 29 223 25 227] [240 3] [0 2]]",
        "ProcessID": 20775
      },
      {
        "Cycles": 0,
        "Agent": "edu.brown.cs.systems.xtrace.logging.BaggageWrappers",
        "ProcessName": "Read",
        "TaskID": "BC88E7A9CB91D717",
        "ParentEventID": [
          "75EB19D225A4CD71",
          "A2EA63B222394E4B"
        ],
        "Label": "Merged current baggage with other baggage",
        "Title": "X-Trace Task",
        "Host": "pinky19.mpi-sws.org",
        "HRT": 26962620008124717,
        "Operation": "join",
        "Timestamp": "1557746259948.284424",
        "TenantClass": 0,
        "Source": "PacketHeader.java:168",
        "ThreadID": 1,
        "ThreadName": "",
        "EventID": "82EDFCEE6F8D80DC",
        "ProcessID": 36430
      },
      {
        "Cycles": 0,
        "Agent": "edu.brown.cs.systems.xtrace.logging.BaggageWrappers",
        "ProcessName": "Read",
        "TaskID": "BC88E7A9CB91D717",
        "ParentEventID": [
          "0797934A38E29639"
        ],
        "Label": "Forking current baggage with Baggage.fork()",
        "Title": "X-Trace Task",
        "Host": "pinky19.mpi-sws.org",
        "HRT": 26962620008183963,
        "Operation": "fork",
        "Timestamp": "1557746259948.343750",
        "TenantClass": 0,
        "Source": "RemoteBlockReader2.java:361",
        "ThreadID": 1,
        "ThreadName": "",
        "EventID": "A334C082B9E6B433",
        "ProcessID": 36430
      },
      {
        "Cycles": 0,
        "Agent": "edu.brown.cs.systems.xtrace.logging.BaggageWrappers",
        "ProcessName": "Read",
        "TaskID": "BC88E7A9CB91D717",
        "ParentEventID": [
          "82EDFCEE6F8D80DC",
          "CF67E19691CA2036"
        ],
        "Label": "Merged current baggage with other baggage",
        "Title": "X-Trace Task",
        "Host": "pinky19.mpi-sws.org",
        "HRT": 26962620008175101,
        "Operation": "join",
        "Timestamp": "1557746259948.334961",
        "TenantClass": 0,
        "Source": "PacketHeader.java:168",
        "ThreadID": 1,
        "ThreadName": "",
        "EventID": "0797934A38E29639",
        "ProcessID": 36430
      },
      {
        "Cycles": 0,
        "Agent": "Execution-Sleep",
        "ProcessName": "Data",
        "TaskID": "BC88E7A9CB91D717",
        "ParentEventID": [
          "CF67E19691CA2036"
        ],
        "Label": "waited",
        "Title": "X-Trace Task",
        "Host": "pinky21.mpi-sws.org",
        "Duration": "64207",
        "HRT": 10808929714551880,
        "Operation": "waited",
        "Timestamp": "1557746259948.428223",
        "TenantClass": 0,
        "Source": "SocketIOWithTimeout.java:335",
        "ThreadID": 14875,
        "ThreadName": "",
        "EventID": "CE75158B4CAA5935",
        "BaggageBytes": "[[248 5] [240 0] [0 188 136 231 169 203 145 215 23] [240 1] [0 207 103 225 150 145 202 32 54] [240 3] [0 2]]",
        "ProcessID": 20775
      },
      {
        "Cycles": 0,
        "Agent": "Execution-CPU",
        "ProcessName": "Data",
        "TaskID": "BC88E7A9CB91D717",
        "ParentEventID": [
          "6C020AFC3008492E"
        ],
        "Label": "unset",
        "Title": "X-Trace Task",
        "Host": "pinky21.mpi-sws.org",
        "Duration": "1315881",
        "HRT": 10808929714749554,
        "Operation": "unset",
        "Timestamp": "1557746259948.625977",
        "TenantClass": 0,
        "Source": "DataXceiver.java:261",
        "ThreadID": 14875,
        "ThreadName": "",
        "EventID": "73BC45C848272F3F",
        "BaggageBytes": "[[248 5] [240 0] [0 188 136 231 169 203 145 215 23] [240 1] [0 108 2 10 252 48 8 73 46] [240 3] [0 2]]",
        "ProcessID": 20775
      },
      {
        "Cycles": 0,
        "Agent": "edu.brown.cs.systems.xtrace.logging.BaggageWrappers",
        "ProcessName": "Data",
        "TaskID": "BC88E7A9CB91D717",
        "ParentEventID": [
          "A334C082B9E6B433",
          "CE75158B4CAA5935"
        ],
        "Label": "Merged current baggage with other baggage",
        "Title": "X-Trace Task",
        "Host": "pinky21.mpi-sws.org",
        "HRT": 10808929714678317,
        "Operation": "join",
        "Timestamp": "1557746259948.554688",
        "TenantClass": 0,
        "Source": "DataXceiver.java:574",
        "ThreadID": 14875,
        "ThreadName": "",
        "EventID": "6C020AFC3008492E",
        "BaggageBytes": "[[248 5] [240 0] [0 188 136 231 169 203 145 215 23] [240 1] [0 163 52 192 130 185 230 180 51] [0 206 117 21 139 76 170 89 53] [240 3] [0 2]]",
        "ProcessID": 20775
      },
      {
        "Cycles": 0,
        "Agent": "edu.brown.cs.systems.retro.benchmarks.hdfs_client.Reader",
        "ProcessName": "Read",
        "TaskID": "BC88E7A9CB91D717",
        "ParentEventID": [
          "0"
        ],
        "Label": "Reading file",
        "Title": "X-Trace Task",
        "Host": "pinky19.mpi-sws.org",
        "HRT": 26962620006029831,
        "Timestamp": "1557746259946.189697",
        "TenantClass": 0,
        "ThreadID": 1,
        "ThreadName": "",
        "EventID": "C899385099C45CFB",
        "ProcessID": 36430,
        "Tag": [
          "reader_10kb",
          "Read Size: 10240"
        ]
      }
    ]
  }
]