[
  {
    "id": "E45BDF8729911D24",
    "reports": [
      {
        "Cycles": 0,
        "Agent": "Execution-CPU",
        "ProcessName": "Read",
        "TaskID": "E45BDF8729911D24",
        "ParentEventID": [
          "6740F077556CB41A"
        ],
        "Label": "unset",
        "Title": "X-Trace Task",
        "Host": "pinky19.mpi-sws.org",
        "Duration": "22082943",
        "HRT": 26962478764135476,
        "Operation": "unset",
        "Timestamp": "1557746118704.312012",
        "TenantClass": 0,
        "Source": "Client.java:1027",
        "ThreadID": 1,
        "ThreadName": "",
        "EventID": "38A31932937E17B7",
        "ProcessID": 36430
      },
      {
        "Cycles": 0,
        "Agent": "Execution-CPU",
        "ProcessName": "Read",
        "TaskID": "E45BDF8729911D24",
        "ParentEventID": [
          "38A31932937E17B7"
        ],
        "Label": "set",
        "Title": "X-Trace Task",
        "Host": "pinky19.mpi-sws.org",
        "HRT": 26962478764184581,
        "Operation": "set",
        "Timestamp": "1557746118704.361328",
        "TenantClass": 0,
        "Source": "Client.java:1032",
        "ThreadID": 41,
        "ThreadName": "",
        "EventID": "7573B92C5DBF5F00",
        "ProcessID": 36430
      },
      {
        "Cycles": 0,
        "Agent": "edu.brown.cs.systems.xtrace.logging.BaggageWrappers",
        "ProcessName": "Read",
        "TaskID": "E45BDF8729911D24",
        "ParentEventID": [
          "7573B92C5DBF5F00"
        ],
        "Label": "Forking current baggage with Baggage.fork()",
        "Title": "X-Trace Task",
        "Host": "pinky19.mpi-sws.org",
        "HRT": 26962478764205870,
        "Operation": "fork",
        "Timestamp": "1557746118704.382568",
        "TenantClass": 0,
        "Source": "Client.java:1043",
        "ThreadID": 41,
        "ThreadName": "",
        "EventID": "A8F91447AF6C6634",
        "ProcessID": 36430
      },
      {
        "Cycles": 0,
        "Agent": "edu.brown.cs.systems.retro.benchmarks.hdfs_client.Reader",
        "ProcessName": "Read",
        "TaskID": "E45BDF8729911D24",
        "ParentEventID": [
          "0"
        ],
        "Label": "Reading file",
        "Title": "X-Trace Task",
        "Host": "pinky19.mpi-sws.org",
        "HRT": 26962478764052533,
        "Timestamp": "1557746118704.229248",
        "TenantClass": 0,
        "ThreadID": 1,
        "ThreadName": "",
        "EventID": "5FDBB23E45D1BB1A",
        "ProcessID": 36430,
        "Tag": [
          "reader_10kb",
          "Read Size: 10240"
        ]
      },
      {
        "Cycles": 0,
        "Agent": "org.apache.hadoop.ipc.ProtobufRpcEngine",
        "ProcessName": "Read",
        "TaskID": "E45BDF8729911D24",
        "ParentEventID": [
          "CD6E727E0D9B1B00"
        ],
        "Label": "Invoking org.apache.hadoop.hdfs.protocol.ClientProtocol.getBlockLocations",
        "Title": "X-Trace Task",
        "Host": "pinky19.mpi-sws.org",
        "HRT": 26962478764107693,
        "Timestamp": "1557746118704.284424",
        "TenantClass": 0,
        "Source": "ProtobufRpcEngine.java:228",
        "ThreadID": 1,
        "ThreadName": "",
        "EventID": "6740F077556CB41A",
        "ProcessID": 36430
      },
      {
        "Cycles": 0,
        "Agent": "Execution-CPU",
        "ProcessName": "Read",
        "TaskID": "E45BDF8729911D24",
        "ParentEventID": [
          "A8F91447AF6C6634"
        ],
        "Label": "unset",
        "Title": "X-Trace Task",
        "Host": "pinky19.mpi-sws.org",
        "Duration": "77907",
        "HRT": 26962478764282498,
        "Operation": "unset",
        "Timestamp": "1557746118704.459229",
        "TenantClass": 0,
        "Source": "Client.java:1062",
        "ThreadID": 41,
        "ThreadName": "",
        "EventID": "2D934996A13C61F1",
        "ProcessID": 36430
      },
      {
        "Cycles": 0,
        "Agent": "Execution-CPU",
        "ProcessName": "Read",
        "TaskID": "E45BDF8729911D24",
        "ParentEventID": [
          "2D934996A13C61F1"
        ],
        "Label": "set",
        "Title": "X-Trace Task",
        "Host": "pinky19.mpi-sws.org",
        "HRT": 26962478764304735,
        "Operation": "set",
        "Timestamp": "1557746118704.481445",
        "TenantClass": 0,
        "Source": "Client.java:1104",
        "ThreadID": 1,
        "ThreadName": "",
        "EventID": "AF98563FF9970F7C",
        "ProcessID": 36430
      },
      {
        "Cycles": 0,
        "Agent": "Execution-CPU",
        "ProcessName": "Name",
        "TaskID": "E45BDF8729911D24",
        "ParentEventID": [
          "A8F91447AF6C6634"
        ],
        "Label": "set",
        "Title": "X-Trace Task",
        "Host": "pinky19.mpi-sws.org",
        "HRT": 26962478764358655,
        "Operation": "set",
        "Timestamp": "1557746118704.538330",
        "TenantClass": 0,
        "Source": "Server.java:1840",
        "ThreadID": 48,
        "ThreadName": "",
        "EventID": "9A8830ADA55A5B2B",
        "BaggageBytes": "[[248 5] [240 0] [0 228 91 223 135 41 145 29 36] [240 1] [0 168 249 20 71 175 108 102 52] [240 3] [0 2]]",
        "ProcessID": 2171
      },
      {
        "Cycles": 0,
        "Agent": "Execution-CPU",
        "ProcessName": "Name",
        "TaskID": "E45BDF8729911D24",
        "ParentEventID": [
          "4B9D09326730BAE2"
        ],
        "Label": "unset",
        "Title": "X-Trace Task",
        "Host": "pinky19.mpi-sws.org",
        "Duration": "24835",
        "HRT": 26962478764409345,
        "Operation": "unset",
        "Timestamp": "1557746118704.588867",
        "TenantClass": 0,
        "Source": "Server.java:1828",
        "ThreadID": 48,
        "ThreadName": "",
        "EventID": "B1474F70842BD881",
        "BaggageBytes": "[[248 5] [240 0] [0 228 91 223 135 41 145 29 36] [240 1] [0 75 157 9 50 103 48 186 226] [240 3] [0 2]]",
        "ProcessID": 2171
      },
      {
        "Cycles": 0,
        "Agent": "edu.brown.cs.systems.xtrace.logging.BaggageWrappers",
        "ProcessName": "Name",
        "TaskID": "E45BDF8729911D24",
        "ParentEventID": [
          "9A8830ADA55A5B2B"
        ],
        "Label": "Forking current baggage with Baggage.fork()",
        "Title": "X-Trace Task",
        "Host": "pinky19.mpi-sws.org",
        "HRT": 26962478764388749,
        "Operation": "fork",
        "Timestamp": "1557746118704.568359",
        "TenantClass": 0,
        "Source": "Server.java:550",
        "ThreadID": 48,
        "ThreadName": "",
        "EventID": "4B9D09326730BAE2",
        "BaggageBytes": "[[248 5] [240 0] [0 228 91 223 135 41 145 29 36] [240 1] [0 154 136 48 173 165 90 91 43] [240 3] [0 2]]",
        "ProcessID": 2171
      },
      {
        "Cycles": 0,
        "Agent": "org.apache.hadoop.ipc.Server",
        "ProcessName": "Name",
        "TaskID": "E45BDF8729911D24",
        "ParentEventID": [
          "366AE79BA291ABEA"
        ],
        "Label": "getBlockLocations in org.apache.hadoop.hdfs.protocol.ClientProtocol",
        "Title": "X-Trace Task",
        "Host": "pinky19.mpi-sws.org",
        "HRT": 26962478764456141,
        "Timestamp": "1557746118704.635742",
        "TenantClass": 0,
        "Source": "ProtobufRpcEngine.java:601",
        "ThreadID": 56,
        "ThreadName": "",
        "EventID": "8A72368EB2C4DEA5",
        "BaggageBytes": "[[248 5] [240 0] [0 228 91 223 135 41 145 29 36] [240 1] [0 54 106 231 155 162 145 171 234] [240 3] [0 2]]",
        "ProcessID": 2171
      },
      {
        "Cycles": 0,
        "Agent": "org.apache.hadoop.hdfs.server.namenode.FSNamesystem.audit",
        "ProcessName": "Name",
        "TaskID": "E45BDF8729911D24",
        "ParentEventID": [
          "8A72368EB2C4DEA5"
        ],
        "Label": "allowed=true\tugi=plascas (auth:SIMPLE)\tip=/139.19.171.63\tcmd=open\tsrc=/ds/atQm1WP1mQMMCum3\tdst=null\tperm=null\tproto=rpc",
        "Title": "X-Trace Task",
        "Host": "pinky19.mpi-sws.org",
        "HRT": 26962478764503093,
        "Timestamp": "1557746118704.682617",
        "TenantClass": 0,
        "Source": "FSNamesystem.java:8313",
        "ThreadID": 56,
        "ThreadName": "",
        "EventID": "F392A7AC06390273",
        "BaggageBytes": "[[248 5] [240 0] [0 228 91 223 135 41 145 29 36] [240 1] [0 138 114 54 142 178 196 222 165] [240 3] [0 2]]",
        "ProcessID": 2171
      },
      {
        "Cycles": 0,
        "Agent": "edu.brown.cs.systems.xtrace.logging.BaggageWrappers",
        "ProcessName": "Name",
        "TaskID": "E45BDF8729911D24",
        "ParentEventID": [
          "F392A7AC06390273"
        ],
        "Label": "Forking current baggage with Baggage.fork()",
        "Title": "X-Trace Task",
        "Host": "pinky19.mpi-sws.org",
        "HRT": 26962478764557193,
        "Operation": "fork",
        "Timestamp": "1557746118704.736816",
        "TenantClass": 0,
        "Source": "Server.java:2398",
        "ThreadID": 56,
        "ThreadName": "",
        "EventID": "877DFE885BEA893D",
        "BaggageBytes": "[[248 5] [240 0] [0 228 91 223 135 41 145 29 36] [240 1] [0 243 146 167 172 6 57 2 115] [240 3] [0 2]]",
        "ProcessID": 2171
      },
      {
        "Cycles": 0,
        "Agent": "Execution-CPU",
        "ProcessName": "Name",
        "TaskID": "E45BDF8729911D24",
        "ParentEventID": [
          "4B9D09326730BAE2"
        ],
        "Label": "set",
        "Title": "X-Trace Task",
        "Host": "pinky19.mpi-sws.org",
        "HRT": 26962478764417990,
        "Operation": "set",
        "Timestamp": "1557746118704.597656",
        "TenantClass": 0,
        "Source": "Server.java:2071",
        "ThreadID": 56,
        "ThreadName": "",
        "EventID": "366AE79BA291ABEA",
        "BaggageBytes": "[[248 5] [240 0] [0 228 91 223 135 41 145 29 36] [240 1] [0 75 157 9 50 103 48 186 226] [240 3] [0 2]]",
        "ProcessID": 2171
      },
      {
        "Cycles": 0,
        "Agent": "Execution-CPU",
        "ProcessName": "Name",
        "TaskID": "E45BDF8729911D24",
        "ParentEventID": [
          "877DFE885BEA893D"
        ],
        "Label": "unset",
        "Title": "X-Trace Task",
        "Host": "pinky19.mpi-sws.org",
        "Duration": "218984",
        "HRT": 26962478764663353,
        "Operation": "unset",
        "Timestamp": "1557746118704.843018",
        "TenantClass": 0,
        "Source": "Server.java:1058",
        "ThreadID": 56,
        "ThreadName": "",
        "EventID": "2C09BEA04F4F0179",
        "BaggageBytes": "[[248 5] [240 0] [0 228 91 223 135 41 145 29 36] [240 1] [0 135 125 254 136 91 234 137 61] [240 3] [0 2]]",
        "ProcessID": 2171
      },
      {
        "Cycles": 0,
        "Agent": "Execution-CPU",
        "ProcessName": "Read",
        "TaskID": "E45BDF8729911D24",
        "ParentEventID": [
          "877DFE885BEA893D"
        ],
        "Label": "set",
        "Title": "X-Trace Task",
        "Host": "pinky19.mpi-sws.org",
        "HRT": 26962478764715685,
        "Operation": "set",
        "Timestamp": "1557746118704.892334",
        "TenantClass": 0,
        "Source": "Client.java:302",
        "ThreadID": 37,
        "ThreadName": "",
        "EventID": "7F5ACA7BC0842F26",
        "ProcessID": 36430
      },
      {
        "Cycles": 0,
        "Agent": "Execution-CPU",
        "ProcessName": "Read",
        "TaskID": "E45BDF8729911D24",
        "ParentEventID": [
          "7F5ACA7BC0842F26"
        ],
        "Label": "unset",
        "Title": "X-Trace Task",
        "Host": "pinky19.mpi-sws.org",
        "Duration": "11083",
        "HRT": 26962478764742284,
        "Operation": "unset",
        "Timestamp": "1557746118704.918945",
        "TenantClass": 0,
        "Source": "Client.java:1168",
        "ThreadID": 37,
        "ThreadName": "",
        "EventID": "CC87B499A248B037",
        "ProcessID": 36430
      },
      {
        "Cycles": 0,
        "Agent": "edu.brown.cs.systems.xtrace.logging.BaggageWrappers",
        "ProcessName": "Read",
        "TaskID": "E45BDF8729911D24",
        "ParentEventID": [
          "67463959C7910813",
          "CC87B499A248B037"
        ],
        "Label": "Merged current baggage with other baggage",
        "Title": "X-Trace Task",
        "Host": "pinky19.mpi-sws.org",
        "HRT": 26962478764781529,
        "Operation": "join",
        "Timestamp": "1557746118704.958252",
        "TenantClass": 0,
        "Source": "Client.java:1545",
        "ThreadID": 1,
        "ThreadName": "",
        "EventID": "B26C96210E922A6F",
        "ProcessID": 36430
      },
      {
        "Cycles": 0,
        "Agent": "Execution-Sleep",
        "ProcessName": "Read",
        "TaskID": "E45BDF8729911D24",
        "ParentEventID": [
          "AF98563FF9970F7C"
        ],
        "Label": "waited",
        "Title": "X-Trace Task",
        "Host": "pinky19.mpi-sws.org",
        "Duration": "444137",
        "HRT": 26962478764764571,
        "Operation": "waited",
        "Timestamp": "1557746118704.941162",
        "TenantClass": 0,
        "Source": "Client.java:1537",
        "ThreadID": 1,
        "ThreadName": "",
        "EventID": "67463959C7910813",
        "ProcessID": 36430
      },
      {
        "Cycles": 0,
        "Agent": "org.apache.hadoop.ipc.ProtobufRpcEngine",
        "ProcessName": "Read",
        "TaskID": "E45BDF8729911D24",
        "ParentEventID": [
          "B26C96210E922A6F"
        ],
        "Label": "org.apache.hadoop.hdfs.protocol.ClientProtocol.getBlockLocations completed",
        "Title": "X-Trace Task",
        "Host": "pinky19.mpi-sws.org",
        "HRT": 26962478764820729,
        "Timestamp": "1557746118704.997314",
        "TenantClass": 0,
        "Source": "ProtobufRpcEngine.java:275",
        "ThreadID": 1,
        "ThreadName": "",
        "EventID": "A48030DBA8FD8ECB",
        "ProcessID": 36430
      },
      {
        "Cycles": 0,
        "Agent": "Execution-CPU",
        "ProcessName": "Data",
        "TaskID": "E45BDF8729911D24",
        "ParentEventID": [
          "EA66B281FF6A2F96"
        ],
        "Label": "set",
        "Title": "X-Trace Task",
        "Host": "pinky22.mpi-sws.org",
        "HRT": 47512451019742367,
        "Operation": "set",
        "Timestamp": "1557746118705.371582",
        "TenantClass": 0,
        "Source": "Receiver.java:117",
        "ThreadID": 15142,
        "ThreadName": "",
        "EventID": "1102EE206C1165CA",
        "BaggageBytes": "[[248 5] [240 0] [0 228 91 223 135 41 145 29 36] [240 1] [0 234 102 178 129 255 106 47 150] [240 3] [0 2]]",
        "ProcessID": 28841
      },
      {
        "Cycles": 0,
        "Agent": "edu.brown.cs.systems.xtrace.logging.XTraceInit",
        "ProcessName": "Data",
        "TaskID": "E45BDF8729911D24",
        "ParentEventID": [
          "1102EE206C1165CA"
        ],
        "Label": "Thread.setName: DataXceiver for client DFSClient_NONMAPREDUCE_778905418_1 at /139.19.171.63:45362 [Sending block BP-1633380353-139.19.171.63-1554193446451:blk_1073768086_27262]",
        "Title": "X-Trace Task",
        "Host": "pinky22.mpi-sws.org",
        "HRT": 47512451019839664,
        "Timestamp": "1557746118705.468994",
        "TenantClass": 0,
        "Source": "DataXceiver.java:168",
        "ThreadID": 15142,
        "ThreadName": "",
        "EventID": "05ED3A904898BF96",
        "BaggageBytes": "[[248 5] [240 0] [0 228 91 223 135 41 145 29 36] [240 1] [0 17 2 238 32 108 17 101 202] [240 3] [0 2]]",
        "ProcessID": 28841
      },
      {
        "Cycles": 0,
        "Agent": "Execution-Sleep",
        "ProcessName": "Read",
        "TaskID": "E45BDF8729911D24",
        "ParentEventID": [
          "EA66B281FF6A2F96"
        ],
        "Label": "waited",
        "Title": "X-Trace Task",
        "Host": "pinky19.mpi-sws.org",
        "Duration": "628221",
        "HRT": 26962478765596528,
        "Operation": "waited",
        "Timestamp": "1557746118705.773193",
        "TenantClass": 0,
        "Source": "SocketIOWithTimeout.java:335",
        "ThreadID": 1,
        "ThreadName": "",
        "EventID": "6AFF449516D889A2",
        "ProcessID": 36430
      },
      {
        "Cycles": 0,
        "Agent": "edu.brown.cs.systems.xtrace.logging.BaggageWrappers",
        "ProcessName": "Data",
        "TaskID": "E45BDF8729911D24",
        "ParentEventID": [
          "05ED3A904898BF96"
        ],
        "Label": "Forking current baggage with Baggage.fork()",
        "Title": "X-Trace Task",
        "Host": "pinky22.mpi-sws.org",
        "HRT": 47512451020029414,
        "Operation": "fork",
        "Timestamp": "1557746118705.658691",
        "TenantClass": 0,
        "Source": "DataXceiver.java:1257",
        "ThreadID": 15142,
        "ThreadName": "",
        "EventID": "04B16EA941B12CE4",
        "BaggageBytes": "[[248 5] [240 0] [0 228 91 223 135 41 145 29 36] [240 1] [0 5 237 58 144 72 152 191 150] [240 3] [0 2]]",
        "ProcessID": 28841
      },
      {
        "Cycles": 0,
        "Agent": "edu.brown.cs.systems.xtrace.logging.BaggageWrappers",
        "ProcessName": "Data",
        "TaskID": "E45BDF8729911D24",
        "ParentEventID": [
          "04B16EA941B12CE4"
        ],
        "Label": "Forking current baggage with Baggage.fork()",
        "Title": "X-Trace Task",
        "Host": "pinky22.mpi-sws.org",
        "HRT": 47512451020165378,
        "Operation": "fork",
        "Timestamp": "1557746118705.794678",
        "TenantClass": 0,
        "Source": "PacketHeader.java:95",
        "ThreadID": 15142,
        "ThreadName": "",
        "EventID": "085B9559C6FB4FB3",
        "BaggageBytes": "[[248 5] [240 0] [0 228 91 223 135 41 145 29 36] [240 1] [0 4 177 110 169 65 177 44 228] [240 3] [0 2]]",
        "ProcessID": 28841
      },
      {
        "Cycles": 0,
        "Agent": "edu.brown.cs.systems.xtrace.logging.BaggageWrappers",
        "ProcessName": "Read",
        "TaskID": "E45BDF8729911D24",
        "ParentEventID": [
          "A48030DBA8FD8ECB"
        ],
        "Label": "Forking current baggage with Baggage.fork()",
        "Title": "X-Trace Task",
        "Host": "pinky19.mpi-sws.org",
        "HRT": 26962478764887411,
        "Operation": "fork",
        "Timestamp": "1557746118705.063965",
        "TenantClass": 0,
        "Source": "DataTransferProtoUtil.java:94",
        "ThreadID": 1,
        "ThreadName": "",
        "EventID": "EA66B281FF6A2F96",
        "ProcessID": 36430
      },
      {
        "Cycles": 0,
        "Agent": "edu.brown.cs.systems.xtrace.logging.BaggageWrappers",
        "ProcessName": "Read",
        "TaskID": "E45BDF8729911D24",
        "ParentEventID": [
          "6AFF449516D889A2",
          "04B16EA941B12CE4"
        ],
        "Label": "Merged current baggage with other baggage",
        "Title": "X-Trace Task",
        "Host": "pinky19.mpi-sws.org",
        "HRT": 26962478765691494,
        "Operation": "join",
        "Timestamp": "1557746118705.868164",
        "TenantClass": 0,
        "Source": "RemoteBlockReader2.java:429",
        "ThreadID": 1,
        "ThreadName": "",
        "EventID": "FB2FB71F73ACE6CD",
        "ProcessID": 36430
      },
      {
        "Cycles": 0,
        "Agent": "Execution-Sleep",
        "ProcessName": "Data",
        "TaskID": "E45BDF8729911D24",
        "ParentEventID": [
          "085B9559C6FB4FB3"
        ],
        "Label": "waited",
        "Title": "X-Trace Task",
        "Host": "pinky22.mpi-sws.org",
        "Duration": "9576",
        "HRT": 47512451020321038,
        "Operation": "waited",
        "Timestamp": "1557746118705.950195",
        "TenantClass": 0,
        "Source": "SocketIOWithTimeout.java:335",
        "ThreadID": 15142,
        "ThreadName": "",
        "EventID": "07F06A417861BEF9",
        "BaggageBytes": "[[248 5] [240 0] [0 228 91 223 135 41 145 29 36] [240 1] [0 8 91 149 89 198 251 79 179] [240 3] [0 2]]",
        "ProcessID": 28841
      },
      {
        "Cycles": 0,
        "Agent": "edu.brown.cs.systems.xtrace.logging.BaggageWrappers",
        "ProcessName": "Data",
        "TaskID": "E45BDF8729911D24",
        "ParentEventID": [
          "07F06A417861BEF9"
        ],
        "Label": "Forking current baggage with Baggage.fork()",
        "Title": "X-Trace Task",
        "Host": "pinky22.mpi-sws.org",
        "HRT": 47512451020482592,
        "Operation": "fork",
        "Timestamp": "1557746118706.111816",
        "TenantClass": 0,
        "Source": "PacketHeader.java:95",
        "ThreadID": 15142,
        "ThreadName": "",
        "EventID": "438D8BC17AC9ADE4",
        "BaggageBytes": "[[248 5] [240 0] [0 228 91 223 135 41 145 29 36] [240 1] [0 7 240 106 65 120 97 190 249] [240 3] [0 2]]",
        "ProcessID": 28841
      },
      {
        "Cycles": 0,
        "Agent": "edu.brown.cs.systems.xtrace.logging.BaggageWrappers",
        "ProcessName": "Read",
        "TaskID": "E45BDF8729911D24",
        "ParentEventID": [
          "8B70E3ED5A7EBD13",
          "085B9559C6FB4FB3"
        ],
        "Label": "Merged current baggage with other baggage",
        "Title": "X-Trace Task",
        "Host": "pinky19.mpi-sws.org",
        "HRT": 26962478766087747,
        "Operation": "join",
        "Timestamp": "1557746118706.264404",
        "TenantClass": 0,
        "Source": "PacketHeader.java:168",
        "ThreadID": 1,
        "ThreadName": "",
        "EventID": "A0CFE521B8793363",
        "ProcessID": 36430
      },
      {
        "Cycles": 0,
        "Agent": "Execution-Sleep",
        "ProcessName": "Read",
        "TaskID": "E45BDF8729911D24",
        "ParentEventID": [
          "FB2FB71F73ACE6CD"
        ],
        "Label": "waited",
        "Title": "X-Trace Task",
        "Host": "pinky19.mpi-sws.org",
        "Duration": "234692",
        "HRT": 26962478766019292,
        "Operation": "waited",
        "Timestamp": "1557746118706.196045",
        "TenantClass": 0,
        "Source": "SocketIOWithTimeout.java:335",
        "ThreadID": 1,
        "ThreadName": "",
        "EventID": "8B70E3ED5A7EBD13",
        "ProcessID": 36430
      },
      {
        "Cycles": 0,
        "Agent": "edu.brown.cs.systems.xtrace.logging.BaggageWrappers",
        "ProcessName": "Read",
        "TaskID": "E45BDF8729911D24",
        "ParentEventID": [
          "A0CFE521B8793363",
          "438D8BC17AC9ADE4"
        ],
        "Label": "Merged current baggage with other baggage",
        "Title": "X-Trace Task",
        "Host": "pinky19.mpi-sws.org",
        "HRT": 26962478766145586,
        "Operation": "join",
        "Timestamp": "1557746118706.322266",
        "TenantClass": 0,
        "Source": "PacketHeader.java:168",
        "ThreadID": 1,
        "ThreadName": "",
        "EventID": "B1FAF854F11DFFE4",
        "ProcessID": 36430
      },
      {
        "Cycles": 0,
        "Agent": "Execution-Sleep",
        "ProcessName": "Data",
        "TaskID": "E45BDF8729911D24",
        "ParentEventID": [
          "438D8BC17AC9ADE4"
        ],
        "Label": "waited",
        "Title": "X-Trace Task",
        "Host": "pinky22.mpi-sws.org",
        "Duration": "144354",
        "HRT": 47512451020802423,
        "Operation": "waited",
        "Timestamp": "1557746118706.431641",
        "TenantClass": 0,
        "Source": "SocketIOWithTimeout.java:335",
        "ThreadID": 15142,
        "ThreadName": "",
        "EventID": "53AEB4779DFC10CE",
        "BaggageBytes": "[[248 5] [240 0] [0 228 91 223 135 41 145 29 36] [240 1] [0 67 141 139 193 122 201 173 228] [240 3] [0 2]]",
        "ProcessID": 28841
      },
      {
        "Cycles": 0,
        "Agent": "edu.brown.cs.systems.xtrace.logging.BaggageWrappers",
        "ProcessName": "Read",
        "TaskID": "E45BDF8729911D24",
        "ParentEventID": [
          "B1FAF854F11DFFE4"
        ],
        "Label": "Forking current baggage with Baggage.fork()",
        "Title": "X-Trace Task",
        "Host": "pinky19.mpi-sws.org",
        "HRT": 26962478766155407,
        "Operation": "fork",
        "Timestamp": "1557746118706.332031",
        "TenantClass": 0,
        "Source": "RemoteBlockReader2.java:361",
        "ThreadID": 1,
        "ThreadName": "",
        "EventID": "FDB5FCD3973D5F9B",
        "ProcessID": 36430
      },
      {
        "Cycles": 0,
        "Agent": "edu.brown.cs.systems.xtrace.logging.BaggageWrappers",
        "ProcessName": "Data",
        "TaskID": "E45BDF8729911D24",
        "ParentEventID": [
          "53AEB4779DFC10CE",
          "FDB5FCD3973D5F9B"
        ],
        "Label": "Merged current baggage with other baggage",
        "Title": "X-Trace Task",
        "Host": "pinky22.mpi-sws.org",
        "HRT": 47512451020912203,
        "Operation": "join",
        "Timestamp": "1557746118706.541504",
        "TenantClass": 0,
        "Source": "DataXceiver.java:574",
        "ThreadID": 15142,
        "ThreadName": "",
        "EventID": "E74D18CFEF836375",
        "BaggageBytes": "[[248 5] [240 0] [0 228 91 223 135 41 145 29 36] [240 1] [0 253 181 252 211 151 61 95 155] [0 83 174 180 119 157 252 16 206] [240 3] [0 2]]",
        "ProcessID": 28841
      },
      {
        "Cycles": 0,
        "Agent": "Execution-CPU",
        "ProcessName": "Data",
        "TaskID": "E45BDF8729911D24",
        "ParentEventID": [
          "E74D18CFEF836375"
        ],
        "Label": "unset",
        "Title": "X-Trace Task",
        "Host": "pinky22.mpi-sws.org",
        "Duration": "1141773",
        "HRT": 47512451020960370,
        "Operation": "unset",
        "Timestamp": "1557746118706.589600",
        "TenantClass": 0,
        "Source": "DataXceiver.java:261",
        "ThreadID": 15142,
        "ThreadName": "",
        "EventID": "3940397DE70BF32E",
        "BaggageBytes": "[[248 5] [240 0] [0 228 91 223 135 41 145 29 36] [240 1] [0 231 77 24 207 239 131 99 117] [240 3] [0 2]]",
        "ProcessID": 28841
      },
      {
        "Cycles": 0,
        "Agent": "edu.brown.cs.systems.retro.benchmarks.hdfs_client.Reader",
        "ProcessName": "Read",
        "TaskID": "E45BDF8729911D24",
        "ParentEventID": [
          "5FDBB23E45D1BB1A"
        ],
        "Label": "Reading file",
        "Title": "X-Trace Task",
        "Host": "pinky19.mpi-sws.org",
        "HRT": 26962478764069658,
        "Timestamp": "1557746118704.246338",
        "TenantClass": 0,
        "ThreadID": 1,
        "ThreadName": "",
        "EventID": "CD6E727E0D9B1B00",
        "ProcessID": 36430
      }
    ]
  }
]