[
  {
    "id": "ED6DCF7907F7A9A2",
    "reports": [
      {
        "Cycles": 0,
        "Agent": "Execution-CPU",
        "ProcessName": "Read",
        "TaskID": "ED6DCF7907F7A9A2",
        "ParentEventID": [
          "77B744B6D2862E23"
        ],
        "Label": "unset",
        "Title": "X-Trace Task",
        "Host": "pinky19.mpi-sws.org",
        "Duration": "21650783",
        "HRT": 26962443119588486,
        "Operation": "unset",
        "Timestamp": "1557746083059.822510",
        "TenantClass": 0,
        "Source": "Client.java:1027",
        "ThreadID": 1,
        "ThreadName": "",
        "EventID": "207D83EDCE862172",
        "ProcessID": 36430
      },
      {
        "Cycles": 0,
        "Agent": "org.apache.hadoop.ipc.ProtobufRpcEngine",
        "ProcessName": "Read",
        "TaskID": "ED6DCF7907F7A9A2",
        "ParentEventID": [
          "42C0966F86E8C3D4"
        ],
        "Label": "Invoking org.apache.hadoop.hdfs.protocol.ClientProtocol.getBlockLocations",
        "Title": "X-Trace Task",
        "Host": "pinky19.mpi-sws.org",
        "HRT": 26962443119547754,
        "Timestamp": "1557746083059.781738",
        "TenantClass": 0,
        "Source": "ProtobufRpcEngine.java:228",
        "ThreadID": 1,
        "ThreadName": "",
        "EventID": "77B744B6D2862E23",
        "ProcessID": 36430
      },
      {
        "Cycles": 0,
        "Agent": "edu.brown.cs.systems.retro.benchmarks.hdfs_client.Reader",
        "ProcessName": "Read",
        "TaskID": "ED6DCF7907F7A9A2",
        "ParentEventID": [
          "7F36EEAE4C20C2F1"
        ],
        "Label": "Reading file",
        "Title": "X-Trace Task",
        "Host": "pinky19.mpi-sws.org",
        "HRT": 26962443119420131,
        "Timestamp": "1557746083059.654053",
        "TenantClass": 0,
        "ThreadID": 1,
        "ThreadName": "",
        "EventID": "42C0966F86E8C3D4",
        "ProcessID": 36430
      },
      {
        "Cycles": 0,
        "Agent": "Execution-CPU",
        "ProcessName": "Read",
        "TaskID": "ED6DCF7907F7A9A2",
        "ParentEventID": [
          "207D83EDCE862172"
        ],
        "Label": "set",
        "Title": "X-Trace Task",
        "Host": "pinky19.mpi-sws.org",
        "HRT": 26962443119651612,
        "Operation": "set",
        "Timestamp": "1557746083059.885742",
        "TenantClass": 0,
        "Source": "Client.java:1032",
        "ThreadID": 41,
        "ThreadName": "",
        "EventID": "82E8ECC2A44B50B9",
        "ProcessID": 36430
      },
      {
        "Cycles": 0,
        "Agent": "edu.brown.cs.systems.retro.benchmarks.hdfs_client.Reader",
        "ProcessName": "Read",
        "TaskID": "ED6DCF7907F7A9A2",
        "ParentEventID": [
          "0"
        ],
        "Label": "Reading file",
        "Title": "X-Trace Task",
        "Host": "pinky19.mpi-sws.org",
        "HRT": 26962443119401387,
        "Timestamp": "1557746083059.635498",
        "TenantClass": 0,
        "ThreadID": 1,
        "ThreadName": "",
        "EventID": "7F36EEAE4C20C2F1",
        "ProcessID": 36430,
        "Tag": [
          "reader_10kb",
          "Read Size: 10240"
        ]
      },
      {
        "Cycles": 0,
        "Agent": "Execution-CPU",
        "ProcessName": "Read",
        "TaskID": "ED6DCF7907F7A9A2",
        "ParentEventID": [
          "79862501B2F53113"
        ],
        "Label": "unset",
        "Title": "X-Trace Task",
        "Host": "pinky19.mpi-sws.org",
        "Duration": "99496",
        "HRT": 26962443119789804,
        "Operation": "unset",
        "Timestamp": "1557746083060.023926",
        "TenantClass": 0,
        "Source": "Client.java:1062",
        "ThreadID": 41,
        "ThreadName": "",
        "EventID": "F7FCD77A97A1E114",
        "ProcessID": 36430
      },
      {
        "Cycles": 0,
        "Agent": "edu.brown.cs.systems.xtrace.logging.BaggageWrappers",
        "ProcessName": "Read",
        "TaskID": "ED6DCF7907F7A9A2",
        "ParentEventID": [
          "82E8ECC2A44B50B9"
        ],
        "Label": "Forking current baggage with Baggage.fork()",
        "Title": "X-Trace Task",
        "Host": "pinky19.mpi-sws.org",
        "HRT": 26962443119692112,
        "Operation": "fork",
        "Timestamp": "1557746083059.926270",
        "TenantClass": 0,
        "Source": "Client.java:1043",
        "ThreadID": 41,
        "ThreadName": "",
        "EventID": "79862501B2F53113",
        "ProcessID": 36430
      },
      {
        "Cycles": 0,
        "Agent": "Execution-CPU",
        "ProcessName": "Read",
        "TaskID": "ED6DCF7907F7A9A2",
        "ParentEventID": [
          "F7FCD77A97A1E114"
        ],
        "Label": "set",
        "Title": "X-Trace Task",
        "Host": "pinky19.mpi-sws.org",
        "HRT": 26962443119826898,
        "Operation": "set",
        "Timestamp": "1557746083060.061035",
        "TenantClass": 0,
        "Source": "Client.java:1104",
        "ThreadID": 1,
        "ThreadName": "",
        "EventID": "502B5437297B1A45",
        "ProcessID": 36430
      },
      {
        "Cycles": 0,
        "Agent": "edu.brown.cs.systems.xtrace.logging.BaggageWrappers",
        "ProcessName": "Name",
        "TaskID": "ED6DCF7907F7A9A2",
        "ParentEventID": [
          "FB9CABDA5528E6FA"
        ],
        "Label": "Forking current baggage with Baggage.fork()",
        "Title": "X-Trace Task",
        "Host": "pinky19.mpi-sws.org",
        "HRT": 26962443119924995,
        "Operation": "fork",
        "Timestamp": "1557746083060.160645",
        "TenantClass": 0,
        "Source": "Server.java:550",
        "ThreadID": 48,
        "ThreadName": "",
        "EventID": "3E3286DB2B5FC79B",
        "BaggageBytes": "[[248 5] [240 0] [0 237 109 207 121 7 247 169 162] [240 1] [0 251 156 171 218 85 40 230 250] [240 3] [0 2]]",
        "ProcessID": 2171
      },
      {
        "Cycles": 0,
        "Agent": "Execution-CPU",
        "ProcessName": "Name",
        "TaskID": "ED6DCF7907F7A9A2",
        "ParentEventID": [
          "79862501B2F53113"
        ],
        "Label": "set",
        "Title": "X-Trace Task",
        "Host": "pinky19.mpi-sws.org",
        "HRT": 26962443119899472,
        "Operation": "set",
        "Timestamp": "1557746083060.135010",
        "TenantClass": 0,
        "Source": "Server.java:1840",
        "ThreadID": 48,
        "ThreadName": "",
        "EventID": "FB9CABDA5528E6FA",
        "BaggageBytes": "[[248 5] [240 0] [0 237 109 207 121 7 247 169 162] [240 1] [0 121 134 37 1 178 245 49 19] [240 3] [0 2]]",
        "ProcessID": 2171
      },
      {
        "Cycles": 0,
        "Agent": "Execution-CPU",
        "ProcessName": "Name",
        "TaskID": "ED6DCF7907F7A9A2",
        "ParentEventID": [
          "3E3286DB2B5FC79B"
        ],
        "Label": "unset",
        "Title": "X-Trace Task",
        "Host": "pinky19.mpi-sws.org",
        "Duration": "23960",
        "HRT": 26962443119945587,
        "Operation": "unset",
        "Timestamp": "1557746083060.181152",
        "TenantClass": 0,
        "Source": "Server.java:1828",
        "ThreadID": 48,
        "ThreadName": "",
        "EventID": "6B4AFBF1A189748F",
        "BaggageBytes": "[[248 5] [240 0] [0 237 109 207 121 7 247 169 162] [240 1] [0 62 50 134 219 43 95 199 155] [240 3] [0 2]]",
        "ProcessID": 2171
      },
      {
        "Cycles": 0,
        "Agent": "org.apache.hadoop.ipc.Server",
        "ProcessName": "Name",
        "TaskID": "ED6DCF7907F7A9A2",
        "ParentEventID": [
          "0DC7D69D7E62CD1D"
        ],
        "Label": "getBlockLocations in org.apache.hadoop.hdfs.protocol.ClientProtocol",
        "Title": "X-Trace Task",
        "Host": "pinky19.mpi-sws.org",
        "HRT": 26962443120007947,
        "Timestamp": "1557746083060.243652",
        "TenantClass": 0,
        "Source": "ProtobufRpcEngine.java:601",
        "ThreadID": 58,
        "ThreadName": "",
        "EventID": "09676086A4B85828",
        "BaggageBytes": "[[248 5] [240 0] [0 237 109 207 121 7 247 169 162] [240 1] [0 13 199 214 157 126 98 205 29] [240 3] [0 2]]",
        "ProcessID": 2171
      },
      {
        "Cycles": 0,
        "Agent": "org.apache.hadoop.hdfs.server.namenode.FSNamesystem.audit",
        "ProcessName": "Name",
        "TaskID": "ED6DCF7907F7A9A2",
        "ParentEventID": [
          "09676086A4B85828"
        ],
        "Label": "allowed=true\tugi=plascas (auth:SIMPLE)\tip=/139.19.171.63\tcmd=open\tsrc=/ds/eceWXVr6DBMWCE31\tdst=null\tperm=null\tproto=rpc",
        "Title": "X-Trace Task",
        "Host": "pinky19.mpi-sws.org",
        "HRT": 26962443120073786,
        "Timestamp": "1557746083060.309326",
        "TenantClass": 0,
        "Source": "FSNamesystem.java:8313",
        "ThreadID": 58,
        "ThreadName": "",
        "EventID": "31B6FACC9FA1FAE2",
        "BaggageBytes": "[[248 5] [240 0] [0 237 109 207 121 7 247 169 162] [240 1] [0 9 103 96 134 164 184 88 40] [240 3] [0 2]]",
        "ProcessID": 2171
      },
      {
        "Cycles": 0,
        "Agent": "Execution-CPU",
        "ProcessName": "Name",
        "TaskID": "ED6DCF7907F7A9A2",
        "ParentEventID": [
          "4AAC8A26890FD2AF"
        ],
        "Label": "unset",
        "Title": "X-Trace Task",
        "Host": "pinky19.mpi-sws.org",
        "Duration": "260688",
        "HRT": 26962443120252442,
        "Operation": "unset",
        "Timestamp": "1557746083060.488037",
        "TenantClass": 0,
        "Source": "Server.java:1058",
        "ThreadID": 58,
        "ThreadName": "",
        "EventID": "CE497EA39EDE91CC",
        "BaggageBytes": "[[248 5] [240 0] [0 237 109 207 121 7 247 169 162] [240 1] [0 74 172 138 38 137 15 210 175] [240 3] [0 2]]",
        "ProcessID": 2171
      },
      {
        "Cycles": 0,
        "Agent": "Execution-CPU",
        "ProcessName": "Name",
        "TaskID": "ED6DCF7907F7A9A2",
        "ParentEventID": [
          "3E3286DB2B5FC79B"
        ],
        "Label": "set",
        "Title": "X-Trace Task",
        "Host": "pinky19.mpi-sws.org",
        "HRT": 26962443119959095,
        "Operation": "set",
        "Timestamp": "1557746083060.194824",
        "TenantClass": 0,
        "Source": "Server.java:2071",
        "ThreadID": 58,
        "ThreadName": "",
        "EventID": "0DC7D69D7E62CD1D",
        "BaggageBytes": "[[248 5] [240 0] [0 237 109 207 121 7 247 169 162] [240 1] [0 62 50 134 219 43 95 199 155] [240 3] [0 2]]",
        "ProcessID": 2171
      },
      {
        "Cycles": 0,
        "Agent": "Execution-CPU",
        "ProcessName": "Read",
        "TaskID": "ED6DCF7907F7A9A2",
        "ParentEventID": [
          "4AAC8A26890FD2AF"
        ],
        "Label": "set",
        "Title": "X-Trace Task",
        "Host": "pinky19.mpi-sws.org",
        "HRT": 26962443120340256,
        "Operation": "set",
        "Timestamp": "1557746083060.574219",
        "TenantClass": 0,
        "Source": "Client.java:302",
        "ThreadID": 37,
        "ThreadName": "",
        "EventID": "93098D96A8D03ABC",
        "ProcessID": 36430
      },
      {
        "Cycles": 0,
        "Agent": "Execution-CPU",
        "ProcessName": "Read",
        "TaskID": "ED6DCF7907F7A9A2",
        "ParentEventID": [
          "93098D96A8D03ABC"
        ],
        "Label": "unset",
        "Title": "X-Trace Task",
        "Host": "pinky19.mpi-sws.org",
        "Duration": "14609",
        "HRT": 26962443120373637,
        "Operation": "unset",
        "Timestamp": "1557746083060.607666",
        "TenantClass": 0,
        "Source": "Client.java:1168",
        "ThreadID": 37,
        "ThreadName": "",
        "EventID": "56D1CE06FEE02AF8",
        "ProcessID": 36430
      },
      {
        "Cycles": 0,
        "Agent": "Execution-Sleep",
        "ProcessName": "Read",
        "TaskID": "ED6DCF7907F7A9A2",
        "ParentEventID": [
          "502B5437297B1A45"
        ],
        "Label": "waited",
        "Title": "X-Trace Task",
        "Host": "pinky19.mpi-sws.org",
        "Duration": "556426",
        "HRT": 26962443120403451,
        "Operation": "waited",
        "Timestamp": "1557746083060.637451",
        "TenantClass": 0,
        "Source": "Client.java:1537",
        "ThreadID": 1,
        "ThreadName": "",
        "EventID": "01D89B6F00BF2460",
        "ProcessID": 36430
      },
      {
        "Cycles": 0,
        "Agent": "org.apache.hadoop.ipc.ProtobufRpcEngine",
        "ProcessName": "Read",
        "TaskID": "ED6DCF7907F7A9A2",
        "ParentEventID": [
          "1DE7188E22D2371B"
        ],
        "Label": "org.apache.hadoop.hdfs.protocol.ClientProtocol.getBlockLocations completed",
        "Title": "X-Trace Task",
        "Host": "pinky19.mpi-sws.org",
        "HRT": 26962443120556716,
        "Timestamp": "1557746083060.790771",
        "TenantClass": 0,
        "Source": "ProtobufRpcEngine.java:275",
        "ThreadID": 1,
        "ThreadName": "",
        "EventID": "C1E6A1D1E58F721B",
        "ProcessID": 36430
      },
      {
        "Cycles": 0,
        "Agent": "edu.brown.cs.systems.xtrace.logging.BaggageWrappers",
        "ProcessName": "Name",
        "TaskID": "ED6DCF7907F7A9A2",
        "ParentEventID": [
          "31B6FACC9FA1FAE2"
        ],
        "Label": "Forking current baggage with Baggage.fork()",
        "Title": "X-Trace Task",
        "Host": "pinky19.mpi-sws.org",
        "HRT": 26962443120129919,
        "Operation": "fork",
        "Timestamp": "1557746083060.365479",
        "TenantClass": 0,
        "Source": "Server.java:2398",
        "ThreadID": 58,
        "ThreadName": "",
        "EventID": "4AAC8A26890FD2AF",
        "BaggageBytes": "[[248 5] [240 0] [0 237 109 207 121 7 247 169 162] [240 1] [0 49 182 250 204 159 161 250 226] [240 3] [0 2]]",
        "ProcessID": 2171
      },
      {
        "Cycles": 0,
        "Agent": "edu.brown.cs.systems.xtrace.logging.BaggageWrappers",
        "ProcessName": "Read",
        "TaskID": "ED6DCF7907F7A9A2",
        "ParentEventID": [
          "C1E6A1D1E58F721B"
        ],
        "Label": "Forking current baggage with Baggage.fork()",
        "Title": "X-Trace Task",
        "Host": "pinky19.mpi-sws.org",
        "HRT": 26962443120661760,
        "Operation": "fork",
        "Timestamp": "1557746083060.895752",
        "TenantClass": 0,
        "Source": "DataTransferProtoUtil.java:94",
        "ThreadID": 1,
        "ThreadName": "",
        "EventID": "8210B27ED71ACE87",
        "ProcessID": 36430
      },
      {
        "Cycles": 0,
        "Agent": "Execution-CPU",
        "ProcessName": "Data",
        "TaskID": "ED6DCF7907F7A9A2",
        "ParentEventID": [
          "8210B27ED71ACE87"
        ],
        "Label": "set",
        "Title": "X-Trace Task",
        "Host": "pinky19.mpi-sws.org",
        "HRT": 26962443120849656,
        "Operation": "set",
        "Timestamp": "1557746083061.096680",
        "TenantClass": 0,
        "Source": "Receiver.java:117",
        "ThreadID": 36633,
        "ThreadName": "",
        "EventID": "210D8FD388961B90",
        "BaggageBytes": "[[248 5] [240 0] [0 237 109 207 121 7 247 169 162] [240 1] [0 130 16 178 126 215 26 206 135] [240 3] [0 2]]",
        "ProcessID": 2319
      },
      {
        "Cycles": 0,
        "Agent": "edu.brown.cs.systems.xtrace.logging.XTraceInit",
        "ProcessName": "Data",
        "TaskID": "ED6DCF7907F7A9A2",
        "ParentEventID": [
          "210D8FD388961B90"
        ],
        "Label": "Thread.setName: DataXceiver for client DFSClient_NONMAPREDUCE_778905418_1 at /139.19.171.63:43130 [Sending block BP-1633380353-139.19.171.63-1554193446451:blk_1073758371_17547]",
        "Title": "X-Trace Task",
        "Host": "pinky19.mpi-sws.org",
        "HRT": 26962443120888761,
        "Timestamp": "1557746083061.135742",
        "TenantClass": 0,
        "Source": "DataXceiver.java:168",
        "ThreadID": 36633,
        "ThreadName": "",
        "EventID": "9CB401AB03BBF6F6",
        "BaggageBytes": "[[248 5] [240 0] [0 237 109 207 121 7 247 169 162] [240 1] [0 33 13 143 211 136 150 27 144] [240 3] [0 2]]",
        "ProcessID": 2319
      },
      {
        "Cycles": 0,
        "Agent": "edu.brown.cs.systems.xtrace.logging.BaggageWrappers",
        "ProcessName": "Data",
        "TaskID": "ED6DCF7907F7A9A2",
        "ParentEventID": [
          "9CB401AB03BBF6F6"
        ],
        "Label": "Forking current baggage with Baggage.fork()",
        "Title": "X-Trace Task",
        "Host": "pinky19.mpi-sws.org",
        "HRT": 26962443120964806,
        "Operation": "fork",
        "Timestamp": "1557746083061.211914",
        "TenantClass": 0,
        "Source": "DataXceiver.java:1257",
        "ThreadID": 36633,
        "ThreadName": "",
        "EventID": "908B68A7010A3E2F",
        "BaggageBytes": "[[248 5] [240 0] [0 237 109 207 121 7 247 169 162] [240 1] [0 156 180 1 171 3 187 246 246] [240 3] [0 2]]",
        "ProcessID": 2319
      },
      {
        "Cycles": 0,
        "Agent": "edu.brown.cs.systems.xtrace.logging.BaggageWrappers",
        "ProcessName": "Data",
        "TaskID": "ED6DCF7907F7A9A2",
        "ParentEventID": [
          "908B68A7010A3E2F"
        ],
        "Label": "Forking current baggage with Baggage.fork()",
        "Title": "X-Trace Task",
        "Host": "pinky19.mpi-sws.org",
        "HRT": 26962443121028361,
        "Operation": "fork",
        "Timestamp": "1557746083061.275391",
        "TenantClass": 0,
        "Source": "PacketHeader.java:95",
        "ThreadID": 36633,
        "ThreadName": "",
        "EventID": "125D899CA7DE7BBC",
        "BaggageBytes": "[[248 5] [240 0] [0 237 109 207 121 7 247 169 162] [240 1] [0 144 139 104 167 1 10 62 47] [240 3] [0 2]]",
        "ProcessID": 2319
      },
      {
        "Cycles": 0,
        "Agent": "Execution-Sleep",
        "ProcessName": "Read",
        "TaskID": "ED6DCF7907F7A9A2",
        "ParentEventID": [
          "8210B27ED71ACE87"
        ],
        "Label": "waited",
        "Title": "X-Trace Task",
        "Host": "pinky19.mpi-sws.org",
        "Duration": "243404",
        "HRT": 26962443121028561,
        "Operation": "waited",
        "Timestamp": "1557746083061.262695",
        "TenantClass": 0,
        "Source": "SocketIOWithTimeout.java:335",
        "ThreadID": 1,
        "ThreadName": "",
        "EventID": "55132015BB7107F8",
        "ProcessID": 36430
      },
      {
        "Cycles": 0,
        "Agent": "edu.brown.cs.systems.xtrace.logging.BaggageWrappers",
        "ProcessName": "Read",
        "TaskID": "ED6DCF7907F7A9A2",
        "ParentEventID": [
          "56D1CE06FEE02AF8",
          "01D89B6F00BF2460"
        ],
        "Label": "Merged current baggage with other baggage",
        "Title": "X-Trace Task",
        "Host": "pinky19.mpi-sws.org",
        "HRT": 26962443120442955,
        "Operation": "join",
        "Timestamp": "1557746083060.677002",
        "TenantClass": 0,
        "Source": "Client.java:1545",
        "ThreadID": 1,
        "ThreadName": "",
        "EventID": "1DE7188E22D2371B",
        "ProcessID": 36430
      },
      {
        "Cycles": 0,
        "Agent": "Execution-Sleep",
        "ProcessName": "Data",
        "TaskID": "ED6DCF7907F7A9A2",
        "ParentEventID": [
          "125D899CA7DE7BBC"
        ],
        "Label": "waited",
        "Title": "X-Trace Task",
        "Host": "pinky19.mpi-sws.org",
        "Duration": "4194",
        "HRT": 26962443121088788,
        "Operation": "waited",
        "Timestamp": "1557746083061.335938",
        "TenantClass": 0,
        "Source": "SocketIOWithTimeout.java:335",
        "ThreadID": 36633,
        "ThreadName": "",
        "EventID": "505252B7F416B838",
        "BaggageBytes": "[[248 5] [240 0] [0 237 109 207 121 7 247 169 162] [240 1] [0 18 93 137 156 167 222 123 188] [240 3] [0 2]]",
        "ProcessID": 2319
      },
      {
        "Cycles": 0,
        "Agent": "edu.brown.cs.systems.xtrace.logging.BaggageWrappers",
        "ProcessName": "Read",
        "TaskID": "ED6DCF7907F7A9A2",
        "ParentEventID": [
          "55132015BB7107F8",
          "908B68A7010A3E2F"
        ],
        "Label": "Merged current baggage with other baggage",
        "Title": "X-Trace Task",
        "Host": "pinky19.mpi-sws.org",
        "HRT": 26962443121114644,
        "Operation": "join",
        "Timestamp": "1557746083061.348633",
        "TenantClass": 0,
        "Source": "RemoteBlockReader2.java:429",
        "ThreadID": 1,
        "ThreadName": "",
        "EventID": "FDAABD5B2F686D1C",
        "ProcessID": 36430
      },
      {
        "Cycles": 0,
        "Agent": "edu.brown.cs.systems.xtrace.logging.BaggageWrappers",
        "ProcessName": "Read",
        "TaskID": "ED6DCF7907F7A9A2",
        "ParentEventID": [
          "125D899CA7DE7BBC",
          "FDAABD5B2F686D1C"
        ],
        "Label": "Merged current baggage with other baggage",
        "Title": "X-Trace Task",
        "Host": "pinky19.mpi-sws.org",
        "HRT": 26962443121214022,
        "Operation": "join",
        "Timestamp": "1557746083061.447998",
        "TenantClass": 0,
        "Source": "PacketHeader.java:168",
        "ThreadID": 1,
        "ThreadName": "",
        "EventID": "04BA4B6FA78900B8",
        "ProcessID": 36430
      },
      {
        "Cycles": 0,
        "Agent": "edu.brown.cs.systems.xtrace.logging.BaggageWrappers",
        "ProcessName": "Read",
        "TaskID": "ED6DCF7907F7A9A2",
        "ParentEventID": [
          "EA17A46B187D386B",
          "04BA4B6FA78900B8"
        ],
        "Label": "Merged current baggage with other baggage",
        "Title": "X-Trace Task",
        "Host": "pinky19.mpi-sws.org",
        "HRT": 26962443121294298,
        "Operation": "join",
        "Timestamp": "1557746083061.528320",
        "TenantClass": 0,
        "Source": "PacketHeader.java:168",
        "ThreadID": 1,
        "ThreadName": "",
        "EventID": "804A96DF38B80929",
        "ProcessID": 36430
      },
      {
        "Cycles": 0,
        "Agent": "Execution-Sleep",
        "ProcessName": "Data",
        "TaskID": "ED6DCF7907F7A9A2",
        "ParentEventID": [
          "EA17A46B187D386B"
        ],
        "Label": "waited",
        "Title": "X-Trace Task",
        "Host": "pinky19.mpi-sws.org",
        "Duration": "134860",
        "HRT": 26962443121368073,
        "Operation": "waited",
        "Timestamp": "1557746083061.615234",
        "TenantClass": 0,
        "Source": "SocketIOWithTimeout.java:335",
        "ThreadID": 36633,
        "ThreadName": "",
        "EventID": "14E7EE50CC123262",
        "BaggageBytes": "[[248 5] [240 0] [0 237 109 207 121 7 247 169 162] [240 1] [0 234 23 164 107 24 125 56 107] [240 3] [0 2]]",
        "ProcessID": 2319
      },
      {
        "Cycles": 0,
        "Agent": "edu.brown.cs.systems.xtrace.logging.BaggageWrappers",
        "ProcessName": "Read",
        "TaskID": "ED6DCF7907F7A9A2",
        "ParentEventID": [
          "804A96DF38B80929"
        ],
        "Label": "Forking current baggage with Baggage.fork()",
        "Title": "X-Trace Task",
        "Host": "pinky19.mpi-sws.org",
        "HRT": 26962443121307733,
        "Operation": "fork",
        "Timestamp": "1557746083061.541748",
        "TenantClass": 0,
        "Source": "RemoteBlockReader2.java:361",
        "ThreadID": 1,
        "ThreadName": "",
        "EventID": "7BC487848F4CFCD2",
        "ProcessID": 36430
      },
      {
        "Cycles": 0,
        "Agent": "edu.brown.cs.systems.xtrace.logging.BaggageWrappers",
        "ProcessName": "Data",
        "TaskID": "ED6DCF7907F7A9A2",
        "ParentEventID": [
          "505252B7F416B838"
        ],
        "Label": "Forking current baggage with Baggage.fork()",
        "Title": "X-Trace Task",
        "Host": "pinky19.mpi-sws.org",
        "HRT": 26962443121151415,
        "Operation": "fork",
        "Timestamp": "1557746083061.398438",
        "TenantClass": 0,
        "Source": "PacketHeader.java:95",
        "ThreadID": 36633,
        "ThreadName": "",
        "EventID": "EA17A46B187D386B",
        "BaggageBytes": "[[248 5] [240 0] [0 237 109 207 121 7 247 169 162] [240 1] [0 80 82 82 183 244 22 184 56] [240 3] [0 2]]",
        "ProcessID": 2319
      },
      {
        "Cycles": 0,
        "Agent": "edu.brown.cs.systems.xtrace.logging.BaggageWrappers",
        "ProcessName": "Data",
        "TaskID": "ED6DCF7907F7A9A2",
        "ParentEventID": [
          "7BC487848F4CFCD2",
          "14E7EE50CC123262"
        ],
        "Label": "Merged current baggage with other baggage",
        "Title": "X-Trace Task",
        "Host": "pinky19.mpi-sws.org",
        "HRT": 26962443121424447,
        "Operation": "join",
        "Timestamp": "1557746083061.671631",
        "TenantClass": 0,
        "Source": "DataXceiver.java:574",
        "ThreadID": 36633,
        "ThreadName": "",
        "EventID": "3A9D7733BDE60595",
        "BaggageBytes": "[[248 5] [240 0] [0 237 109 207 121 7 247 169 162] [240 1] [0 20 231 238 80 204 18 50 98] [0 123 196 135 132 143 76 252 210] [240 3] [0 2]]",
        "ProcessID": 2319
      },
      {
        "Cycles": 0,
        "Agent": "Execution-CPU",
        "ProcessName": "Data",
        "TaskID": "ED6DCF7907F7A9A2",
        "ParentEventID": [
          "3A9D7733BDE60595"
        ],
        "Label": "unset",
        "Title": "X-Trace Task",
        "Host": "pinky19.mpi-sws.org",
        "Duration": "566063",
        "HRT": 26962443121444063,
        "Operation": "unset",
        "Timestamp": "1557746083061.691162",
        "TenantClass": 0,
        "Source": "DataXceiver.java:261",
        "ThreadID": 36633,
        "ThreadName": "",
        "EventID": "F0071F9BC837B560",
        "BaggageBytes": "[[248 5] [240 0] [0 237 109 207 121 7 247 169 162] [240 1] [0 58 157 119 51 189 230 5 149] [240 3] [0 2]]",
        "ProcessID": 2319
      }
    ]
  }
]