[
  {
    "id": "ABE088568870F30A",
    "reports": [
      {
        "Cycles": 0,
        "Agent": "Execution-CPU",
        "ProcessName": "Read",
        "TaskID": "ABE088568870F30A",
        "ParentEventID": [
          "7FBF30EC5D4700D5"
        ],
        "Label": "unset",
        "Title": "X-Trace Task",
        "Host": "pinky19.mpi-sws.org",
        "Duration": "25531721",
        "HRT": 26966677057581318,
        "Operation": "unset",
        "Timestamp": "1557750316997.754883",
        "TenantClass": 0,
        "Source": "Client.java:1027",
        "ThreadID": 1,
        "ThreadName": "",
        "EventID": "1DA8FF4834E802A5",
        "ProcessID": 2801
      },
      {
        "Cycles": 0,
        "Agent": "org.apache.hadoop.ipc.ProtobufRpcEngine",
        "ProcessName": "Read",
        "TaskID": "ABE088568870F30A",
        "ParentEventID": [
          "988ABF36A0DEF5B4"
        ],
        "Label": "Invoking org.apache.hadoop.hdfs.protocol.ClientProtocol.getBlockLocations",
        "Title": "X-Trace Task",
        "Host": "pinky19.mpi-sws.org",
        "HRT": 26966677057556231,
        "Timestamp": "1557750316997.729736",
        "TenantClass": 0,
        "Source": "ProtobufRpcEngine.java:228",
        "ThreadID": 1,
        "ThreadName": "",
        "EventID": "7FBF30EC5D4700D5",
        "ProcessID": 2801
      },
      {
        "Cycles": 0,
        "Agent": "edu.brown.cs.systems.retro.benchmarks.hdfs_client.Reader",
        "ProcessName": "Read",
        "TaskID": "ABE088568870F30A",
        "ParentEventID": [
          "408A310033424CEB"
        ],
        "Label": "Reading file",
        "Title": "X-Trace Task",
        "Host": "pinky19.mpi-sws.org",
        "HRT": 26966677057508861,
        "Timestamp": "1557750316997.682373",
        "TenantClass": 0,
        "ThreadID": 1,
        "ThreadName": "",
        "EventID": "988ABF36A0DEF5B4",
        "ProcessID": 2801
      },
      {
        "Cycles": 0,
        "Agent": "Execution-CPU",
        "ProcessName": "Read",
        "TaskID": "ABE088568870F30A",
        "ParentEventID": [
          "1DA8FF4834E802A5"
        ],
        "Label": "set",
        "Title": "X-Trace Task",
        "Host": "pinky19.mpi-sws.org",
        "HRT": 26966677057619924,
        "Operation": "set",
        "Timestamp": "1557750316997.793457",
        "TenantClass": 0,
        "Source": "Client.java:1032",
        "ThreadID": 41,
        "ThreadName": "",
        "EventID": "4AB9F504E24DF3C1",
        "ProcessID": 2801
      },
      {
        "Cycles": 0,
        "Agent": "edu.brown.cs.systems.xtrace.logging.BaggageWrappers",
        "ProcessName": "Read",
        "TaskID": "ABE088568870F30A",
        "ParentEventID": [
          "4AB9F504E24DF3C1"
        ],
        "Label": "Forking current baggage with Baggage.fork()",
        "Title": "X-Trace Task",
        "Host": "pinky19.mpi-sws.org",
        "HRT": 26966677057644094,
        "Operation": "fork",
        "Timestamp": "1557750316997.817627",
        "TenantClass": 0,
        "Source": "Client.java:1043",
        "ThreadID": 41,
        "ThreadName": "",
        "EventID": "AEAA5AF4893E00A3",
        "ProcessID": 2801
      },
      {
        "Cycles": 0,
        "Agent": "Execution-CPU",
        "ProcessName": "Read",
        "TaskID": "ABE088568870F30A",
        "ParentEventID": [
          "24CABBF3B35DF398"
        ],
        "Label": "set",
        "Title": "X-Trace Task",
        "Host": "pinky19.mpi-sws.org",
        "HRT": 26966677057746067,
        "Operation": "set",
        "Timestamp": "1557750316997.919678",
        "TenantClass": 0,
        "Source": "Client.java:1104",
        "ThreadID": 1,
        "ThreadName": "",
        "EventID": "A0D08999EE6DEA3C",
        "ProcessID": 2801
      },
      {
        "Cycles": 0,
        "Agent": "Execution-CPU",
        "ProcessName": "Read",
        "TaskID": "ABE088568870F30A",
        "ParentEventID": [
          "AEAA5AF4893E00A3"
        ],
        "Label": "unset",
        "Title": "X-Trace Task",
        "Host": "pinky19.mpi-sws.org",
        "Duration": "76345",
        "HRT": 26966677057719706,
        "Operation": "unset",
        "Timestamp": "1557750316997.893311",
        "TenantClass": 0,
        "Source": "Client.java:1062",
        "ThreadID": 41,
        "ThreadName": "",
        "EventID": "24CABBF3B35DF398",
        "ProcessID": 2801
      },
      {
        "Cycles": 0,
        "Agent": "Execution-CPU",
        "ProcessName": "Name",
        "TaskID": "ABE088568870F30A",
        "ParentEventID": [
          "AEAA5AF4893E00A3"
        ],
        "Label": "set",
        "Title": "X-Trace Task",
        "Host": "pinky19.mpi-sws.org",
        "HRT": 26966677057773171,
        "Operation": "set",
        "Timestamp": "1557750316997.960205",
        "TenantClass": 0,
        "Source": "Server.java:1840",
        "ThreadID": 48,
        "ThreadName": "",
        "EventID": "8974066D80A2788F",
        "BaggageBytes": "[[248 5] [240 0] [0 171 224 136 86 136 112 243 10] [240 1] [0 174 170 90 244 137 62 0 163] [240 3] [0 2]]",
        "ProcessID": 2171
      },
      {
        "Cycles": 0,
        "Agent": "edu.brown.cs.systems.xtrace.logging.BaggageWrappers",
        "ProcessName": "Name",
        "TaskID": "ABE088568870F30A",
        "ParentEventID": [
          "8974066D80A2788F"
        ],
        "Label": "Forking current baggage with Baggage.fork()",
        "Title": "X-Trace Task",
        "Host": "pinky19.mpi-sws.org",
        "HRT": 26966677057802924,
        "Operation": "fork",
        "Timestamp": "1557750316997.989990",
        "TenantClass": 0,
        "Source": "Server.java:550",
        "ThreadID": 48,
        "ThreadName": "",
        "EventID": "D2B08A891600286F",
        "BaggageBytes": "[[248 5] [240 0] [0 171 224 136 86 136 112 243 10] [240 1] [0 137 116 6 109 128 162 120 143] [240 3] [0 2]]",
        "ProcessID": 2171
      },
      {
        "Cycles": 0,
        "Agent": "Execution-CPU",
        "ProcessName": "Name",
        "TaskID": "ABE088568870F30A",
        "ParentEventID": [
          "D2B08A891600286F"
        ],
        "Label": "unset",
        "Title": "X-Trace Task",
        "Host": "pinky19.mpi-sws.org",
        "Duration": "25774",
        "HRT": 26966677057825390,
        "Operation": "unset",
        "Timestamp": "1557750316998.012451",
        "TenantClass": 0,
        "Source": "Server.java:1828",
        "ThreadID": 48,
        "ThreadName": "",
        "EventID": "16C8C02785D174F0",
        "BaggageBytes": "[[248 5] [240 0] [0 171 224 136 86 136 112 243 10] [240 1] [0 210 176 138 137 22 0 40 111] [240 3] [0 2]]",
        "ProcessID": 2171
      },
      {
        "Cycles": 0,
        "Agent": "org.apache.hadoop.ipc.Server",
        "ProcessName": "Name",
        "TaskID": "ABE088568870F30A",
        "ParentEventID": [
          "711F97793FB4CD24"
        ],
        "Label": "getBlockLocations in org.apache.hadoop.hdfs.protocol.ClientProtocol",
        "Title": "X-Trace Task",
        "Host": "pinky19.mpi-sws.org",
        "HRT": 26966677057868687,
        "Timestamp": "1557750316998.055908",
        "TenantClass": 0,
        "Source": "ProtobufRpcEngine.java:601",
        "ThreadID": 55,
        "ThreadName": "",
        "EventID": "1CC95CC9E85BA085",
        "BaggageBytes": "[[248 5] [240 0] [0 171 224 136 86 136 112 243 10] [240 1] [0 113 31 151 121 63 180 205 36] [240 3] [0 2]]",
        "ProcessID": 2171
      },
      {
        "Cycles": 0,
        "Agent": "org.apache.hadoop.hdfs.server.namenode.FSNamesystem.audit",
        "ProcessName": "Name",
        "TaskID": "ABE088568870F30A",
        "ParentEventID": [
          "1CC95CC9E85BA085"
        ],
        "Label": "allowed=true\tugi=plascas (auth:SIMPLE)\tip=/139.19.171.63\tcmd=open\tsrc=/ds/zAOH5NmPCwv0SPER\tdst=null\tperm=null\tproto=rpc",
        "Title": "X-Trace Task",
        "Host": "pinky19.mpi-sws.org",
        "HRT": 26966677057917450,
        "Timestamp": "1557750316998.104492",
        "TenantClass": 0,
        "Source": "FSNamesystem.java:8313",
        "ThreadID": 55,
        "ThreadName": "",
        "EventID": "49BBDDE665D218B8",
        "BaggageBytes": "[[248 5] [240 0] [0 171 224 136 86 136 112 243 10] [240 1] [0 28 201 92 201 232 91 160 133] [240 3] [0 2]]",
        "ProcessID": 2171
      },
      {
        "Cycles": 0,
        "Agent": "Execution-CPU",
        "ProcessName": "Name",
        "TaskID": "ABE088568870F30A",
        "ParentEventID": [
          "D2B08A891600286F"
        ],
        "Label": "set",
        "Title": "X-Trace Task",
        "Host": "pinky19.mpi-sws.org",
        "HRT": 26966677057834357,
        "Operation": "set",
        "Timestamp": "1557750316998.021484",
        "TenantClass": 0,
        "Source": "Server.java:2071",
        "ThreadID": 55,
        "ThreadName": "",
        "EventID": "711F97793FB4CD24",
        "BaggageBytes": "[[248 5] [240 0] [0 171 224 136 86 136 112 243 10] [240 1] [0 210 176 138 137 22 0 40 111] [240 3] [0 2]]",
        "ProcessID": 2171
      },
      {
        "Cycles": 0,
        "Agent": "edu.brown.cs.systems.xtrace.logging.BaggageWrappers",
        "ProcessName": "Name",
        "TaskID": "ABE088568870F30A",
        "ParentEventID": [
          "49BBDDE665D218B8"
        ],
        "Label": "Forking current baggage with Baggage.fork()",
        "Title": "X-Trace Task",
        "Host": "pinky19.mpi-sws.org",
        "HRT": 26966677057960850,
        "Operation": "fork",
        "Timestamp": "1557750316998.147949",
        "TenantClass": 0,
        "Source": "Server.java:2398",
        "ThreadID": 55,
        "ThreadName": "",
        "EventID": "DDDF50E491D7E9D5",
        "BaggageBytes": "[[248 5] [240 0] [0 171 224 136 86 136 112 243 10] [240 1] [0 73 187 221 230 101 210 24 184] [240 3] [0 2]]",
        "ProcessID": 2171
      },
      {
        "Cycles": 0,
        "Agent": "Execution-CPU",
        "ProcessName": "Read",
        "TaskID": "ABE088568870F30A",
        "ParentEventID": [
          "DDDF50E491D7E9D5"
        ],
        "Label": "set",
        "Title": "X-Trace Task",
        "Host": "pinky19.mpi-sws.org",
        "HRT": 26966677058116699,
        "Operation": "set",
        "Timestamp": "1557750316998.290283",
        "TenantClass": 0,
        "Source": "Client.java:302",
        "ThreadID": 40,
        "ThreadName": "",
        "EventID": "3230CD678256DD1D",
        "ProcessID": 2801
      },
      {
        "Cycles": 0,
        "Agent": "Execution-CPU",
        "ProcessName": "Read",
        "TaskID": "ABE088568870F30A",
        "ParentEventID": [
          "3230CD678256DD1D"
        ],
        "Label": "unset",
        "Title": "X-Trace Task",
        "Host": "pinky19.mpi-sws.org",
        "Duration": "14074",
        "HRT": 26966677058153065,
        "Operation": "unset",
        "Timestamp": "1557750316998.326660",
        "TenantClass": 0,
        "Source": "Client.java:1168",
        "ThreadID": 40,
        "ThreadName": "",
        "EventID": "3A9A5E466C98773E",
        "ProcessID": 2801
      },
      {
        "Cycles": 0,
        "Agent": "Execution-Sleep",
        "ProcessName": "Read",
        "TaskID": "ABE088568870F30A",
        "ParentEventID": [
          "A0D08999EE6DEA3C"
        ],
        "Label": "waited",
        "Title": "X-Trace Task",
        "Host": "pinky19.mpi-sws.org",
        "Duration": "420258",
        "HRT": 26966677058176634,
        "Operation": "waited",
        "Timestamp": "1557750316998.350098",
        "TenantClass": 0,
        "Source": "Client.java:1537",
        "ThreadID": 1,
        "ThreadName": "",
        "EventID": "0CE8D88282CDA487",
        "ProcessID": 2801
      },
      {
        "Cycles": 0,
        "Agent": "edu.brown.cs.systems.xtrace.logging.BaggageWrappers",
        "ProcessName": "Read",
        "TaskID": "ABE088568870F30A",
        "ParentEventID": [
          "0CE8D88282CDA487",
          "3A9A5E466C98773E"
        ],
        "Label": "Merged current baggage with other baggage",
        "Title": "X-Trace Task",
        "Host": "pinky19.mpi-sws.org",
        "HRT": 26966677058195006,
        "Operation": "join",
        "Timestamp": "1557750316998.368408",
        "TenantClass": 0,
        "Source": "Client.java:1545",
        "ThreadID": 1,
        "ThreadName": "",
        "EventID": "C19866C0BD87696B",
        "ProcessID": 2801
      },
      {
        "Cycles": 0,
        "Agent": "Execution-CPU",
        "ProcessName": "Name",
        "TaskID": "ABE088568870F30A",
        "ParentEventID": [
          "DDDF50E491D7E9D5"
        ],
        "Label": "unset",
        "Title": "X-Trace Task",
        "Host": "pinky19.mpi-sws.org",
        "Duration": "210648",
        "HRT": 26966677058067095,
        "Operation": "unset",
        "Timestamp": "1557750316998.254150",
        "TenantClass": 0,
        "Source": "Server.java:1058",
        "ThreadID": 55,
        "ThreadName": "",
        "EventID": "5E3D4FA4A9FC913B",
        "BaggageBytes": "[[248 5] [240 0] [0 171 224 136 86 136 112 243 10] [240 1] [0 221 223 80 228 145 215 233 213] [240 3] [0 2]]",
        "ProcessID": 2171
      },
      {
        "Cycles": 0,
        "Agent": "org.apache.hadoop.ipc.ProtobufRpcEngine",
        "ProcessName": "Read",
        "TaskID": "ABE088568870F30A",
        "ParentEventID": [
          "C19866C0BD87696B"
        ],
        "Label": "org.apache.hadoop.hdfs.protocol.ClientProtocol.getBlockLocations completed",
        "Title": "X-Trace Task",
        "Host": "pinky19.mpi-sws.org",
        "HRT": 26966677058243988,
        "Timestamp": "1557750316998.417480",
        "TenantClass": 0,
        "Source": "ProtobufRpcEngine.java:275",
        "ThreadID": 1,
        "ThreadName": "",
        "EventID": "309854742547D34F",
        "ProcessID": 2801
      },
      {
        "Cycles": 0,
        "Agent": "Execution-Sleep",
        "ProcessName": "Read",
        "TaskID": "ABE088568870F30A",
        "ParentEventID": [
          "309854742547D34F"
        ],
        "Label": "waited",
        "Title": "X-Trace Task",
        "Host": "pinky19.mpi-sws.org",
        "Duration": "168476",
        "HRT": 26966677058514463,
        "Operation": "waited",
        "Timestamp": "1557750316998.687988",
        "TenantClass": 0,
        "Source": "SocketIOWithTimeout.java:335",
        "ThreadID": 1,
        "ThreadName": "",
        "EventID": "7D3DF6CFAA7E706D",
        "ProcessID": 2801
      },
      {
        "Cycles": 0,
        "Agent": "edu.brown.cs.systems.xtrace.logging.BaggageWrappers",
        "ProcessName": "Read",
        "TaskID": "ABE088568870F30A",
        "ParentEventID": [
          "7D3DF6CFAA7E706D"
        ],
        "Label": "Forking current baggage with Baggage.fork()",
        "Title": "X-Trace Task",
        "Host": "pinky19.mpi-sws.org",
        "HRT": 26966677058560169,
        "Operation": "fork",
        "Timestamp": "1557750316998.733643",
        "TenantClass": 0,
        "Source": "DataTransferProtoUtil.java:94",
        "ThreadID": 1,
        "ThreadName": "",
        "EventID": "563BC763C6508F4B",
        "ProcessID": 2801
      },
      {
        "Cycles": 0,
        "Agent": "edu.brown.cs.systems.xtrace.logging.XTraceInit",
        "ProcessName": "Data",
        "TaskID": "ABE088568870F30A",
        "ParentEventID": [
          "669C9223AEC61AFF"
        ],
        "Label": "Thread.setName: DataXceiver for client DFSClient_NONMAPREDUCE_310321604_1 at /139.19.171.63:45514 [Sending block BP-1633380353-139.19.171.63-1554193446451:blk_1073769118_28294]",
        "Title": "X-Trace Task",
        "Host": "pinky21.mpi-sws.org",
        "HRT": 10812986765250705,
        "Timestamp": "1557750316999.246582",
        "TenantClass": 0,
        "Source": "DataXceiver.java:168",
        "ThreadID": 15463,
        "ThreadName": "",
        "EventID": "A2B80DC9C0FD50F2",
        "BaggageBytes": "[[248 5] [240 0] [0 171 224 136 86 136 112 243 10] [240 1] [0 102 156 146 35 174 198 26 255] [240 3] [0 2]]",
        "ProcessID": 20775
      },
      {
        "Cycles": 0,
        "Agent": "Execution-CPU",
        "ProcessName": "Data",
        "TaskID": "ABE088568870F30A",
        "ParentEventID": [
          "563BC763C6508F4B"
        ],
        "Label": "set",
        "Title": "X-Trace Task",
        "Host": "pinky21.mpi-sws.org",
        "HRT": 10812986765157139,
        "Operation": "set",
        "Timestamp": "1557750316999.153076",
        "TenantClass": 0,
        "Source": "Receiver.java:117",
        "ThreadID": 15463,
        "ThreadName": "",
        "EventID": "669C9223AEC61AFF",
        "BaggageBytes": "[[248 5] [240 0] [0 171 224 136 86 136 112 243 10] [240 1] [0 86 59 199 99 198 80 143 75] [240 3] [0 2]]",
        "ProcessID": 20775
      },
      {
        "Cycles": 0,
        "Agent": "Execution-Sleep",
        "ProcessName": "Read",
        "TaskID": "ABE088568870F30A",
        "ParentEventID": [
          "563BC763C6508F4B"
        ],
        "Label": "waited",
        "Title": "X-Trace Task",
        "Host": "pinky19.mpi-sws.org",
        "Duration": "907341",
        "HRT": 26966677059559866,
        "Operation": "waited",
        "Timestamp": "1557750316999.733398",
        "TenantClass": 0,
        "Source": "SocketIOWithTimeout.java:335",
        "ThreadID": 1,
        "ThreadName": "",
        "EventID": "05A123B765A1D907",
        "ProcessID": 2801
      },
      {
        "Cycles": 0,
        "Agent": "edu.brown.cs.systems.xtrace.logging.BaggageWrappers",
        "ProcessName": "Data",
        "TaskID": "ABE088568870F30A",
        "ParentEventID": [
          "72BD74AB9BE15759"
        ],
        "Label": "Forking current baggage with Baggage.fork()",
        "Title": "X-Trace Task",
        "Host": "pinky21.mpi-sws.org",
        "HRT": 10812986765640111,
        "Operation": "fork",
        "Timestamp": "1557750316999.635986",
        "TenantClass": 0,
        "Source": "PacketHeader.java:95",
        "ThreadID": 15463,
        "ThreadName": "",
        "EventID": "B04323DD6E3B1094",
        "BaggageBytes": "[[248 5] [240 0] [0 171 224 136 86 136 112 243 10] [240 1] [0 114 189 116 171 155 225 87 89] [240 3] [0 2]]",
        "ProcessID": 20775
      },
      {
        "Cycles": 0,
        "Agent": "edu.brown.cs.systems.xtrace.logging.BaggageWrappers",
        "ProcessName": "Data",
        "TaskID": "ABE088568870F30A",
        "ParentEventID": [
          "A2B80DC9C0FD50F2"
        ],
        "Label": "Forking current baggage with Baggage.fork()",
        "Title": "X-Trace Task",
        "Host": "pinky21.mpi-sws.org",
        "HRT": 10812986765485852,
        "Operation": "fork",
        "Timestamp": "1557750316999.481689",
        "TenantClass": 0,
        "Source": "DataXceiver.java:1257",
        "ThreadID": 15463,
        "ThreadName": "",
        "EventID": "72BD74AB9BE15759",
        "BaggageBytes": "[[248 5] [240 0] [0 171 224 136 86 136 112 243 10] [240 1] [0 162 184 13 201 192 253 80 242] [240 3] [0 2]]",
        "ProcessID": 20775
      },
      {
        "Cycles": 0,
        "Agent": "edu.brown.cs.systems.xtrace.logging.BaggageWrappers",
        "ProcessName": "Read",
        "TaskID": "ABE088568870F30A",
        "ParentEventID": [
          "72BD74AB9BE15759",
          "05A123B765A1D907"
        ],
        "Label": "Merged current baggage with other baggage",
        "Title": "X-Trace Task",
        "Host": "pinky19.mpi-sws.org",
        "HRT": 26966677059638357,
        "Operation": "join",
        "Timestamp": "1557750316999.811768",
        "TenantClass": 0,
        "Source": "RemoteBlockReader2.java:429",
        "ThreadID": 1,
        "ThreadName": "",
        "EventID": "623817959FEE7EFC",
        "ProcessID": 2801
      },
      {
        "Cycles": 0,
        "Agent": "edu.brown.cs.systems.xtrace.logging.BaggageWrappers",
        "ProcessName": "Data",
        "TaskID": "ABE088568870F30A",
        "ParentEventID": [
          "28E742DD4B1E7C31"
        ],
        "Label": "Forking current baggage with Baggage.fork()",
        "Title": "X-Trace Task",
        "Host": "pinky21.mpi-sws.org",
        "HRT": 10812986765956192,
        "Operation": "fork",
        "Timestamp": "1557750316999.952148",
        "TenantClass": 0,
        "Source": "PacketHeader.java:95",
        "ThreadID": 15463,
        "ThreadName": "",
        "EventID": "5F6DB6FC4177E6E1",
        "BaggageBytes": "[[248 5] [240 0] [0 171 224 136 86 136 112 243 10] [240 1] [0 40 231 66 221 75 30 124 49] [240 3] [0 2]]",
        "ProcessID": 20775
      },
      {
        "Cycles": 0,
        "Agent": "Execution-Sleep",
        "ProcessName": "Data",
        "TaskID": "ABE088568870F30A",
        "ParentEventID": [
          "B04323DD6E3B1094"
        ],
        "Label": "waited",
        "Title": "X-Trace Task",
        "Host": "pinky21.mpi-sws.org",
        "Duration": "12920",
        "HRT": 10812986765785665,
        "Operation": "waited",
        "Timestamp": "1557750316999.781494",
        "TenantClass": 0,
        "Source": "SocketIOWithTimeout.java:335",
        "ThreadID": 15463,
        "ThreadName": "",
        "EventID": "28E742DD4B1E7C31",
        "BaggageBytes": "[[248 5] [240 0] [0 171 224 136 86 136 112 243 10] [240 1] [0 176 67 35 221 110 59 16 148] [240 3] [0 2]]",
        "ProcessID": 20775
      },
      {
        "Cycles": 0,
        "Agent": "Execution-Sleep",
        "ProcessName": "Read",
        "TaskID": "ABE088568870F30A",
        "ParentEventID": [
          "623817959FEE7EFC"
        ],
        "Label": "waited",
        "Title": "X-Trace Task",
        "Host": "pinky19.mpi-sws.org",
        "Duration": "355480",
        "HRT": 26966677060074199,
        "Operation": "waited",
        "Timestamp": "1557750317000.247803",
        "TenantClass": 0,
        "Source": "SocketIOWithTimeout.java:335",
        "ThreadID": 1,
        "ThreadName": "",
        "EventID": "534073FDDDBC7B8D",
        "ProcessID": 2801
      },
      {
        "Cycles": 0,
        "Agent": "Execution-Sleep",
        "ProcessName": "Read",
        "TaskID": "ABE088568870F30A",
        "ParentEventID": [
          "4ECD4AC8DCA31F23"
        ],
        "Label": "waited",
        "Title": "X-Trace Task",
        "Host": "pinky19.mpi-sws.org",
        "Duration": "126041",
        "HRT": 26966677060578985,
        "Operation": "waited",
        "Timestamp": "1557750317000.752441",
        "TenantClass": 0,
        "Source": "SocketIOWithTimeout.java:335",
        "ThreadID": 1,
        "ThreadName": "",
        "EventID": "790D4777A9D19D96",
        "ProcessID": 2801
      },
      {
        "Cycles": 0,
        "Agent": "edu.brown.cs.systems.xtrace.logging.BaggageWrappers",
        "ProcessName": "Read",
        "TaskID": "ABE088568870F30A",
        "ParentEventID": [
          "B04323DD6E3B1094",
          "790D4777A9D19D96"
        ],
        "Label": "Merged current baggage with other baggage",
        "Title": "X-Trace Task",
        "Host": "pinky19.mpi-sws.org",
        "HRT": 26966677060656356,
        "Operation": "join",
        "Timestamp": "1557750317000.829834",
        "TenantClass": 0,
        "Source": "PacketHeader.java:168",
        "ThreadID": 1,
        "ThreadName": "",
        "EventID": "B3EB57E01C915D99",
        "ProcessID": 2801
      },
      {
        "Cycles": 0,
        "Agent": "Execution-Sleep",
        "ProcessName": "Read",
        "TaskID": "ABE088568870F30A",
        "ParentEventID": [
          "534073FDDDBC7B8D"
        ],
        "Label": "waited",
        "Title": "X-Trace Task",
        "Host": "pinky19.mpi-sws.org",
        "Duration": "244913",
        "HRT": 26966677060380379,
        "Operation": "waited",
        "Timestamp": "1557750317000.553955",
        "TenantClass": 0,
        "Source": "SocketIOWithTimeout.java:335",
        "ThreadID": 1,
        "ThreadName": "",
        "EventID": "4ECD4AC8DCA31F23",
        "ProcessID": 2801
      },
      {
        "Cycles": 0,
        "Agent": "edu.brown.cs.systems.xtrace.logging.BaggageWrappers",
        "ProcessName": "Read",
        "TaskID": "ABE088568870F30A",
        "ParentEventID": [
          "B3EB57E01C915D99",
          "5F6DB6FC4177E6E1"
        ],
        "Label": "Merged current baggage with other baggage",
        "Title": "X-Trace Task",
        "Host": "pinky19.mpi-sws.org",
        "HRT": 26966677060778085,
        "Operation": "join",
        "Timestamp": "1557750317000.951660",
        "TenantClass": 0,
        "Source": "PacketHeader.java:168",
        "ThreadID": 1,
        "ThreadName": "",
        "EventID": "98663B80477EBAEF",
        "ProcessID": 2801
      },
      {
        "Cycles": 0,
        "Agent": "edu.brown.cs.systems.xtrace.logging.BaggageWrappers",
        "ProcessName": "Read",
        "TaskID": "ABE088568870F30A",
        "ParentEventID": [
          "98663B80477EBAEF"
        ],
        "Label": "Forking current baggage with Baggage.fork()",
        "Title": "X-Trace Task",
        "Host": "pinky19.mpi-sws.org",
        "HRT": 26966677060789420,
        "Operation": "fork",
        "Timestamp": "1557750317000.962891",
        "TenantClass": 0,
        "Source": "RemoteBlockReader2.java:361",
        "ThreadID": 1,
        "ThreadName": "",
        "EventID": "0A4FEEC3C8F28D60",
        "ProcessID": 2801
      },
      {
        "Cycles": 0,
        "Agent": "edu.brown.cs.systems.xtrace.logging.BaggageWrappers",
        "ProcessName": "Read",
        "TaskID": "ABE088568870F30A",
        "ParentEventID": [
          "0A4FEEC3C8F28D60"
        ],
        "Label": "Forking current baggage with Baggage.fork()",
        "Title": "X-Trace Task",
        "Host": "pinky19.mpi-sws.org",
        "HRT": 26966677060907526,
        "Operation": "fork",
        "Timestamp": "1557750317001.081055",
        "TenantClass": 0,
        "Source": "DataTransferProtoUtil.java:94",
        "ThreadID": 1,
        "ThreadName": "",
        "EventID": "D79D0F867EFC69D2",
        "ProcessID": 2801
      },
      {
        "Cycles": 0,
        "Agent": "edu.brown.cs.systems.xtrace.logging.BaggageWrappers",
        "ProcessName": "Data",
        "TaskID": "ABE088568870F30A",
        "ParentEventID": [
          "E436D6408510240E",
          "0A4FEEC3C8F28D60"
        ],
        "Label": "Merged current baggage with other baggage",
        "Title": "X-Trace Task",
        "Host": "pinky21.mpi-sws.org",
        "HRT": 10812986767282918,
        "Operation": "join",
        "Timestamp": "1557750317001.278809",
        "TenantClass": 0,
        "Source": "DataXceiver.java:574",
        "ThreadID": 15463,
        "ThreadName": "",
        "EventID": "8E77D9DD3824047B",
        "BaggageBytes": "[[248 5] [240 0] [0 171 224 136 86 136 112 243 10] [240 1] [0 228 54 214 64 133 16 36 14] [0 10 79 238 195 200 242 141 96] [240 3] [0 2]]",
        "ProcessID": 20775
      },
      {
        "Cycles": 0,
        "Agent": "Execution-Sleep",
        "ProcessName": "Data",
        "TaskID": "ABE088568870F30A",
        "ParentEventID": [
          "5F6DB6FC4177E6E1"
        ],
        "Label": "waited",
        "Title": "X-Trace Task",
        "Host": "pinky21.mpi-sws.org",
        "Duration": "921736",
        "HRT": 10812986767045477,
        "Operation": "waited",
        "Timestamp": "1557750317001.041260",
        "TenantClass": 0,
        "Source": "SocketIOWithTimeout.java:335",
        "ThreadID": 15463,
        "ThreadName": "",
        "EventID": "E436D6408510240E",
        "BaggageBytes": "[[248 5] [240 0] [0 171 224 136 86 136 112 243 10] [240 1] [0 95 109 182 252 65 119 230 225] [240 3] [0 2]]",
        "ProcessID": 20775
      },
      {
        "Cycles": 0,
        "Agent": "Execution-CPU",
        "ProcessName": "Data",
        "TaskID": "ABE088568870F30A",
        "ParentEventID": [
          "8E77D9DD3824047B"
        ],
        "Label": "unset",
        "Title": "X-Trace Task",
        "Host": "pinky21.mpi-sws.org",
        "Duration": "2151570",
        "HRT": 10812986767376384,
        "Operation": "unset",
        "Timestamp": "1557750317001.372314",
        "TenantClass": 0,
        "Source": "DataXceiver.java:261",
        "ThreadID": 15463,
        "ThreadName": "",
        "EventID": "6F46637B09222F91",
        "BaggageBytes": "[[248 5] [240 0] [0 171 224 136 86 136 112 243 10] [240 1] [0 142 119 217 221 56 36 4 123] [240 3] [0 2]]",
        "ProcessID": 20775
      },
      {
        "Cycles": 0,
        "Agent": "edu.brown.cs.systems.xtrace.logging.XTraceInit",
        "ProcessName": "Data",
        "TaskID": "ABE088568870F30A",
        "ParentEventID": [
          "0ED30DDFCA62614C"
        ],
        "Label": "Thread.setName: DataXceiver for client DFSClient_NONMAPREDUCE_310321604_1 at /139.19.171.63:45514 [Sending block BP-1633380353-139.19.171.63-1554193446451:blk_1073769118_28294]",
        "Title": "X-Trace Task",
        "Host": "pinky21.mpi-sws.org",
        "HRT": 10812986767562468,
        "Timestamp": "1557750317001.558350",
        "TenantClass": 0,
        "Source": "DataXceiver.java:168",
        "ThreadID": 15463,
        "ThreadName": "",
        "EventID": "944148BE9C74E4DD",
        "BaggageBytes": "[[248 5] [240 0] [0 171 224 136 86 136 112 243 10] [240 1] [0 14 211 13 223 202 98 97 76] [240 3] [0 2]]",
        "ProcessID": 20775
      },
      {
        "Cycles": 0,
        "Agent": "Execution-CPU",
        "ProcessName": "Data",
        "TaskID": "ABE088568870F30A",
        "ParentEventID": [
          "D79D0F867EFC69D2"
        ],
        "Label": "set",
        "Title": "X-Trace Task",
        "Host": "pinky21.mpi-sws.org",
        "HRT": 10812986767459931,
        "Operation": "set",
        "Timestamp": "1557750317001.455811",
        "TenantClass": 0,
        "Source": "Receiver.java:117",
        "ThreadID": 15463,
        "ThreadName": "",
        "EventID": "0ED30DDFCA62614C",
        "BaggageBytes": "[[248 5] [240 0] [0 171 224 136 86 136 112 243 10] [240 1] [0 215 157 15 134 126 252 105 210] [240 3] [0 2]]",
        "ProcessID": 20775
      },
      {
        "Cycles": 0,
        "Agent": "edu.brown.cs.systems.xtrace.logging.BaggageWrappers",
        "ProcessName": "Data",
        "TaskID": "ABE088568870F30A",
        "ParentEventID": [
          "944148BE9C74E4DD"
        ],
        "Label": "Forking current baggage with Baggage.fork()",
        "Title": "X-Trace Task",
        "Host": "pinky21.mpi-sws.org",
        "HRT": 10812986767805936,
        "Operation": "fork",
        "Timestamp": "1557750317001.801758",
        "TenantClass": 0,
        "Source": "DataXceiver.java:1257",
        "ThreadID": 15463,
        "ThreadName": "",
        "EventID": "7ED278A8A7A28485",
        "BaggageBytes": "[[248 5] [240 0] [0 171 224 136 86 136 112 243 10] [240 1] [0 148 65 72 190 156 116 228 221] [240 3] [0 2]]",
        "ProcessID": 20775
      },
      {
        "Cycles": 0,
        "Agent": "edu.brown.cs.systems.xtrace.logging.BaggageWrappers",
        "ProcessName": "Read",
        "TaskID": "ABE088568870F30A",
        "ParentEventID": [
          "84DE5A8944DE07F4",
          "7ED278A8A7A28485"
        ],
        "Label": "Merged current baggage with other baggage",
        "Title": "X-Trace Task",
        "Host": "pinky19.mpi-sws.org",
        "HRT": 26966677061944004,
        "Operation": "join",
        "Timestamp": "1557750317002.117432",
        "TenantClass": 0,
        "Source": "RemoteBlockReader2.java:429",
        "ThreadID": 1,
        "ThreadName": "",
        "EventID": "1357CDC8C0CCCE56",
        "ProcessID": 2801
      },
      {
        "Cycles": 0,
        "Agent": "Execution-Sleep",
        "ProcessName": "Read",
        "TaskID": "ABE088568870F30A",
        "ParentEventID": [
          "D79D0F867EFC69D2"
        ],
        "Label": "waited",
        "Title": "X-Trace Task",
        "Host": "pinky19.mpi-sws.org",
        "Duration": "894866",
        "HRT": 26966677061877590,
        "Operation": "waited",
        "Timestamp": "1557750317002.051025",
        "TenantClass": 0,
        "Source": "SocketIOWithTimeout.java:335",
        "ThreadID": 1,
        "ThreadName": "",
        "EventID": "84DE5A8944DE07F4",
        "ProcessID": 2801
      },
      {
        "Cycles": 0,
        "Agent": "edu.brown.cs.systems.xtrace.logging.BaggageWrappers",
        "ProcessName": "Data",
        "TaskID": "ABE088568870F30A",
        "ParentEventID": [
          "7ED278A8A7A28485"
        ],
        "Label": "Forking current baggage with Baggage.fork()",
        "Title": "X-Trace Task",
        "Host": "pinky21.mpi-sws.org",
        "HRT": 10812986767992856,
        "Operation": "fork",
        "Timestamp": "1557750317001.988770",
        "TenantClass": 0,
        "Source": "PacketHeader.java:95",
        "ThreadID": 15463,
        "ThreadName": "",
        "EventID": "6FC1CF8338402132",
        "BaggageBytes": "[[248 5] [240 0] [0 171 224 136 86 136 112 243 10] [240 1] [0 126 210 120 168 167 162 132 133] [240 3] [0 2]]",
        "ProcessID": 20775
      },
      {
        "Cycles": 0,
        "Agent": "Execution-Sleep",
        "ProcessName": "Read",
        "TaskID": "ABE088568870F30A",
        "ParentEventID": [
          "1357CDC8C0CCCE56"
        ],
        "Label": "waited",
        "Title": "X-Trace Task",
        "Host": "pinky19.mpi-sws.org",
        "Duration": "23718",
        "HRT": 26966677062043507,
        "Operation": "waited",
        "Timestamp": "1557750317002.217041",
        "TenantClass": 0,
        "Source": "SocketIOWithTimeout.java:335",
        "ThreadID": 1,
        "ThreadName": "",
        "EventID": "B690E1CF05D90FE7",
        "ProcessID": 2801
      },
      {
        "Cycles": 0,
        "Agent": "Execution-Sleep",
        "ProcessName": "Data",
        "TaskID": "ABE088568870F30A",
        "ParentEventID": [
          "6FC1CF8338402132"
        ],
        "Label": "waited",
        "Title": "X-Trace Task",
        "Host": "pinky21.mpi-sws.org",
        "Duration": "11513",
        "HRT": 10812986768151107,
        "Operation": "waited",
        "Timestamp": "1557750317002.146973",
        "TenantClass": 0,
        "Source": "SocketIOWithTimeout.java:335",
        "ThreadID": 15463,
        "ThreadName": "",
        "EventID": "23B05EED8AC048E3",
        "BaggageBytes": "[[248 5] [240 0] [0 171 224 136 86 136 112 243 10] [240 1] [0 111 193 207 131 56 64 33 50] [240 3] [0 2]]",
        "ProcessID": 20775
      },
      {
        "Cycles": 0,
        "Agent": "Execution-Sleep",
        "ProcessName": "Read",
        "TaskID": "ABE088568870F30A",
        "ParentEventID": [
          "B690E1CF05D90FE7"
        ],
        "Label": "waited",
        "Title": "X-Trace Task",
        "Host": "pinky19.mpi-sws.org",
        "Duration": "319133",
        "HRT": 26966677062454687,
        "Operation": "waited",
        "Timestamp": "1557750317002.628174",
        "TenantClass": 0,
        "Source": "SocketIOWithTimeout.java:335",
        "ThreadID": 1,
        "ThreadName": "",
        "EventID": "D1D53C64DF195129",
        "ProcessID": 2801
      },
      {
        "Cycles": 0,
        "Agent": "Execution-Sleep",
        "ProcessName": "Read",
        "TaskID": "ABE088568870F30A",
        "ParentEventID": [
          "D1D53C64DF195129"
        ],
        "Label": "waited",
        "Title": "X-Trace Task",
        "Host": "pinky19.mpi-sws.org",
        "Duration": "127771",
        "HRT": 26966677062646289,
        "Operation": "waited",
        "Timestamp": "1557750317002.819824",
        "TenantClass": 0,
        "Source": "SocketIOWithTimeout.java:335",
        "ThreadID": 1,
        "ThreadName": "",
        "EventID": "3775496A57E9C8AC",
        "ProcessID": 2801
      },
      {
        "Cycles": 0,
        "Agent": "edu.brown.cs.systems.xtrace.logging.BaggageWrappers",
        "ProcessName": "Data",
        "TaskID": "ABE088568870F30A",
        "ParentEventID": [
          "23B05EED8AC048E3"
        ],
        "Label": "Forking current baggage with Baggage.fork()",
        "Title": "X-Trace Task",
        "Host": "pinky21.mpi-sws.org",
        "HRT": 10812986768365161,
        "Operation": "fork",
        "Timestamp": "1557750317002.361084",
        "TenantClass": 0,
        "Source": "PacketHeader.java:95",
        "ThreadID": 15463,
        "ThreadName": "",
        "EventID": "335CD575B20580DB",
        "BaggageBytes": "[[248 5] [240 0] [0 171 224 136 86 136 112 243 10] [240 1] [0 35 176 94 237 138 192 72 227] [240 3] [0 2]]",
        "ProcessID": 20775
      },
      {
        "Cycles": 0,
        "Agent": "Execution-Sleep",
        "ProcessName": "Data",
        "TaskID": "ABE088568870F30A",
        "ParentEventID": [
          "335CD575B20580DB"
        ],
        "Label": "waited",
        "Title": "X-Trace Task",
        "Host": "pinky21.mpi-sws.org",
        "Duration": "156340",
        "HRT": 10812986768634938,
        "Operation": "waited",
        "Timestamp": "1557750317002.630859",
        "TenantClass": 0,
        "Source": "SocketIOWithTimeout.java:335",
        "ThreadID": 15463,
        "ThreadName": "",
        "EventID": "14EFF89171A52133",
        "BaggageBytes": "[[248 5] [240 0] [0 171 224 136 86 136 112 243 10] [240 1] [0 51 92 213 117 178 5 128 219] [240 3] [0 2]]",
        "ProcessID": 20775
      },
      {
        "Cycles": 0,
        "Agent": "Execution-Sleep",
        "ProcessName": "Read",
        "TaskID": "ABE088568870F30A",
        "ParentEventID": [
          "3775496A57E9C8AC"
        ],
        "Label": "waited",
        "Title": "X-Trace Task",
        "Host": "pinky19.mpi-sws.org",
        "Duration": "129344",
        "HRT": 26966677062822946,
        "Operation": "waited",
        "Timestamp": "1557750317002.996338",
        "TenantClass": 0,
        "Source": "SocketIOWithTimeout.java:335",
        "ThreadID": 1,
        "ThreadName": "",
        "EventID": "1918DA9036A88D7D",
        "ProcessID": 2801
      },
      {
        "Cycles": 0,
        "Agent": "edu.brown.cs.systems.xtrace.logging.BaggageWrappers",
        "ProcessName": "Read",
        "TaskID": "ABE088568870F30A",
        "ParentEventID": [
          "1918DA9036A88D7D",
          "6FC1CF8338402132"
        ],
        "Label": "Merged current baggage with other baggage",
        "Title": "X-Trace Task",
        "Host": "pinky19.mpi-sws.org",
        "HRT": 26966677062861690,
        "Operation": "join",
        "Timestamp": "1557750317003.035156",
        "TenantClass": 0,
        "Source": "PacketHeader.java:168",
        "ThreadID": 1,
        "ThreadName": "",
        "EventID": "FE1C5D44914157B2",
        "ProcessID": 2801
      },
      {
        "Cycles": 0,
        "Agent": "edu.brown.cs.systems.xtrace.logging.BaggageWrappers",
        "ProcessName": "Data",
        "TaskID": "ABE088568870F30A",
        "ParentEventID": [
          "14EFF89171A52133"
        ],
        "Label": "Forking current baggage with Baggage.fork()",
        "Title": "X-Trace Task",
        "Host": "pinky21.mpi-sws.org",
        "HRT": 10812986768857272,
        "Operation": "fork",
        "Timestamp": "1557750317002.853271",
        "TenantClass": 0,
        "Source": "PacketHeader.java:95",
        "ThreadID": 15463,
        "ThreadName": "",
        "EventID": "5A8A90B15AE2A14A",
        "BaggageBytes": "[[248 5] [240 0] [0 171 224 136 86 136 112 243 10] [240 1] [0 20 239 248 145 113 165 33 51] [240 3] [0 2]]",
        "ProcessID": 20775
      },
      {
        "Cycles": 0,
        "Agent": "Execution-Sleep",
        "ProcessName": "Data",
        "TaskID": "ABE088568870F30A",
        "ParentEventID": [
          "5A8A90B15AE2A14A"
        ],
        "Label": "waited",
        "Title": "X-Trace Task",
        "Host": "pinky21.mpi-sws.org",
        "Duration": "10090",
        "HRT": 10812986769044693,
        "Operation": "waited",
        "Timestamp": "1557750317003.040527",
        "TenantClass": 0,
        "Source": "SocketIOWithTimeout.java:335",
        "ThreadID": 15463,
        "ThreadName": "",
        "EventID": "2AFFF1F14A1AA118",
        "BaggageBytes": "[[248 5] [240 0] [0 171 224 136 86 136 112 243 10] [240 1] [0 90 138 144 177 90 226 161 74] [240 3] [0 2]]",
        "ProcessID": 20775
      },
      {
        "Cycles": 0,
        "Agent": "Execution-CPU",
        "ProcessName": "Data",
        "TaskID": "ABE088568870F30A",
        "ParentEventID": [
          "2AFFF1F14A1AA118"
        ],
        "Label": "unset",
        "Title": "X-Trace Task",
        "Host": "pinky21.mpi-sws.org",
        "Duration": "1890576",
        "HRT": 10812986769427951,
        "Operation": "unset",
        "Timestamp": "1557750317003.423828",
        "TenantClass": 0,
        "Source": "DataXceiver.java:261",
        "ThreadID": 15463,
        "ThreadName": "",
        "EventID": "73DAE32C34C2E181",
        "BaggageBytes": "[[248 5] [240 0] [0 171 224 136 86 136 112 243 10] [240 1] [0 42 255 241 241 74 26 161 24] [240 3] [0 2]]",
        "ProcessID": 20775
      },
      {
        "Cycles": 0,
        "Agent": "edu.brown.cs.systems.retro.benchmarks.hdfs_client.Reader",
        "ProcessName": "Read",
        "TaskID": "ABE088568870F30A",
        "ParentEventID": [
          "0"
        ],
        "Label": "Reading file",
        "Title": "X-Trace Task",
        "Host": "pinky19.mpi-sws.org",
        "HRT": 26966677057488938,
        "Timestamp": "1557750316997.662354",
        "TenantClass": 0,
        "ThreadID": 1,
        "ThreadName": "",
        "EventID": "408A310033424CEB",
        "ProcessID": 2801,
        "Tag": [
          "reader_100kb",
          "Read Size: 102400"
        ]
      }
    ]
  }
]