[
  {
    "id": "B1AA812E0E64EFF0",
    "reports": [
      {
        "Cycles": 0,
        "Agent": "edu.brown.cs.systems.retro.benchmarks.hdfs_client.Reader",
        "ProcessName": "Read",
        "TaskID": "B1AA812E0E64EFF0",
        "ParentEventID": [
          "E1CFC79FC2CB3EB8"
        ],
        "Label": "Reading file",
        "Title": "X-Trace Task",
        "Host": "pinky19.mpi-sws.org",
        "HRT": 26962574861877464,
        "Timestamp": "1557746214802.228271",
        "TenantClass": 0,
        "ThreadID": 1,
        "ThreadName": "",
        "EventID": "D6F3FEC1352CDCCB",
        "ProcessID": 36430
      },
      {
        "Cycles": 0,
        "Agent": "Execution-CPU",
        "ProcessName": "Read",
        "TaskID": "B1AA812E0E64EFF0",
        "ParentEventID": [
          "F653DC79FC64298A"
        ],
        "Label": "set",
        "Title": "X-Trace Task",
        "Host": "pinky19.mpi-sws.org",
        "HRT": 26962574861975616,
        "Operation": "set",
        "Timestamp": "1557746214802.326416",
        "TenantClass": 0,
        "Source": "Client.java:1032",
        "ThreadID": 41,
        "ThreadName": "",
        "EventID": "E8B7F99FF2389F32",
        "ProcessID": 36430
      },
      {
        "Cycles": 0,
        "Agent": "org.apache.hadoop.ipc.ProtobufRpcEngine",
        "ProcessName": "Read",
        "TaskID": "B1AA812E0E64EFF0",
        "ParentEventID": [
          "D6F3FEC1352CDCCB"
        ],
        "Label": "Invoking org.apache.hadoop.hdfs.protocol.ClientProtocol.getBlockLocations",
        "Title": "X-Trace Task",
        "Host": "pinky19.mpi-sws.org",
        "HRT": 26962574861904875,
        "Timestamp": "1557746214802.255615",
        "TenantClass": 0,
        "Source": "ProtobufRpcEngine.java:228",
        "ThreadID": 1,
        "ThreadName": "",
        "EventID": "CB30F1FAA32F86BA",
        "ProcessID": 36430
      },
      {
        "Cycles": 0,
        "Agent": "Execution-CPU",
        "ProcessName": "Read",
        "TaskID": "B1AA812E0E64EFF0",
        "ParentEventID": [
          "CB30F1FAA32F86BA"
        ],
        "Label": "unset",
        "Title": "X-Trace Task",
        "Host": "pinky19.mpi-sws.org",
        "Duration": "21898881",
        "HRT": 26962574861926492,
        "Operation": "unset",
        "Timestamp": "1557746214802.277100",
        "TenantClass": 0,
        "Source": "Client.java:1027",
        "ThreadID": 1,
        "ThreadName": "",
        "EventID": "F653DC79FC64298A",
        "ProcessID": 36430
      },
      {
        "Cycles": 0,
        "Agent": "edu.brown.cs.systems.xtrace.logging.BaggageWrappers",
        "ProcessName": "Read",
        "TaskID": "B1AA812E0E64EFF0",
        "ParentEventID": [
          "E8B7F99FF2389F32"
        ],
        "Label": "Forking current baggage with Baggage.fork()",
        "Title": "X-Trace Task",
        "Host": "pinky19.mpi-sws.org",
        "HRT": 26962574861994757,
        "Operation": "fork",
        "Timestamp": "1557746214802.345459",
        "TenantClass": 0,
        "Source": "Client.java:1043",
        "ThreadID": 41,
        "ThreadName": "",
        "EventID": "591C2440F716E662",
        "ProcessID": 36430
      },
      {
        "Cycles": 0,
        "Agent": "Execution-CPU",
        "ProcessName": "Read",
        "TaskID": "B1AA812E0E64EFF0",
        "ParentEventID": [
          "591C2440F716E662"
        ],
        "Label": "unset",
        "Title": "X-Trace Task",
        "Host": "pinky19.mpi-sws.org",
        "Duration": "73202",
        "HRT": 26962574862067364,
        "Operation": "unset",
        "Timestamp": "1557746214802.417969",
        "TenantClass": 0,
        "Source": "Client.java:1062",
        "ThreadID": 41,
        "ThreadName": "",
        "EventID": "9AE589F1AD5CC53A",
        "ProcessID": 36430
      },
      {
        "Cycles": 0,
        "Agent": "Execution-CPU",
        "ProcessName": "Read",
        "TaskID": "B1AA812E0E64EFF0",
        "ParentEventID": [
          "9AE589F1AD5CC53A"
        ],
        "Label": "set",
        "Title": "X-Trace Task",
        "Host": "pinky19.mpi-sws.org",
        "HRT": 26962574862089225,
        "Operation": "set",
        "Timestamp": "1557746214802.439941",
        "TenantClass": 0,
        "Source": "Client.java:1104",
        "ThreadID": 1,
        "ThreadName": "",
        "EventID": "B7C86CFD38A4B2DD",
        "ProcessID": 36430
      },
      {
        "Cycles": 0,
        "Agent": "edu.brown.cs.systems.xtrace.logging.BaggageWrappers",
        "ProcessName": "Name",
        "TaskID": "B1AA812E0E64EFF0",
        "ParentEventID": [
          "AF281994F6E98407"
        ],
        "Label": "Forking current baggage with Baggage.fork()",
        "Title": "X-Trace Task",
        "Host": "pinky19.mpi-sws.org",
        "HRT": 26962574862177317,
        "Operation": "fork",
        "Timestamp": "1557746214802.527588",
        "TenantClass": 0,
        "Source": "Server.java:550",
        "ThreadID": 48,
        "ThreadName": "",
        "EventID": "90093BA82AF7C780",
        "BaggageBytes": "[[248 5] [240 0] [0 177 170 129 46 14 100 239 240] [240 1] [0 175 40 25 148 246 233 132 7] [240 3] [0 2]]",
        "ProcessID": 2171
      },
      {
        "Cycles": 0,
        "Agent": "Execution-CPU",
        "ProcessName": "Name",
        "TaskID": "B1AA812E0E64EFF0",
        "ParentEventID": [
          "591C2440F716E662"
        ],
        "Label": "set",
        "Title": "X-Trace Task",
        "Host": "pinky19.mpi-sws.org",
        "HRT": 26962574862146790,
        "Operation": "set",
        "Timestamp": "1557746214802.497070",
        "TenantClass": 0,
        "Source": "Server.java:1840",
        "ThreadID": 48,
        "ThreadName": "",
        "EventID": "AF281994F6E98407",
        "BaggageBytes": "[[248 5] [240 0] [0 177 170 129 46 14 100 239 240] [240 1] [0 89 28 36 64 247 22 230 98] [240 3] [0 2]]",
        "ProcessID": 2171
      },
      {
        "Cycles": 0,
        "Agent": "Execution-CPU",
        "ProcessName": "Name",
        "TaskID": "B1AA812E0E64EFF0",
        "ParentEventID": [
          "90093BA82AF7C780"
        ],
        "Label": "unset",
        "Title": "X-Trace Task",
        "Host": "pinky19.mpi-sws.org",
        "Duration": "26062",
        "HRT": 26962574862199318,
        "Operation": "unset",
        "Timestamp": "1557746214802.549805",
        "TenantClass": 0,
        "Source": "Server.java:1828",
        "ThreadID": 48,
        "ThreadName": "",
        "EventID": "8E7CBBF422C792E6",
        "BaggageBytes": "[[248 5] [240 0] [0 177 170 129 46 14 100 239 240] [240 1] [0 144 9 59 168 42 247 199 128] [240 3] [0 2]]",
        "ProcessID": 2171
      },
      {
        "Cycles": 0,
        "Agent": "Execution-CPU",
        "ProcessName": "Name",
        "TaskID": "B1AA812E0E64EFF0",
        "ParentEventID": [
          "90093BA82AF7C780"
        ],
        "Label": "set",
        "Title": "X-Trace Task",
        "Host": "pinky19.mpi-sws.org",
        "HRT": 26962574862206745,
        "Operation": "set",
        "Timestamp": "1557746214802.557129",
        "TenantClass": 0,
        "Source": "Server.java:2071",
        "ThreadID": 63,
        "ThreadName": "",
        "EventID": "1CB2924DF82CA2F3",
        "BaggageBytes": "[[248 5] [240 0] [0 177 170 129 46 14 100 239 240] [240 1] [0 144 9 59 168 42 247 199 128] [240 3] [0 2]]",
        "ProcessID": 2171
      },
      {
        "Cycles": 0,
        "Agent": "org.apache.hadoop.hdfs.server.namenode.FSNamesystem.audit",
        "ProcessName": "Name",
        "TaskID": "B1AA812E0E64EFF0",
        "ParentEventID": [
          "FF49A05751EBCF16"
        ],
        "Label": "allowed=true\tugi=plascas (auth:SIMPLE)\tip=/139.19.171.63\tcmd=open\tsrc=/ds/SYd9hpOBq6TgIBQ6\tdst=null\tperm=null\tproto=rpc",
        "Title": "X-Trace Task",
        "Host": "pinky19.mpi-sws.org",
        "HRT": 26962574862286831,
        "Timestamp": "1557746214802.637207",
        "TenantClass": 0,
        "Source": "FSNamesystem.java:8313",
        "ThreadID": 63,
        "ThreadName": "",
        "EventID": "FA7A36BE75F46F46",
        "BaggageBytes": "[[248 5] [240 0] [0 177 170 129 46 14 100 239 240] [240 1] [0 255 73 160 87 81 235 207 22] [240 3] [0 2]]",
        "ProcessID": 2171
      },
      {
        "Cycles": 0,
        "Agent": "edu.brown.cs.systems.xtrace.logging.BaggageWrappers",
        "ProcessName": "Name",
        "TaskID": "B1AA812E0E64EFF0",
        "ParentEventID": [
          "FA7A36BE75F46F46"
        ],
        "Label": "Forking current baggage with Baggage.fork()",
        "Title": "X-Trace Task",
        "Host": "pinky19.mpi-sws.org",
        "HRT": 26962574862332355,
        "Operation": "fork",
        "Timestamp": "1557746214802.682617",
        "TenantClass": 0,
        "Source": "Server.java:2398",
        "ThreadID": 63,
        "ThreadName": "",
        "EventID": "3617389B74118887",
        "BaggageBytes": "[[248 5] [240 0] [0 177 170 129 46 14 100 239 240] [240 1] [0 250 122 54 190 117 244 111 70] [240 3] [0 2]]",
        "ProcessID": 2171
      },
      {
        "Cycles": 0,
        "Agent": "org.apache.hadoop.ipc.Server",
        "ProcessName": "Name",
        "TaskID": "B1AA812E0E64EFF0",
        "ParentEventID": [
          "1CB2924DF82CA2F3"
        ],
        "Label": "getBlockLocations in org.apache.hadoop.hdfs.protocol.ClientProtocol",
        "Title": "X-Trace Task",
        "Host": "pinky19.mpi-sws.org",
        "HRT": 26962574862240459,
        "Timestamp": "1557746214802.590820",
        "TenantClass": 0,
        "Source": "ProtobufRpcEngine.java:601",
        "ThreadID": 63,
        "ThreadName": "",
        "EventID": "FF49A05751EBCF16",
        "BaggageBytes": "[[248 5] [240 0] [0 177 170 129 46 14 100 239 240] [240 1] [0 28 178 146 77 248 44 162 243] [240 3] [0 2]]",
        "ProcessID": 2171
      },
      {
        "Cycles": 0,
        "Agent": "Execution-CPU",
        "ProcessName": "Name",
        "TaskID": "B1AA812E0E64EFF0",
        "ParentEventID": [
          "3617389B74118887"
        ],
        "Label": "unset",
        "Title": "X-Trace Task",
        "Host": "pinky19.mpi-sws.org",
        "Duration": "208356",
        "HRT": 26962574862437351,
        "Operation": "unset",
        "Timestamp": "1557746214802.787598",
        "TenantClass": 0,
        "Source": "Server.java:1058",
        "ThreadID": 63,
        "ThreadName": "",
        "EventID": "DF231100895DE509",
        "BaggageBytes": "[[248 5] [240 0] [0 177 170 129 46 14 100 239 240] [240 1] [0 54 23 56 155 116 17 136 135] [240 3] [0 2]]",
        "ProcessID": 2171
      },
      {
        "Cycles": 0,
        "Agent": "Execution-CPU",
        "ProcessName": "Read",
        "TaskID": "B1AA812E0E64EFF0",
        "ParentEventID": [
          "3617389B74118887"
        ],
        "Label": "set",
        "Title": "X-Trace Task",
        "Host": "pinky19.mpi-sws.org",
        "HRT": 26962574862483339,
        "Operation": "set",
        "Timestamp": "1557746214802.833984",
        "TenantClass": 0,
        "Source": "Client.java:302",
        "ThreadID": 37,
        "ThreadName": "",
        "EventID": "69BF06B0B48949FD",
        "ProcessID": 36430
      },
      {
        "Cycles": 0,
        "Agent": "Execution-CPU",
        "ProcessName": "Read",
        "TaskID": "B1AA812E0E64EFF0",
        "ParentEventID": [
          "69BF06B0B48949FD"
        ],
        "Label": "unset",
        "Title": "X-Trace Task",
        "Host": "pinky19.mpi-sws.org",
        "Duration": "6865",
        "HRT": 26962574862505850,
        "Operation": "unset",
        "Timestamp": "1557746214802.856445",
        "TenantClass": 0,
        "Source": "Client.java:1168",
        "ThreadID": 37,
        "ThreadName": "",
        "EventID": "4C2FA524E864F6DD",
        "ProcessID": 36430
      },
      {
        "Cycles": 0,
        "Agent": "Execution-Sleep",
        "ProcessName": "Read",
        "TaskID": "B1AA812E0E64EFF0",
        "ParentEventID": [
          "B7C86CFD38A4B2DD"
        ],
        "Label": "waited",
        "Title": "X-Trace Task",
        "Host": "pinky19.mpi-sws.org",
        "Duration": "430597",
        "HRT": 26962574862532575,
        "Operation": "waited",
        "Timestamp": "1557746214802.883301",
        "TenantClass": 0,
        "Source": "Client.java:1537",
        "ThreadID": 1,
        "ThreadName": "",
        "EventID": "74A46AAFF4381D56",
        "ProcessID": 36430
      },
      {
        "Cycles": 0,
        "Agent": "org.apache.hadoop.ipc.ProtobufRpcEngine",
        "ProcessName": "Read",
        "TaskID": "B1AA812E0E64EFF0",
        "ParentEventID": [
          "1E6F7296A96727E0"
        ],
        "Label": "org.apache.hadoop.hdfs.protocol.ClientProtocol.getBlockLocations completed",
        "Title": "X-Trace Task",
        "Host": "pinky19.mpi-sws.org",
        "HRT": 26962574862611334,
        "Timestamp": "1557746214802.962158",
        "TenantClass": 0,
        "Source": "ProtobufRpcEngine.java:275",
        "ThreadID": 1,
        "ThreadName": "",
        "EventID": "3018DDCA3F80DEB6",
        "ProcessID": 36430
      },
      {
        "Cycles": 0,
        "Agent": "edu.brown.cs.systems.xtrace.logging.BaggageWrappers",
        "ProcessName": "Read",
        "TaskID": "B1AA812E0E64EFF0",
        "ParentEventID": [
          "4C2FA524E864F6DD",
          "74A46AAFF4381D56"
        ],
        "Label": "Merged current baggage with other baggage",
        "Title": "X-Trace Task",
        "Host": "pinky19.mpi-sws.org",
        "HRT": 26962574862556724,
        "Operation": "join",
        "Timestamp": "1557746214802.907471",
        "TenantClass": 0,
        "Source": "Client.java:1545",
        "ThreadID": 1,
        "ThreadName": "",
        "EventID": "1E6F7296A96727E0",
        "ProcessID": 36430
      },
      {
        "Cycles": 0,
        "Agent": "edu.brown.cs.systems.xtrace.logging.BaggageWrappers",
        "ProcessName": "Read",
        "TaskID": "B1AA812E0E64EFF0",
        "ParentEventID": [
          "3018DDCA3F80DEB6"
        ],
        "Label": "Forking current baggage with Baggage.fork()",
        "Title": "X-Trace Task",
        "Host": "pinky19.mpi-sws.org",
        "HRT": 26962574862682809,
        "Operation": "fork",
        "Timestamp": "1557746214803.033447",
        "TenantClass": 0,
        "Source": "DataTransferProtoUtil.java:94",
        "ThreadID": 1,
        "ThreadName": "",
        "EventID": "7D8D3BA85B9B9E84",
        "ProcessID": 36430
      },
      {
        "Cycles": 0,
        "Agent": "Execution-CPU",
        "ProcessName": "Data",
        "TaskID": "B1AA812E0E64EFF0",
        "ParentEventID": [
          "7D8D3BA85B9B9E84"
        ],
        "Label": "set",
        "Title": "X-Trace Task",
        "Host": "pinky19.mpi-sws.org",
        "HRT": 26962574862811967,
        "Operation": "set",
        "Timestamp": "1557746214803.172363",
        "TenantClass": 0,
        "Source": "Receiver.java:117",
        "ThreadID": 36633,
        "ThreadName": "",
        "EventID": "B91F102D666E1EEB",
        "BaggageBytes": "[[248 5] [240 0] [0 177 170 129 46 14 100 239 240] [240 1] [0 125 141 59 168 91 155 158 132] [240 3] [0 2]]",
        "ProcessID": 2319
      },
      {
        "Cycles": 0,
        "Agent": "edu.brown.cs.systems.xtrace.logging.BaggageWrappers",
        "ProcessName": "Data",
        "TaskID": "B1AA812E0E64EFF0",
        "ParentEventID": [
          "2BD5D73048BEE74C"
        ],
        "Label": "Forking current baggage with Baggage.fork()",
        "Title": "X-Trace Task",
        "Host": "pinky19.mpi-sws.org",
        "HRT": 26962574862923469,
        "Operation": "fork",
        "Timestamp": "1557746214803.283691",
        "TenantClass": 0,
        "Source": "DataXceiver.java:1257",
        "ThreadID": 36633,
        "ThreadName": "",
        "EventID": "E9CB4A10F1513B16",
        "BaggageBytes": "[[248 5] [240 0] [0 177 170 129 46 14 100 239 240] [240 1] [0 43 213 215 48 72 190 231 76] [240 3] [0 2]]",
        "ProcessID": 2319
      },
      {
        "Cycles": 0,
        "Agent": "Execution-Sleep",
        "ProcessName": "Read",
        "TaskID": "B1AA812E0E64EFF0",
        "ParentEventID": [
          "7D8D3BA85B9B9E84"
        ],
        "Label": "waited",
        "Title": "X-Trace Task",
        "Host": "pinky19.mpi-sws.org",
        "Duration": "194628",
        "HRT": 26962574862986120,
        "Operation": "waited",
        "Timestamp": "1557746214803.336914",
        "TenantClass": 0,
        "Source": "SocketIOWithTimeout.java:335",
        "ThreadID": 1,
        "ThreadName": "",
        "EventID": "A1AA361603AF9849",
        "ProcessID": 36430
      },
      {
        "Cycles": 0,
        "Agent": "edu.brown.cs.systems.xtrace.logging.XTraceInit",
        "ProcessName": "Data",
        "TaskID": "B1AA812E0E64EFF0",
        "ParentEventID": [
          "B91F102D666E1EEB"
        ],
        "Label": "Thread.setName: DataXceiver for client DFSClient_NONMAPREDUCE_778905418_1 at /139.19.171.63:43130 [Sending block BP-1633380353-139.19.171.63-1554193446451:blk_1073763763_22939]",
        "Title": "X-Trace Task",
        "Host": "pinky19.mpi-sws.org",
        "HRT": 26962574862845432,
        "Timestamp": "1557746214803.205811",
        "TenantClass": 0,
        "Source": "DataXceiver.java:168",
        "ThreadID": 36633,
        "ThreadName": "",
        "EventID": "2BD5D73048BEE74C",
        "BaggageBytes": "[[248 5] [240 0] [0 177 170 129 46 14 100 239 240] [240 1] [0 185 31 16 45 102 110 30 235] [240 3] [0 2]]",
        "ProcessID": 2319
      },
      {
        "Cycles": 0,
        "Agent": "edu.brown.cs.systems.xtrace.logging.BaggageWrappers",
        "ProcessName": "Data",
        "TaskID": "B1AA812E0E64EFF0",
        "ParentEventID": [
          "E9CB4A10F1513B16"
        ],
        "Label": "Forking current baggage with Baggage.fork()",
        "Title": "X-Trace Task",
        "Host": "pinky19.mpi-sws.org",
        "HRT": 26962574862989535,
        "Operation": "fork",
        "Timestamp": "1557746214803.349854",
        "TenantClass": 0,
        "Source": "PacketHeader.java:95",
        "ThreadID": 36633,
        "ThreadName": "",
        "EventID": "6AA8C332E509B853",
        "BaggageBytes": "[[248 5] [240 0] [0 177 170 129 46 14 100 239 240] [240 1] [0 233 203 74 16 241 81 59 22] [240 3] [0 2]]",
        "ProcessID": 2319
      },
      {
        "Cycles": 0,
        "Agent": "edu.brown.cs.systems.xtrace.logging.BaggageWrappers",
        "ProcessName": "Read",
        "TaskID": "B1AA812E0E64EFF0",
        "ParentEventID": [
          "A1AA361603AF9849",
          "E9CB4A10F1513B16"
        ],
        "Label": "Merged current baggage with other baggage",
        "Title": "X-Trace Task",
        "Host": "pinky19.mpi-sws.org",
        "HRT": 26962574863074980,
        "Operation": "join",
        "Timestamp": "1557746214803.425781",
        "TenantClass": 0,
        "Source": "RemoteBlockReader2.java:429",
        "ThreadID": 1,
        "ThreadName": "",
        "EventID": "9FF62D7B2575C04D",
        "ProcessID": 36430
      },
      {
        "Cycles": 0,
        "Agent": "Execution-Sleep",
        "ProcessName": "Data",
        "TaskID": "B1AA812E0E64EFF0",
        "ParentEventID": [
          "6AA8C332E509B853"
        ],
        "Label": "waited",
        "Title": "X-Trace Task",
        "Host": "pinky19.mpi-sws.org",
        "Duration": "5615",
        "HRT": 26962574863055041,
        "Operation": "waited",
        "Timestamp": "1557746214803.415283",
        "TenantClass": 0,
        "Source": "SocketIOWithTimeout.java:335",
        "ThreadID": 36633,
        "ThreadName": "",
        "EventID": "6C25B55A6C6E5B18",
        "BaggageBytes": "[[248 5] [240 0] [0 177 170 129 46 14 100 239 240] [240 1] [0 106 168 195 50 229 9 184 83] [240 3] [0 2]]",
        "ProcessID": 2319
      },
      {
        "Cycles": 0,
        "Agent": "edu.brown.cs.systems.xtrace.logging.BaggageWrappers",
        "ProcessName": "Data",
        "TaskID": "B1AA812E0E64EFF0",
        "ParentEventID": [
          "6C25B55A6C6E5B18"
        ],
        "Label": "Forking current baggage with Baggage.fork()",
        "Title": "X-Trace Task",
        "Host": "pinky19.mpi-sws.org",
        "HRT": 26962574863123135,
        "Operation": "fork",
        "Timestamp": "1557746214803.483398",
        "TenantClass": 0,
        "Source": "PacketHeader.java:95",
        "ThreadID": 36633,
        "ThreadName": "",
        "EventID": "F66AC1E9262886C8",
        "BaggageBytes": "[[248 5] [240 0] [0 177 170 129 46 14 100 239 240] [240 1] [0 108 37 181 90 108 110 91 24] [240 3] [0 2]]",
        "ProcessID": 2319
      },
      {
        "Cycles": 0,
        "Agent": "edu.brown.cs.systems.xtrace.logging.BaggageWrappers",
        "ProcessName": "Read",
        "TaskID": "B1AA812E0E64EFF0",
        "ParentEventID": [
          "9FF62D7B2575C04D",
          "6AA8C332E509B853"
        ],
        "Label": "Merged current baggage with other baggage",
        "Title": "X-Trace Task",
        "Host": "pinky19.mpi-sws.org",
        "HRT": 26962574863169408,
        "Operation": "join",
        "Timestamp": "1557746214803.520020",
        "TenantClass": 0,
        "Source": "PacketHeader.java:168",
        "ThreadID": 1,
        "ThreadName": "",
        "EventID": "A432D8590AE9885B",
        "ProcessID": 36430
      },
      {
        "Cycles": 0,
        "Agent": "edu.brown.cs.systems.xtrace.logging.BaggageWrappers",
        "ProcessName": "Read",
        "TaskID": "B1AA812E0E64EFF0",
        "ParentEventID": [
          "A432D8590AE9885B",
          "F66AC1E9262886C8"
        ],
        "Label": "Merged current baggage with other baggage",
        "Title": "X-Trace Task",
        "Host": "pinky19.mpi-sws.org",
        "HRT": 26962574863252996,
        "Operation": "join",
        "Timestamp": "1557746214803.603760",
        "TenantClass": 0,
        "Source": "PacketHeader.java:168",
        "ThreadID": 1,
        "ThreadName": "",
        "EventID": "F0C8D3958EE081A6",
        "ProcessID": 36430
      },
      {
        "Cycles": 0,
        "Agent": "Execution-Sleep",
        "ProcessName": "Data",
        "TaskID": "B1AA812E0E64EFF0",
        "ParentEventID": [
          "F66AC1E9262886C8"
        ],
        "Label": "waited",
        "Title": "X-Trace Task",
        "Host": "pinky19.mpi-sws.org",
        "Duration": "93855",
        "HRT": 26962574863315790,
        "Operation": "waited",
        "Timestamp": "1557746214803.676025",
        "TenantClass": 0,
        "Source": "SocketIOWithTimeout.java:335",
        "ThreadID": 36633,
        "ThreadName": "",
        "EventID": "D0505FA092C37C41",
        "BaggageBytes": "[[248 5] [240 0] [0 177 170 129 46 14 100 239 240] [240 1] [0 246 106 193 233 38 40 134 200] [240 3] [0 2]]",
        "ProcessID": 2319
      },
      {
        "Cycles": 0,
        "Agent": "edu.brown.cs.systems.xtrace.logging.BaggageWrappers",
        "ProcessName": "Read",
        "TaskID": "B1AA812E0E64EFF0",
        "ParentEventID": [
          "F0C8D3958EE081A6"
        ],
        "Label": "Forking current baggage with Baggage.fork()",
        "Title": "X-Trace Task",
        "Host": "pinky19.mpi-sws.org",
        "HRT": 26962574863262725,
        "Operation": "fork",
        "Timestamp": "1557746214803.613525",
        "TenantClass": 0,
        "Source": "RemoteBlockReader2.java:361",
        "ThreadID": 1,
        "ThreadName": "",
        "EventID": "6274ABBBA90A9CF8",
        "ProcessID": 36430
      },
      {
        "Cycles": 0,
        "Agent": "edu.brown.cs.systems.xtrace.logging.BaggageWrappers",
        "ProcessName": "Data",
        "TaskID": "B1AA812E0E64EFF0",
        "ParentEventID": [
          "D0505FA092C37C41",
          "6274ABBBA90A9CF8"
        ],
        "Label": "Merged current baggage with other baggage",
        "Title": "X-Trace Task",
        "Host": "pinky19.mpi-sws.org",
        "HRT": 26962574863373775,
        "Operation": "join",
        "Timestamp": "1557746214803.734131",
        "TenantClass": 0,
        "Source": "DataXceiver.java:574",
        "ThreadID": 36633,
        "ThreadName": "",
        "EventID": "4CB0D050B354BF47",
        "BaggageBytes": "[[248 5] [240 0] [0 177 170 129 46 14 100 239 240] [240 1] [0 208 80 95 160 146 195 124 65] [0 98 116 171 187 169 10 156 248] [240 3] [0 2]]",
        "ProcessID": 2319
      },
      {
        "Cycles": 0,
        "Agent": "Execution-CPU",
        "ProcessName": "Data",
        "TaskID": "B1AA812E0E64EFF0",
        "ParentEventID": [
          "4CB0D050B354BF47"
        ],
        "Label": "unset",
        "Title": "X-Trace Task",
        "Host": "pinky19.mpi-sws.org",
        "Duration": "563861",
        "HRT": 26962574863399475,
        "Operation": "unset",
        "Timestamp": "1557746214803.759766",
        "TenantClass": 0,
        "Source": "DataXceiver.java:261",
        "ThreadID": 36633,
        "ThreadName": "",
        "EventID": "CD1A8E0D854FAAA3",
        "BaggageBytes": "[[248 5] [240 0] [0 177 170 129 46 14 100 239 240] [240 1] [0 76 176 208 80 179 84 191 71] [240 3] [0 2]]",
        "ProcessID": 2319
      },
      {
        "Cycles": 0,
        "Agent": "edu.brown.cs.systems.retro.benchmarks.hdfs_client.Reader",
        "ProcessName": "Read",
        "TaskID": "B1AA812E0E64EFF0",
        "ParentEventID": [
          "0"
        ],
        "Label": "Reading file",
        "Title": "X-Trace Task",
        "Host": "pinky19.mpi-sws.org",
        "HRT": 26962574861865808,
        "Timestamp": "1557746214802.216553",
        "TenantClass": 0,
        "ThreadID": 1,
        "ThreadName": "",
        "EventID": "E1CFC79FC2CB3EB8",
        "ProcessID": 36430,
        "Tag": [
          "reader_10kb",
          "Read Size: 10240"
        ]
      }
    ]
  }
]