[
  {
    "id": "1890C6AB15B85211",
    "reports": [
      {
        "Cycles": 0,
        "Agent": "org.apache.hadoop.ipc.ProtobufRpcEngine",
        "ProcessName": "Read",
        "TaskID": "1890C6AB15B85211",
        "ParentEventID": [
          "D81D1DA767A75412"
        ],
        "Label": "Invoking org.apache.hadoop.hdfs.protocol.ClientProtocol.getBlockLocations",
        "Title": "X-Trace Task",
        "Host": "pinky19.mpi-sws.org",
        "HRT": 26962446748896834,
        "Timestamp": "1557746086689.003418",
        "TenantClass": 0,
        "Source": "ProtobufRpcEngine.java:228",
        "ThreadID": 1,
        "ThreadName": "",
        "EventID": "4B76848B7449966C",
        "ProcessID": 36430
      },
      {
        "Cycles": 0,
        "Agent": "edu.brown.cs.systems.retro.benchmarks.hdfs_client.Reader",
        "ProcessName": "Read",
        "TaskID": "1890C6AB15B85211",
        "ParentEventID": [
          "13DBA7C2B72A76F2"
        ],
        "Label": "Reading file",
        "Title": "X-Trace Task",
        "Host": "pinky19.mpi-sws.org",
        "HRT": 26962446748753317,
        "Timestamp": "1557746086688.859863",
        "TenantClass": 0,
        "ThreadID": 1,
        "ThreadName": "",
        "EventID": "D81D1DA767A75412",
        "ProcessID": 36430
      },
      {
        "Cycles": 0,
        "Agent": "Execution-CPU",
        "ProcessName": "Read",
        "TaskID": "1890C6AB15B85211",
        "ParentEventID": [
          "DF7D5F1C8E8ADE21"
        ],
        "Label": "set",
        "Title": "X-Trace Task",
        "Host": "pinky19.mpi-sws.org",
        "HRT": 26962446749000413,
        "Operation": "set",
        "Timestamp": "1557746086689.106934",
        "TenantClass": 0,
        "Source": "Client.java:1032",
        "ThreadID": 41,
        "ThreadName": "",
        "EventID": "DFF34217CE87A14E",
        "ProcessID": 36430
      },
      {
        "Cycles": 0,
        "Agent": "Execution-CPU",
        "ProcessName": "Read",
        "TaskID": "1890C6AB15B85211",
        "ParentEventID": [
          "4B76848B7449966C"
        ],
        "Label": "unset",
        "Title": "X-Trace Task",
        "Host": "pinky19.mpi-sws.org",
        "Duration": "22063521",
        "HRT": 26962446748935226,
        "Operation": "unset",
        "Timestamp": "1557746086689.041748",
        "TenantClass": 0,
        "Source": "Client.java:1027",
        "ThreadID": 1,
        "ThreadName": "",
        "EventID": "DF7D5F1C8E8ADE21",
        "ProcessID": 36430
      },
      {
        "Cycles": 0,
        "Agent": "Execution-CPU",
        "ProcessName": "Read",
        "TaskID": "1890C6AB15B85211",
        "ParentEventID": [
          "69753D4ABACF6447"
        ],
        "Label": "unset",
        "Title": "X-Trace Task",
        "Host": "pinky19.mpi-sws.org",
        "Duration": "89954",
        "HRT": 26962446749111102,
        "Operation": "unset",
        "Timestamp": "1557746086689.217529",
        "TenantClass": 0,
        "Source": "Client.java:1062",
        "ThreadID": 41,
        "ThreadName": "",
        "EventID": "9C73F845ED7A13DD",
        "ProcessID": 36430
      },
      {
        "Cycles": 0,
        "Agent": "edu.brown.cs.systems.xtrace.logging.BaggageWrappers",
        "ProcessName": "Read",
        "TaskID": "1890C6AB15B85211",
        "ParentEventID": [
          "DFF34217CE87A14E"
        ],
        "Label": "Forking current baggage with Baggage.fork()",
        "Title": "X-Trace Task",
        "Host": "pinky19.mpi-sws.org",
        "HRT": 26962446749021938,
        "Operation": "fork",
        "Timestamp": "1557746086689.128418",
        "TenantClass": 0,
        "Source": "Client.java:1043",
        "ThreadID": 41,
        "ThreadName": "",
        "EventID": "69753D4ABACF6447",
        "ProcessID": 36430
      },
      {
        "Cycles": 0,
        "Agent": "Execution-CPU",
        "ProcessName": "Name",
        "TaskID": "1890C6AB15B85211",
        "ParentEventID": [
          "69753D4ABACF6447"
        ],
        "Label": "set",
        "Title": "X-Trace Task",
        "Host": "pinky19.mpi-sws.org",
        "HRT": 26962446749163889,
        "Operation": "set",
        "Timestamp": "1557746086689.312012",
        "TenantClass": 0,
        "Source": "Server.java:1840",
        "ThreadID": 48,
        "ThreadName": "",
        "EventID": "37541C66927D4365",
        "BaggageBytes": "[[248 5] [240 0] [0 24 144 198 171 21 184 82 17] [240 1] [0 105 117 61 74 186 207 100 71] [240 3] [0 2]]",
        "ProcessID": 2171
      },
      {
        "Cycles": 0,
        "Agent": "Execution-CPU",
        "ProcessName": "Read",
        "TaskID": "1890C6AB15B85211",
        "ParentEventID": [
          "9C73F845ED7A13DD"
        ],
        "Label": "set",
        "Title": "X-Trace Task",
        "Host": "pinky19.mpi-sws.org",
        "HRT": 26962446749134644,
        "Operation": "set",
        "Timestamp": "1557746086689.241211",
        "TenantClass": 0,
        "Source": "Client.java:1104",
        "ThreadID": 1,
        "ThreadName": "",
        "EventID": "08E29656A84D02AA",
        "ProcessID": 36430
      },
      {
        "Cycles": 0,
        "Agent": "edu.brown.cs.systems.xtrace.logging.BaggageWrappers",
        "ProcessName": "Name",
        "TaskID": "1890C6AB15B85211",
        "ParentEventID": [
          "37541C66927D4365"
        ],
        "Label": "Forking current baggage with Baggage.fork()",
        "Title": "X-Trace Task",
        "Host": "pinky19.mpi-sws.org",
        "HRT": 26962446749192653,
        "Operation": "fork",
        "Timestamp": "1557746086689.340820",
        "TenantClass": 0,
        "Source": "Server.java:550",
        "ThreadID": 48,
        "ThreadName": "",
        "EventID": "F561D22431C2C6AE",
        "BaggageBytes": "[[248 5] [240 0] [0 24 144 198 171 21 184 82 17] [240 1] [0 55 84 28 102 146 125 67 101] [240 3] [0 2]]",
        "ProcessID": 2171
      },
      {
        "Cycles": 0,
        "Agent": "Execution-CPU",
        "ProcessName": "Name",
        "TaskID": "1890C6AB15B85211",
        "ParentEventID": [
          "F561D22431C2C6AE"
        ],
        "Label": "unset",
        "Title": "X-Trace Task",
        "Host": "pinky19.mpi-sws.org",
        "Duration": "24204",
        "HRT": 26962446749213080,
        "Operation": "unset",
        "Timestamp": "1557746086689.361328",
        "TenantClass": 0,
        "Source": "Server.java:1828",
        "ThreadID": 48,
        "ThreadName": "",
        "EventID": "AC8A204FCCA5917B",
        "BaggageBytes": "[[248 5] [240 0] [0 24 144 198 171 21 184 82 17] [240 1] [0 245 97 210 36 49 194 198 174] [240 3] [0 2]]",
        "ProcessID": 2171
      },
      {
        "Cycles": 0,
        "Agent": "org.apache.hadoop.ipc.Server",
        "ProcessName": "Name",
        "TaskID": "1890C6AB15B85211",
        "ParentEventID": [
          "58A0807158ADE081"
        ],
        "Label": "getBlockLocations in org.apache.hadoop.hdfs.protocol.ClientProtocol",
        "Title": "X-Trace Task",
        "Host": "pinky19.mpi-sws.org",
        "HRT": 26962446749277649,
        "Timestamp": "1557746086689.425781",
        "TenantClass": 0,
        "Source": "ProtobufRpcEngine.java:601",
        "ThreadID": 60,
        "ThreadName": "",
        "EventID": "113AF59CA4C6CFF8",
        "BaggageBytes": "[[248 5] [240 0] [0 24 144 198 171 21 184 82 17] [240 1] [0 88 160 128 113 88 173 224 129] [240 3] [0 2]]",
        "ProcessID": 2171
      },
      {
        "Cycles": 0,
        "Agent": "org.apache.hadoop.hdfs.server.namenode.FSNamesystem.audit",
        "ProcessName": "Name",
        "TaskID": "1890C6AB15B85211",
        "ParentEventID": [
          "113AF59CA4C6CFF8"
        ],
        "Label": "allowed=true\tugi=plascas (auth:SIMPLE)\tip=/139.19.171.63\tcmd=open\tsrc=/ds/PWEdqIYOED0exjwt\tdst=null\tperm=null\tproto=rpc",
        "Title": "X-Trace Task",
        "Host": "pinky19.mpi-sws.org",
        "HRT": 26962446749342050,
        "Timestamp": "1557746086689.490234",
        "TenantClass": 0,
        "Source": "FSNamesystem.java:8313",
        "ThreadID": 60,
        "ThreadName": "",
        "EventID": "700311BE538FDB2A",
        "BaggageBytes": "[[248 5] [240 0] [0 24 144 198 171 21 184 82 17] [240 1] [0 17 58 245 156 164 198 207 248] [240 3] [0 2]]",
        "ProcessID": 2171
      },
      {
        "Cycles": 0,
        "Agent": "edu.brown.cs.systems.xtrace.logging.BaggageWrappers",
        "ProcessName": "Name",
        "TaskID": "1890C6AB15B85211",
        "ParentEventID": [
          "700311BE538FDB2A"
        ],
        "Label": "Forking current baggage with Baggage.fork()",
        "Title": "X-Trace Task",
        "Host": "pinky19.mpi-sws.org",
        "HRT": 26962446749399498,
        "Operation": "fork",
        "Timestamp": "1557746086689.547607",
        "TenantClass": 0,
        "Source": "Server.java:2398",
        "ThreadID": 60,
        "ThreadName": "",
        "EventID": "3801C2905C719BBF",
        "BaggageBytes": "[[248 5] [240 0] [0 24 144 198 171 21 184 82 17] [240 1] [0 112 3 17 190 83 143 219 42] [240 3] [0 2]]",
        "ProcessID": 2171
      },
      {
        "Cycles": 0,
        "Agent": "Execution-CPU",
        "ProcessName": "Name",
        "TaskID": "1890C6AB15B85211",
        "ParentEventID": [
          "F561D22431C2C6AE"
        ],
        "Label": "set",
        "Title": "X-Trace Task",
        "Host": "pinky19.mpi-sws.org",
        "HRT": 26962446749223327,
        "Operation": "set",
        "Timestamp": "1557746086689.371582",
        "TenantClass": 0,
        "Source": "Server.java:2071",
        "ThreadID": 60,
        "ThreadName": "",
        "EventID": "58A0807158ADE081",
        "BaggageBytes": "[[248 5] [240 0] [0 24 144 198 171 21 184 82 17] [240 1] [0 245 97 210 36 49 194 198 174] [240 3] [0 2]]",
        "ProcessID": 2171
      },
      {
        "Cycles": 0,
        "Agent": "Execution-CPU",
        "ProcessName": "Name",
        "TaskID": "1890C6AB15B85211",
        "ParentEventID": [
          "3801C2905C719BBF"
        ],
        "Label": "unset",
        "Title": "X-Trace Task",
        "Host": "pinky19.mpi-sws.org",
        "Duration": "260268",
        "HRT": 26962446749525749,
        "Operation": "unset",
        "Timestamp": "1557746086689.673828",
        "TenantClass": 0,
        "Source": "Server.java:1058",
        "ThreadID": 60,
        "ThreadName": "",
        "EventID": "68F44378E12562DF",
        "BaggageBytes": "[[248 5] [240 0] [0 24 144 198 171 21 184 82 17] [240 1] [0 56 1 194 144 92 113 155 191] [240 3] [0 2]]",
        "ProcessID": 2171
      },
      {
        "Cycles": 0,
        "Agent": "Execution-CPU",
        "ProcessName": "Read",
        "TaskID": "1890C6AB15B85211",
        "ParentEventID": [
          "3801C2905C719BBF"
        ],
        "Label": "set",
        "Title": "X-Trace Task",
        "Host": "pinky19.mpi-sws.org",
        "HRT": 26962446749625041,
        "Operation": "set",
        "Timestamp": "1557746086689.731445",
        "TenantClass": 0,
        "Source": "Client.java:302",
        "ThreadID": 37,
        "ThreadName": "",
        "EventID": "1B85B47844077872",
        "ProcessID": 36430
      },
      {
        "Cycles": 0,
        "Agent": "Execution-CPU",
        "ProcessName": "Read",
        "TaskID": "1890C6AB15B85211",
        "ParentEventID": [
          "1B85B47844077872"
        ],
        "Label": "unset",
        "Title": "X-Trace Task",
        "Host": "pinky19.mpi-sws.org",
        "Duration": "37559",
        "HRT": 26962446749680559,
        "Operation": "unset",
        "Timestamp": "1557746086689.787109",
        "TenantClass": 0,
        "Source": "Client.java:1168",
        "ThreadID": 37,
        "ThreadName": "",
        "EventID": "BCD1455E0EFF7B12",
        "ProcessID": 36430
      },
      {
        "Cycles": 0,
        "Agent": "edu.brown.cs.systems.xtrace.logging.BaggageWrappers",
        "ProcessName": "Read",
        "TaskID": "1890C6AB15B85211",
        "ParentEventID": [
          "40EC02CBDD458AA1",
          "BCD1455E0EFF7B12"
        ],
        "Label": "Merged current baggage with other baggage",
        "Title": "X-Trace Task",
        "Host": "pinky19.mpi-sws.org",
        "HRT": 26962446749758247,
        "Operation": "join",
        "Timestamp": "1557746086689.864746",
        "TenantClass": 0,
        "Source": "Client.java:1545",
        "ThreadID": 1,
        "ThreadName": "",
        "EventID": "DBD270CD550206A9",
        "ProcessID": 36430
      },
      {
        "Cycles": 0,
        "Agent": "Execution-Sleep",
        "ProcessName": "Read",
        "TaskID": "1890C6AB15B85211",
        "ParentEventID": [
          "08E29656A84D02AA"
        ],
        "Label": "waited",
        "Title": "X-Trace Task",
        "Host": "pinky19.mpi-sws.org",
        "Duration": "566064",
        "HRT": 26962446749722226,
        "Operation": "waited",
        "Timestamp": "1557746086689.828613",
        "TenantClass": 0,
        "Source": "Client.java:1537",
        "ThreadID": 1,
        "ThreadName": "",
        "EventID": "40EC02CBDD458AA1",
        "ProcessID": 36430
      },
      {
        "Cycles": 0,
        "Agent": "org.apache.hadoop.ipc.ProtobufRpcEngine",
        "ProcessName": "Read",
        "TaskID": "1890C6AB15B85211",
        "ParentEventID": [
          "DBD270CD550206A9"
        ],
        "Label": "org.apache.hadoop.hdfs.protocol.ClientProtocol.getBlockLocations completed",
        "Title": "X-Trace Task",
        "Host": "pinky19.mpi-sws.org",
        "HRT": 26962446749865016,
        "Timestamp": "1557746086689.971436",
        "TenantClass": 0,
        "Source": "ProtobufRpcEngine.java:275",
        "ThreadID": 1,
        "ThreadName": "",
        "EventID": "98FF568FAC73E89D",
        "ProcessID": 36430
      },
      {
        "Cycles": 0,
        "Agent": "Execution-CPU",
        "ProcessName": "Data",
        "TaskID": "1890C6AB15B85211",
        "ParentEventID": [
          "9D49E9EFFCD00002"
        ],
        "Label": "set",
        "Title": "X-Trace Task",
        "Host": "pinky21.mpi-sws.org",
        "HRT": 10808756456723221,
        "Operation": "set",
        "Timestamp": "1557746086690.542725",
        "TenantClass": 0,
        "Source": "Receiver.java:117",
        "ThreadID": 14875,
        "ThreadName": "",
        "EventID": "07B3E51B83E265AA",
        "BaggageBytes": "[[248 5] [240 0] [0 24 144 198 171 21 184 82 17] [240 1] [0 157 73 233 239 252 208 0 2] [240 3] [0 2]]",
        "ProcessID": 20775
      },
      {
        "Cycles": 0,
        "Agent": "edu.brown.cs.systems.xtrace.logging.BaggageWrappers",
        "ProcessName": "Read",
        "TaskID": "1890C6AB15B85211",
        "ParentEventID": [
          "98FF568FAC73E89D"
        ],
        "Label": "Forking current baggage with Baggage.fork()",
        "Title": "X-Trace Task",
        "Host": "pinky19.mpi-sws.org",
        "HRT": 26962446750073613,
        "Operation": "fork",
        "Timestamp": "1557746086690.180176",
        "TenantClass": 0,
        "Source": "DataTransferProtoUtil.java:94",
        "ThreadID": 1,
        "ThreadName": "",
        "EventID": "9D49E9EFFCD00002",
        "ProcessID": 36430
      },
      {
        "Cycles": 0,
        "Agent": "edu.brown.cs.systems.xtrace.logging.BaggageWrappers",
        "ProcessName": "Data",
        "TaskID": "1890C6AB15B85211",
        "ParentEventID": [
          "BE76019275271EFB"
        ],
        "Label": "Forking current baggage with Baggage.fork()",
        "Title": "X-Trace Task",
        "Host": "pinky21.mpi-sws.org",
        "HRT": 10808756457002516,
        "Operation": "fork",
        "Timestamp": "1557746086690.822021",
        "TenantClass": 0,
        "Source": "DataXceiver.java:1257",
        "ThreadID": 14875,
        "ThreadName": "",
        "EventID": "B896D1B0EBB2BD41",
        "BaggageBytes": "[[248 5] [240 0] [0 24 144 198 171 21 184 82 17] [240 1] [0 190 118 1 146 117 39 30 251] [240 3] [0 2]]",
        "ProcessID": 20775
      },
      {
        "Cycles": 0,
        "Agent": "edu.brown.cs.systems.xtrace.logging.BaggageWrappers",
        "ProcessName": "Data",
        "TaskID": "1890C6AB15B85211",
        "ParentEventID": [
          "B896D1B0EBB2BD41"
        ],
        "Label": "Forking current baggage with Baggage.fork()",
        "Title": "X-Trace Task",
        "Host": "pinky21.mpi-sws.org",
        "HRT": 10808756457168992,
        "Operation": "fork",
        "Timestamp": "1557746086690.988525",
        "TenantClass": 0,
        "Source": "PacketHeader.java:95",
        "ThreadID": 14875,
        "ThreadName": "",
        "EventID": "12BCA07685E9E3DD",
        "BaggageBytes": "[[248 5] [240 0] [0 24 144 198 171 21 184 82 17] [240 1] [0 184 150 209 176 235 178 189 65] [240 3] [0 2]]",
        "ProcessID": 20775
      },
      {
        "Cycles": 0,
        "Agent": "edu.brown.cs.systems.xtrace.logging.XTraceInit",
        "ProcessName": "Data",
        "TaskID": "1890C6AB15B85211",
        "ParentEventID": [
          "07B3E51B83E265AA"
        ],
        "Label": "Thread.setName: DataXceiver for client DFSClient_NONMAPREDUCE_778905418_1 at /139.19.171.63:35320 [Sending block BP-1633380353-139.19.171.63-1554193446451:blk_1073756539_15715]",
        "Title": "X-Trace Task",
        "Host": "pinky21.mpi-sws.org",
        "HRT": 10808756456824392,
        "Timestamp": "1557746086690.643799",
        "TenantClass": 0,
        "Source": "DataXceiver.java:168",
        "ThreadID": 14875,
        "ThreadName": "",
        "EventID": "BE76019275271EFB",
        "BaggageBytes": "[[248 5] [240 0] [0 24 144 198 171 21 184 82 17] [240 1] [0 7 179 229 27 131 226 101 170] [240 3] [0 2]]",
        "ProcessID": 20775
      },
      {
        "Cycles": 0,
        "Agent": "Execution-Sleep",
        "ProcessName": "Read",
        "TaskID": "1890C6AB15B85211",
        "ParentEventID": [
          "9D49E9EFFCD00002"
        ],
        "Label": "waited",
        "Title": "X-Trace Task",
        "Host": "pinky19.mpi-sws.org",
        "Duration": "684851",
        "HRT": 26962446750872671,
        "Operation": "waited",
        "Timestamp": "1557746086690.979248",
        "TenantClass": 0,
        "Source": "SocketIOWithTimeout.java:335",
        "ThreadID": 1,
        "ThreadName": "",
        "EventID": "96A505F2DDA5F6DB",
        "ProcessID": 36430
      },
      {
        "Cycles": 0,
        "Agent": "Execution-Sleep",
        "ProcessName": "Data",
        "TaskID": "1890C6AB15B85211",
        "ParentEventID": [
          "12BCA07685E9E3DD"
        ],
        "Label": "waited",
        "Title": "X-Trace Task",
        "Host": "pinky21.mpi-sws.org",
        "Duration": "7710",
        "HRT": 10808756457297966,
        "Operation": "waited",
        "Timestamp": "1557746086691.117432",
        "TenantClass": 0,
        "Source": "SocketIOWithTimeout.java:335",
        "ThreadID": 14875,
        "ThreadName": "",
        "EventID": "6B5CC61349CA5C0F",
        "BaggageBytes": "[[248 5] [240 0] [0 24 144 198 171 21 184 82 17] [240 1] [0 18 188 160 118 133 233 227 221] [240 3] [0 2]]",
        "ProcessID": 20775
      },
      {
        "Cycles": 0,
        "Agent": "edu.brown.cs.systems.xtrace.logging.BaggageWrappers",
        "ProcessName": "Read",
        "TaskID": "1890C6AB15B85211",
        "ParentEventID": [
          "96A505F2DDA5F6DB",
          "B896D1B0EBB2BD41"
        ],
        "Label": "Merged current baggage with other baggage",
        "Title": "X-Trace Task",
        "Host": "pinky19.mpi-sws.org",
        "HRT": 26962446751018165,
        "Operation": "join",
        "Timestamp": "1557746086691.124756",
        "TenantClass": 0,
        "Source": "RemoteBlockReader2.java:429",
        "ThreadID": 1,
        "ThreadName": "",
        "EventID": "277971C80B57A95C",
        "ProcessID": 36430
      },
      {
        "Cycles": 0,
        "Agent": "edu.brown.cs.systems.xtrace.logging.BaggageWrappers",
        "ProcessName": "Data",
        "TaskID": "1890C6AB15B85211",
        "ParentEventID": [
          "6B5CC61349CA5C0F"
        ],
        "Label": "Forking current baggage with Baggage.fork()",
        "Title": "X-Trace Task",
        "Host": "pinky21.mpi-sws.org",
        "HRT": 10808756457411826,
        "Operation": "fork",
        "Timestamp": "1557746086691.231201",
        "TenantClass": 0,
        "Source": "PacketHeader.java:95",
        "ThreadID": 14875,
        "ThreadName": "",
        "EventID": "A9D46E9B2A7E9E1A",
        "BaggageBytes": "[[248 5] [240 0] [0 24 144 198 171 21 184 82 17] [240 1] [0 107 92 198 19 73 202 92 15] [240 3] [0 2]]",
        "ProcessID": 20775
      },
      {
        "Cycles": 0,
        "Agent": "edu.brown.cs.systems.xtrace.logging.BaggageWrappers",
        "ProcessName": "Read",
        "TaskID": "1890C6AB15B85211",
        "ParentEventID": [
          "A61ECCFE98B4D9F4",
          "12BCA07685E9E3DD"
        ],
        "Label": "Merged current baggage with other baggage",
        "Title": "X-Trace Task",
        "Host": "pinky19.mpi-sws.org",
        "HRT": 26962446751306883,
        "Operation": "join",
        "Timestamp": "1557746086691.413330",
        "TenantClass": 0,
        "Source": "PacketHeader.java:168",
        "ThreadID": 1,
        "ThreadName": "",
        "EventID": "0D3AF720767C9326",
        "ProcessID": 36430
      },
      {
        "Cycles": 0,
        "Agent": "Execution-Sleep",
        "ProcessName": "Read",
        "TaskID": "1890C6AB15B85211",
        "ParentEventID": [
          "277971C80B57A95C"
        ],
        "Label": "waited",
        "Title": "X-Trace Task",
        "Host": "pinky19.mpi-sws.org",
        "Duration": "89894",
        "HRT": 26962446751238386,
        "Operation": "waited",
        "Timestamp": "1557746086691.344971",
        "TenantClass": 0,
        "Source": "SocketIOWithTimeout.java:335",
        "ThreadID": 1,
        "ThreadName": "",
        "EventID": "A61ECCFE98B4D9F4",
        "ProcessID": 36430
      },
      {
        "Cycles": 0,
        "Agent": "edu.brown.cs.systems.xtrace.logging.BaggageWrappers",
        "ProcessName": "Read",
        "TaskID": "1890C6AB15B85211",
        "ParentEventID": [
          "5C5B0BC5AE3CAACF"
        ],
        "Label": "Forking current baggage with Baggage.fork()",
        "Title": "X-Trace Task",
        "Host": "pinky19.mpi-sws.org",
        "HRT": 26962446751412951,
        "Operation": "fork",
        "Timestamp": "1557746086691.519531",
        "TenantClass": 0,
        "Source": "RemoteBlockReader2.java:361",
        "ThreadID": 1,
        "ThreadName": "",
        "EventID": "BBD821E1DA7B66C6",
        "ProcessID": 36430
      },
      {
        "Cycles": 0,
        "Agent": "edu.brown.cs.systems.xtrace.logging.BaggageWrappers",
        "ProcessName": "Read",
        "TaskID": "1890C6AB15B85211",
        "ParentEventID": [
          "A9D46E9B2A7E9E1A",
          "0D3AF720767C9326"
        ],
        "Label": "Merged current baggage with other baggage",
        "Title": "X-Trace Task",
        "Host": "pinky19.mpi-sws.org",
        "HRT": 26962446751393000,
        "Operation": "join",
        "Timestamp": "1557746086691.499512",
        "TenantClass": 0,
        "Source": "PacketHeader.java:168",
        "ThreadID": 1,
        "ThreadName": "",
        "EventID": "5C5B0BC5AE3CAACF",
        "ProcessID": 36430
      },
      {
        "Cycles": 0,
        "Agent": "Execution-Sleep",
        "ProcessName": "Data",
        "TaskID": "1890C6AB15B85211",
        "ParentEventID": [
          "A9D46E9B2A7E9E1A"
        ],
        "Label": "waited",
        "Title": "X-Trace Task",
        "Host": "pinky21.mpi-sws.org",
        "Duration": "257995",
        "HRT": 10808756457834905,
        "Operation": "waited",
        "Timestamp": "1557746086691.654297",
        "TenantClass": 0,
        "Source": "SocketIOWithTimeout.java:335",
        "ThreadID": 14875,
        "ThreadName": "",
        "EventID": "9AE14CD877D889F3",
        "BaggageBytes": "[[248 5] [240 0] [0 24 144 198 171 21 184 82 17] [240 1] [0 169 212 110 155 42 126 158 26] [240 3] [0 2]]",
        "ProcessID": 20775
      },
      {
        "Cycles": 0,
        "Agent": "edu.brown.cs.systems.xtrace.logging.BaggageWrappers",
        "ProcessName": "Data",
        "TaskID": "1890C6AB15B85211",
        "ParentEventID": [
          "9AE14CD877D889F3",
          "BBD821E1DA7B66C6"
        ],
        "Label": "Merged current baggage with other baggage",
        "Title": "X-Trace Task",
        "Host": "pinky21.mpi-sws.org",
        "HRT": 10808756457968172,
        "Operation": "join",
        "Timestamp": "1557746086691.787598",
        "TenantClass": 0,
        "Source": "DataXceiver.java:574",
        "ThreadID": 14875,
        "ThreadName": "",
        "EventID": "798AA0566CD9F91F",
        "BaggageBytes": "[[248 5] [240 0] [0 24 144 198 171 21 184 82 17] [240 1] [0 154 225 76 216 119 216 137 243] [0 187 216 33 225 218 123 102 198] [240 3] [0 2]]",
        "ProcessID": 20775
      },
      {
        "Cycles": 0,
        "Agent": "Execution-CPU",
        "ProcessName": "Data",
        "TaskID": "1890C6AB15B85211",
        "ParentEventID": [
          "798AA0566CD9F91F"
        ],
        "Label": "unset",
        "Title": "X-Trace Task",
        "Host": "pinky21.mpi-sws.org",
        "Duration": "1209694",
        "HRT": 10808756458005876,
        "Operation": "unset",
        "Timestamp": "1557746086691.825195",
        "TenantClass": 0,
        "Source": "DataXceiver.java:261",
        "ThreadID": 14875,
        "ThreadName": "",
        "EventID": "D93DBB62EBC74FAF",
        "BaggageBytes": "[[248 5] [240 0] [0 24 144 198 171 21 184 82 17] [240 1] [0 121 138 160 86 108 217 249 31] [240 3] [0 2]]",
        "ProcessID": 20775
      },
      {
        "Cycles": 0,
        "Agent": "edu.brown.cs.systems.retro.benchmarks.hdfs_client.Reader",
        "ProcessName": "Read",
        "TaskID": "1890C6AB15B85211",
        "ParentEventID": [
          "0"
        ],
        "Label": "Reading file",
        "Title": "X-Trace Task",
        "Host": "pinky19.mpi-sws.org",
        "HRT": 26962446748713271,
        "Timestamp": "1557746086688.819824",
        "TenantClass": 0,
        "ThreadID": 1,
        "ThreadName": "",
        "EventID": "13DBA7C2B72A76F2",
        "ProcessID": 36430,
        "Tag": [
          "reader_10kb",
          "Read Size: 10240"
        ]
      }
    ]
  }
]