[
  {
    "id": "45228F8B7384DAD4",
    "reports": [
      {
        "Cycles": 0,
        "Agent": "Execution-CPU",
        "ProcessName": "Read",
        "TaskID": "45228F8B7384DAD4",
        "ParentEventID": [
          "7FB1557A0E6A32BB"
        ],
        "Label": "unset",
        "Title": "X-Trace Task",
        "Host": "pinky19.mpi-sws.org",
        "Duration": "22279552",
        "HRT": 26962474381022418,
        "Operation": "unset",
        "Timestamp": "1557746114321.475586",
        "TenantClass": 0,
        "Source": "Client.java:1027",
        "ThreadID": 1,
        "ThreadName": "",
        "EventID": "5BF2A3CC2A506981",
        "ProcessID": 36430
      },
      {
        "Cycles": 0,
        "Agent": "org.apache.hadoop.ipc.ProtobufRpcEngine",
        "ProcessName": "Read",
        "TaskID": "45228F8B7384DAD4",
        "ParentEventID": [
          "1948EEAAFE964D81"
        ],
        "Label": "Invoking org.apache.hadoop.hdfs.protocol.ClientProtocol.getBlockLocations",
        "Title": "X-Trace Task",
        "Host": "pinky19.mpi-sws.org",
        "HRT": 26962474380990145,
        "Timestamp": "1557746114321.443115",
        "TenantClass": 0,
        "Source": "ProtobufRpcEngine.java:228",
        "ThreadID": 1,
        "ThreadName": "",
        "EventID": "7FB1557A0E6A32BB",
        "ProcessID": 36430
      },
      {
        "Cycles": 0,
        "Agent": "edu.brown.cs.systems.retro.benchmarks.hdfs_client.Reader",
        "ProcessName": "Read",
        "TaskID": "45228F8B7384DAD4",
        "ParentEventID": [
          "85BFBA3C02FF8BE2"
        ],
        "Label": "Reading file",
        "Title": "X-Trace Task",
        "Host": "pinky19.mpi-sws.org",
        "HRT": 26962474380955424,
        "Timestamp": "1557746114321.408447",
        "TenantClass": 0,
        "ThreadID": 1,
        "ThreadName": "",
        "EventID": "1948EEAAFE964D81",
        "ProcessID": 36430
      },
      {
        "Cycles": 0,
        "Agent": "Execution-CPU",
        "ProcessName": "Read",
        "TaskID": "45228F8B7384DAD4",
        "ParentEventID": [
          "5BF2A3CC2A506981"
        ],
        "Label": "set",
        "Title": "X-Trace Task",
        "Host": "pinky19.mpi-sws.org",
        "HRT": 26962474381065713,
        "Operation": "set",
        "Timestamp": "1557746114321.518799",
        "TenantClass": 0,
        "Source": "Client.java:1032",
        "ThreadID": 41,
        "ThreadName": "",
        "EventID": "0132AD77CDD39C73",
        "ProcessID": 36430
      },
      {
        "Cycles": 0,
        "Agent": "edu.brown.cs.systems.xtrace.logging.BaggageWrappers",
        "ProcessName": "Read",
        "TaskID": "45228F8B7384DAD4",
        "ParentEventID": [
          "0132AD77CDD39C73"
        ],
        "Label": "Forking current baggage with Baggage.fork()",
        "Title": "X-Trace Task",
        "Host": "pinky19.mpi-sws.org",
        "HRT": 26962474381085798,
        "Operation": "fork",
        "Timestamp": "1557746114321.538818",
        "TenantClass": 0,
        "Source": "Client.java:1043",
        "ThreadID": 41,
        "ThreadName": "",
        "EventID": "B1AE7A81337303A9",
        "ProcessID": 36430
      },
      {
        "Cycles": 0,
        "Agent": "Execution-CPU",
        "ProcessName": "Read",
        "TaskID": "45228F8B7384DAD4",
        "ParentEventID": [
          "B1AE7A81337303A9"
        ],
        "Label": "unset",
        "Title": "X-Trace Task",
        "Host": "pinky19.mpi-sws.org",
        "Duration": "78724",
        "HRT": 26962474381164269,
        "Operation": "unset",
        "Timestamp": "1557746114321.617432",
        "TenantClass": 0,
        "Source": "Client.java:1062",
        "ThreadID": 41,
        "ThreadName": "",
        "EventID": "99A89288A263F394",
        "ProcessID": 36430
      },
      {
        "Cycles": 0,
        "Agent": "Execution-CPU",
        "ProcessName": "Read",
        "TaskID": "45228F8B7384DAD4",
        "ParentEventID": [
          "99A89288A263F394"
        ],
        "Label": "set",
        "Title": "X-Trace Task",
        "Host": "pinky19.mpi-sws.org",
        "HRT": 26962474381194723,
        "Operation": "set",
        "Timestamp": "1557746114321.647705",
        "TenantClass": 0,
        "Source": "Client.java:1104",
        "ThreadID": 1,
        "ThreadName": "",
        "EventID": "CDA4A258ED267171",
        "ProcessID": 36430
      },
      {
        "Cycles": 0,
        "Agent": "Execution-CPU",
        "ProcessName": "Name",
        "TaskID": "45228F8B7384DAD4",
        "ParentEventID": [
          "B1AE7A81337303A9"
        ],
        "Label": "set",
        "Title": "X-Trace Task",
        "Host": "pinky19.mpi-sws.org",
        "HRT": 26962474381228809,
        "Operation": "set",
        "Timestamp": "1557746114321.692871",
        "TenantClass": 0,
        "Source": "Server.java:1840",
        "ThreadID": 48,
        "ThreadName": "",
        "EventID": "452F03E18B4B54AD",
        "BaggageBytes": "[[248 5] [240 0] [0 69 34 143 139 115 132 218 212] [240 1] [0 177 174 122 129 51 115 3 169] [240 3] [0 2]]",
        "ProcessID": 2171
      },
      {
        "Cycles": 0,
        "Agent": "edu.brown.cs.systems.xtrace.logging.BaggageWrappers",
        "ProcessName": "Name",
        "TaskID": "45228F8B7384DAD4",
        "ParentEventID": [
          "452F03E18B4B54AD"
        ],
        "Label": "Forking current baggage with Baggage.fork()",
        "Title": "X-Trace Task",
        "Host": "pinky19.mpi-sws.org",
        "HRT": 26962474381263589,
        "Operation": "fork",
        "Timestamp": "1557746114321.727539",
        "TenantClass": 0,
        "Source": "Server.java:550",
        "ThreadID": 48,
        "ThreadName": "",
        "EventID": "7F1B24E5BDB31F89",
        "BaggageBytes": "[[248 5] [240 0] [0 69 34 143 139 115 132 218 212] [240 1] [0 69 47 3 225 139 75 84 173] [240 3] [0 2]]",
        "ProcessID": 2171
      },
      {
        "Cycles": 0,
        "Agent": "Execution-CPU",
        "ProcessName": "Name",
        "TaskID": "45228F8B7384DAD4",
        "ParentEventID": [
          "7F1B24E5BDB31F89"
        ],
        "Label": "unset",
        "Title": "X-Trace Task",
        "Host": "pinky19.mpi-sws.org",
        "Duration": "24383",
        "HRT": 26962474381284088,
        "Operation": "unset",
        "Timestamp": "1557746114321.748047",
        "TenantClass": 0,
        "Source": "Server.java:1828",
        "ThreadID": 48,
        "ThreadName": "",
        "EventID": "A9D1C4248E8ECBEB",
        "BaggageBytes": "[[248 5] [240 0] [0 69 34 143 139 115 132 218 212] [240 1] [0 127 27 36 229 189 179 31 137] [240 3] [0 2]]",
        "ProcessID": 2171
      },
      {
        "Cycles": 0,
        "Agent": "Execution-CPU",
        "ProcessName": "Name",
        "TaskID": "45228F8B7384DAD4",
        "ParentEventID": [
          "7F1B24E5BDB31F89"
        ],
        "Label": "set",
        "Title": "X-Trace Task",
        "Host": "pinky19.mpi-sws.org",
        "HRT": 26962474381292856,
        "Operation": "set",
        "Timestamp": "1557746114321.756836",
        "TenantClass": 0,
        "Source": "Server.java:2071",
        "ThreadID": 57,
        "ThreadName": "",
        "EventID": "F969BCF0E2440866",
        "BaggageBytes": "[[248 5] [240 0] [0 69 34 143 139 115 132 218 212] [240 1] [0 127 27 36 229 189 179 31 137] [240 3] [0 2]]",
        "ProcessID": 2171
      },
      {
        "Cycles": 0,
        "Agent": "org.apache.hadoop.hdfs.server.namenode.FSNamesystem.audit",
        "ProcessName": "Name",
        "TaskID": "45228F8B7384DAD4",
        "ParentEventID": [
          "01B4A97D2088CC87"
        ],
        "Label": "allowed=true\tugi=plascas (auth:SIMPLE)\tip=/139.19.171.63\tcmd=open\tsrc=/ds/JZeOy8d2Hez9kPPm\tdst=null\tperm=null\tproto=rpc",
        "Title": "X-Trace Task",
        "Host": "pinky19.mpi-sws.org",
        "HRT": 26962474381371009,
        "Timestamp": "1557746114321.834961",
        "TenantClass": 0,
        "Source": "FSNamesystem.java:8313",
        "ThreadID": 57,
        "ThreadName": "",
        "EventID": "ED1EB487081A6A44",
        "BaggageBytes": "[[248 5] [240 0] [0 69 34 143 139 115 132 218 212] [240 1] [0 1 180 169 125 32 136 204 135] [240 3] [0 2]]",
        "ProcessID": 2171
      },
      {
        "Cycles": 0,
        "Agent": "org.apache.hadoop.ipc.Server",
        "ProcessName": "Name",
        "TaskID": "45228F8B7384DAD4",
        "ParentEventID": [
          "F969BCF0E2440866"
        ],
        "Label": "getBlockLocations in org.apache.hadoop.hdfs.protocol.ClientProtocol",
        "Title": "X-Trace Task",
        "Host": "pinky19.mpi-sws.org",
        "HRT": 26962474381327531,
        "Timestamp": "1557746114321.791504",
        "TenantClass": 0,
        "Source": "ProtobufRpcEngine.java:601",
        "ThreadID": 57,
        "ThreadName": "",
        "EventID": "01B4A97D2088CC87",
        "BaggageBytes": "[[248 5] [240 0] [0 69 34 143 139 115 132 218 212] [240 1] [0 249 105 188 240 226 68 8 102] [240 3] [0 2]]",
        "ProcessID": 2171
      },
      {
        "Cycles": 0,
        "Agent": "edu.brown.cs.systems.xtrace.logging.BaggageWrappers",
        "ProcessName": "Name",
        "TaskID": "45228F8B7384DAD4",
        "ParentEventID": [
          "ED1EB487081A6A44"
        ],
        "Label": "Forking current baggage with Baggage.fork()",
        "Title": "X-Trace Task",
        "Host": "pinky19.mpi-sws.org",
        "HRT": 26962474381415834,
        "Operation": "fork",
        "Timestamp": "1557746114321.879883",
        "TenantClass": 0,
        "Source": "Server.java:2398",
        "ThreadID": 57,
        "ThreadName": "",
        "EventID": "55284294004DAE14",
        "BaggageBytes": "[[248 5] [240 0] [0 69 34 143 139 115 132 218 212] [240 1] [0 237 30 180 135 8 26 106 68] [240 3] [0 2]]",
        "ProcessID": 2171
      },
      {
        "Cycles": 0,
        "Agent": "Execution-CPU",
        "ProcessName": "Read",
        "TaskID": "45228F8B7384DAD4",
        "ParentEventID": [
          "55284294004DAE14"
        ],
        "Label": "set",
        "Title": "X-Trace Task",
        "Host": "pinky19.mpi-sws.org",
        "HRT": 26962474381580565,
        "Operation": "set",
        "Timestamp": "1557746114322.033691",
        "TenantClass": 0,
        "Source": "Client.java:302",
        "ThreadID": 37,
        "ThreadName": "",
        "EventID": "91C192BA9C3E66E3",
        "ProcessID": 36430
      },
      {
        "Cycles": 0,
        "Agent": "Execution-CPU",
        "ProcessName": "Name",
        "TaskID": "45228F8B7384DAD4",
        "ParentEventID": [
          "55284294004DAE14"
        ],
        "Label": "unset",
        "Title": "X-Trace Task",
        "Host": "pinky19.mpi-sws.org",
        "Duration": "207466",
        "HRT": 26962474381524283,
        "Operation": "unset",
        "Timestamp": "1557746114321.988281",
        "TenantClass": 0,
        "Source": "Server.java:1058",
        "ThreadID": 57,
        "ThreadName": "",
        "EventID": "2FC4AFA3EE196CA3",
        "BaggageBytes": "[[248 5] [240 0] [0 69 34 143 139 115 132 218 212] [240 1] [0 85 40 66 148 0 77 174 20] [240 3] [0 2]]",
        "ProcessID": 2171
      },
      {
        "Cycles": 0,
        "Agent": "Execution-CPU",
        "ProcessName": "Read",
        "TaskID": "45228F8B7384DAD4",
        "ParentEventID": [
          "91C192BA9C3E66E3"
        ],
        "Label": "unset",
        "Title": "X-Trace Task",
        "Host": "pinky19.mpi-sws.org",
        "Duration": "12281",
        "HRT": 26962474381611425,
        "Operation": "unset",
        "Timestamp": "1557746114322.064453",
        "TenantClass": 0,
        "Source": "Client.java:1168",
        "ThreadID": 37,
        "ThreadName": "",
        "EventID": "12DD6D30488A0AB2",
        "ProcessID": 36430
      },
      {
        "Cycles": 0,
        "Agent": "edu.brown.cs.systems.xtrace.logging.BaggageWrappers",
        "ProcessName": "Read",
        "TaskID": "45228F8B7384DAD4",
        "ParentEventID": [
          "4469524B1E860AC1",
          "12DD6D30488A0AB2"
        ],
        "Label": "Merged current baggage with other baggage",
        "Title": "X-Trace Task",
        "Host": "pinky19.mpi-sws.org",
        "HRT": 26962474381645083,
        "Operation": "join",
        "Timestamp": "1557746114322.098145",
        "TenantClass": 0,
        "Source": "Client.java:1545",
        "ThreadID": 1,
        "ThreadName": "",
        "EventID": "4D051EBFA10283B0",
        "ProcessID": 36430
      },
      {
        "Cycles": 0,
        "Agent": "Execution-Sleep",
        "ProcessName": "Read",
        "TaskID": "45228F8B7384DAD4",
        "ParentEventID": [
          "CDA4A258ED267171"
        ],
        "Label": "waited",
        "Title": "X-Trace Task",
        "Host": "pinky19.mpi-sws.org",
        "Duration": "419377",
        "HRT": 26962474381630822,
        "Operation": "waited",
        "Timestamp": "1557746114322.083984",
        "TenantClass": 0,
        "Source": "Client.java:1537",
        "ThreadID": 1,
        "ThreadName": "",
        "EventID": "4469524B1E860AC1",
        "ProcessID": 36430
      },
      {
        "Cycles": 0,
        "Agent": "org.apache.hadoop.ipc.ProtobufRpcEngine",
        "ProcessName": "Read",
        "TaskID": "45228F8B7384DAD4",
        "ParentEventID": [
          "4D051EBFA10283B0"
        ],
        "Label": "org.apache.hadoop.hdfs.protocol.ClientProtocol.getBlockLocations completed",
        "Title": "X-Trace Task",
        "Host": "pinky19.mpi-sws.org",
        "HRT": 26962474381687182,
        "Timestamp": "1557746114322.140137",
        "TenantClass": 0,
        "Source": "ProtobufRpcEngine.java:275",
        "ThreadID": 1,
        "ThreadName": "",
        "EventID": "74B4775ACC84ECD3",
        "ProcessID": 36430
      },
      {
        "Cycles": 0,
        "Agent": "Execution-CPU",
        "ProcessName": "Data",
        "TaskID": "45228F8B7384DAD4",
        "ParentEventID": [
          "18E4A17E3585635B"
        ],
        "Label": "set",
        "Title": "X-Trace Task",
        "Host": "pinky26.mpi-sws.org",
        "HRT": 47512131111989261,
        "Operation": "set",
        "Timestamp": "1557746114322.589844",
        "TenantClass": 0,
        "Source": "Receiver.java:117",
        "ThreadID": 8227,
        "ThreadName": "",
        "EventID": "BBAE12028ACC7045",
        "BaggageBytes": "[[248 5] [240 0] [0 69 34 143 139 115 132 218 212] [240 1] [0 24 228 161 126 53 133 99 91] [240 3] [0 2]]",
        "ProcessID": 17069
      },
      {
        "Cycles": 0,
        "Agent": "edu.brown.cs.systems.xtrace.logging.BaggageWrappers",
        "ProcessName": "Read",
        "TaskID": "45228F8B7384DAD4",
        "ParentEventID": [
          "74B4775ACC84ECD3"
        ],
        "Label": "Forking current baggage with Baggage.fork()",
        "Title": "X-Trace Task",
        "Host": "pinky19.mpi-sws.org",
        "HRT": 26962474381771398,
        "Operation": "fork",
        "Timestamp": "1557746114322.224365",
        "TenantClass": 0,
        "Source": "DataTransferProtoUtil.java:94",
        "ThreadID": 1,
        "ThreadName": "",
        "EventID": "18E4A17E3585635B",
        "ProcessID": 36430
      },
      {
        "Cycles": 0,
        "Agent": "edu.brown.cs.systems.xtrace.logging.XTraceInit",
        "ProcessName": "Data",
        "TaskID": "45228F8B7384DAD4",
        "ParentEventID": [
          "BBAE12028ACC7045"
        ],
        "Label": "Thread.setName: DataXceiver for client DFSClient_NONMAPREDUCE_778905418_1 at /139.19.171.63:36880 [Sending block BP-1633380353-139.19.171.63-1554193446451:blk_1073765092_24268]",
        "Title": "X-Trace Task",
        "Host": "pinky26.mpi-sws.org",
        "HRT": 47512131112119022,
        "Timestamp": "1557746114322.719727",
        "TenantClass": 0,
        "Source": "DataXceiver.java:168",
        "ThreadID": 8227,
        "ThreadName": "",
        "EventID": "8572900A75A68322",
        "BaggageBytes": "[[248 5] [240 0] [0 69 34 143 139 115 132 218 212] [240 1] [0 187 174 18 2 138 204 112 69] [240 3] [0 2]]",
        "ProcessID": 17069
      },
      {
        "Cycles": 0,
        "Agent": "edu.brown.cs.systems.retro.benchmarks.hdfs_client.Reader",
        "ProcessName": "Read",
        "TaskID": "45228F8B7384DAD4",
        "ParentEventID": [
          "0"
        ],
        "Label": "Reading file",
        "Title": "X-Trace Task",
        "Host": "pinky19.mpi-sws.org",
        "HRT": 26962474380938884,
        "Timestamp": "1557746114321.391846",
        "TenantClass": 0,
        "ThreadID": 1,
        "ThreadName": "",
        "EventID": "85BFBA3C02FF8BE2",
        "ProcessID": 36430,
        "Tag": [
          "reader_10kb",
          "Read Size: 10240"
        ]
      },
      {
        "Cycles": 0,
        "Agent": "edu.brown.cs.systems.xtrace.logging.BaggageWrappers",
        "ProcessName": "Data",
        "TaskID": "45228F8B7384DAD4",
        "ParentEventID": [
          "8572900A75A68322"
        ],
        "Label": "Forking current baggage with Baggage.fork()",
        "Title": "X-Trace Task",
        "Host": "pinky26.mpi-sws.org",
        "HRT": 47512131131276577,
        "Operation": "fork",
        "Timestamp": "1557746114341.877197",
        "TenantClass": 0,
        "Source": "DataXceiver.java:1257",
        "ThreadID": 8227,
        "ThreadName": "",
        "EventID": "A72BF38122FBF89B",
        "BaggageBytes": "[[248 5] [240 0] [0 69 34 143 139 115 132 218 212] [240 1] [0 133 114 144 10 117 166 131 34] [240 3] [0 2]]",
        "ProcessID": 17069
      },
      {
        "Cycles": 0,
        "Agent": "Execution-Sleep",
        "ProcessName": "Read",
        "TaskID": "45228F8B7384DAD4",
        "ParentEventID": [
          "18E4A17E3585635B"
        ],
        "Label": "waited",
        "Title": "X-Trace Task",
        "Host": "pinky19.mpi-sws.org",
        "Duration": "19853746",
        "HRT": 26962474401720562,
        "Operation": "waited",
        "Timestamp": "1557746114342.173584",
        "TenantClass": 0,
        "Source": "SocketIOWithTimeout.java:335",
        "ThreadID": 1,
        "ThreadName": "",
        "EventID": "BDF31CE265BE3DE5",
        "ProcessID": 36430
      },
      {
        "Cycles": 0,
        "Agent": "edu.brown.cs.systems.xtrace.logging.BaggageWrappers",
        "ProcessName": "Data",
        "TaskID": "45228F8B7384DAD4",
        "ParentEventID": [
          "A72BF38122FBF89B"
        ],
        "Label": "Forking current baggage with Baggage.fork()",
        "Title": "X-Trace Task",
        "Host": "pinky26.mpi-sws.org",
        "HRT": 47512131131586725,
        "Operation": "fork",
        "Timestamp": "1557746114342.187500",
        "TenantClass": 0,
        "Source": "PacketHeader.java:95",
        "ThreadID": 8227,
        "ThreadName": "",
        "EventID": "3960BE604D76E71D",
        "BaggageBytes": "[[248 5] [240 0] [0 69 34 143 139 115 132 218 212] [240 1] [0 167 43 243 129 34 251 248 155] [240 3] [0 2]]",
        "ProcessID": 17069
      },
      {
        "Cycles": 0,
        "Agent": "edu.brown.cs.systems.xtrace.logging.BaggageWrappers",
        "ProcessName": "Read",
        "TaskID": "45228F8B7384DAD4",
        "ParentEventID": [
          "A72BF38122FBF89B",
          "BDF31CE265BE3DE5"
        ],
        "Label": "Merged current baggage with other baggage",
        "Title": "X-Trace Task",
        "Host": "pinky19.mpi-sws.org",
        "HRT": 26962474401799911,
        "Operation": "join",
        "Timestamp": "1557746114342.252930",
        "TenantClass": 0,
        "Source": "RemoteBlockReader2.java:429",
        "ThreadID": 1,
        "ThreadName": "",
        "EventID": "3FF034A3272F19D2",
        "ProcessID": 36430
      },
      {
        "Cycles": 0,
        "Agent": "Execution-Sleep",
        "ProcessName": "Read",
        "TaskID": "45228F8B7384DAD4",
        "ParentEventID": [
          "3FF034A3272F19D2"
        ],
        "Label": "waited",
        "Title": "X-Trace Task",
        "Host": "pinky19.mpi-sws.org",
        "Duration": "4671",
        "HRT": 26962474401869623,
        "Operation": "waited",
        "Timestamp": "1557746114342.322754",
        "TenantClass": 0,
        "Source": "SocketIOWithTimeout.java:335",
        "ThreadID": 1,
        "ThreadName": "",
        "EventID": "0B8300E34FDEB60B",
        "ProcessID": 36430
      },
      {
        "Cycles": 0,
        "Agent": "Execution-Sleep",
        "ProcessName": "Data",
        "TaskID": "45228F8B7384DAD4",
        "ParentEventID": [
          "3960BE604D76E71D"
        ],
        "Label": "waited",
        "Title": "X-Trace Task",
        "Host": "pinky26.mpi-sws.org",
        "Duration": "14125",
        "HRT": 47512131131761465,
        "Operation": "waited",
        "Timestamp": "1557746114342.362061",
        "TenantClass": 0,
        "Source": "SocketIOWithTimeout.java:335",
        "ThreadID": 8227,
        "ThreadName": "",
        "EventID": "70F95781007F6F51",
        "BaggageBytes": "[[248 5] [240 0] [0 69 34 143 139 115 132 218 212] [240 1] [0 57 96 190 96 77 118 231 29] [240 3] [0 2]]",
        "ProcessID": 17069
      },
      {
        "Cycles": 0,
        "Agent": "Execution-Sleep",
        "ProcessName": "Read",
        "TaskID": "45228F8B7384DAD4",
        "ParentEventID": [
          "0B8300E34FDEB60B"
        ],
        "Label": "waited",
        "Title": "X-Trace Task",
        "Host": "pinky19.mpi-sws.org",
        "Duration": "2517537",
        "HRT": 26962474404461865,
        "Operation": "waited",
        "Timestamp": "1557746114344.915039",
        "TenantClass": 0,
        "Source": "SocketIOWithTimeout.java:335",
        "ThreadID": 1,
        "ThreadName": "",
        "EventID": "F6CA67884E457B27",
        "ProcessID": 36430
      },
      {
        "Cycles": 0,
        "Agent": "edu.brown.cs.systems.xtrace.logging.BaggageWrappers",
        "ProcessName": "Data",
        "TaskID": "45228F8B7384DAD4",
        "ParentEventID": [
          "70F95781007F6F51"
        ],
        "Label": "Forking current baggage with Baggage.fork()",
        "Title": "X-Trace Task",
        "Host": "pinky26.mpi-sws.org",
        "HRT": 47512131134211848,
        "Operation": "fork",
        "Timestamp": "1557746114344.812500",
        "TenantClass": 0,
        "Source": "PacketHeader.java:95",
        "ThreadID": 8227,
        "ThreadName": "",
        "EventID": "7D2B5E7FC09DC281",
        "BaggageBytes": "[[248 5] [240 0] [0 69 34 143 139 115 132 218 212] [240 1] [0 112 249 87 129 0 127 111 81] [240 3] [0 2]]",
        "ProcessID": 17069
      },
      {
        "Cycles": 0,
        "Agent": "edu.brown.cs.systems.xtrace.logging.BaggageWrappers",
        "ProcessName": "Read",
        "TaskID": "45228F8B7384DAD4",
        "ParentEventID": [
          "F6CA67884E457B27",
          "3960BE604D76E71D"
        ],
        "Label": "Merged current baggage with other baggage",
        "Title": "X-Trace Task",
        "Host": "pinky19.mpi-sws.org",
        "HRT": 26962474404551497,
        "Operation": "join",
        "Timestamp": "1557746114345.004639",
        "TenantClass": 0,
        "Source": "PacketHeader.java:168",
        "ThreadID": 1,
        "ThreadName": "",
        "EventID": "A9D9E1E0E70C9709",
        "ProcessID": 36430
      },
      {
        "Cycles": 0,
        "Agent": "edu.brown.cs.systems.xtrace.logging.BaggageWrappers",
        "ProcessName": "Read",
        "TaskID": "45228F8B7384DAD4",
        "ParentEventID": [
          "A9D9E1E0E70C9709",
          "7D2B5E7FC09DC281"
        ],
        "Label": "Merged current baggage with other baggage",
        "Title": "X-Trace Task",
        "Host": "pinky19.mpi-sws.org",
        "HRT": 26962474404629585,
        "Operation": "join",
        "Timestamp": "1557746114345.082764",
        "TenantClass": 0,
        "Source": "PacketHeader.java:168",
        "ThreadID": 1,
        "ThreadName": "",
        "EventID": "DDAAF63580A0A269",
        "ProcessID": 36430
      },
      {
        "Cycles": 0,
        "Agent": "edu.brown.cs.systems.xtrace.logging.BaggageWrappers",
        "ProcessName": "Read",
        "TaskID": "45228F8B7384DAD4",
        "ParentEventID": [
          "DDAAF63580A0A269"
        ],
        "Label": "Forking current baggage with Baggage.fork()",
        "Title": "X-Trace Task",
        "Host": "pinky19.mpi-sws.org",
        "HRT": 26962474404641354,
        "Operation": "fork",
        "Timestamp": "1557746114345.094482",
        "TenantClass": 0,
        "Source": "RemoteBlockReader2.java:361",
        "ThreadID": 1,
        "ThreadName": "",
        "EventID": "3CD3BF91694AF0F4",
        "ProcessID": 36430
      },
      {
        "Cycles": 0,
        "Agent": "Execution-Sleep",
        "ProcessName": "Data",
        "TaskID": "45228F8B7384DAD4",
        "ParentEventID": [
          "7D2B5E7FC09DC281"
        ],
        "Label": "waited",
        "Title": "X-Trace Task",
        "Host": "pinky26.mpi-sws.org",
        "Duration": "171369",
        "HRT": 47512131134599922,
        "Operation": "waited",
        "Timestamp": "1557746114345.200684",
        "TenantClass": 0,
        "Source": "SocketIOWithTimeout.java:335",
        "ThreadID": 8227,
        "ThreadName": "",
        "EventID": "2301D91DBBFAAAE8",
        "BaggageBytes": "[[248 5] [240 0] [0 69 34 143 139 115 132 218 212] [240 1] [0 125 43 94 127 192 157 194 129] [240 3] [0 2]]",
        "ProcessID": 17069
      },
      {
        "Cycles": 0,
        "Agent": "edu.brown.cs.systems.xtrace.logging.BaggageWrappers",
        "ProcessName": "Data",
        "TaskID": "45228F8B7384DAD4",
        "ParentEventID": [
          "3CD3BF91694AF0F4",
          "2301D91DBBFAAAE8"
        ],
        "Label": "Merged current baggage with other baggage",
        "Title": "X-Trace Task",
        "Host": "pinky26.mpi-sws.org",
        "HRT": 47512131134764333,
        "Operation": "join",
        "Timestamp": "1557746114345.364990",
        "TenantClass": 0,
        "Source": "DataXceiver.java:574",
        "ThreadID": 8227,
        "ThreadName": "",
        "EventID": "8319A08BDD56A03B",
        "BaggageBytes": "[[248 5] [240 0] [0 69 34 143 139 115 132 218 212] [240 1] [0 35 1 217 29 187 250 170 232] [0 60 211 191 145 105 74 240 244] [240 3] [0 2]]",
        "ProcessID": 17069
      },
      {
        "Cycles": 0,
        "Agent": "Execution-CPU",
        "ProcessName": "Data",
        "TaskID": "45228F8B7384DAD4",
        "ParentEventID": [
          "8319A08BDD56A03B"
        ],
        "Label": "unset",
        "Title": "X-Trace Task",
        "Host": "pinky26.mpi-sws.org",
        "Duration": "22793456",
        "HRT": 47512131134842549,
        "Operation": "unset",
        "Timestamp": "1557746114345.443359",
        "TenantClass": 0,
        "Source": "DataXceiver.java:261",
        "ThreadID": 8227,
        "ThreadName": "",
        "EventID": "04AB1F463AFA6FE7",
        "BaggageBytes": "[[248 5] [240 0] [0 69 34 143 139 115 132 218 212] [240 1] [0 131 25 160 139 221 86 160 59] [240 3] [0 2]]",
        "ProcessID": 17069
      }
    ]
  }
]