[
  {
    "id": "E0400DD628D48C9E",
    "reports": [
      {
        "Cycles": 0,
        "Agent": "Execution-CPU",
        "ProcessName": "Read",
        "TaskID": "E0400DD628D48C9E",
        "ParentEventID": [
          "2691792543D37885"
        ],
        "Label": "unset",
        "Title": "X-Trace Task",
        "Host": "pinky19.mpi-sws.org",
        "Duration": "22290818",
        "HRT": 25491879516102164,
        "Operation": "unset",
        "Timestamp": "1556275519456.373535",
        "TenantClass": 0,
        "Source": "Client.java:1027",
        "ThreadID": 1,
        "ThreadName": "",
        "EventID": "8AA25C0C72E9FCD4",
        "ProcessID": 21035
      },
      {
        "Cycles": 0,
        "Agent": "org.apache.hadoop.ipc.ProtobufRpcEngine",
        "ProcessName": "Read",
        "TaskID": "E0400DD628D48C9E",
        "ParentEventID": [
          "AB4CD7D66DE3F337"
        ],
        "Label": "Invoking org.apache.hadoop.hdfs.protocol.ClientProtocol.getBlockLocations",
        "Title": "X-Trace Task",
        "Host": "pinky19.mpi-sws.org",
        "HRT": 25491879516078838,
        "Timestamp": "1556275519456.350098",
        "TenantClass": 0,
        "Source": "ProtobufRpcEngine.java:228",
        "ThreadID": 1,
        "ThreadName": "",
        "EventID": "2691792543D37885",
        "ProcessID": 21035
      },
      {
        "Cycles": 0,
        "Agent": "edu.brown.cs.systems.retro.benchmarks.hdfs_client.Reader",
        "ProcessName": "Read",
        "TaskID": "E0400DD628D48C9E",
        "ParentEventID": [
          "0"
        ],
        "Label": "Reading file",
        "Title": "X-Trace Task",
        "Host": "pinky19.mpi-sws.org",
        "HRT": 25491879516004732,
        "Timestamp": "1556275519456.276123",
        "TenantClass": 0,
        "ThreadID": 1,
        "ThreadName": "",
        "EventID": "AD666F3AF78A5652",
        "ProcessID": 21035,
        "Tag": [
          "reader_1kb",
          "Read Size: 1024"
        ]
      },
      {
        "Cycles": 0,
        "Agent": "Execution-CPU",
        "ProcessName": "Read",
        "TaskID": "E0400DD628D48C9E",
        "ParentEventID": [
          "8AA25C0C72E9FCD4"
        ],
        "Label": "set",
        "Title": "X-Trace Task",
        "Host": "pinky19.mpi-sws.org",
        "HRT": 25491879516169512,
        "Operation": "set",
        "Timestamp": "1556275519456.440918",
        "TenantClass": 0,
        "Source": "Client.java:1032",
        "ThreadID": 41,
        "ThreadName": "",
        "EventID": "E5B897B409415ED0",
        "ProcessID": 21035
      },
      {
        "Cycles": 0,
        "Agent": "edu.brown.cs.systems.xtrace.logging.BaggageWrappers",
        "ProcessName": "Read",
        "TaskID": "E0400DD628D48C9E",
        "ParentEventID": [
          "E5B897B409415ED0"
        ],
        "Label": "Forking current baggage with Baggage.fork()",
        "Title": "X-Trace Task",
        "Host": "pinky19.mpi-sws.org",
        "HRT": 25491879516202511,
        "Operation": "fork",
        "Timestamp": "1556275519456.473877",
        "TenantClass": 0,
        "Source": "Client.java:1043",
        "ThreadID": 41,
        "ThreadName": "",
        "EventID": "9FA22764AB8DD8C3",
        "ProcessID": 21035
      },
      {
        "Cycles": 0,
        "Agent": "Execution-CPU",
        "ProcessName": "Read",
        "TaskID": "E0400DD628D48C9E",
        "ParentEventID": [
          "9FA22764AB8DD8C3"
        ],
        "Label": "unset",
        "Title": "X-Trace Task",
        "Host": "pinky19.mpi-sws.org",
        "Duration": "74232",
        "HRT": 25491879516275148,
        "Operation": "unset",
        "Timestamp": "1556275519456.546387",
        "TenantClass": 0,
        "Source": "Client.java:1062",
        "ThreadID": 41,
        "ThreadName": "",
        "EventID": "10E155141062E97C",
        "ProcessID": 21035
      },
      {
        "Cycles": 0,
        "Agent": "Execution-CPU",
        "ProcessName": "Read",
        "TaskID": "E0400DD628D48C9E",
        "ParentEventID": [
          "10E155141062E97C"
        ],
        "Label": "set",
        "Title": "X-Trace Task",
        "Host": "pinky19.mpi-sws.org",
        "HRT": 25491879516303653,
        "Operation": "set",
        "Timestamp": "1556275519456.574951",
        "TenantClass": 0,
        "Source": "Client.java:1104",
        "ThreadID": 1,
        "ThreadName": "",
        "EventID": "AB150A9019BBE25E",
        "ProcessID": 21035
      },
      {
        "Cycles": 0,
        "Agent": "edu.brown.cs.systems.xtrace.logging.BaggageWrappers",
        "ProcessName": "Name",
        "TaskID": "E0400DD628D48C9E",
        "ParentEventID": [
          "C3CFCC6CBC51CCF7"
        ],
        "Label": "Forking current baggage with Baggage.fork()",
        "Title": "X-Trace Task",
        "Host": "pinky19.mpi-sws.org",
        "HRT": 25491879516379658,
        "Operation": "fork",
        "Timestamp": "1556275519456.669189",
        "TenantClass": 0,
        "Source": "Server.java:550",
        "ThreadID": 48,
        "ThreadName": "",
        "EventID": "37F8952DD41CD828",
        "BaggageBytes": "[[248 5] [240 0] [0 224 64 13 214 40 212 140 158] [240 1] [0 195 207 204 108 188 81 204 247] [240 3] [0 2]]",
        "ProcessID": 2171
      },
      {
        "Cycles": 0,
        "Agent": "Execution-CPU",
        "ProcessName": "Name",
        "TaskID": "E0400DD628D48C9E",
        "ParentEventID": [
          "37F8952DD41CD828"
        ],
        "Label": "unset",
        "Title": "X-Trace Task",
        "Host": "pinky19.mpi-sws.org",
        "Duration": "27566",
        "HRT": 25491879516403701,
        "Operation": "unset",
        "Timestamp": "1556275519456.693359",
        "TenantClass": 0,
        "Source": "Server.java:1828",
        "ThreadID": 48,
        "ThreadName": "",
        "EventID": "CE5423FB2C345D15",
        "BaggageBytes": "[[248 5] [240 0] [0 224 64 13 214 40 212 140 158] [240 1] [0 55 248 149 45 212 28 216 40] [240 3] [0 2]]",
        "ProcessID": 2171
      },
      {
        "Cycles": 0,
        "Agent": "Execution-CPU",
        "ProcessName": "Name",
        "TaskID": "E0400DD628D48C9E",
        "ParentEventID": [
          "37F8952DD41CD828"
        ],
        "Label": "set",
        "Title": "X-Trace Task",
        "Host": "pinky19.mpi-sws.org",
        "HRT": 25491879516414376,
        "Operation": "set",
        "Timestamp": "1556275519456.704102",
        "TenantClass": 0,
        "Source": "Server.java:2071",
        "ThreadID": 61,
        "ThreadName": "",
        "EventID": "2A35F4BBE7C63FC0",
        "BaggageBytes": "[[248 5] [240 0] [0 224 64 13 214 40 212 140 158] [240 1] [0 55 248 149 45 212 28 216 40] [240 3] [0 2]]",
        "ProcessID": 2171
      },
      {
        "Cycles": 0,
        "Agent": "Execution-CPU",
        "ProcessName": "Name",
        "TaskID": "E0400DD628D48C9E",
        "ParentEventID": [
          "9FA22764AB8DD8C3"
        ],
        "Label": "set",
        "Title": "X-Trace Task",
        "Host": "pinky19.mpi-sws.org",
        "HRT": 25491879516349141,
        "Operation": "set",
        "Timestamp": "1556275519456.638916",
        "TenantClass": 0,
        "Source": "Server.java:1840",
        "ThreadID": 48,
        "ThreadName": "",
        "EventID": "C3CFCC6CBC51CCF7",
        "BaggageBytes": "[[248 5] [240 0] [0 224 64 13 214 40 212 140 158] [240 1] [0 159 162 39 100 171 141 216 195] [240 3] [0 2]]",
        "ProcessID": 2171
      },
      {
        "Cycles": 0,
        "Agent": "org.apache.hadoop.ipc.Server",
        "ProcessName": "Name",
        "TaskID": "E0400DD628D48C9E",
        "ParentEventID": [
          "2A35F4BBE7C63FC0"
        ],
        "Label": "getBlockLocations in org.apache.hadoop.hdfs.protocol.ClientProtocol",
        "Title": "X-Trace Task",
        "Host": "pinky19.mpi-sws.org",
        "HRT": 25491879516451463,
        "Timestamp": "1556275519456.741211",
        "TenantClass": 0,
        "Source": "ProtobufRpcEngine.java:601",
        "ThreadID": 61,
        "ThreadName": "",
        "EventID": "A1154D7F0B16B798",
        "BaggageBytes": "[[248 5] [240 0] [0 224 64 13 214 40 212 140 158] [240 1] [0 42 53 244 187 231 198 63 192] [240 3] [0 2]]",
        "ProcessID": 2171
      },
      {
        "Cycles": 0,
        "Agent": "edu.brown.cs.systems.xtrace.logging.BaggageWrappers",
        "ProcessName": "Name",
        "TaskID": "E0400DD628D48C9E",
        "ParentEventID": [
          "875A7033DCA40DFD"
        ],
        "Label": "Forking current baggage with Baggage.fork()",
        "Title": "X-Trace Task",
        "Host": "pinky19.mpi-sws.org",
        "HRT": 25491879516552457,
        "Operation": "fork",
        "Timestamp": "1556275519456.842041",
        "TenantClass": 0,
        "Source": "Server.java:2398",
        "ThreadID": 61,
        "ThreadName": "",
        "EventID": "C17520CC118CD6E3",
        "BaggageBytes": "[[248 5] [240 0] [0 224 64 13 214 40 212 140 158] [240 1] [0 135 90 112 51 220 164 13 253] [240 3] [0 2]]",
        "ProcessID": 2171
      },
      {
        "Cycles": 0,
        "Agent": "org.apache.hadoop.hdfs.server.namenode.FSNamesystem.audit",
        "ProcessName": "Name",
        "TaskID": "E0400DD628D48C9E",
        "ParentEventID": [
          "A1154D7F0B16B798"
        ],
        "Label": "allowed=true\tugi=plascas (auth:SIMPLE)\tip=/139.19.171.63\tcmd=open\tsrc=/ds/Sic6JD1yuQYDMFC2\tdst=null\tperm=null\tproto=rpc",
        "Title": "X-Trace Task",
        "Host": "pinky19.mpi-sws.org",
        "HRT": 25491879516503567,
        "Timestamp": "1556275519456.793213",
        "TenantClass": 0,
        "Source": "FSNamesystem.java:8313",
        "ThreadID": 61,
        "ThreadName": "",
        "EventID": "875A7033DCA40DFD",
        "BaggageBytes": "[[248 5] [240 0] [0 224 64 13 214 40 212 140 158] [240 1] [0 161 21 77 127 11 22 183 152] [240 3] [0 2]]",
        "ProcessID": 2171
      },
      {
        "Cycles": 0,
        "Agent": "Execution-CPU",
        "ProcessName": "Name",
        "TaskID": "E0400DD628D48C9E",
        "ParentEventID": [
          "C17520CC118CD6E3"
        ],
        "Label": "unset",
        "Title": "X-Trace Task",
        "Host": "pinky19.mpi-sws.org",
        "Duration": "234721",
        "HRT": 25491879516671365,
        "Operation": "unset",
        "Timestamp": "1556275519456.960938",
        "TenantClass": 0,
        "Source": "Server.java:1058",
        "ThreadID": 61,
        "ThreadName": "",
        "EventID": "52B337C51FDF614E",
        "BaggageBytes": "[[248 5] [240 0] [0 224 64 13 214 40 212 140 158] [240 1] [0 193 117 32 204 17 140 214 227] [240 3] [0 2]]",
        "ProcessID": 2171
      },
      {
        "Cycles": 0,
        "Agent": "Execution-CPU",
        "ProcessName": "Read",
        "TaskID": "E0400DD628D48C9E",
        "ParentEventID": [
          "C17520CC118CD6E3"
        ],
        "Label": "set",
        "Title": "X-Trace Task",
        "Host": "pinky19.mpi-sws.org",
        "HRT": 25491879516735711,
        "Operation": "set",
        "Timestamp": "1556275519457.007080",
        "TenantClass": 0,
        "Source": "Client.java:302",
        "ThreadID": 37,
        "ThreadName": "",
        "EventID": "9EA9B16B6E96A394",
        "ProcessID": 21035
      },
      {
        "Cycles": 0,
        "Agent": "Execution-CPU",
        "ProcessName": "Read",
        "TaskID": "E0400DD628D48C9E",
        "ParentEventID": [
          "9EA9B16B6E96A394"
        ],
        "Label": "unset",
        "Title": "X-Trace Task",
        "Host": "pinky19.mpi-sws.org",
        "Duration": "11817",
        "HRT": 25491879516766269,
        "Operation": "unset",
        "Timestamp": "1556275519457.037598",
        "TenantClass": 0,
        "Source": "Client.java:1168",
        "ThreadID": 37,
        "ThreadName": "",
        "EventID": "F5402A0946B10AC4",
        "ProcessID": 21035
      },
      {
        "Cycles": 0,
        "Agent": "edu.brown.cs.systems.xtrace.logging.BaggageWrappers",
        "ProcessName": "Read",
        "TaskID": "E0400DD628D48C9E",
        "ParentEventID": [
          "F5402A0946B10AC4",
          "2B0BDC85515A25B7"
        ],
        "Label": "Merged current baggage with other baggage",
        "Title": "X-Trace Task",
        "Host": "pinky19.mpi-sws.org",
        "HRT": 25491879516829265,
        "Operation": "join",
        "Timestamp": "1556275519457.100586",
        "TenantClass": 0,
        "Source": "Client.java:1545",
        "ThreadID": 1,
        "ThreadName": "",
        "EventID": "24EC8A51DFE6A9CB",
        "ProcessID": 21035
      },
      {
        "Cycles": 0,
        "Agent": "org.apache.hadoop.ipc.ProtobufRpcEngine",
        "ProcessName": "Read",
        "TaskID": "E0400DD628D48C9E",
        "ParentEventID": [
          "24EC8A51DFE6A9CB"
        ],
        "Label": "org.apache.hadoop.hdfs.protocol.ClientProtocol.getBlockLocations completed",
        "Title": "X-Trace Task",
        "Host": "pinky19.mpi-sws.org",
        "HRT": 25491879516871739,
        "Timestamp": "1556275519457.143066",
        "TenantClass": 0,
        "Source": "ProtobufRpcEngine.java:275",
        "ThreadID": 1,
        "ThreadName": "",
        "EventID": "DE7165B37CAC522F",
        "ProcessID": 21035
      },
      {
        "Cycles": 0,
        "Agent": "edu.brown.cs.systems.xtrace.logging.BaggageWrappers",
        "ProcessName": "Read",
        "TaskID": "E0400DD628D48C9E",
        "ParentEventID": [
          "DE7165B37CAC522F"
        ],
        "Label": "Forking current baggage with Baggage.fork()",
        "Title": "X-Trace Task",
        "Host": "pinky19.mpi-sws.org",
        "HRT": 25491879516954681,
        "Operation": "fork",
        "Timestamp": "1556275519457.226074",
        "TenantClass": 0,
        "Source": "DataTransferProtoUtil.java:94",
        "ThreadID": 1,
        "ThreadName": "",
        "EventID": "0BA49C82FB35EA34",
        "ProcessID": 21035
      },
      {
        "Cycles": 0,
        "Agent": "Execution-CPU",
        "ProcessName": "Data",
        "TaskID": "E0400DD628D48C9E",
        "ParentEventID": [
          "0BA49C82FB35EA34"
        ],
        "Label": "set",
        "Title": "X-Trace Task",
        "Host": "pinky19.mpi-sws.org",
        "HRT": 25491879517112936,
        "Operation": "set",
        "Timestamp": "1556275519457.379395",
        "TenantClass": 0,
        "Source": "Receiver.java:117",
        "ThreadID": 9602,
        "ThreadName": "",
        "EventID": "55382BE78978B271",
        "BaggageBytes": "[[248 5] [240 0] [0 224 64 13 214 40 212 140 158] [240 1] [0 11 164 156 130 251 53 234 52] [240 3] [0 2]]",
        "ProcessID": 2319
      },
      {
        "Cycles": 0,
        "Agent": "Execution-Sleep",
        "ProcessName": "Read",
        "TaskID": "E0400DD628D48C9E",
        "ParentEventID": [
          "AB150A9019BBE25E"
        ],
        "Label": "waited",
        "Title": "X-Trace Task",
        "Host": "pinky19.mpi-sws.org",
        "Duration": "486450",
        "HRT": 25491879516808499,
        "Operation": "waited",
        "Timestamp": "1556275519457.079834",
        "TenantClass": 0,
        "Source": "Client.java:1537",
        "ThreadID": 1,
        "ThreadName": "",
        "EventID": "2B0BDC85515A25B7",
        "ProcessID": 21035
      },
      {
        "Cycles": 0,
        "Agent": "edu.brown.cs.systems.xtrace.logging.XTraceInit",
        "ProcessName": "Data",
        "TaskID": "E0400DD628D48C9E",
        "ParentEventID": [
          "55382BE78978B271"
        ],
        "Label": "Thread.setName: DataXceiver for client DFSClient_NONMAPREDUCE_1377588049_1 at /139.19.171.63:36074 [Sending block BP-1633380353-139.19.171.63-1554193446451:blk_1073758027_17203]",
        "Title": "X-Trace Task",
        "Host": "pinky19.mpi-sws.org",
        "HRT": 25491879517150623,
        "Timestamp": "1556275519457.417236",
        "TenantClass": 0,
        "Source": "DataXceiver.java:168",
        "ThreadID": 9602,
        "ThreadName": "",
        "EventID": "E733FD1921214BBF",
        "BaggageBytes": "[[248 5] [240 0] [0 224 64 13 214 40 212 140 158] [240 1] [0 85 56 43 231 137 120 178 113] [240 3] [0 2]]",
        "ProcessID": 2319
      },
      {
        "Cycles": 0,
        "Agent": "edu.brown.cs.systems.xtrace.logging.BaggageWrappers",
        "ProcessName": "Data",
        "TaskID": "E0400DD628D48C9E",
        "ParentEventID": [
          "BE09B7E8ACBF2EB8"
        ],
        "Label": "Forking current baggage with Baggage.fork()",
        "Title": "X-Trace Task",
        "Host": "pinky19.mpi-sws.org",
        "HRT": 25491879517290227,
        "Operation": "fork",
        "Timestamp": "1556275519457.556641",
        "TenantClass": 0,
        "Source": "PacketHeader.java:95",
        "ThreadID": 9602,
        "ThreadName": "",
        "EventID": "6F04558E41DF11FF",
        "BaggageBytes": "[[248 5] [240 0] [0 224 64 13 214 40 212 140 158] [240 1] [0 190 9 183 232 172 191 46 184] [240 3] [0 2]]",
        "ProcessID": 2319
      },
      {
        "Cycles": 0,
        "Agent": "Execution-Sleep",
        "ProcessName": "Read",
        "TaskID": "E0400DD628D48C9E",
        "ParentEventID": [
          "0BA49C82FB35EA34"
        ],
        "Label": "waited",
        "Title": "X-Trace Task",
        "Host": "pinky19.mpi-sws.org",
        "Duration": "226252",
        "HRT": 25491879517287127,
        "Operation": "waited",
        "Timestamp": "1556275519457.558350",
        "TenantClass": 0,
        "Source": "SocketIOWithTimeout.java:335",
        "ThreadID": 1,
        "ThreadName": "",
        "EventID": "1BEF05EEC34EBE41",
        "ProcessID": 21035
      },
      {
        "Cycles": 0,
        "Agent": "edu.brown.cs.systems.xtrace.logging.BaggageWrappers",
        "ProcessName": "Data",
        "TaskID": "E0400DD628D48C9E",
        "ParentEventID": [
          "E733FD1921214BBF"
        ],
        "Label": "Forking current baggage with Baggage.fork()",
        "Title": "X-Trace Task",
        "Host": "pinky19.mpi-sws.org",
        "HRT": 25491879517226606,
        "Operation": "fork",
        "Timestamp": "1556275519457.493164",
        "TenantClass": 0,
        "Source": "DataXceiver.java:1257",
        "ThreadID": 9602,
        "ThreadName": "",
        "EventID": "BE09B7E8ACBF2EB8",
        "BaggageBytes": "[[248 5] [240 0] [0 224 64 13 214 40 212 140 158] [240 1] [0 231 51 253 25 33 33 75 191] [240 3] [0 2]]",
        "ProcessID": 2319
      },
      {
        "Cycles": 0,
        "Agent": "edu.brown.cs.systems.xtrace.logging.BaggageWrappers",
        "ProcessName": "Read",
        "TaskID": "E0400DD628D48C9E",
        "ParentEventID": [
          "1BEF05EEC34EBE41",
          "BE09B7E8ACBF2EB8"
        ],
        "Label": "Merged current baggage with other baggage",
        "Title": "X-Trace Task",
        "Host": "pinky19.mpi-sws.org",
        "HRT": 25491879517357719,
        "Operation": "join",
        "Timestamp": "1556275519457.628906",
        "TenantClass": 0,
        "Source": "RemoteBlockReader2.java:429",
        "ThreadID": 1,
        "ThreadName": "",
        "EventID": "8F9F8F0487494520",
        "ProcessID": 21035
      },
      {
        "Cycles": 0,
        "Agent": "Execution-Sleep",
        "ProcessName": "Data",
        "TaskID": "E0400DD628D48C9E",
        "ParentEventID": [
          "6F04558E41DF11FF"
        ],
        "Label": "waited",
        "Title": "X-Trace Task",
        "Host": "pinky19.mpi-sws.org",
        "Duration": "4164",
        "HRT": 25491879517348156,
        "Operation": "waited",
        "Timestamp": "1556275519457.614746",
        "TenantClass": 0,
        "Source": "SocketIOWithTimeout.java:335",
        "ThreadID": 9602,
        "ThreadName": "",
        "EventID": "348B16AEBE026A80",
        "BaggageBytes": "[[248 5] [240 0] [0 224 64 13 214 40 212 140 158] [240 1] [0 111 4 85 142 65 223 17 255] [240 3] [0 2]]",
        "ProcessID": 2319
      },
      {
        "Cycles": 0,
        "Agent": "edu.brown.cs.systems.xtrace.logging.BaggageWrappers",
        "ProcessName": "Data",
        "TaskID": "E0400DD628D48C9E",
        "ParentEventID": [
          "348B16AEBE026A80"
        ],
        "Label": "Forking current baggage with Baggage.fork()",
        "Title": "X-Trace Task",
        "Host": "pinky19.mpi-sws.org",
        "HRT": 25491879517408636,
        "Operation": "fork",
        "Timestamp": "1556275519457.675049",
        "TenantClass": 0,
        "Source": "PacketHeader.java:95",
        "ThreadID": 9602,
        "ThreadName": "",
        "EventID": "293A690A3FAF1A6A",
        "BaggageBytes": "[[248 5] [240 0] [0 224 64 13 214 40 212 140 158] [240 1] [0 52 139 22 174 190 2 106 128] [240 3] [0 2]]",
        "ProcessID": 2319
      },
      {
        "Cycles": 0,
        "Agent": "edu.brown.cs.systems.xtrace.logging.BaggageWrappers",
        "ProcessName": "Read",
        "TaskID": "E0400DD628D48C9E",
        "ParentEventID": [
          "293A690A3FAF1A6A",
          "BD7068446FA3DCC6"
        ],
        "Label": "Merged current baggage with other baggage",
        "Title": "X-Trace Task",
        "Host": "pinky19.mpi-sws.org",
        "HRT": 25491879517500459,
        "Operation": "join",
        "Timestamp": "1556275519457.771729",
        "TenantClass": 0,
        "Source": "PacketHeader.java:168",
        "ThreadID": 1,
        "ThreadName": "",
        "EventID": "850A669A03E5C0C3",
        "ProcessID": 21035
      },
      {
        "Cycles": 0,
        "Agent": "edu.brown.cs.systems.xtrace.logging.BaggageWrappers",
        "ProcessName": "Read",
        "TaskID": "E0400DD628D48C9E",
        "ParentEventID": [
          "6F04558E41DF11FF",
          "8F9F8F0487494520"
        ],
        "Label": "Merged current baggage with other baggage",
        "Title": "X-Trace Task",
        "Host": "pinky19.mpi-sws.org",
        "HRT": 25491879517436134,
        "Operation": "join",
        "Timestamp": "1556275519457.707520",
        "TenantClass": 0,
        "Source": "PacketHeader.java:168",
        "ThreadID": 1,
        "ThreadName": "",
        "EventID": "BD7068446FA3DCC6",
        "ProcessID": 21035
      },
      {
        "Cycles": 0,
        "Agent": "edu.brown.cs.systems.xtrace.logging.BaggageWrappers",
        "ProcessName": "Read",
        "TaskID": "E0400DD628D48C9E",
        "ParentEventID": [
          "850A669A03E5C0C3"
        ],
        "Label": "Forking current baggage with Baggage.fork()",
        "Title": "X-Trace Task",
        "Host": "pinky19.mpi-sws.org",
        "HRT": 25491879517511546,
        "Operation": "fork",
        "Timestamp": "1556275519457.782959",
        "TenantClass": 0,
        "Source": "RemoteBlockReader2.java:361",
        "ThreadID": 1,
        "ThreadName": "",
        "EventID": "3F2D946BC9ACBDFA",
        "ProcessID": 21035
      },
      {
        "Cycles": 0,
        "Agent": "edu.brown.cs.systems.xtrace.logging.BaggageWrappers",
        "ProcessName": "Data",
        "TaskID": "E0400DD628D48C9E",
        "ParentEventID": [
          "E22EBA4B329FF09D",
          "3F2D946BC9ACBDFA"
        ],
        "Label": "Merged current baggage with other baggage",
        "Title": "X-Trace Task",
        "Host": "pinky19.mpi-sws.org",
        "HRT": 25491879517613013,
        "Operation": "join",
        "Timestamp": "1556275519457.879639",
        "TenantClass": 0,
        "Source": "DataXceiver.java:574",
        "ThreadID": 9602,
        "ThreadName": "",
        "EventID": "CB6D2AAD6C6F3A17",
        "BaggageBytes": "[[248 5] [240 0] [0 224 64 13 214 40 212 140 158] [240 1] [0 226 46 186 75 50 159 240 157] [0 63 45 148 107 201 172 189 250] [240 3] [0 2]]",
        "ProcessID": 2319
      },
      {
        "Cycles": 0,
        "Agent": "Execution-Sleep",
        "ProcessName": "Data",
        "TaskID": "E0400DD628D48C9E",
        "ParentEventID": [
          "293A690A3FAF1A6A"
        ],
        "Label": "waited",
        "Title": "X-Trace Task",
        "Host": "pinky19.mpi-sws.org",
        "Duration": "62351",
        "HRT": 25491879517560170,
        "Operation": "waited",
        "Timestamp": "1556275519457.826660",
        "TenantClass": 0,
        "Source": "SocketIOWithTimeout.java:335",
        "ThreadID": 9602,
        "ThreadName": "",
        "EventID": "E22EBA4B329FF09D",
        "BaggageBytes": "[[248 5] [240 0] [0 224 64 13 214 40 212 140 158] [240 1] [0 41 58 105 10 63 175 26 106] [240 3] [0 2]]",
        "ProcessID": 2319
      },
      {
        "Cycles": 0,
        "Agent": "Execution-CPU",
        "ProcessName": "Data",
        "TaskID": "E0400DD628D48C9E",
        "ParentEventID": [
          "CB6D2AAD6C6F3A17"
        ],
        "Label": "unset",
        "Title": "X-Trace Task",
        "Host": "pinky19.mpi-sws.org",
        "Duration": "496772",
        "HRT": 25491879517634631,
        "Operation": "unset",
        "Timestamp": "1556275519457.901123",
        "TenantClass": 0,
        "Source": "DataXceiver.java:261",
        "ThreadID": 9602,
        "ThreadName": "",
        "EventID": "2FAB365972E69620",
        "BaggageBytes": "[[248 5] [240 0] [0 224 64 13 214 40 212 140 158] [240 1] [0 203 109 42 173 108 111 58 23] [240 3] [0 2]]",
        "ProcessID": 2319
      },
      {
        "Cycles": 0,
        "Agent": "edu.brown.cs.systems.retro.benchmarks.hdfs_client.Reader",
        "ProcessName": "Read",
        "TaskID": "E0400DD628D48C9E",
        "ParentEventID": [
          "AD666F3AF78A5652"
        ],
        "Label": "Reading file",
        "Title": "X-Trace Task",
        "Host": "pinky19.mpi-sws.org",
        "HRT": 25491879516023448,
        "Timestamp": "1556275519456.294678",
        "TenantClass": 0,
        "ThreadID": 1,
        "ThreadName": "",
        "EventID": "AB4CD7D66DE3F337",
        "ProcessID": 21035
      }
    ]
  }
]