[
  {
    "id": "9BFAD5C583F3FD0A",
    "reports": [
      {
        "Cycles": 0,
        "Agent": "Execution-CPU",
        "ProcessName": "Read",
        "TaskID": "9BFAD5C583F3FD0A",
        "ParentEventID": [
          "6915C0BB751D84A2"
        ],
        "Label": "unset",
        "Title": "X-Trace Task",
        "Host": "pinky19.mpi-sws.org",
        "Duration": "21447748",
        "HRT": 25491825951729335,
        "Operation": "unset",
        "Timestamp": "1556275465891.807617",
        "TenantClass": 0,
        "Source": "Client.java:1027",
        "ThreadID": 1,
        "ThreadName": "",
        "EventID": "1576620F614EDB3D",
        "ProcessID": 21035
      },
      {
        "Cycles": 0,
        "Agent": "Execution-CPU",
        "ProcessName": "Read",
        "TaskID": "9BFAD5C583F3FD0A",
        "ParentEventID": [
          "1576620F614EDB3D"
        ],
        "Label": "set",
        "Title": "X-Trace Task",
        "Host": "pinky19.mpi-sws.org",
        "HRT": 25491825951758715,
        "Operation": "set",
        "Timestamp": "1556275465891.836914",
        "TenantClass": 0,
        "Source": "Client.java:1032",
        "ThreadID": 41,
        "ThreadName": "",
        "EventID": "BB45D149D4AD4673",
        "ProcessID": 21035
      },
      {
        "Cycles": 0,
        "Agent": "edu.brown.cs.systems.xtrace.logging.BaggageWrappers",
        "ProcessName": "Read",
        "TaskID": "9BFAD5C583F3FD0A",
        "ParentEventID": [
          "BB45D149D4AD4673"
        ],
        "Label": "Forking current baggage with Baggage.fork()",
        "Title": "X-Trace Task",
        "Host": "pinky19.mpi-sws.org",
        "HRT": 25491825951769652,
        "Operation": "fork",
        "Timestamp": "1556275465891.847900",
        "TenantClass": 0,
        "Source": "Client.java:1043",
        "ThreadID": 41,
        "ThreadName": "",
        "EventID": "3E51ADD9D8A9F1F1",
        "ProcessID": 21035
      },
      {
        "Cycles": 0,
        "Agent": "edu.brown.cs.systems.retro.benchmarks.hdfs_client.Reader",
        "ProcessName": "Read",
        "TaskID": "9BFAD5C583F3FD0A",
        "ParentEventID": [
          "BFEB64200B4FDAF0"
        ],
        "Label": "Reading file",
        "Title": "X-Trace Task",
        "Host": "pinky19.mpi-sws.org",
        "HRT": 25491825951670527,
        "Timestamp": "1556275465891.748779",
        "TenantClass": 0,
        "ThreadID": 1,
        "ThreadName": "",
        "EventID": "F6ED07CBE6C898D9",
        "ProcessID": 21035
      },
      {
        "Cycles": 0,
        "Agent": "org.apache.hadoop.ipc.ProtobufRpcEngine",
        "ProcessName": "Read",
        "TaskID": "9BFAD5C583F3FD0A",
        "ParentEventID": [
          "F6ED07CBE6C898D9"
        ],
        "Label": "Invoking org.apache.hadoop.hdfs.protocol.ClientProtocol.getBlockLocations",
        "Title": "X-Trace Task",
        "Host": "pinky19.mpi-sws.org",
        "HRT": 25491825951703598,
        "Timestamp": "1556275465891.781982",
        "TenantClass": 0,
        "Source": "ProtobufRpcEngine.java:228",
        "ThreadID": 1,
        "ThreadName": "",
        "EventID": "6915C0BB751D84A2",
        "ProcessID": 21035
      },
      {
        "Cycles": 0,
        "Agent": "Execution-CPU",
        "ProcessName": "Read",
        "TaskID": "9BFAD5C583F3FD0A",
        "ParentEventID": [
          "3E51ADD9D8A9F1F1"
        ],
        "Label": "unset",
        "Title": "X-Trace Task",
        "Host": "pinky19.mpi-sws.org",
        "Duration": "54366",
        "HRT": 25491825951821226,
        "Operation": "unset",
        "Timestamp": "1556275465891.899414",
        "TenantClass": 0,
        "Source": "Client.java:1062",
        "ThreadID": 41,
        "ThreadName": "",
        "EventID": "A95A926CB56DB0E7",
        "ProcessID": 21035
      },
      {
        "Cycles": 0,
        "Agent": "Execution-CPU",
        "ProcessName": "Read",
        "TaskID": "9BFAD5C583F3FD0A",
        "ParentEventID": [
          "A95A926CB56DB0E7"
        ],
        "Label": "set",
        "Title": "X-Trace Task",
        "Host": "pinky19.mpi-sws.org",
        "HRT": 25491825951841467,
        "Operation": "set",
        "Timestamp": "1556275465891.919678",
        "TenantClass": 0,
        "Source": "Client.java:1104",
        "ThreadID": 1,
        "ThreadName": "",
        "EventID": "297443BFC09BC2CC",
        "ProcessID": 21035
      },
      {
        "Cycles": 0,
        "Agent": "Execution-CPU",
        "ProcessName": "Name",
        "TaskID": "9BFAD5C583F3FD0A",
        "ParentEventID": [
          "3E51ADD9D8A9F1F1"
        ],
        "Label": "set",
        "Title": "X-Trace Task",
        "Host": "pinky19.mpi-sws.org",
        "HRT": 25491825951901913,
        "Operation": "set",
        "Timestamp": "1556275465892.010254",
        "TenantClass": 0,
        "Source": "Server.java:1840",
        "ThreadID": 48,
        "ThreadName": "",
        "EventID": "3C6DDAAC91F47D64",
        "BaggageBytes": "[[248 5] [240 0] [0 155 250 213 197 131 243 253 10] [240 1] [0 62 81 173 217 216 169 241 241] [240 3] [0 2]]",
        "ProcessID": 2171
      },
      {
        "Cycles": 0,
        "Agent": "Execution-CPU",
        "ProcessName": "Name",
        "TaskID": "9BFAD5C583F3FD0A",
        "ParentEventID": [
          "3493B6F03705587A"
        ],
        "Label": "unset",
        "Title": "X-Trace Task",
        "Host": "pinky19.mpi-sws.org",
        "Duration": "24133",
        "HRT": 25491825951952050,
        "Operation": "unset",
        "Timestamp": "1556275465892.060547",
        "TenantClass": 0,
        "Source": "Server.java:1828",
        "ThreadID": 48,
        "ThreadName": "",
        "EventID": "CF4E6485F4015B7B",
        "BaggageBytes": "[[248 5] [240 0] [0 155 250 213 197 131 243 253 10] [240 1] [0 52 147 182 240 55 5 88 122] [240 3] [0 2]]",
        "ProcessID": 2171
      },
      {
        "Cycles": 0,
        "Agent": "edu.brown.cs.systems.xtrace.logging.BaggageWrappers",
        "ProcessName": "Name",
        "TaskID": "9BFAD5C583F3FD0A",
        "ParentEventID": [
          "3C6DDAAC91F47D64"
        ],
        "Label": "Forking current baggage with Baggage.fork()",
        "Title": "X-Trace Task",
        "Host": "pinky19.mpi-sws.org",
        "HRT": 25491825951931617,
        "Operation": "fork",
        "Timestamp": "1556275465892.040039",
        "TenantClass": 0,
        "Source": "Server.java:550",
        "ThreadID": 48,
        "ThreadName": "",
        "EventID": "3493B6F03705587A",
        "BaggageBytes": "[[248 5] [240 0] [0 155 250 213 197 131 243 253 10] [240 1] [0 60 109 218 172 145 244 125 100] [240 3] [0 2]]",
        "ProcessID": 2171
      },
      {
        "Cycles": 0,
        "Agent": "org.apache.hadoop.ipc.Server",
        "ProcessName": "Name",
        "TaskID": "9BFAD5C583F3FD0A",
        "ParentEventID": [
          "06B6CA690E41CCA6"
        ],
        "Label": "getBlockLocations in org.apache.hadoop.hdfs.protocol.ClientProtocol",
        "Title": "X-Trace Task",
        "Host": "pinky19.mpi-sws.org",
        "HRT": 25491825952011491,
        "Timestamp": "1556275465892.119873",
        "TenantClass": 0,
        "Source": "ProtobufRpcEngine.java:601",
        "ThreadID": 62,
        "ThreadName": "",
        "EventID": "4212450E9191208B",
        "BaggageBytes": "[[248 5] [240 0] [0 155 250 213 197 131 243 253 10] [240 1] [0 6 182 202 105 14 65 204 166] [240 3] [0 2]]",
        "ProcessID": 2171
      },
      {
        "Cycles": 0,
        "Agent": "Execution-CPU",
        "ProcessName": "Name",
        "TaskID": "9BFAD5C583F3FD0A",
        "ParentEventID": [
          "3493B6F03705587A"
        ],
        "Label": "set",
        "Title": "X-Trace Task",
        "Host": "pinky19.mpi-sws.org",
        "HRT": 25491825951961858,
        "Operation": "set",
        "Timestamp": "1556275465892.070312",
        "TenantClass": 0,
        "Source": "Server.java:2071",
        "ThreadID": 62,
        "ThreadName": "",
        "EventID": "06B6CA690E41CCA6",
        "BaggageBytes": "[[248 5] [240 0] [0 155 250 213 197 131 243 253 10] [240 1] [0 52 147 182 240 55 5 88 122] [240 3] [0 2]]",
        "ProcessID": 2171
      },
      {
        "Cycles": 0,
        "Agent": "edu.brown.cs.systems.xtrace.logging.BaggageWrappers",
        "ProcessName": "Name",
        "TaskID": "9BFAD5C583F3FD0A",
        "ParentEventID": [
          "597AE7D19C986CA5"
        ],
        "Label": "Forking current baggage with Baggage.fork()",
        "Title": "X-Trace Task",
        "Host": "pinky19.mpi-sws.org",
        "HRT": 25491825952127473,
        "Operation": "fork",
        "Timestamp": "1556275465892.235840",
        "TenantClass": 0,
        "Source": "Server.java:2398",
        "ThreadID": 62,
        "ThreadName": "",
        "EventID": "000BF48A75A98D11",
        "BaggageBytes": "[[248 5] [240 0] [0 155 250 213 197 131 243 253 10] [240 1] [0 89 122 231 209 156 152 108 165] [240 3] [0 2]]",
        "ProcessID": 2171
      },
      {
        "Cycles": 0,
        "Agent": "org.apache.hadoop.hdfs.server.namenode.FSNamesystem.audit",
        "ProcessName": "Name",
        "TaskID": "9BFAD5C583F3FD0A",
        "ParentEventID": [
          "4212450E9191208B"
        ],
        "Label": "allowed=true\tugi=plascas (auth:SIMPLE)\tip=/139.19.171.63\tcmd=open\tsrc=/ds/SKYptKYBr8C5me6N\tdst=null\tperm=null\tproto=rpc",
        "Title": "X-Trace Task",
        "Host": "pinky19.mpi-sws.org",
        "HRT": 25491825952072348,
        "Timestamp": "1556275465892.180664",
        "TenantClass": 0,
        "Source": "FSNamesystem.java:8313",
        "ThreadID": 62,
        "ThreadName": "",
        "EventID": "597AE7D19C986CA5",
        "BaggageBytes": "[[248 5] [240 0] [0 155 250 213 197 131 243 253 10] [240 1] [0 66 18 69 14 145 145 32 139] [240 3] [0 2]]",
        "ProcessID": 2171
      },
      {
        "Cycles": 0,
        "Agent": "Execution-CPU",
        "ProcessName": "Name",
        "TaskID": "9BFAD5C583F3FD0A",
        "ParentEventID": [
          "000BF48A75A98D11"
        ],
        "Label": "unset",
        "Title": "X-Trace Task",
        "Host": "pinky19.mpi-sws.org",
        "Duration": "251750",
        "HRT": 25491825952248250,
        "Operation": "unset",
        "Timestamp": "1556275465892.356689",
        "TenantClass": 0,
        "Source": "Server.java:1058",
        "ThreadID": 62,
        "ThreadName": "",
        "EventID": "13C77132586D8FD9",
        "BaggageBytes": "[[248 5] [240 0] [0 155 250 213 197 131 243 253 10] [240 1] [0 0 11 244 138 117 169 141 17] [240 3] [0 2]]",
        "ProcessID": 2171
      },
      {
        "Cycles": 0,
        "Agent": "Execution-CPU",
        "ProcessName": "Read",
        "TaskID": "9BFAD5C583F3FD0A",
        "ParentEventID": [
          "D1A8ACB7F10FFCFF"
        ],
        "Label": "unset",
        "Title": "X-Trace Task",
        "Host": "pinky19.mpi-sws.org",
        "Duration": "10259",
        "HRT": 25491825952346864,
        "Operation": "unset",
        "Timestamp": "1556275465892.425049",
        "TenantClass": 0,
        "Source": "Client.java:1168",
        "ThreadID": 37,
        "ThreadName": "",
        "EventID": "B3668E05E98A4859",
        "ProcessID": 21035
      },
      {
        "Cycles": 0,
        "Agent": "Execution-Sleep",
        "ProcessName": "Read",
        "TaskID": "9BFAD5C583F3FD0A",
        "ParentEventID": [
          "297443BFC09BC2CC"
        ],
        "Label": "waited",
        "Title": "X-Trace Task",
        "Host": "pinky19.mpi-sws.org",
        "Duration": "521256",
        "HRT": 25491825952371905,
        "Operation": "waited",
        "Timestamp": "1556275465892.450195",
        "TenantClass": 0,
        "Source": "Client.java:1537",
        "ThreadID": 1,
        "ThreadName": "",
        "EventID": "B7DFD7B62CD8CCF2",
        "ProcessID": 21035
      },
      {
        "Cycles": 0,
        "Agent": "edu.brown.cs.systems.xtrace.logging.BaggageWrappers",
        "ProcessName": "Read",
        "TaskID": "9BFAD5C583F3FD0A",
        "ParentEventID": [
          "B7DFD7B62CD8CCF2",
          "B3668E05E98A4859"
        ],
        "Label": "Merged current baggage with other baggage",
        "Title": "X-Trace Task",
        "Host": "pinky19.mpi-sws.org",
        "HRT": 25491825952386197,
        "Operation": "join",
        "Timestamp": "1556275465892.464355",
        "TenantClass": 0,
        "Source": "Client.java:1545",
        "ThreadID": 1,
        "ThreadName": "",
        "EventID": "83B7CD41E1A5A3A7",
        "ProcessID": 21035
      },
      {
        "Cycles": 0,
        "Agent": "org.apache.hadoop.ipc.ProtobufRpcEngine",
        "ProcessName": "Read",
        "TaskID": "9BFAD5C583F3FD0A",
        "ParentEventID": [
          "83B7CD41E1A5A3A7"
        ],
        "Label": "org.apache.hadoop.hdfs.protocol.ClientProtocol.getBlockLocations completed",
        "Title": "X-Trace Task",
        "Host": "pinky19.mpi-sws.org",
        "HRT": 25491825952425360,
        "Timestamp": "1556275465892.503662",
        "TenantClass": 0,
        "Source": "ProtobufRpcEngine.java:275",
        "ThreadID": 1,
        "ThreadName": "",
        "EventID": "9DB4E92EEE6FC41D",
        "ProcessID": 21035
      },
      {
        "Cycles": 0,
        "Agent": "edu.brown.cs.systems.xtrace.logging.BaggageWrappers",
        "ProcessName": "Read",
        "TaskID": "9BFAD5C583F3FD0A",
        "ParentEventID": [
          "9DB4E92EEE6FC41D"
        ],
        "Label": "Forking current baggage with Baggage.fork()",
        "Title": "X-Trace Task",
        "Host": "pinky19.mpi-sws.org",
        "HRT": 25491825952490466,
        "Operation": "fork",
        "Timestamp": "1556275465892.568848",
        "TenantClass": 0,
        "Source": "DataTransferProtoUtil.java:94",
        "ThreadID": 1,
        "ThreadName": "",
        "EventID": "18D7033F257CF75C",
        "ProcessID": 21035
      },
      {
        "Cycles": 0,
        "Agent": "Execution-CPU",
        "ProcessName": "Data",
        "TaskID": "9BFAD5C583F3FD0A",
        "ParentEventID": [
          "18D7033F257CF75C"
        ],
        "Label": "set",
        "Title": "X-Trace Task",
        "Host": "pinky23.mpi-sws.org",
        "HRT": 10893321926858152,
        "Operation": "set",
        "Timestamp": "1556275465892.917236",
        "TenantClass": 0,
        "Source": "Receiver.java:117",
        "ThreadID": 6296,
        "ThreadName": "",
        "EventID": "09DD1832FC57BCBB",
        "BaggageBytes": "[[248 5] [240 0] [0 155 250 213 197 131 243 253 10] [240 1] [0 24 215 3 63 37 124 247 92] [240 3] [0 2]]",
        "ProcessID": 24612
      },
      {
        "Cycles": 0,
        "Agent": "edu.brown.cs.systems.xtrace.logging.XTraceInit",
        "ProcessName": "Data",
        "TaskID": "9BFAD5C583F3FD0A",
        "ParentEventID": [
          "09DD1832FC57BCBB"
        ],
        "Label": "Thread.setName: DataXceiver for client DFSClient_NONMAPREDUCE_1377588049_1 at /139.19.171.63:57972 [Sending block BP-1633380353-139.19.171.63-1554193446451:blk_1073769990_29166]",
        "Title": "X-Trace Task",
        "Host": "pinky23.mpi-sws.org",
        "HRT": 10893321926957935,
        "Timestamp": "1556275465893.016846",
        "TenantClass": 0,
        "Source": "DataXceiver.java:168",
        "ThreadID": 6296,
        "ThreadName": "",
        "EventID": "4788366E41BD2953",
        "BaggageBytes": "[[248 5] [240 0] [0 155 250 213 197 131 243 253 10] [240 1] [0 9 221 24 50 252 87 188 187] [240 3] [0 2]]",
        "ProcessID": 24612
      },
      {
        "Cycles": 0,
        "Agent": "edu.brown.cs.systems.xtrace.logging.BaggageWrappers",
        "ProcessName": "Data",
        "TaskID": "9BFAD5C583F3FD0A",
        "ParentEventID": [
          "4788366E41BD2953"
        ],
        "Label": "Forking current baggage with Baggage.fork()",
        "Title": "X-Trace Task",
        "Host": "pinky23.mpi-sws.org",
        "HRT": 10893321927174162,
        "Operation": "fork",
        "Timestamp": "1556275465893.233154",
        "TenantClass": 0,
        "Source": "DataXceiver.java:1257",
        "ThreadID": 6296,
        "ThreadName": "",
        "EventID": "AD6FC494B51BFE4C",
        "BaggageBytes": "[[248 5] [240 0] [0 155 250 213 197 131 243 253 10] [240 1] [0 71 136 54 110 65 189 41 83] [240 3] [0 2]]",
        "ProcessID": 24612
      },
      {
        "Cycles": 0,
        "Agent": "Execution-CPU",
        "ProcessName": "Read",
        "TaskID": "9BFAD5C583F3FD0A",
        "ParentEventID": [
          "000BF48A75A98D11"
        ],
        "Label": "set",
        "Title": "X-Trace Task",
        "Host": "pinky19.mpi-sws.org",
        "HRT": 25491825952320215,
        "Operation": "set",
        "Timestamp": "1556275465892.398438",
        "TenantClass": 0,
        "Source": "Client.java:302",
        "ThreadID": 37,
        "ThreadName": "",
        "EventID": "D1A8ACB7F10FFCFF",
        "ProcessID": 21035
      },
      {
        "Cycles": 0,
        "Agent": "Execution-Sleep",
        "ProcessName": "Read",
        "TaskID": "9BFAD5C583F3FD0A",
        "ParentEventID": [
          "18D7033F257CF75C"
        ],
        "Label": "waited",
        "Title": "X-Trace Task",
        "Host": "pinky19.mpi-sws.org",
        "Duration": "808901",
        "HRT": 25491825953379728,
        "Operation": "waited",
        "Timestamp": "1556275465893.458008",
        "TenantClass": 0,
        "Source": "SocketIOWithTimeout.java:335",
        "ThreadID": 1,
        "ThreadName": "",
        "EventID": "3D8714AD90FC2A37",
        "ProcessID": 21035
      },
      {
        "Cycles": 0,
        "Agent": "edu.brown.cs.systems.xtrace.logging.BaggageWrappers",
        "ProcessName": "Data",
        "TaskID": "9BFAD5C583F3FD0A",
        "ParentEventID": [
          "AD6FC494B51BFE4C"
        ],
        "Label": "Forking current baggage with Baggage.fork()",
        "Title": "X-Trace Task",
        "Host": "pinky23.mpi-sws.org",
        "HRT": 10893321927329603,
        "Operation": "fork",
        "Timestamp": "1556275465893.388672",
        "TenantClass": 0,
        "Source": "PacketHeader.java:95",
        "ThreadID": 6296,
        "ThreadName": "",
        "EventID": "EAED94D57A77A1E2",
        "BaggageBytes": "[[248 5] [240 0] [0 155 250 213 197 131 243 253 10] [240 1] [0 173 111 196 148 181 27 254 76] [240 3] [0 2]]",
        "ProcessID": 24612
      },
      {
        "Cycles": 0,
        "Agent": "Execution-Sleep",
        "ProcessName": "Read",
        "TaskID": "9BFAD5C583F3FD0A",
        "ParentEventID": [
          "6BD528228A9D6010"
        ],
        "Label": "waited",
        "Title": "X-Trace Task",
        "Host": "pinky19.mpi-sws.org",
        "Duration": "9459",
        "HRT": 25491825953525023,
        "Operation": "waited",
        "Timestamp": "1556275465893.603271",
        "TenantClass": 0,
        "Source": "SocketIOWithTimeout.java:335",
        "ThreadID": 1,
        "ThreadName": "",
        "EventID": "C89B1F3D658C0DC8",
        "ProcessID": 21035
      },
      {
        "Cycles": 0,
        "Agent": "edu.brown.cs.systems.xtrace.logging.BaggageWrappers",
        "ProcessName": "Read",
        "TaskID": "9BFAD5C583F3FD0A",
        "ParentEventID": [
          "AD6FC494B51BFE4C",
          "3D8714AD90FC2A37"
        ],
        "Label": "Merged current baggage with other baggage",
        "Title": "X-Trace Task",
        "Host": "pinky19.mpi-sws.org",
        "HRT": 25491825953451624,
        "Operation": "join",
        "Timestamp": "1556275465893.529785",
        "TenantClass": 0,
        "Source": "RemoteBlockReader2.java:429",
        "ThreadID": 1,
        "ThreadName": "",
        "EventID": "6BD528228A9D6010",
        "ProcessID": 21035
      },
      {
        "Cycles": 0,
        "Agent": "Execution-Sleep",
        "ProcessName": "Data",
        "TaskID": "9BFAD5C583F3FD0A",
        "ParentEventID": [
          "EAED94D57A77A1E2"
        ],
        "Label": "waited",
        "Title": "X-Trace Task",
        "Host": "pinky23.mpi-sws.org",
        "Duration": "15953",
        "HRT": 10893321927542556,
        "Operation": "waited",
        "Timestamp": "1556275465893.601562",
        "TenantClass": 0,
        "Source": "SocketIOWithTimeout.java:335",
        "ThreadID": 6296,
        "ThreadName": "",
        "EventID": "ADE214BBDCD9F8F9",
        "BaggageBytes": "[[248 5] [240 0] [0 155 250 213 197 131 243 253 10] [240 1] [0 234 237 148 213 122 119 161 226] [240 3] [0 2]]",
        "ProcessID": 24612
      },
      {
        "Cycles": 0,
        "Agent": "edu.brown.cs.systems.xtrace.logging.BaggageWrappers",
        "ProcessName": "Read",
        "TaskID": "9BFAD5C583F3FD0A",
        "ParentEventID": [
          "EAED94D57A77A1E2",
          "C0330DD30CB79DD7"
        ],
        "Label": "Merged current baggage with other baggage",
        "Title": "X-Trace Task",
        "Host": "pinky19.mpi-sws.org",
        "HRT": 25491825953783328,
        "Operation": "join",
        "Timestamp": "1556275465893.861572",
        "TenantClass": 0,
        "Source": "PacketHeader.java:168",
        "ThreadID": 1,
        "ThreadName": "",
        "EventID": "C2EF8B71F7A699DB",
        "ProcessID": 21035
      },
      {
        "Cycles": 0,
        "Agent": "edu.brown.cs.systems.xtrace.logging.BaggageWrappers",
        "ProcessName": "Data",
        "TaskID": "9BFAD5C583F3FD0A",
        "ParentEventID": [
          "ADE214BBDCD9F8F9"
        ],
        "Label": "Forking current baggage with Baggage.fork()",
        "Title": "X-Trace Task",
        "Host": "pinky23.mpi-sws.org",
        "HRT": 10893321927732317,
        "Operation": "fork",
        "Timestamp": "1556275465893.791260",
        "TenantClass": 0,
        "Source": "PacketHeader.java:95",
        "ThreadID": 6296,
        "ThreadName": "",
        "EventID": "7BBAAB14688115D6",
        "BaggageBytes": "[[248 5] [240 0] [0 155 250 213 197 131 243 253 10] [240 1] [0 173 226 20 187 220 217 248 249] [240 3] [0 2]]",
        "ProcessID": 24612
      },
      {
        "Cycles": 0,
        "Agent": "Execution-Sleep",
        "ProcessName": "Read",
        "TaskID": "9BFAD5C583F3FD0A",
        "ParentEventID": [
          "C2EF8B71F7A699DB"
        ],
        "Label": "waited",
        "Title": "X-Trace Task",
        "Host": "pinky19.mpi-sws.org",
        "Duration": "28391",
        "HRT": 25491825953867031,
        "Operation": "waited",
        "Timestamp": "1556275465893.945312",
        "TenantClass": 0,
        "Source": "SocketIOWithTimeout.java:335",
        "ThreadID": 1,
        "ThreadName": "",
        "EventID": "691F9596587E431F",
        "ProcessID": 21035
      },
      {
        "Cycles": 0,
        "Agent": "edu.brown.cs.systems.xtrace.logging.BaggageWrappers",
        "ProcessName": "Read",
        "TaskID": "9BFAD5C583F3FD0A",
        "ParentEventID": [
          "7BBAAB14688115D6",
          "691F9596587E431F"
        ],
        "Label": "Merged current baggage with other baggage",
        "Title": "X-Trace Task",
        "Host": "pinky19.mpi-sws.org",
        "HRT": 25491825953916514,
        "Operation": "join",
        "Timestamp": "1556275465893.994873",
        "TenantClass": 0,
        "Source": "PacketHeader.java:168",
        "ThreadID": 1,
        "ThreadName": "",
        "EventID": "C55901AF4FC192F2",
        "ProcessID": 21035
      },
      {
        "Cycles": 0,
        "Agent": "edu.brown.cs.systems.xtrace.logging.BaggageWrappers",
        "ProcessName": "Read",
        "TaskID": "9BFAD5C583F3FD0A",
        "ParentEventID": [
          "C55901AF4FC192F2"
        ],
        "Label": "Forking current baggage with Baggage.fork()",
        "Title": "X-Trace Task",
        "Host": "pinky19.mpi-sws.org",
        "HRT": 25491825953926285,
        "Operation": "fork",
        "Timestamp": "1556275465894.004639",
        "TenantClass": 0,
        "Source": "RemoteBlockReader2.java:361",
        "ThreadID": 1,
        "ThreadName": "",
        "EventID": "6CB11BF810377CBC",
        "ProcessID": 21035
      },
      {
        "Cycles": 0,
        "Agent": "Execution-Sleep",
        "ProcessName": "Data",
        "TaskID": "9BFAD5C583F3FD0A",
        "ParentEventID": [
          "7BBAAB14688115D6"
        ],
        "Label": "waited",
        "Title": "X-Trace Task",
        "Host": "pinky23.mpi-sws.org",
        "Duration": "69887",
        "HRT": 10893321928024227,
        "Operation": "waited",
        "Timestamp": "1556275465894.083252",
        "TenantClass": 0,
        "Source": "SocketIOWithTimeout.java:335",
        "ThreadID": 6296,
        "ThreadName": "",
        "EventID": "47F4D5A0C8FABF93",
        "BaggageBytes": "[[248 5] [240 0] [0 155 250 213 197 131 243 253 10] [240 1] [0 123 186 171 20 104 129 21 214] [240 3] [0 2]]",
        "ProcessID": 24612
      },
      {
        "Cycles": 0,
        "Agent": "edu.brown.cs.systems.xtrace.logging.BaggageWrappers",
        "ProcessName": "Data",
        "TaskID": "9BFAD5C583F3FD0A",
        "ParentEventID": [
          "47F4D5A0C8FABF93",
          "6CB11BF810377CBC"
        ],
        "Label": "Merged current baggage with other baggage",
        "Title": "X-Trace Task",
        "Host": "pinky23.mpi-sws.org",
        "HRT": 10893321928149154,
        "Operation": "join",
        "Timestamp": "1556275465894.208252",
        "TenantClass": 0,
        "Source": "DataXceiver.java:574",
        "ThreadID": 6296,
        "ThreadName": "",
        "EventID": "CAAAC428BF25E7B9",
        "BaggageBytes": "[[248 5] [240 0] [0 155 250 213 197 131 243 253 10] [240 1] [0 71 244 213 160 200 250 191 147] [0 108 177 27 248 16 55 124 188] [240 3] [0 2]]",
        "ProcessID": 24612
      },
      {
        "Cycles": 0,
        "Agent": "Execution-CPU",
        "ProcessName": "Data",
        "TaskID": "9BFAD5C583F3FD0A",
        "ParentEventID": [
          "CAAAC428BF25E7B9"
        ],
        "Label": "unset",
        "Title": "X-Trace Task",
        "Host": "pinky23.mpi-sws.org",
        "Duration": "1275545",
        "HRT": 10893321928205047,
        "Operation": "unset",
        "Timestamp": "1556275465894.264160",
        "TenantClass": 0,
        "Source": "DataXceiver.java:261",
        "ThreadID": 6296,
        "ThreadName": "",
        "EventID": "49493067EBAF9869",
        "BaggageBytes": "[[248 5] [240 0] [0 155 250 213 197 131 243 253 10] [240 1] [0 202 170 196 40 191 37 231 185] [240 3] [0 2]]",
        "ProcessID": 24612
      },
      {
        "Cycles": 0,
        "Agent": "Execution-Sleep",
        "ProcessName": "Read",
        "TaskID": "9BFAD5C583F3FD0A",
        "ParentEventID": [
          "C89B1F3D658C0DC8"
        ],
        "Label": "waited",
        "Title": "X-Trace Task",
        "Host": "pinky19.mpi-sws.org",
        "Duration": "161511",
        "HRT": 25491825953747006,
        "Operation": "waited",
        "Timestamp": "1556275465893.825195",
        "TenantClass": 0,
        "Source": "SocketIOWithTimeout.java:335",
        "ThreadID": 1,
        "ThreadName": "",
        "EventID": "C0330DD30CB79DD7",
        "ProcessID": 21035
      },
      {
        "Cycles": 0,
        "Agent": "edu.brown.cs.systems.retro.benchmarks.hdfs_client.Reader",
        "ProcessName": "Read",
        "TaskID": "9BFAD5C583F3FD0A",
        "ParentEventID": [
          "0"
        ],
        "Label": "Reading file",
        "Title": "X-Trace Task",
        "Host": "pinky19.mpi-sws.org",
        "HRT": 25491825951654286,
        "Timestamp": "1556275465891.732666",
        "TenantClass": 0,
        "ThreadID": 1,
        "ThreadName": "",
        "EventID": "BFEB64200B4FDAF0",
        "ProcessID": 21035,
        "Tag": [
          "reader_1kb",
          "Read Size: 1024"
        ]
      }
    ]
  }
]