[
  {
    "id": "1F0F455A3707E06F",
    "reports": [
      {
        "Cycles": 0,
        "Agent": "org.apache.hadoop.ipc.ProtobufRpcEngine",
        "ProcessName": "Read",
        "TaskID": "1F0F455A3707E06F",
        "ParentEventID": [
          "9FA1DB247E7AF09C"
        ],
        "Label": "Invoking org.apache.hadoop.hdfs.protocol.ClientProtocol.getBlockLocations",
        "Title": "X-Trace Task",
        "Host": "pinky19.mpi-sws.org",
        "HRT": 26962515251591427,
        "Timestamp": "1557746155191.758545",
        "TenantClass": 0,
        "Source": "ProtobufRpcEngine.java:228",
        "ThreadID": 1,
        "ThreadName": "",
        "EventID": "EE4025A26C0F7F6C",
        "ProcessID": 36430
      },
      {
        "Cycles": 0,
        "Agent": "Execution-CPU",
        "ProcessName": "Read",
        "TaskID": "1F0F455A3707E06F",
        "ParentEventID": [
          "66D674991FD149EE"
        ],
        "Label": "set",
        "Title": "X-Trace Task",
        "Host": "pinky19.mpi-sws.org",
        "HRT": 26962515251662132,
        "Operation": "set",
        "Timestamp": "1557746155191.829102",
        "TenantClass": 0,
        "Source": "Client.java:1032",
        "ThreadID": 41,
        "ThreadName": "",
        "EventID": "74F93DAEB8EFD1E2",
        "ProcessID": 36430
      },
      {
        "Cycles": 0,
        "Agent": "edu.brown.cs.systems.xtrace.logging.BaggageWrappers",
        "ProcessName": "Read",
        "TaskID": "1F0F455A3707E06F",
        "ParentEventID": [
          "74F93DAEB8EFD1E2"
        ],
        "Label": "Forking current baggage with Baggage.fork()",
        "Title": "X-Trace Task",
        "Host": "pinky19.mpi-sws.org",
        "HRT": 26962515251684537,
        "Operation": "fork",
        "Timestamp": "1557746155191.851562",
        "TenantClass": 0,
        "Source": "Client.java:1043",
        "ThreadID": 41,
        "ThreadName": "",
        "EventID": "B3D9F98CD607D543",
        "ProcessID": 36430
      },
      {
        "Cycles": 0,
        "Agent": "Execution-CPU",
        "ProcessName": "Read",
        "TaskID": "1F0F455A3707E06F",
        "ParentEventID": [
          "EE4025A26C0F7F6C"
        ],
        "Label": "unset",
        "Title": "X-Trace Task",
        "Host": "pinky19.mpi-sws.org",
        "Duration": "21485274",
        "HRT": 26962515251615054,
        "Operation": "unset",
        "Timestamp": "1557746155191.782227",
        "TenantClass": 0,
        "Source": "Client.java:1027",
        "ThreadID": 1,
        "ThreadName": "",
        "EventID": "66D674991FD149EE",
        "ProcessID": 36430
      },
      {
        "Cycles": 0,
        "Agent": "edu.brown.cs.systems.retro.benchmarks.hdfs_client.Reader",
        "ProcessName": "Read",
        "TaskID": "1F0F455A3707E06F",
        "ParentEventID": [
          "7721B858BE20B1F1"
        ],
        "Label": "Reading file",
        "Title": "X-Trace Task",
        "Host": "pinky19.mpi-sws.org",
        "HRT": 26962515251559820,
        "Timestamp": "1557746155191.726807",
        "TenantClass": 0,
        "ThreadID": 1,
        "ThreadName": "",
        "EventID": "9FA1DB247E7AF09C",
        "ProcessID": 36430
      },
      {
        "Cycles": 0,
        "Agent": "Execution-CPU",
        "ProcessName": "Read",
        "TaskID": "1F0F455A3707E06F",
        "ParentEventID": [
          "B3D9F98CD607D543"
        ],
        "Label": "unset",
        "Title": "X-Trace Task",
        "Host": "pinky19.mpi-sws.org",
        "Duration": "80988",
        "HRT": 26962515251764186,
        "Operation": "unset",
        "Timestamp": "1557746155191.931152",
        "TenantClass": 0,
        "Source": "Client.java:1062",
        "ThreadID": 41,
        "ThreadName": "",
        "EventID": "7075E1DF614F6AC3",
        "ProcessID": 36430
      },
      {
        "Cycles": 0,
        "Agent": "Execution-CPU",
        "ProcessName": "Read",
        "TaskID": "1F0F455A3707E06F",
        "ParentEventID": [
          "7075E1DF614F6AC3"
        ],
        "Label": "set",
        "Title": "X-Trace Task",
        "Host": "pinky19.mpi-sws.org",
        "HRT": 26962515251788261,
        "Operation": "set",
        "Timestamp": "1557746155191.955322",
        "TenantClass": 0,
        "Source": "Client.java:1104",
        "ThreadID": 1,
        "ThreadName": "",
        "EventID": "0A3A0A46DCE6C335",
        "ProcessID": 36430
      },
      {
        "Cycles": 0,
        "Agent": "edu.brown.cs.systems.xtrace.logging.BaggageWrappers",
        "ProcessName": "Name",
        "TaskID": "1F0F455A3707E06F",
        "ParentEventID": [
          "47BB56F4976F58AE"
        ],
        "Label": "Forking current baggage with Baggage.fork()",
        "Title": "X-Trace Task",
        "Host": "pinky19.mpi-sws.org",
        "HRT": 26962515251845056,
        "Operation": "fork",
        "Timestamp": "1557746155192.021973",
        "TenantClass": 0,
        "Source": "Server.java:550",
        "ThreadID": 48,
        "ThreadName": "",
        "EventID": "05ACF97B3ECE85F4",
        "BaggageBytes": "[[248 5] [240 0] [0 31 15 69 90 55 7 224 111] [240 1] [0 71 187 86 244 151 111 88 174] [240 3] [0 2]]",
        "ProcessID": 2171
      },
      {
        "Cycles": 0,
        "Agent": "Execution-CPU",
        "ProcessName": "Name",
        "TaskID": "1F0F455A3707E06F",
        "ParentEventID": [
          "B3D9F98CD607D543"
        ],
        "Label": "set",
        "Title": "X-Trace Task",
        "Host": "pinky19.mpi-sws.org",
        "HRT": 26962515251816537,
        "Operation": "set",
        "Timestamp": "1557746155191.993408",
        "TenantClass": 0,
        "Source": "Server.java:1840",
        "ThreadID": 48,
        "ThreadName": "",
        "EventID": "47BB56F4976F58AE",
        "BaggageBytes": "[[248 5] [240 0] [0 31 15 69 90 55 7 224 111] [240 1] [0 179 217 249 140 214 7 213 67] [240 3] [0 2]]",
        "ProcessID": 2171
      },
      {
        "Cycles": 0,
        "Agent": "Execution-CPU",
        "ProcessName": "Name",
        "TaskID": "1F0F455A3707E06F",
        "ParentEventID": [
          "05ACF97B3ECE85F4"
        ],
        "Label": "unset",
        "Title": "X-Trace Task",
        "Host": "pinky19.mpi-sws.org",
        "Duration": "24543",
        "HRT": 26962515251865832,
        "Operation": "unset",
        "Timestamp": "1557746155192.042725",
        "TenantClass": 0,
        "Source": "Server.java:1828",
        "ThreadID": 48,
        "ThreadName": "",
        "EventID": "079D8E091EC6DC0C",
        "BaggageBytes": "[[248 5] [240 0] [0 31 15 69 90 55 7 224 111] [240 1] [0 5 172 249 123 62 206 133 244] [240 3] [0 2]]",
        "ProcessID": 2171
      },
      {
        "Cycles": 0,
        "Agent": "org.apache.hadoop.ipc.Server",
        "ProcessName": "Name",
        "TaskID": "1F0F455A3707E06F",
        "ParentEventID": [
          "F9DA41B1FE9436B3"
        ],
        "Label": "getBlockLocations in org.apache.hadoop.hdfs.protocol.ClientProtocol",
        "Title": "X-Trace Task",
        "Host": "pinky19.mpi-sws.org",
        "HRT": 26962515251908117,
        "Timestamp": "1557746155192.084961",
        "TenantClass": 0,
        "Source": "ProtobufRpcEngine.java:601",
        "ThreadID": 61,
        "ThreadName": "",
        "EventID": "01AFBD90CE62C175",
        "BaggageBytes": "[[248 5] [240 0] [0 31 15 69 90 55 7 224 111] [240 1] [0 249 218 65 177 254 148 54 179] [240 3] [0 2]]",
        "ProcessID": 2171
      },
      {
        "Cycles": 0,
        "Agent": "Execution-CPU",
        "ProcessName": "Name",
        "TaskID": "1F0F455A3707E06F",
        "ParentEventID": [
          "05ACF97B3ECE85F4"
        ],
        "Label": "set",
        "Title": "X-Trace Task",
        "Host": "pinky19.mpi-sws.org",
        "HRT": 26962515251874202,
        "Operation": "set",
        "Timestamp": "1557746155192.051025",
        "TenantClass": 0,
        "Source": "Server.java:2071",
        "ThreadID": 61,
        "ThreadName": "",
        "EventID": "F9DA41B1FE9436B3",
        "BaggageBytes": "[[248 5] [240 0] [0 31 15 69 90 55 7 224 111] [240 1] [0 5 172 249 123 62 206 133 244] [240 3] [0 2]]",
        "ProcessID": 2171
      },
      {
        "Cycles": 0,
        "Agent": "org.apache.hadoop.hdfs.server.namenode.FSNamesystem.audit",
        "ProcessName": "Name",
        "TaskID": "1F0F455A3707E06F",
        "ParentEventID": [
          "01AFBD90CE62C175"
        ],
        "Label": "allowed=true\tugi=plascas (auth:SIMPLE)\tip=/139.19.171.63\tcmd=open\tsrc=/ds/kQUEfNMW6bYk1Grw\tdst=null\tperm=null\tproto=rpc",
        "Title": "X-Trace Task",
        "Host": "pinky19.mpi-sws.org",
        "HRT": 26962515251956975,
        "Timestamp": "1557746155192.133789",
        "TenantClass": 0,
        "Source": "FSNamesystem.java:8313",
        "ThreadID": 61,
        "ThreadName": "",
        "EventID": "9C6A5B80E0DCFD2E",
        "BaggageBytes": "[[248 5] [240 0] [0 31 15 69 90 55 7 224 111] [240 1] [0 1 175 189 144 206 98 193 117] [240 3] [0 2]]",
        "ProcessID": 2171
      },
      {
        "Cycles": 0,
        "Agent": "Execution-CPU",
        "ProcessName": "Name",
        "TaskID": "1F0F455A3707E06F",
        "ParentEventID": [
          "4576E73FA1EF17AC"
        ],
        "Label": "unset",
        "Title": "X-Trace Task",
        "Host": "pinky19.mpi-sws.org",
        "Duration": "209479",
        "HRT": 26962515252106047,
        "Operation": "unset",
        "Timestamp": "1557746155192.282959",
        "TenantClass": 0,
        "Source": "Server.java:1058",
        "ThreadID": 61,
        "ThreadName": "",
        "EventID": "2CB963F6EC7E1332",
        "BaggageBytes": "[[248 5] [240 0] [0 31 15 69 90 55 7 224 111] [240 1] [0 69 118 231 63 161 239 23 172] [240 3] [0 2]]",
        "ProcessID": 2171
      },
      {
        "Cycles": 0,
        "Agent": "edu.brown.cs.systems.xtrace.logging.BaggageWrappers",
        "ProcessName": "Name",
        "TaskID": "1F0F455A3707E06F",
        "ParentEventID": [
          "9C6A5B80E0DCFD2E"
        ],
        "Label": "Forking current baggage with Baggage.fork()",
        "Title": "X-Trace Task",
        "Host": "pinky19.mpi-sws.org",
        "HRT": 26962515251999060,
        "Operation": "fork",
        "Timestamp": "1557746155192.176025",
        "TenantClass": 0,
        "Source": "Server.java:2398",
        "ThreadID": 61,
        "ThreadName": "",
        "EventID": "4576E73FA1EF17AC",
        "BaggageBytes": "[[248 5] [240 0] [0 31 15 69 90 55 7 224 111] [240 1] [0 156 106 91 128 224 220 253 46] [240 3] [0 2]]",
        "ProcessID": 2171
      },
      {
        "Cycles": 0,
        "Agent": "Execution-CPU",
        "ProcessName": "Read",
        "TaskID": "1F0F455A3707E06F",
        "ParentEventID": [
          "4576E73FA1EF17AC"
        ],
        "Label": "set",
        "Title": "X-Trace Task",
        "Host": "pinky19.mpi-sws.org",
        "HRT": 26962515252150717,
        "Operation": "set",
        "Timestamp": "1557746155192.317871",
        "TenantClass": 0,
        "Source": "Client.java:302",
        "ThreadID": 37,
        "ThreadName": "",
        "EventID": "E43706835801A88F",
        "ProcessID": 36430
      },
      {
        "Cycles": 0,
        "Agent": "Execution-Sleep",
        "ProcessName": "Read",
        "TaskID": "1F0F455A3707E06F",
        "ParentEventID": [
          "0A3A0A46DCE6C335"
        ],
        "Label": "waited",
        "Title": "X-Trace Task",
        "Host": "pinky19.mpi-sws.org",
        "Duration": "397919",
        "HRT": 26962515252197749,
        "Operation": "waited",
        "Timestamp": "1557746155192.364746",
        "TenantClass": 0,
        "Source": "Client.java:1537",
        "ThreadID": 1,
        "ThreadName": "",
        "EventID": "1B2E26D43AA61DC0",
        "ProcessID": 36430
      },
      {
        "Cycles": 0,
        "Agent": "edu.brown.cs.systems.xtrace.logging.BaggageWrappers",
        "ProcessName": "Read",
        "TaskID": "1F0F455A3707E06F",
        "ParentEventID": [
          "1B2E26D43AA61DC0",
          "74998D5126BE6758"
        ],
        "Label": "Merged current baggage with other baggage",
        "Title": "X-Trace Task",
        "Host": "pinky19.mpi-sws.org",
        "HRT": 26962515252213169,
        "Operation": "join",
        "Timestamp": "1557746155192.380127",
        "TenantClass": 0,
        "Source": "Client.java:1545",
        "ThreadID": 1,
        "ThreadName": "",
        "EventID": "DFBFC68E4F0003BF",
        "ProcessID": 36430
      },
      {
        "Cycles": 0,
        "Agent": "Execution-CPU",
        "ProcessName": "Read",
        "TaskID": "1F0F455A3707E06F",
        "ParentEventID": [
          "E43706835801A88F"
        ],
        "Label": "unset",
        "Title": "X-Trace Task",
        "Host": "pinky19.mpi-sws.org",
        "Duration": "8953",
        "HRT": 26962515252174190,
        "Operation": "unset",
        "Timestamp": "1557746155192.341309",
        "TenantClass": 0,
        "Source": "Client.java:1168",
        "ThreadID": 37,
        "ThreadName": "",
        "EventID": "74998D5126BE6758",
        "ProcessID": 36430
      },
      {
        "Cycles": 0,
        "Agent": "org.apache.hadoop.ipc.ProtobufRpcEngine",
        "ProcessName": "Read",
        "TaskID": "1F0F455A3707E06F",
        "ParentEventID": [
          "DFBFC68E4F0003BF"
        ],
        "Label": "org.apache.hadoop.hdfs.protocol.ClientProtocol.getBlockLocations completed",
        "Title": "X-Trace Task",
        "Host": "pinky19.mpi-sws.org",
        "HRT": 26962515252252288,
        "Timestamp": "1557746155192.419434",
        "TenantClass": 0,
        "Source": "ProtobufRpcEngine.java:275",
        "ThreadID": 1,
        "ThreadName": "",
        "EventID": "4F548426EBC731E7",
        "ProcessID": 36430
      },
      {
        "Cycles": 0,
        "Agent": "edu.brown.cs.systems.xtrace.logging.BaggageWrappers",
        "ProcessName": "Read",
        "TaskID": "1F0F455A3707E06F",
        "ParentEventID": [
          "4F548426EBC731E7"
        ],
        "Label": "Forking current baggage with Baggage.fork()",
        "Title": "X-Trace Task",
        "Host": "pinky19.mpi-sws.org",
        "HRT": 26962515252323043,
        "Operation": "fork",
        "Timestamp": "1557746155192.490234",
        "TenantClass": 0,
        "Source": "DataTransferProtoUtil.java:94",
        "ThreadID": 1,
        "ThreadName": "",
        "EventID": "03994B91C09948C5",
        "ProcessID": 36430
      },
      {
        "Cycles": 0,
        "Agent": "edu.brown.cs.systems.xtrace.logging.XTraceInit",
        "ProcessName": "Data",
        "TaskID": "1F0F455A3707E06F",
        "ParentEventID": [
          "E553B2DEACA49A25"
        ],
        "Label": "Thread.setName: DataXceiver for client DFSClient_NONMAPREDUCE_778905418_1 at /139.19.171.63:39908 [Sending block BP-1633380353-139.19.171.63-1554193446451:blk_1073764644_23820]",
        "Title": "X-Trace Task",
        "Host": "pinky20.mpi-sws.org",
        "HRT": 6565719611766003,
        "Timestamp": "1557746155192.969482",
        "TenantClass": 0,
        "Source": "DataXceiver.java:168",
        "ThreadID": 14317,
        "ThreadName": "",
        "EventID": "2BE6B5EBDB28A90C",
        "BaggageBytes": "[[248 5] [240 0] [0 31 15 69 90 55 7 224 111] [240 1] [0 229 83 178 222 172 164 154 37] [240 3] [0 2]]",
        "ProcessID": 13111
      },
      {
        "Cycles": 0,
        "Agent": "edu.brown.cs.systems.xtrace.logging.BaggageWrappers",
        "ProcessName": "Data",
        "TaskID": "1F0F455A3707E06F",
        "ParentEventID": [
          "2BE6B5EBDB28A90C"
        ],
        "Label": "Forking current baggage with Baggage.fork()",
        "Title": "X-Trace Task",
        "Host": "pinky20.mpi-sws.org",
        "HRT": 6565719612010260,
        "Operation": "fork",
        "Timestamp": "1557746155193.213867",
        "TenantClass": 0,
        "Source": "DataXceiver.java:1257",
        "ThreadID": 14317,
        "ThreadName": "",
        "EventID": "DDF03865615FABF7",
        "BaggageBytes": "[[248 5] [240 0] [0 31 15 69 90 55 7 224 111] [240 1] [0 43 230 181 235 219 40 169 12] [240 3] [0 2]]",
        "ProcessID": 13111
      },
      {
        "Cycles": 0,
        "Agent": "Execution-Sleep",
        "ProcessName": "Read",
        "TaskID": "1F0F455A3707E06F",
        "ParentEventID": [
          "03994B91C09948C5"
        ],
        "Label": "waited",
        "Title": "X-Trace Task",
        "Host": "pinky19.mpi-sws.org",
        "Duration": "800226",
        "HRT": 26962515253207262,
        "Operation": "waited",
        "Timestamp": "1557746155193.374268",
        "TenantClass": 0,
        "Source": "SocketIOWithTimeout.java:335",
        "ThreadID": 1,
        "ThreadName": "",
        "EventID": "F41AA45D9ADF3114",
        "ProcessID": 36430
      },
      {
        "Cycles": 0,
        "Agent": "Execution-CPU",
        "ProcessName": "Data",
        "TaskID": "1F0F455A3707E06F",
        "ParentEventID": [
          "03994B91C09948C5"
        ],
        "Label": "set",
        "Title": "X-Trace Task",
        "Host": "pinky20.mpi-sws.org",
        "HRT": 6565719611655306,
        "Operation": "set",
        "Timestamp": "1557746155192.858887",
        "TenantClass": 0,
        "Source": "Receiver.java:117",
        "ThreadID": 14317,
        "ThreadName": "",
        "EventID": "E553B2DEACA49A25",
        "BaggageBytes": "[[248 5] [240 0] [0 31 15 69 90 55 7 224 111] [240 1] [0 3 153 75 145 192 153 72 197] [240 3] [0 2]]",
        "ProcessID": 13111
      },
      {
        "Cycles": 0,
        "Agent": "edu.brown.cs.systems.xtrace.logging.BaggageWrappers",
        "ProcessName": "Read",
        "TaskID": "1F0F455A3707E06F",
        "ParentEventID": [
          "DDF03865615FABF7",
          "F41AA45D9ADF3114"
        ],
        "Label": "Merged current baggage with other baggage",
        "Title": "X-Trace Task",
        "Host": "pinky19.mpi-sws.org",
        "HRT": 26962515253271876,
        "Operation": "join",
        "Timestamp": "1557746155193.438965",
        "TenantClass": 0,
        "Source": "RemoteBlockReader2.java:429",
        "ThreadID": 1,
        "ThreadName": "",
        "EventID": "4163692D48218D09",
        "ProcessID": 36430
      },
      {
        "Cycles": 0,
        "Agent": "Execution-Sleep",
        "ProcessName": "Read",
        "TaskID": "1F0F455A3707E06F",
        "ParentEventID": [
          "4163692D48218D09"
        ],
        "Label": "waited",
        "Title": "X-Trace Task",
        "Host": "pinky19.mpi-sws.org",
        "Duration": "56840",
        "HRT": 26962515253375351,
        "Operation": "waited",
        "Timestamp": "1557746155193.542480",
        "TenantClass": 0,
        "Source": "SocketIOWithTimeout.java:335",
        "ThreadID": 1,
        "ThreadName": "",
        "EventID": "AFACC3A14E946D7A",
        "ProcessID": 36430
      },
      {
        "Cycles": 0,
        "Agent": "edu.brown.cs.systems.xtrace.logging.BaggageWrappers",
        "ProcessName": "Data",
        "TaskID": "1F0F455A3707E06F",
        "ParentEventID": [
          "DDF03865615FABF7"
        ],
        "Label": "Forking current baggage with Baggage.fork()",
        "Title": "X-Trace Task",
        "Host": "pinky20.mpi-sws.org",
        "HRT": 6565719612198197,
        "Operation": "fork",
        "Timestamp": "1557746155193.401855",
        "TenantClass": 0,
        "Source": "PacketHeader.java:95",
        "ThreadID": 14317,
        "ThreadName": "",
        "EventID": "88B34508ACAC726D",
        "BaggageBytes": "[[248 5] [240 0] [0 31 15 69 90 55 7 224 111] [240 1] [0 221 240 56 101 97 95 171 247] [240 3] [0 2]]",
        "ProcessID": 13111
      },
      {
        "Cycles": 0,
        "Agent": "edu.brown.cs.systems.xtrace.logging.BaggageWrappers",
        "ProcessName": "Data",
        "TaskID": "1F0F455A3707E06F",
        "ParentEventID": [
          "1C6117936A4F12EE"
        ],
        "Label": "Forking current baggage with Baggage.fork()",
        "Title": "X-Trace Task",
        "Host": "pinky20.mpi-sws.org",
        "HRT": 6565719612566081,
        "Operation": "fork",
        "Timestamp": "1557746155193.769531",
        "TenantClass": 0,
        "Source": "PacketHeader.java:95",
        "ThreadID": 14317,
        "ThreadName": "",
        "EventID": "AFC47BCD3EFF07F1",
        "BaggageBytes": "[[248 5] [240 0] [0 31 15 69 90 55 7 224 111] [240 1] [0 28 97 23 147 106 79 18 238] [240 3] [0 2]]",
        "ProcessID": 13111
      },
      {
        "Cycles": 0,
        "Agent": "Execution-Sleep",
        "ProcessName": "Data",
        "TaskID": "1F0F455A3707E06F",
        "ParentEventID": [
          "88B34508ACAC726D"
        ],
        "Label": "waited",
        "Title": "X-Trace Task",
        "Host": "pinky20.mpi-sws.org",
        "Duration": "11857",
        "HRT": 6565719612367474,
        "Operation": "waited",
        "Timestamp": "1557746155193.571045",
        "TenantClass": 0,
        "Source": "SocketIOWithTimeout.java:335",
        "ThreadID": 14317,
        "ThreadName": "",
        "EventID": "1C6117936A4F12EE",
        "BaggageBytes": "[[248 5] [240 0] [0 31 15 69 90 55 7 224 111] [240 1] [0 136 179 69 8 172 172 114 109] [240 3] [0 2]]",
        "ProcessID": 13111
      },
      {
        "Cycles": 0,
        "Agent": "Execution-Sleep",
        "ProcessName": "Read",
        "TaskID": "1F0F455A3707E06F",
        "ParentEventID": [
          "AFACC3A14E946D7A"
        ],
        "Label": "waited",
        "Title": "X-Trace Task",
        "Host": "pinky19.mpi-sws.org",
        "Duration": "263107",
        "HRT": 26962515253711544,
        "Operation": "waited",
        "Timestamp": "1557746155193.878662",
        "TenantClass": 0,
        "Source": "SocketIOWithTimeout.java:335",
        "ThreadID": 1,
        "ThreadName": "",
        "EventID": "C0AFCE490D5401BA",
        "ProcessID": 36430
      },
      {
        "Cycles": 0,
        "Agent": "edu.brown.cs.systems.xtrace.logging.BaggageWrappers",
        "ProcessName": "Read",
        "TaskID": "1F0F455A3707E06F",
        "ParentEventID": [
          "85A02D4E67635753",
          "AFC47BCD3EFF07F1"
        ],
        "Label": "Merged current baggage with other baggage",
        "Title": "X-Trace Task",
        "Host": "pinky19.mpi-sws.org",
        "HRT": 26962515253874052,
        "Operation": "join",
        "Timestamp": "1557746155194.041016",
        "TenantClass": 0,
        "Source": "PacketHeader.java:168",
        "ThreadID": 1,
        "ThreadName": "",
        "EventID": "A1778FF515426714",
        "ProcessID": 36430
      },
      {
        "Cycles": 0,
        "Agent": "edu.brown.cs.systems.xtrace.logging.BaggageWrappers",
        "ProcessName": "Read",
        "TaskID": "1F0F455A3707E06F",
        "ParentEventID": [
          "C0AFCE490D5401BA",
          "88B34508ACAC726D"
        ],
        "Label": "Merged current baggage with other baggage",
        "Title": "X-Trace Task",
        "Host": "pinky19.mpi-sws.org",
        "HRT": 26962515253786563,
        "Operation": "join",
        "Timestamp": "1557746155193.953613",
        "TenantClass": 0,
        "Source": "PacketHeader.java:168",
        "ThreadID": 1,
        "ThreadName": "",
        "EventID": "85A02D4E67635753",
        "ProcessID": 36430
      },
      {
        "Cycles": 0,
        "Agent": "edu.brown.cs.systems.xtrace.logging.BaggageWrappers",
        "ProcessName": "Read",
        "TaskID": "1F0F455A3707E06F",
        "ParentEventID": [
          "A1778FF515426714"
        ],
        "Label": "Forking current baggage with Baggage.fork()",
        "Title": "X-Trace Task",
        "Host": "pinky19.mpi-sws.org",
        "HRT": 26962515253884918,
        "Operation": "fork",
        "Timestamp": "1557746155194.052002",
        "TenantClass": 0,
        "Source": "RemoteBlockReader2.java:361",
        "ThreadID": 1,
        "ThreadName": "",
        "EventID": "B668B02C82F7AF01",
        "ProcessID": 36430
      },
      {
        "Cycles": 0,
        "Agent": "Execution-Sleep",
        "ProcessName": "Data",
        "TaskID": "1F0F455A3707E06F",
        "ParentEventID": [
          "AFC47BCD3EFF07F1"
        ],
        "Label": "waited",
        "Title": "X-Trace Task",
        "Host": "pinky20.mpi-sws.org",
        "Duration": "137327",
        "HRT": 6565719612948394,
        "Operation": "waited",
        "Timestamp": "1557746155194.151855",
        "TenantClass": 0,
        "Source": "SocketIOWithTimeout.java:335",
        "ThreadID": 14317,
        "ThreadName": "",
        "EventID": "613E5CCFD68ED7B8",
        "BaggageBytes": "[[248 5] [240 0] [0 31 15 69 90 55 7 224 111] [240 1] [0 175 196 123 205 62 255 7 241] [240 3] [0 2]]",
        "ProcessID": 13111
      },
      {
        "Cycles": 0,
        "Agent": "Execution-CPU",
        "ProcessName": "Data",
        "TaskID": "1F0F455A3707E06F",
        "ParentEventID": [
          "F0510257E5C652CC"
        ],
        "Label": "unset",
        "Title": "X-Trace Task",
        "Host": "pinky20.mpi-sws.org",
        "Duration": "1397105",
        "HRT": 6565719613124245,
        "Operation": "unset",
        "Timestamp": "1557746155194.327881",
        "TenantClass": 0,
        "Source": "DataXceiver.java:261",
        "ThreadID": 14317,
        "ThreadName": "",
        "EventID": "79DDB06328630E26",
        "BaggageBytes": "[[248 5] [240 0] [0 31 15 69 90 55 7 224 111] [240 1] [0 240 81 2 87 229 198 82 204] [240 3] [0 2]]",
        "ProcessID": 13111
      },
      {
        "Cycles": 0,
        "Agent": "edu.brown.cs.systems.xtrace.logging.BaggageWrappers",
        "ProcessName": "Data",
        "TaskID": "1F0F455A3707E06F",
        "ParentEventID": [
          "613E5CCFD68ED7B8",
          "B668B02C82F7AF01"
        ],
        "Label": "Merged current baggage with other baggage",
        "Title": "X-Trace Task",
        "Host": "pinky20.mpi-sws.org",
        "HRT": 6565719613073528,
        "Operation": "join",
        "Timestamp": "1557746155194.277100",
        "TenantClass": 0,
        "Source": "DataXceiver.java:574",
        "ThreadID": 14317,
        "ThreadName": "",
        "EventID": "F0510257E5C652CC",
        "BaggageBytes": "[[248 5] [240 0] [0 31 15 69 90 55 7 224 111] [240 1] [0 182 104 176 44 130 247 175 1] [0 97 62 92 207 214 142 215 184] [240 3] [0 2]]",
        "ProcessID": 13111
      },
      {
        "Cycles": 0,
        "Agent": "edu.brown.cs.systems.retro.benchmarks.hdfs_client.Reader",
        "ProcessName": "Read",
        "TaskID": "1F0F455A3707E06F",
        "ParentEventID": [
          "0"
        ],
        "Label": "Reading file",
        "Title": "X-Trace Task",
        "Host": "pinky19.mpi-sws.org",
        "HRT": 26962515251543684,
        "Timestamp": "1557746155191.710693",
        "TenantClass": 0,
        "ThreadID": 1,
        "ThreadName": "",
        "EventID": "7721B858BE20B1F1",
        "ProcessID": 36430,
        "Tag": [
          "reader_10kb",
          "Read Size: 10240"
        ]
      }
    ]
  }
]