[
  {
    "id": "13813AEFABA7E61E",
    "reports": [
      {
        "Cycles": 0,
        "Agent": "Execution-CPU",
        "ProcessName": "Read",
        "TaskID": "13813AEFABA7E61E",
        "ParentEventID": [
          "7C06A9D9E1563B16"
        ],
        "Label": "unset",
        "Title": "X-Trace Task",
        "Host": "pinky19.mpi-sws.org",
        "Duration": "24844538",
        "HRT": 26966661795024661,
        "Operation": "unset",
        "Timestamp": "1557750301735.165039",
        "TenantClass": 0,
        "Source": "Client.java:1027",
        "ThreadID": 1,
        "ThreadName": "",
        "EventID": "47462F03C952FFB9",
        "ProcessID": 2801
      },
      {
        "Cycles": 0,
        "Agent": "org.apache.hadoop.ipc.ProtobufRpcEngine",
        "ProcessName": "Read",
        "TaskID": "13813AEFABA7E61E",
        "ParentEventID": [
          "AD8BC80653880635"
        ],
        "Label": "Invoking org.apache.hadoop.hdfs.protocol.ClientProtocol.getBlockLocations",
        "Title": "X-Trace Task",
        "Host": "pinky19.mpi-sws.org",
        "HRT": 26966661794966999,
        "Timestamp": "1557750301735.107422",
        "TenantClass": 0,
        "Source": "ProtobufRpcEngine.java:228",
        "ThreadID": 1,
        "ThreadName": "",
        "EventID": "7C06A9D9E1563B16",
        "ProcessID": 2801
      },
      {
        "Cycles": 0,
        "Agent": "edu.brown.cs.systems.retro.benchmarks.hdfs_client.Reader",
        "ProcessName": "Read",
        "TaskID": "13813AEFABA7E61E",
        "ParentEventID": [
          "7F2989163CA447EC"
        ],
        "Label": "Reading file",
        "Title": "X-Trace Task",
        "Host": "pinky19.mpi-sws.org",
        "HRT": 26966661794873383,
        "Timestamp": "1557750301735.013672",
        "TenantClass": 0,
        "ThreadID": 1,
        "ThreadName": "",
        "EventID": "AD8BC80653880635",
        "ProcessID": 2801
      },
      {
        "Cycles": 0,
        "Agent": "edu.brown.cs.systems.xtrace.logging.BaggageWrappers",
        "ProcessName": "Read",
        "TaskID": "13813AEFABA7E61E",
        "ParentEventID": [
          "8A145D329E7CE6AF"
        ],
        "Label": "Forking current baggage with Baggage.fork()",
        "Title": "X-Trace Task",
        "Host": "pinky19.mpi-sws.org",
        "HRT": 26966661795109003,
        "Operation": "fork",
        "Timestamp": "1557750301735.249268",
        "TenantClass": 0,
        "Source": "Client.java:1043",
        "ThreadID": 41,
        "ThreadName": "",
        "EventID": "9B755093DF53E433",
        "ProcessID": 2801
      },
      {
        "Cycles": 0,
        "Agent": "Execution-CPU",
        "ProcessName": "Read",
        "TaskID": "13813AEFABA7E61E",
        "ParentEventID": [
          "9B755093DF53E433"
        ],
        "Label": "unset",
        "Title": "X-Trace Task",
        "Host": "pinky19.mpi-sws.org",
        "Duration": "70943",
        "HRT": 26966661795179333,
        "Operation": "unset",
        "Timestamp": "1557750301735.319824",
        "TenantClass": 0,
        "Source": "Client.java:1062",
        "ThreadID": 41,
        "ThreadName": "",
        "EventID": "A992D5963F8D3B63",
        "ProcessID": 2801
      },
      {
        "Cycles": 0,
        "Agent": "Execution-CPU",
        "ProcessName": "Read",
        "TaskID": "13813AEFABA7E61E",
        "ParentEventID": [
          "47462F03C952FFB9"
        ],
        "Label": "set",
        "Title": "X-Trace Task",
        "Host": "pinky19.mpi-sws.org",
        "HRT": 26966661795093758,
        "Operation": "set",
        "Timestamp": "1557750301735.234131",
        "TenantClass": 0,
        "Source": "Client.java:1032",
        "ThreadID": 41,
        "ThreadName": "",
        "EventID": "8A145D329E7CE6AF",
        "ProcessID": 2801
      },
      {
        "Cycles": 0,
        "Agent": "Execution-CPU",
        "ProcessName": "Read",
        "TaskID": "13813AEFABA7E61E",
        "ParentEventID": [
          "A992D5963F8D3B63"
        ],
        "Label": "set",
        "Title": "X-Trace Task",
        "Host": "pinky19.mpi-sws.org",
        "HRT": 26966661795201930,
        "Operation": "set",
        "Timestamp": "1557750301735.342285",
        "TenantClass": 0,
        "Source": "Client.java:1104",
        "ThreadID": 1,
        "ThreadName": "",
        "EventID": "A57C0994670FB29C",
        "ProcessID": 2801
      },
      {
        "Cycles": 0,
        "Agent": "Execution-CPU",
        "ProcessName": "Name",
        "TaskID": "13813AEFABA7E61E",
        "ParentEventID": [
          "9B755093DF53E433"
        ],
        "Label": "set",
        "Title": "X-Trace Task",
        "Host": "pinky19.mpi-sws.org",
        "HRT": 26966661795234326,
        "Operation": "set",
        "Timestamp": "1557750301735.388672",
        "TenantClass": 0,
        "Source": "Server.java:1840",
        "ThreadID": 48,
        "ThreadName": "",
        "EventID": "A151508452FA7006",
        "BaggageBytes": "[[248 5] [240 0] [0 19 129 58 239 171 167 230 30] [240 1] [0 155 117 80 147 223 83 228 51] [240 3] [0 2]]",
        "ProcessID": 2171
      },
      {
        "Cycles": 0,
        "Agent": "Execution-CPU",
        "ProcessName": "Name",
        "TaskID": "13813AEFABA7E61E",
        "ParentEventID": [
          "CFF464F66315554B"
        ],
        "Label": "unset",
        "Title": "X-Trace Task",
        "Host": "pinky19.mpi-sws.org",
        "Duration": "25405",
        "HRT": 26966661795284534,
        "Operation": "unset",
        "Timestamp": "1557750301735.438965",
        "TenantClass": 0,
        "Source": "Server.java:1828",
        "ThreadID": 48,
        "ThreadName": "",
        "EventID": "27CA5135FE0700AA",
        "BaggageBytes": "[[248 5] [240 0] [0 19 129 58 239 171 167 230 30] [240 1] [0 207 244 100 246 99 21 85 75] [240 3] [0 2]]",
        "ProcessID": 2171
      },
      {
        "Cycles": 0,
        "Agent": "Execution-CPU",
        "ProcessName": "Name",
        "TaskID": "13813AEFABA7E61E",
        "ParentEventID": [
          "CFF464F66315554B"
        ],
        "Label": "set",
        "Title": "X-Trace Task",
        "Host": "pinky19.mpi-sws.org",
        "HRT": 26966661795292564,
        "Operation": "set",
        "Timestamp": "1557750301735.447021",
        "TenantClass": 0,
        "Source": "Server.java:2071",
        "ThreadID": 60,
        "ThreadName": "",
        "EventID": "16264B647B62F670",
        "BaggageBytes": "[[248 5] [240 0] [0 19 129 58 239 171 167 230 30] [240 1] [0 207 244 100 246 99 21 85 75] [240 3] [0 2]]",
        "ProcessID": 2171
      },
      {
        "Cycles": 0,
        "Agent": "edu.brown.cs.systems.xtrace.logging.BaggageWrappers",
        "ProcessName": "Name",
        "TaskID": "13813AEFABA7E61E",
        "ParentEventID": [
          "A151508452FA7006"
        ],
        "Label": "Forking current baggage with Baggage.fork()",
        "Title": "X-Trace Task",
        "Host": "pinky19.mpi-sws.org",
        "HRT": 26966661795263019,
        "Operation": "fork",
        "Timestamp": "1557750301735.417480",
        "TenantClass": 0,
        "Source": "Server.java:550",
        "ThreadID": 48,
        "ThreadName": "",
        "EventID": "CFF464F66315554B",
        "BaggageBytes": "[[248 5] [240 0] [0 19 129 58 239 171 167 230 30] [240 1] [0 161 81 80 132 82 250 112 6] [240 3] [0 2]]",
        "ProcessID": 2171
      },
      {
        "Cycles": 0,
        "Agent": "org.apache.hadoop.ipc.Server",
        "ProcessName": "Name",
        "TaskID": "13813AEFABA7E61E",
        "ParentEventID": [
          "16264B647B62F670"
        ],
        "Label": "getBlockLocations in org.apache.hadoop.hdfs.protocol.ClientProtocol",
        "Title": "X-Trace Task",
        "Host": "pinky19.mpi-sws.org",
        "HRT": 26966661795330863,
        "Timestamp": "1557750301735.485352",
        "TenantClass": 0,
        "Source": "ProtobufRpcEngine.java:601",
        "ThreadID": 60,
        "ThreadName": "",
        "EventID": "928141F2C357323B",
        "BaggageBytes": "[[248 5] [240 0] [0 19 129 58 239 171 167 230 30] [240 1] [0 22 38 75 100 123 98 246 112] [240 3] [0 2]]",
        "ProcessID": 2171
      },
      {
        "Cycles": 0,
        "Agent": "org.apache.hadoop.hdfs.server.namenode.FSNamesystem.audit",
        "ProcessName": "Name",
        "TaskID": "13813AEFABA7E61E",
        "ParentEventID": [
          "928141F2C357323B"
        ],
        "Label": "allowed=true\tugi=plascas (auth:SIMPLE)\tip=/139.19.171.63\tcmd=open\tsrc=/ds/jyqrTflUH4YgNOw8\tdst=null\tperm=null\tproto=rpc",
        "Title": "X-Trace Task",
        "Host": "pinky19.mpi-sws.org",
        "HRT": 26966661795376168,
        "Timestamp": "1557750301735.530518",
        "TenantClass": 0,
        "Source": "FSNamesystem.java:8313",
        "ThreadID": 60,
        "ThreadName": "",
        "EventID": "171D726F83A54D4F",
        "BaggageBytes": "[[248 5] [240 0] [0 19 129 58 239 171 167 230 30] [240 1] [0 146 129 65 242 195 87 50 59] [240 3] [0 2]]",
        "ProcessID": 2171
      },
      {
        "Cycles": 0,
        "Agent": "edu.brown.cs.systems.xtrace.logging.BaggageWrappers",
        "ProcessName": "Name",
        "TaskID": "13813AEFABA7E61E",
        "ParentEventID": [
          "171D726F83A54D4F"
        ],
        "Label": "Forking current baggage with Baggage.fork()",
        "Title": "X-Trace Task",
        "Host": "pinky19.mpi-sws.org",
        "HRT": 26966661795418087,
        "Operation": "fork",
        "Timestamp": "1557750301735.572510",
        "TenantClass": 0,
        "Source": "Server.java:2398",
        "ThreadID": 60,
        "ThreadName": "",
        "EventID": "32FF0336C29E6B7F",
        "BaggageBytes": "[[248 5] [240 0] [0 19 129 58 239 171 167 230 30] [240 1] [0 23 29 114 111 131 165 77 79] [240 3] [0 2]]",
        "ProcessID": 2171
      },
      {
        "Cycles": 0,
        "Agent": "Execution-CPU",
        "ProcessName": "Read",
        "TaskID": "13813AEFABA7E61E",
        "ParentEventID": [
          "32FF0336C29E6B7F"
        ],
        "Label": "set",
        "Title": "X-Trace Task",
        "Host": "pinky19.mpi-sws.org",
        "HRT": 26966661795571669,
        "Operation": "set",
        "Timestamp": "1557750301735.712158",
        "TenantClass": 0,
        "Source": "Client.java:302",
        "ThreadID": 40,
        "ThreadName": "",
        "EventID": "A980EB0D963D0EA5",
        "ProcessID": 2801
      },
      {
        "Cycles": 0,
        "Agent": "Execution-CPU",
        "ProcessName": "Name",
        "TaskID": "13813AEFABA7E61E",
        "ParentEventID": [
          "32FF0336C29E6B7F"
        ],
        "Label": "unset",
        "Title": "X-Trace Task",
        "Host": "pinky19.mpi-sws.org",
        "Duration": "203622",
        "HRT": 26966661795522303,
        "Operation": "unset",
        "Timestamp": "1557750301735.676758",
        "TenantClass": 0,
        "Source": "Server.java:1058",
        "ThreadID": 60,
        "ThreadName": "",
        "EventID": "E0403C04FBE4C088",
        "BaggageBytes": "[[248 5] [240 0] [0 19 129 58 239 171 167 230 30] [240 1] [0 50 255 3 54 194 158 107 127] [240 3] [0 2]]",
        "ProcessID": 2171
      },
      {
        "Cycles": 0,
        "Agent": "Execution-CPU",
        "ProcessName": "Read",
        "TaskID": "13813AEFABA7E61E",
        "ParentEventID": [
          "A980EB0D963D0EA5"
        ],
        "Label": "unset",
        "Title": "X-Trace Task",
        "Host": "pinky19.mpi-sws.org",
        "Duration": "10699",
        "HRT": 26966661795597609,
        "Operation": "unset",
        "Timestamp": "1557750301735.738037",
        "TenantClass": 0,
        "Source": "Client.java:1168",
        "ThreadID": 40,
        "ThreadName": "",
        "EventID": "8B3ED661C690F354",
        "ProcessID": 2801
      },
      {
        "Cycles": 0,
        "Agent": "edu.brown.cs.systems.xtrace.logging.BaggageWrappers",
        "ProcessName": "Read",
        "TaskID": "13813AEFABA7E61E",
        "ParentEventID": [
          "8B3ED661C690F354",
          "03DABA1AB61D99C3"
        ],
        "Label": "Merged current baggage with other baggage",
        "Title": "X-Trace Task",
        "Host": "pinky19.mpi-sws.org",
        "HRT": 26966661795644718,
        "Operation": "join",
        "Timestamp": "1557750301735.785156",
        "TenantClass": 0,
        "Source": "Client.java:1545",
        "ThreadID": 1,
        "ThreadName": "",
        "EventID": "4A87E6582B3C9F59",
        "ProcessID": 2801
      },
      {
        "Cycles": 0,
        "Agent": "Execution-Sleep",
        "ProcessName": "Read",
        "TaskID": "13813AEFABA7E61E",
        "ParentEventID": [
          "A57C0994670FB29C"
        ],
        "Label": "waited",
        "Title": "X-Trace Task",
        "Host": "pinky19.mpi-sws.org",
        "Duration": "406539",
        "HRT": 26966661795619053,
        "Operation": "waited",
        "Timestamp": "1557750301735.759521",
        "TenantClass": 0,
        "Source": "Client.java:1537",
        "ThreadID": 1,
        "ThreadName": "",
        "EventID": "03DABA1AB61D99C3",
        "ProcessID": 2801
      },
      {
        "Cycles": 0,
        "Agent": "org.apache.hadoop.ipc.ProtobufRpcEngine",
        "ProcessName": "Read",
        "TaskID": "13813AEFABA7E61E",
        "ParentEventID": [
          "4A87E6582B3C9F59"
        ],
        "Label": "org.apache.hadoop.hdfs.protocol.ClientProtocol.getBlockLocations completed",
        "Title": "X-Trace Task",
        "Host": "pinky19.mpi-sws.org",
        "HRT": 26966661795696991,
        "Timestamp": "1557750301735.837402",
        "TenantClass": 0,
        "Source": "ProtobufRpcEngine.java:275",
        "ThreadID": 1,
        "ThreadName": "",
        "EventID": "05E8CCD662765634",
        "ProcessID": 2801
      },
      {
        "Cycles": 0,
        "Agent": "Execution-Sleep",
        "ProcessName": "Read",
        "TaskID": "13813AEFABA7E61E",
        "ParentEventID": [
          "05E8CCD662765634"
        ],
        "Label": "waited",
        "Title": "X-Trace Task",
        "Host": "pinky19.mpi-sws.org",
        "Duration": "115287",
        "HRT": 26966661795931586,
        "Operation": "waited",
        "Timestamp": "1557750301736.072021",
        "TenantClass": 0,
        "Source": "SocketIOWithTimeout.java:335",
        "ThreadID": 1,
        "ThreadName": "",
        "EventID": "169A6399D4B1C6B4",
        "ProcessID": 2801
      },
      {
        "Cycles": 0,
        "Agent": "edu.brown.cs.systems.xtrace.logging.BaggageWrappers",
        "ProcessName": "Read",
        "TaskID": "13813AEFABA7E61E",
        "ParentEventID": [
          "169A6399D4B1C6B4"
        ],
        "Label": "Forking current baggage with Baggage.fork()",
        "Title": "X-Trace Task",
        "Host": "pinky19.mpi-sws.org",
        "HRT": 26966661795977119,
        "Operation": "fork",
        "Timestamp": "1557750301736.117432",
        "TenantClass": 0,
        "Source": "DataTransferProtoUtil.java:94",
        "ThreadID": 1,
        "ThreadName": "",
        "EventID": "ABF632597C00CB34",
        "ProcessID": 2801
      },
      {
        "Cycles": 0,
        "Agent": "edu.brown.cs.systems.xtrace.logging.XTraceInit",
        "ProcessName": "Data",
        "TaskID": "13813AEFABA7E61E",
        "ParentEventID": [
          "33267815F77C5ED9"
        ],
        "Label": "Thread.setName: DataXceiver for client DFSClient_NONMAPREDUCE_310321604_1 at /139.19.171.63:54404 [Sending block BP-1633380353-139.19.171.63-1554193446451:blk_1073770078_29254]",
        "Title": "X-Trace Task",
        "Host": "pinky22.mpi-sws.org",
        "HRT": 47516634050897243,
        "Timestamp": "1557750301736.588135",
        "TenantClass": 0,
        "Source": "DataXceiver.java:168",
        "ThreadID": 15675,
        "ThreadName": "",
        "EventID": "C6E31DB2299147EF",
        "BaggageBytes": "[[248 5] [240 0] [0 19 129 58 239 171 167 230 30] [240 1] [0 51 38 120 21 247 124 94 217] [240 3] [0 2]]",
        "ProcessID": 28841
      },
      {
        "Cycles": 0,
        "Agent": "Execution-CPU",
        "ProcessName": "Data",
        "TaskID": "13813AEFABA7E61E",
        "ParentEventID": [
          "ABF632597C00CB34"
        ],
        "Label": "set",
        "Title": "X-Trace Task",
        "Host": "pinky22.mpi-sws.org",
        "HRT": 47516634050785969,
        "Operation": "set",
        "Timestamp": "1557750301736.476807",
        "TenantClass": 0,
        "Source": "Receiver.java:117",
        "ThreadID": 15675,
        "ThreadName": "",
        "EventID": "33267815F77C5ED9",
        "BaggageBytes": "[[248 5] [240 0] [0 19 129 58 239 171 167 230 30] [240 1] [0 171 246 50 89 124 0 203 52] [240 3] [0 2]]",
        "ProcessID": 28841
      },
      {
        "Cycles": 0,
        "Agent": "edu.brown.cs.systems.xtrace.logging.BaggageWrappers",
        "ProcessName": "Data",
        "TaskID": "13813AEFABA7E61E",
        "ParentEventID": [
          "C6E31DB2299147EF"
        ],
        "Label": "Forking current baggage with Baggage.fork()",
        "Title": "X-Trace Task",
        "Host": "pinky22.mpi-sws.org",
        "HRT": 47516634051118147,
        "Operation": "fork",
        "Timestamp": "1557750301736.808838",
        "TenantClass": 0,
        "Source": "DataXceiver.java:1257",
        "ThreadID": 15675,
        "ThreadName": "",
        "EventID": "9BD5EF42F1507211",
        "BaggageBytes": "[[248 5] [240 0] [0 19 129 58 239 171 167 230 30] [240 1] [0 198 227 29 178 41 145 71 239] [240 3] [0 2]]",
        "ProcessID": 28841
      },
      {
        "Cycles": 0,
        "Agent": "Execution-Sleep",
        "ProcessName": "Read",
        "TaskID": "13813AEFABA7E61E",
        "ParentEventID": [
          "ABF632597C00CB34"
        ],
        "Label": "waited",
        "Title": "X-Trace Task",
        "Host": "pinky19.mpi-sws.org",
        "Duration": "919078",
        "HRT": 26966661796979085,
        "Operation": "waited",
        "Timestamp": "1557750301737.119385",
        "TenantClass": 0,
        "Source": "SocketIOWithTimeout.java:335",
        "ThreadID": 1,
        "ThreadName": "",
        "EventID": "A84BF30D9458AA36",
        "ProcessID": 2801
      },
      {
        "Cycles": 0,
        "Agent": "edu.brown.cs.systems.xtrace.logging.BaggageWrappers",
        "ProcessName": "Data",
        "TaskID": "13813AEFABA7E61E",
        "ParentEventID": [
          "9BD5EF42F1507211"
        ],
        "Label": "Forking current baggage with Baggage.fork()",
        "Title": "X-Trace Task",
        "Host": "pinky22.mpi-sws.org",
        "HRT": 47516634051271654,
        "Operation": "fork",
        "Timestamp": "1557750301736.962402",
        "TenantClass": 0,
        "Source": "PacketHeader.java:95",
        "ThreadID": 15675,
        "ThreadName": "",
        "EventID": "BC5225F85832E08B",
        "BaggageBytes": "[[248 5] [240 0] [0 19 129 58 239 171 167 230 30] [240 1] [0 155 213 239 66 241 80 114 17] [240 3] [0 2]]",
        "ProcessID": 28841
      },
      {
        "Cycles": 0,
        "Agent": "Execution-Sleep",
        "ProcessName": "Read",
        "TaskID": "13813AEFABA7E61E",
        "ParentEventID": [
          "4C46285D1D1B2092"
        ],
        "Label": "waited",
        "Title": "X-Trace Task",
        "Host": "pinky19.mpi-sws.org",
        "Duration": "31665",
        "HRT": 26966661797129229,
        "Operation": "waited",
        "Timestamp": "1557750301737.269531",
        "TenantClass": 0,
        "Source": "SocketIOWithTimeout.java:335",
        "ThreadID": 1,
        "ThreadName": "",
        "EventID": "E2E7B0AB775D3C64",
        "ProcessID": 2801
      },
      {
        "Cycles": 0,
        "Agent": "Execution-Sleep",
        "ProcessName": "Data",
        "TaskID": "13813AEFABA7E61E",
        "ParentEventID": [
          "BC5225F85832E08B"
        ],
        "Label": "waited",
        "Title": "X-Trace Task",
        "Host": "pinky22.mpi-sws.org",
        "Duration": "13487",
        "HRT": 47516634051412851,
        "Operation": "waited",
        "Timestamp": "1557750301737.103760",
        "TenantClass": 0,
        "Source": "SocketIOWithTimeout.java:335",
        "ThreadID": 15675,
        "ThreadName": "",
        "EventID": "D5910934BBD40E65",
        "BaggageBytes": "[[248 5] [240 0] [0 19 129 58 239 171 167 230 30] [240 1] [0 188 82 37 248 88 50 224 139] [240 3] [0 2]]",
        "ProcessID": 28841
      },
      {
        "Cycles": 0,
        "Agent": "edu.brown.cs.systems.xtrace.logging.BaggageWrappers",
        "ProcessName": "Read",
        "TaskID": "13813AEFABA7E61E",
        "ParentEventID": [
          "9BD5EF42F1507211",
          "A84BF30D9458AA36"
        ],
        "Label": "Merged current baggage with other baggage",
        "Title": "X-Trace Task",
        "Host": "pinky19.mpi-sws.org",
        "HRT": 26966661797052742,
        "Operation": "join",
        "Timestamp": "1557750301737.193115",
        "TenantClass": 0,
        "Source": "RemoteBlockReader2.java:429",
        "ThreadID": 1,
        "ThreadName": "",
        "EventID": "4C46285D1D1B2092",
        "ProcessID": 2801
      },
      {
        "Cycles": 0,
        "Agent": "edu.brown.cs.systems.xtrace.logging.BaggageWrappers",
        "ProcessName": "Data",
        "TaskID": "13813AEFABA7E61E",
        "ParentEventID": [
          "D5910934BBD40E65"
        ],
        "Label": "Forking current baggage with Baggage.fork()",
        "Title": "X-Trace Task",
        "Host": "pinky22.mpi-sws.org",
        "HRT": 47516634051577681,
        "Operation": "fork",
        "Timestamp": "1557750301737.268555",
        "TenantClass": 0,
        "Source": "PacketHeader.java:95",
        "ThreadID": 15675,
        "ThreadName": "",
        "EventID": "C8073BDD1E537C7F",
        "BaggageBytes": "[[248 5] [240 0] [0 19 129 58 239 171 167 230 30] [240 1] [0 213 145 9 52 187 212 14 101] [240 3] [0 2]]",
        "ProcessID": 28841
      },
      {
        "Cycles": 0,
        "Agent": "Execution-Sleep",
        "ProcessName": "Read",
        "TaskID": "13813AEFABA7E61E",
        "ParentEventID": [
          "E2E7B0AB775D3C64"
        ],
        "Label": "waited",
        "Title": "X-Trace Task",
        "Host": "pinky19.mpi-sws.org",
        "Duration": "308458",
        "HRT": 26966661797507806,
        "Operation": "waited",
        "Timestamp": "1557750301737.648193",
        "TenantClass": 0,
        "Source": "SocketIOWithTimeout.java:335",
        "ThreadID": 1,
        "ThreadName": "",
        "EventID": "7F883B2306108AC8",
        "ProcessID": 2801
      },
      {
        "Cycles": 0,
        "Agent": "Execution-Sleep",
        "ProcessName": "Read",
        "TaskID": "13813AEFABA7E61E",
        "ParentEventID": [
          "7F883B2306108AC8"
        ],
        "Label": "waited",
        "Title": "X-Trace Task",
        "Host": "pinky19.mpi-sws.org",
        "Duration": "222060",
        "HRT": 26966661797793509,
        "Operation": "waited",
        "Timestamp": "1557750301737.933838",
        "TenantClass": 0,
        "Source": "SocketIOWithTimeout.java:335",
        "ThreadID": 1,
        "ThreadName": "",
        "EventID": "FA8E2BF69C1C3DAF",
        "ProcessID": 2801
      },
      {
        "Cycles": 0,
        "Agent": "Execution-Sleep",
        "ProcessName": "Read",
        "TaskID": "13813AEFABA7E61E",
        "ParentEventID": [
          "FA8E2BF69C1C3DAF"
        ],
        "Label": "waited",
        "Title": "X-Trace Task",
        "Host": "pinky19.mpi-sws.org",
        "Duration": "137786",
        "HRT": 26966661797998298,
        "Operation": "waited",
        "Timestamp": "1557750301738.138672",
        "TenantClass": 0,
        "Source": "SocketIOWithTimeout.java:335",
        "ThreadID": 1,
        "ThreadName": "",
        "EventID": "1F93FF978D73E44C",
        "ProcessID": 2801
      },
      {
        "Cycles": 0,
        "Agent": "edu.brown.cs.systems.xtrace.logging.BaggageWrappers",
        "ProcessName": "Read",
        "TaskID": "13813AEFABA7E61E",
        "ParentEventID": [
          "1F93FF978D73E44C",
          "BC5225F85832E08B"
        ],
        "Label": "Merged current baggage with other baggage",
        "Title": "X-Trace Task",
        "Host": "pinky19.mpi-sws.org",
        "HRT": 26966661798064650,
        "Operation": "join",
        "Timestamp": "1557750301738.205078",
        "TenantClass": 0,
        "Source": "PacketHeader.java:168",
        "ThreadID": 1,
        "ThreadName": "",
        "EventID": "61FA28C9E0C967E8",
        "ProcessID": 2801
      },
      {
        "Cycles": 0,
        "Agent": "edu.brown.cs.systems.xtrace.logging.BaggageWrappers",
        "ProcessName": "Read",
        "TaskID": "13813AEFABA7E61E",
        "ParentEventID": [
          "61FA28C9E0C967E8",
          "C8073BDD1E537C7F"
        ],
        "Label": "Merged current baggage with other baggage",
        "Title": "X-Trace Task",
        "Host": "pinky19.mpi-sws.org",
        "HRT": 26966661798195339,
        "Operation": "join",
        "Timestamp": "1557750301738.335693",
        "TenantClass": 0,
        "Source": "PacketHeader.java:168",
        "ThreadID": 1,
        "ThreadName": "",
        "EventID": "9623CBB29B7A0825",
        "ProcessID": 2801
      },
      {
        "Cycles": 0,
        "Agent": "edu.brown.cs.systems.xtrace.logging.BaggageWrappers",
        "ProcessName": "Read",
        "TaskID": "13813AEFABA7E61E",
        "ParentEventID": [
          "9623CBB29B7A0825"
        ],
        "Label": "Forking current baggage with Baggage.fork()",
        "Title": "X-Trace Task",
        "Host": "pinky19.mpi-sws.org",
        "HRT": 26966661798206923,
        "Operation": "fork",
        "Timestamp": "1557750301738.347412",
        "TenantClass": 0,
        "Source": "RemoteBlockReader2.java:361",
        "ThreadID": 1,
        "ThreadName": "",
        "EventID": "D5CA28568A885CF2",
        "ProcessID": 2801
      },
      {
        "Cycles": 0,
        "Agent": "edu.brown.cs.systems.xtrace.logging.BaggageWrappers",
        "ProcessName": "Read",
        "TaskID": "13813AEFABA7E61E",
        "ParentEventID": [
          "D5CA28568A885CF2"
        ],
        "Label": "Forking current baggage with Baggage.fork()",
        "Title": "X-Trace Task",
        "Host": "pinky19.mpi-sws.org",
        "HRT": 26966661798272458,
        "Operation": "fork",
        "Timestamp": "1557750301738.412842",
        "TenantClass": 0,
        "Source": "DataTransferProtoUtil.java:94",
        "ThreadID": 1,
        "ThreadName": "",
        "EventID": "8ED811224006C1C0",
        "ProcessID": 2801
      },
      {
        "Cycles": 0,
        "Agent": "edu.brown.cs.systems.xtrace.logging.BaggageWrappers",
        "ProcessName": "Data",
        "TaskID": "13813AEFABA7E61E",
        "ParentEventID": [
          "D5CA28568A885CF2",
          "C8073BDD1E537C7F"
        ],
        "Label": "Merged current baggage with other baggage",
        "Title": "X-Trace Task",
        "Host": "pinky22.mpi-sws.org",
        "HRT": 47516634054341879,
        "Operation": "join",
        "Timestamp": "1557750301740.032715",
        "TenantClass": 0,
        "Source": "DataXceiver.java:574",
        "ThreadID": 15675,
        "ThreadName": "",
        "EventID": "EF824FC1E1D0F51E",
        "BaggageBytes": "[[248 5] [240 0] [0 19 129 58 239 171 167 230 30] [240 1] [0 200 7 59 221 30 83 124 127] [0 213 202 40 86 138 136 92 242] [240 3] [0 2]]",
        "ProcessID": 28841
      },
      {
        "Cycles": 0,
        "Agent": "Execution-CPU",
        "ProcessName": "Data",
        "TaskID": "13813AEFABA7E61E",
        "ParentEventID": [
          "EF824FC1E1D0F51E"
        ],
        "Label": "unset",
        "Title": "X-Trace Task",
        "Host": "pinky22.mpi-sws.org",
        "Duration": "3536739",
        "HRT": 47516634054401222,
        "Operation": "unset",
        "Timestamp": "1557750301740.092041",
        "TenantClass": 0,
        "Source": "DataXceiver.java:261",
        "ThreadID": 15675,
        "ThreadName": "",
        "EventID": "C288B9E8CCD3CE77",
        "BaggageBytes": "[[248 5] [240 0] [0 19 129 58 239 171 167 230 30] [240 1] [0 239 130 79 193 225 208 245 30] [240 3] [0 2]]",
        "ProcessID": 28841
      },
      {
        "Cycles": 0,
        "Agent": "Execution-CPU",
        "ProcessName": "Data",
        "TaskID": "13813AEFABA7E61E",
        "ParentEventID": [
          "8ED811224006C1C0"
        ],
        "Label": "set",
        "Title": "X-Trace Task",
        "Host": "pinky22.mpi-sws.org",
        "HRT": 47516634054470019,
        "Operation": "set",
        "Timestamp": "1557750301740.160889",
        "TenantClass": 0,
        "Source": "Receiver.java:117",
        "ThreadID": 15675,
        "ThreadName": "",
        "EventID": "161BA689A7EAA4FF",
        "BaggageBytes": "[[248 5] [240 0] [0 19 129 58 239 171 167 230 30] [240 1] [0 142 216 17 34 64 6 193 192] [240 3] [0 2]]",
        "ProcessID": 28841
      },
      {
        "Cycles": 0,
        "Agent": "edu.brown.cs.systems.xtrace.logging.XTraceInit",
        "ProcessName": "Data",
        "TaskID": "13813AEFABA7E61E",
        "ParentEventID": [
          "161BA689A7EAA4FF"
        ],
        "Label": "Thread.setName: DataXceiver for client DFSClient_NONMAPREDUCE_310321604_1 at /139.19.171.63:54404 [Sending block BP-1633380353-139.19.171.63-1554193446451:blk_1073770078_29254]",
        "Title": "X-Trace Task",
        "Host": "pinky22.mpi-sws.org",
        "HRT": 47516634054521736,
        "Timestamp": "1557750301740.212646",
        "TenantClass": 0,
        "Source": "DataXceiver.java:168",
        "ThreadID": 15675,
        "ThreadName": "",
        "EventID": "99BAC9E85601E788",
        "BaggageBytes": "[[248 5] [240 0] [0 19 129 58 239 171 167 230 30] [240 1] [0 22 27 166 137 167 234 164 255] [240 3] [0 2]]",
        "ProcessID": 28841
      },
      {
        "Cycles": 0,
        "Agent": "edu.brown.cs.systems.xtrace.logging.BaggageWrappers",
        "ProcessName": "Data",
        "TaskID": "13813AEFABA7E61E",
        "ParentEventID": [
          "99BAC9E85601E788"
        ],
        "Label": "Forking current baggage with Baggage.fork()",
        "Title": "X-Trace Task",
        "Host": "pinky22.mpi-sws.org",
        "HRT": 47516634054683720,
        "Operation": "fork",
        "Timestamp": "1557750301740.374512",
        "TenantClass": 0,
        "Source": "DataXceiver.java:1257",
        "ThreadID": 15675,
        "ThreadName": "",
        "EventID": "02B9B37E36C87275",
        "BaggageBytes": "[[248 5] [240 0] [0 19 129 58 239 171 167 230 30] [240 1] [0 153 186 201 232 86 1 231 136] [240 3] [0 2]]",
        "ProcessID": 28841
      },
      {
        "Cycles": 0,
        "Agent": "Execution-Sleep",
        "ProcessName": "Read",
        "TaskID": "13813AEFABA7E61E",
        "ParentEventID": [
          "8ED811224006C1C0"
        ],
        "Label": "waited",
        "Title": "X-Trace Task",
        "Host": "pinky19.mpi-sws.org",
        "Duration": "2181178",
        "HRT": 26966661800534238,
        "Operation": "waited",
        "Timestamp": "1557750301740.674561",
        "TenantClass": 0,
        "Source": "SocketIOWithTimeout.java:335",
        "ThreadID": 1,
        "ThreadName": "",
        "EventID": "CEEAFE6C51994CB8",
        "ProcessID": 2801
      },
      {
        "Cycles": 0,
        "Agent": "edu.brown.cs.systems.xtrace.logging.BaggageWrappers",
        "ProcessName": "Read",
        "TaskID": "13813AEFABA7E61E",
        "ParentEventID": [
          "02B9B37E36C87275",
          "CEEAFE6C51994CB8"
        ],
        "Label": "Merged current baggage with other baggage",
        "Title": "X-Trace Task",
        "Host": "pinky19.mpi-sws.org",
        "HRT": 26966661800593491,
        "Operation": "join",
        "Timestamp": "1557750301740.733887",
        "TenantClass": 0,
        "Source": "RemoteBlockReader2.java:429",
        "ThreadID": 1,
        "ThreadName": "",
        "EventID": "D8433E243AF86603",
        "ProcessID": 2801
      },
      {
        "Cycles": 0,
        "Agent": "edu.brown.cs.systems.xtrace.logging.BaggageWrappers",
        "ProcessName": "Data",
        "TaskID": "13813AEFABA7E61E",
        "ParentEventID": [
          "02B9B37E36C87275"
        ],
        "Label": "Forking current baggage with Baggage.fork()",
        "Title": "X-Trace Task",
        "Host": "pinky22.mpi-sws.org",
        "HRT": 47516634054811737,
        "Operation": "fork",
        "Timestamp": "1557750301740.502441",
        "TenantClass": 0,
        "Source": "PacketHeader.java:95",
        "ThreadID": 15675,
        "ThreadName": "",
        "EventID": "7E7A6B11E14F2C85",
        "BaggageBytes": "[[248 5] [240 0] [0 19 129 58 239 171 167 230 30] [240 1] [0 2 185 179 126 54 200 114 117] [240 3] [0 2]]",
        "ProcessID": 28841
      },
      {
        "Cycles": 0,
        "Agent": "Execution-Sleep",
        "ProcessName": "Read",
        "TaskID": "13813AEFABA7E61E",
        "ParentEventID": [
          "D8433E243AF86603"
        ],
        "Label": "waited",
        "Title": "X-Trace Task",
        "Host": "pinky19.mpi-sws.org",
        "Duration": "8451",
        "HRT": 26966661800652182,
        "Operation": "waited",
        "Timestamp": "1557750301740.792480",
        "TenantClass": 0,
        "Source": "SocketIOWithTimeout.java:335",
        "ThreadID": 1,
        "ThreadName": "",
        "EventID": "ECBFF6F7B3D58661",
        "ProcessID": 2801
      },
      {
        "Cycles": 0,
        "Agent": "Execution-Sleep",
        "ProcessName": "Data",
        "TaskID": "13813AEFABA7E61E",
        "ParentEventID": [
          "7E7A6B11E14F2C85"
        ],
        "Label": "waited",
        "Title": "X-Trace Task",
        "Host": "pinky22.mpi-sws.org",
        "Duration": "9994",
        "HRT": 47516634054939610,
        "Operation": "waited",
        "Timestamp": "1557750301740.630371",
        "TenantClass": 0,
        "Source": "SocketIOWithTimeout.java:335",
        "ThreadID": 15675,
        "ThreadName": "",
        "EventID": "5BF6CBA65BCC6F0C",
        "BaggageBytes": "[[248 5] [240 0] [0 19 129 58 239 171 167 230 30] [240 1] [0 126 122 107 17 225 79 44 133] [240 3] [0 2]]",
        "ProcessID": 28841
      },
      {
        "Cycles": 0,
        "Agent": "edu.brown.cs.systems.xtrace.logging.BaggageWrappers",
        "ProcessName": "Data",
        "TaskID": "13813AEFABA7E61E",
        "ParentEventID": [
          "5BF6CBA65BCC6F0C"
        ],
        "Label": "Forking current baggage with Baggage.fork()",
        "Title": "X-Trace Task",
        "Host": "pinky22.mpi-sws.org",
        "HRT": 47516634055104984,
        "Operation": "fork",
        "Timestamp": "1557750301740.795898",
        "TenantClass": 0,
        "Source": "PacketHeader.java:95",
        "ThreadID": 15675,
        "ThreadName": "",
        "EventID": "3D60366B56DFCC91",
        "BaggageBytes": "[[248 5] [240 0] [0 19 129 58 239 171 167 230 30] [240 1] [0 91 246 203 166 91 204 111 12] [240 3] [0 2]]",
        "ProcessID": 28841
      },
      {
        "Cycles": 0,
        "Agent": "Execution-Sleep",
        "ProcessName": "Read",
        "TaskID": "13813AEFABA7E61E",
        "ParentEventID": [
          "ECBFF6F7B3D58661"
        ],
        "Label": "waited",
        "Title": "X-Trace Task",
        "Host": "pinky19.mpi-sws.org",
        "Duration": "330395",
        "HRT": 26966661801043775,
        "Operation": "waited",
        "Timestamp": "1557750301741.184082",
        "TenantClass": 0,
        "Source": "SocketIOWithTimeout.java:335",
        "ThreadID": 1,
        "ThreadName": "",
        "EventID": "615848B7B26B69A2",
        "ProcessID": 2801
      },
      {
        "Cycles": 0,
        "Agent": "Execution-Sleep",
        "ProcessName": "Read",
        "TaskID": "13813AEFABA7E61E",
        "ParentEventID": [
          "615848B7B26B69A2"
        ],
        "Label": "waited",
        "Title": "X-Trace Task",
        "Host": "pinky19.mpi-sws.org",
        "Duration": "153166",
        "HRT": 26966661801250015,
        "Operation": "waited",
        "Timestamp": "1557750301741.390381",
        "TenantClass": 0,
        "Source": "SocketIOWithTimeout.java:335",
        "ThreadID": 1,
        "ThreadName": "",
        "EventID": "B6694FCDC9C768C2",
        "ProcessID": 2801
      },
      {
        "Cycles": 0,
        "Agent": "edu.brown.cs.systems.retro.benchmarks.hdfs_client.Reader",
        "ProcessName": "Read",
        "TaskID": "13813AEFABA7E61E",
        "ParentEventID": [
          "0"
        ],
        "Label": "Reading file",
        "Title": "X-Trace Task",
        "Host": "pinky19.mpi-sws.org",
        "HRT": 26966661794828305,
        "Timestamp": "1557750301734.968750",
        "TenantClass": 0,
        "ThreadID": 1,
        "ThreadName": "",
        "EventID": "7F2989163CA447EC",
        "ProcessID": 2801,
        "Tag": [
          "reader_100kb",
          "Read Size: 102400"
        ]
      },
      {
        "Cycles": 0,
        "Agent": "Execution-Sleep",
        "ProcessName": "Data",
        "TaskID": "13813AEFABA7E61E",
        "ParentEventID": [
          "3D60366B56DFCC91"
        ],
        "Label": "waited",
        "Title": "X-Trace Task",
        "Host": "pinky22.mpi-sws.org",
        "Duration": "212384",
        "HRT": 47516634055427931,
        "Operation": "waited",
        "Timestamp": "1557750301741.118652",
        "TenantClass": 0,
        "Source": "SocketIOWithTimeout.java:335",
        "ThreadID": 15675,
        "ThreadName": "",
        "EventID": "AEB9681DE90CD425",
        "BaggageBytes": "[[248 5] [240 0] [0 19 129 58 239 171 167 230 30] [240 1] [0 61 96 54 107 86 223 204 145] [240 3] [0 2]]",
        "ProcessID": 28841
      },
      {
        "Cycles": 0,
        "Agent": "Execution-Sleep",
        "ProcessName": "Read",
        "TaskID": "13813AEFABA7E61E",
        "ParentEventID": [
          "B6694FCDC9C768C2"
        ],
        "Label": "waited",
        "Title": "X-Trace Task",
        "Host": "pinky19.mpi-sws.org",
        "Duration": "155650",
        "HRT": 26966661801455221,
        "Operation": "waited",
        "Timestamp": "1557750301741.595703",
        "TenantClass": 0,
        "Source": "SocketIOWithTimeout.java:335",
        "ThreadID": 1,
        "ThreadName": "",
        "EventID": "B99447F7447088B2",
        "ProcessID": 2801
      },
      {
        "Cycles": 0,
        "Agent": "edu.brown.cs.systems.xtrace.logging.BaggageWrappers",
        "ProcessName": "Data",
        "TaskID": "13813AEFABA7E61E",
        "ParentEventID": [
          "AEB9681DE90CD425"
        ],
        "Label": "Forking current baggage with Baggage.fork()",
        "Title": "X-Trace Task",
        "Host": "pinky22.mpi-sws.org",
        "HRT": 47516634055615716,
        "Operation": "fork",
        "Timestamp": "1557750301741.306396",
        "TenantClass": 0,
        "Source": "PacketHeader.java:95",
        "ThreadID": 15675,
        "ThreadName": "",
        "EventID": "A7C0856D0E828CF5",
        "BaggageBytes": "[[248 5] [240 0] [0 19 129 58 239 171 167 230 30] [240 1] [0 174 185 104 29 233 12 212 37] [240 3] [0 2]]",
        "ProcessID": 28841
      },
      {
        "Cycles": 0,
        "Agent": "edu.brown.cs.systems.xtrace.logging.BaggageWrappers",
        "ProcessName": "Read",
        "TaskID": "13813AEFABA7E61E",
        "ParentEventID": [
          "B99447F7447088B2",
          "7E7A6B11E14F2C85"
        ],
        "Label": "Merged current baggage with other baggage",
        "Title": "X-Trace Task",
        "Host": "pinky19.mpi-sws.org",
        "HRT": 26966661801517477,
        "Operation": "join",
        "Timestamp": "1557750301741.657959",
        "TenantClass": 0,
        "Source": "PacketHeader.java:168",
        "ThreadID": 1,
        "ThreadName": "",
        "EventID": "A1520AA78F6C6614",
        "ProcessID": 2801
      },
      {
        "Cycles": 0,
        "Agent": "Execution-Sleep",
        "ProcessName": "Data",
        "TaskID": "13813AEFABA7E61E",
        "ParentEventID": [
          "A7C0856D0E828CF5"
        ],
        "Label": "waited",
        "Title": "X-Trace Task",
        "Host": "pinky22.mpi-sws.org",
        "Duration": "8536",
        "HRT": 47516634055737867,
        "Operation": "waited",
        "Timestamp": "1557750301741.428711",
        "TenantClass": 0,
        "Source": "SocketIOWithTimeout.java:335",
        "ThreadID": 15675,
        "ThreadName": "",
        "EventID": "4E466760A66CE4E6",
        "BaggageBytes": "[[248 5] [240 0] [0 19 129 58 239 171 167 230 30] [240 1] [0 167 192 133 109 14 130 140 245] [240 3] [0 2]]",
        "ProcessID": 28841
      },
      {
        "Cycles": 0,
        "Agent": "edu.brown.cs.systems.xtrace.logging.BaggageWrappers",
        "ProcessName": "Data",
        "TaskID": "13813AEFABA7E61E",
        "ParentEventID": [
          "4E466760A66CE4E6"
        ],
        "Label": "Forking current baggage with Baggage.fork()",
        "Title": "X-Trace Task",
        "Host": "pinky22.mpi-sws.org",
        "HRT": 47516634055859150,
        "Operation": "fork",
        "Timestamp": "1557750301741.550049",
        "TenantClass": 0,
        "Source": "PacketHeader.java:95",
        "ThreadID": 15675,
        "ThreadName": "",
        "EventID": "7B34DEE2F738FE33",
        "BaggageBytes": "[[248 5] [240 0] [0 19 129 58 239 171 167 230 30] [240 1] [0 78 70 103 96 166 108 228 230] [240 3] [0 2]]",
        "ProcessID": 28841
      },
      {
        "Cycles": 0,
        "Agent": "Execution-CPU",
        "ProcessName": "Data",
        "TaskID": "13813AEFABA7E61E",
        "ParentEventID": [
          "7B34DEE2F738FE33"
        ],
        "Label": "unset",
        "Title": "X-Trace Task",
        "Host": "pinky22.mpi-sws.org",
        "Duration": "1653499",
        "HRT": 47516634056156314,
        "Operation": "unset",
        "Timestamp": "1557750301741.847168",
        "TenantClass": 0,
        "Source": "DataXceiver.java:261",
        "ThreadID": 15675,
        "ThreadName": "",
        "EventID": "CF5F9EC8D20D7B71",
        "BaggageBytes": "[[248 5] [240 0] [0 19 129 58 239 171 167 230 30] [240 1] [0 123 52 222 226 247 56 254 51] [240 3] [0 2]]",
        "ProcessID": 28841
      }
    ]
  }
]