[
  {
    "id": "E85A21B9FC6295D3",
    "reports": [
      {
        "Cycles": 0,
        "Agent": "org.apache.hadoop.ipc.ProtobufRpcEngine",
        "ProcessName": "Read",
        "TaskID": "E85A21B9FC6295D3",
        "ParentEventID": [
          "E6413E207DB05166"
        ],
        "Label": "Invoking org.apache.hadoop.hdfs.protocol.ClientProtocol.getBlockLocations",
        "Title": "X-Trace Task",
        "Host": "pinky19.mpi-sws.org",
        "HRT": 26962632638501319,
        "Timestamp": "1557746272578.952148",
        "TenantClass": 0,
        "Source": "ProtobufRpcEngine.java:228",
        "ThreadID": 1,
        "ThreadName": "",
        "EventID": "0CC54B70CB48753A",
        "ProcessID": 36430
      },
      {
        "Cycles": 0,
        "Agent": "Execution-CPU",
        "ProcessName": "Read",
        "TaskID": "E85A21B9FC6295D3",
        "ParentEventID": [
          "0CC54B70CB48753A"
        ],
        "Label": "unset",
        "Title": "X-Trace Task",
        "Host": "pinky19.mpi-sws.org",
        "Duration": "21892718",
        "HRT": 26962632638521348,
        "Operation": "unset",
        "Timestamp": "1557746272578.972168",
        "TenantClass": 0,
        "Source": "Client.java:1027",
        "ThreadID": 1,
        "ThreadName": "",
        "EventID": "9E3EA7F5F8FC45C8",
        "ProcessID": 36430
      },
      {
        "Cycles": 0,
        "Agent": "Execution-CPU",
        "ProcessName": "Read",
        "TaskID": "E85A21B9FC6295D3",
        "ParentEventID": [
          "9E3EA7F5F8FC45C8"
        ],
        "Label": "set",
        "Title": "X-Trace Task",
        "Host": "pinky19.mpi-sws.org",
        "HRT": 26962632638571301,
        "Operation": "set",
        "Timestamp": "1557746272579.022217",
        "TenantClass": 0,
        "Source": "Client.java:1032",
        "ThreadID": 41,
        "ThreadName": "",
        "EventID": "0929BA0EF13CD18E",
        "ProcessID": 36430
      },
      {
        "Cycles": 0,
        "Agent": "Execution-CPU",
        "ProcessName": "Read",
        "TaskID": "E85A21B9FC6295D3",
        "ParentEventID": [
          "68CADFFE49CAD9F6"
        ],
        "Label": "unset",
        "Title": "X-Trace Task",
        "Host": "pinky19.mpi-sws.org",
        "Duration": "93172",
        "HRT": 26962632638689683,
        "Operation": "unset",
        "Timestamp": "1557746272579.140625",
        "TenantClass": 0,
        "Source": "Client.java:1062",
        "ThreadID": 41,
        "ThreadName": "",
        "EventID": "C271A2304756556A",
        "ProcessID": 36430
      },
      {
        "Cycles": 0,
        "Agent": "edu.brown.cs.systems.retro.benchmarks.hdfs_client.Reader",
        "ProcessName": "Read",
        "TaskID": "E85A21B9FC6295D3",
        "ParentEventID": [
          "BD107490049B8913"
        ],
        "Label": "Reading file",
        "Title": "X-Trace Task",
        "Host": "pinky19.mpi-sws.org",
        "HRT": 26962632638456087,
        "Timestamp": "1557746272578.906982",
        "TenantClass": 0,
        "ThreadID": 1,
        "ThreadName": "",
        "EventID": "E6413E207DB05166",
        "ProcessID": 36430
      },
      {
        "Cycles": 0,
        "Agent": "Execution-CPU",
        "ProcessName": "Read",
        "TaskID": "E85A21B9FC6295D3",
        "ParentEventID": [
          "C271A2304756556A"
        ],
        "Label": "set",
        "Title": "X-Trace Task",
        "Host": "pinky19.mpi-sws.org",
        "HRT": 26962632638714728,
        "Operation": "set",
        "Timestamp": "1557746272579.165771",
        "TenantClass": 0,
        "Source": "Client.java:1104",
        "ThreadID": 1,
        "ThreadName": "",
        "EventID": "B48AD0C1EE9B4F22",
        "ProcessID": 36430
      },
      {
        "Cycles": 0,
        "Agent": "edu.brown.cs.systems.xtrace.logging.BaggageWrappers",
        "ProcessName": "Read",
        "TaskID": "E85A21B9FC6295D3",
        "ParentEventID": [
          "0929BA0EF13CD18E"
        ],
        "Label": "Forking current baggage with Baggage.fork()",
        "Title": "X-Trace Task",
        "Host": "pinky19.mpi-sws.org",
        "HRT": 26962632638600475,
        "Operation": "fork",
        "Timestamp": "1557746272579.051514",
        "TenantClass": 0,
        "Source": "Client.java:1043",
        "ThreadID": 41,
        "ThreadName": "",
        "EventID": "68CADFFE49CAD9F6",
        "ProcessID": 36430
      },
      {
        "Cycles": 0,
        "Agent": "Execution-CPU",
        "ProcessName": "Name",
        "TaskID": "E85A21B9FC6295D3",
        "ParentEventID": [
          "68CADFFE49CAD9F6"
        ],
        "Label": "set",
        "Title": "X-Trace Task",
        "Host": "pinky19.mpi-sws.org",
        "HRT": 26962632638737891,
        "Operation": "set",
        "Timestamp": "1557746272579.195801",
        "TenantClass": 0,
        "Source": "Server.java:1840",
        "ThreadID": 48,
        "ThreadName": "",
        "EventID": "A8128D24801BEC7F",
        "BaggageBytes": "[[248 5] [240 0] [0 232 90 33 185 252 98 149 211] [240 1] [0 104 202 223 254 73 202 217 246] [240 3] [0 2]]",
        "ProcessID": 2171
      },
      {
        "Cycles": 0,
        "Agent": "edu.brown.cs.systems.xtrace.logging.BaggageWrappers",
        "ProcessName": "Name",
        "TaskID": "E85A21B9FC6295D3",
        "ParentEventID": [
          "A8128D24801BEC7F"
        ],
        "Label": "Forking current baggage with Baggage.fork()",
        "Title": "X-Trace Task",
        "Host": "pinky19.mpi-sws.org",
        "HRT": 26962632638760376,
        "Operation": "fork",
        "Timestamp": "1557746272579.218262",
        "TenantClass": 0,
        "Source": "Server.java:550",
        "ThreadID": 48,
        "ThreadName": "",
        "EventID": "C1932D3912253D2E",
        "BaggageBytes": "[[248 5] [240 0] [0 232 90 33 185 252 98 149 211] [240 1] [0 168 18 141 36 128 27 236 127] [240 3] [0 2]]",
        "ProcessID": 2171
      },
      {
        "Cycles": 0,
        "Agent": "Execution-CPU",
        "ProcessName": "Name",
        "TaskID": "E85A21B9FC6295D3",
        "ParentEventID": [
          "C1932D3912253D2E"
        ],
        "Label": "unset",
        "Title": "X-Trace Task",
        "Host": "pinky19.mpi-sws.org",
        "Duration": "20965",
        "HRT": 26962632638778383,
        "Operation": "unset",
        "Timestamp": "1557746272579.236328",
        "TenantClass": 0,
        "Source": "Server.java:1828",
        "ThreadID": 48,
        "ThreadName": "",
        "EventID": "A7B58EE907840C16",
        "BaggageBytes": "[[248 5] [240 0] [0 232 90 33 185 252 98 149 211] [240 1] [0 193 147 45 57 18 37 61 46] [240 3] [0 2]]",
        "ProcessID": 2171
      },
      {
        "Cycles": 0,
        "Agent": "org.apache.hadoop.ipc.Server",
        "ProcessName": "Name",
        "TaskID": "E85A21B9FC6295D3",
        "ParentEventID": [
          "91EDB454CE0CA17D"
        ],
        "Label": "getBlockLocations in org.apache.hadoop.hdfs.protocol.ClientProtocol",
        "Title": "X-Trace Task",
        "Host": "pinky19.mpi-sws.org",
        "HRT": 26962632638821707,
        "Timestamp": "1557746272579.279541",
        "TenantClass": 0,
        "Source": "ProtobufRpcEngine.java:601",
        "ThreadID": 55,
        "ThreadName": "",
        "EventID": "7E062E2E1A131C99",
        "BaggageBytes": "[[248 5] [240 0] [0 232 90 33 185 252 98 149 211] [240 1] [0 145 237 180 84 206 12 161 125] [240 3] [0 2]]",
        "ProcessID": 2171
      },
      {
        "Cycles": 0,
        "Agent": "Execution-CPU",
        "ProcessName": "Name",
        "TaskID": "E85A21B9FC6295D3",
        "ParentEventID": [
          "C1932D3912253D2E"
        ],
        "Label": "set",
        "Title": "X-Trace Task",
        "Host": "pinky19.mpi-sws.org",
        "HRT": 26962632638786503,
        "Operation": "set",
        "Timestamp": "1557746272579.244385",
        "TenantClass": 0,
        "Source": "Server.java:2071",
        "ThreadID": 55,
        "ThreadName": "",
        "EventID": "91EDB454CE0CA17D",
        "BaggageBytes": "[[248 5] [240 0] [0 232 90 33 185 252 98 149 211] [240 1] [0 193 147 45 57 18 37 61 46] [240 3] [0 2]]",
        "ProcessID": 2171
      },
      {
        "Cycles": 0,
        "Agent": "org.apache.hadoop.hdfs.server.namenode.FSNamesystem.audit",
        "ProcessName": "Name",
        "TaskID": "E85A21B9FC6295D3",
        "ParentEventID": [
          "7E062E2E1A131C99"
        ],
        "Label": "allowed=true\tugi=plascas (auth:SIMPLE)\tip=/139.19.171.63\tcmd=open\tsrc=/ds/i54qbCQWWDcidQUE\tdst=null\tperm=null\tproto=rpc",
        "Title": "X-Trace Task",
        "Host": "pinky19.mpi-sws.org",
        "HRT": 26962632638870286,
        "Timestamp": "1557746272579.328125",
        "TenantClass": 0,
        "Source": "FSNamesystem.java:8313",
        "ThreadID": 55,
        "ThreadName": "",
        "EventID": "CE692CDEDAFF8E73",
        "BaggageBytes": "[[248 5] [240 0] [0 232 90 33 185 252 98 149 211] [240 1] [0 126 6 46 46 26 19 28 153] [240 3] [0 2]]",
        "ProcessID": 2171
      },
      {
        "Cycles": 0,
        "Agent": "Execution-CPU",
        "ProcessName": "Name",
        "TaskID": "E85A21B9FC6295D3",
        "ParentEventID": [
          "7940354D39E5FF8C"
        ],
        "Label": "unset",
        "Title": "X-Trace Task",
        "Host": "pinky19.mpi-sws.org",
        "Duration": "216469",
        "HRT": 26962632639025255,
        "Operation": "unset",
        "Timestamp": "1557746272579.483154",
        "TenantClass": 0,
        "Source": "Server.java:1058",
        "ThreadID": 55,
        "ThreadName": "",
        "EventID": "4C609603C5C51F02",
        "BaggageBytes": "[[248 5] [240 0] [0 232 90 33 185 252 98 149 211] [240 1] [0 121 64 53 77 57 229 255 140] [240 3] [0 2]]",
        "ProcessID": 2171
      },
      {
        "Cycles": 0,
        "Agent": "Execution-CPU",
        "ProcessName": "Read",
        "TaskID": "E85A21B9FC6295D3",
        "ParentEventID": [
          "7940354D39E5FF8C"
        ],
        "Label": "set",
        "Title": "X-Trace Task",
        "Host": "pinky19.mpi-sws.org",
        "HRT": 26962632639065498,
        "Operation": "set",
        "Timestamp": "1557746272579.516357",
        "TenantClass": 0,
        "Source": "Client.java:302",
        "ThreadID": 37,
        "ThreadName": "",
        "EventID": "49A225A902F41873",
        "ProcessID": 36430
      },
      {
        "Cycles": 0,
        "Agent": "edu.brown.cs.systems.xtrace.logging.BaggageWrappers",
        "ProcessName": "Name",
        "TaskID": "E85A21B9FC6295D3",
        "ParentEventID": [
          "CE692CDEDAFF8E73"
        ],
        "Label": "Forking current baggage with Baggage.fork()",
        "Title": "X-Trace Task",
        "Host": "pinky19.mpi-sws.org",
        "HRT": 26962632638914333,
        "Operation": "fork",
        "Timestamp": "1557746272579.372070",
        "TenantClass": 0,
        "Source": "Server.java:2398",
        "ThreadID": 55,
        "ThreadName": "",
        "EventID": "7940354D39E5FF8C",
        "BaggageBytes": "[[248 5] [240 0] [0 232 90 33 185 252 98 149 211] [240 1] [0 206 105 44 222 218 255 142 115] [240 3] [0 2]]",
        "ProcessID": 2171
      },
      {
        "Cycles": 0,
        "Agent": "Execution-CPU",
        "ProcessName": "Read",
        "TaskID": "E85A21B9FC6295D3",
        "ParentEventID": [
          "49A225A902F41873"
        ],
        "Label": "unset",
        "Title": "X-Trace Task",
        "Host": "pinky19.mpi-sws.org",
        "Duration": "8014",
        "HRT": 26962632639086597,
        "Operation": "unset",
        "Timestamp": "1557746272579.537598",
        "TenantClass": 0,
        "Source": "Client.java:1168",
        "ThreadID": 37,
        "ThreadName": "",
        "EventID": "5FAF19EBFD984B6E",
        "ProcessID": 36430
      },
      {
        "Cycles": 0,
        "Agent": "Execution-Sleep",
        "ProcessName": "Read",
        "TaskID": "E85A21B9FC6295D3",
        "ParentEventID": [
          "B48AD0C1EE9B4F22"
        ],
        "Label": "waited",
        "Title": "X-Trace Task",
        "Host": "pinky19.mpi-sws.org",
        "Duration": "383175",
        "HRT": 26962632639108502,
        "Operation": "waited",
        "Timestamp": "1557746272579.559326",
        "TenantClass": 0,
        "Source": "Client.java:1537",
        "ThreadID": 1,
        "ThreadName": "",
        "EventID": "6118D3CBD94B24FE",
        "ProcessID": 36430
      },
      {
        "Cycles": 0,
        "Agent": "edu.brown.cs.systems.xtrace.logging.BaggageWrappers",
        "ProcessName": "Read",
        "TaskID": "E85A21B9FC6295D3",
        "ParentEventID": [
          "5FAF19EBFD984B6E",
          "6118D3CBD94B24FE"
        ],
        "Label": "Merged current baggage with other baggage",
        "Title": "X-Trace Task",
        "Host": "pinky19.mpi-sws.org",
        "HRT": 26962632639125054,
        "Operation": "join",
        "Timestamp": "1557746272579.575928",
        "TenantClass": 0,
        "Source": "Client.java:1545",
        "ThreadID": 1,
        "ThreadName": "",
        "EventID": "02AC3CD3DD7FCCF6",
        "ProcessID": 36430
      },
      {
        "Cycles": 0,
        "Agent": "org.apache.hadoop.ipc.ProtobufRpcEngine",
        "ProcessName": "Read",
        "TaskID": "E85A21B9FC6295D3",
        "ParentEventID": [
          "02AC3CD3DD7FCCF6"
        ],
        "Label": "org.apache.hadoop.hdfs.protocol.ClientProtocol.getBlockLocations completed",
        "Title": "X-Trace Task",
        "Host": "pinky19.mpi-sws.org",
        "HRT": 26962632639164000,
        "Timestamp": "1557746272579.614990",
        "TenantClass": 0,
        "Source": "ProtobufRpcEngine.java:275",
        "ThreadID": 1,
        "ThreadName": "",
        "EventID": "1B53BA1DD7874CAE",
        "ProcessID": 36430
      },
      {
        "Cycles": 0,
        "Agent": "Execution-CPU",
        "ProcessName": "Data",
        "TaskID": "E85A21B9FC6295D3",
        "ParentEventID": [
          "B4707E5940E8C914"
        ],
        "Label": "set",
        "Title": "X-Trace Task",
        "Host": "pinky19.mpi-sws.org",
        "HRT": 26962632639360728,
        "Operation": "set",
        "Timestamp": "1557746272579.796387",
        "TenantClass": 0,
        "Source": "Receiver.java:117",
        "ThreadID": 36633,
        "ThreadName": "",
        "EventID": "A180E7A1DBB8F9AE",
        "BaggageBytes": "[[248 5] [240 0] [0 232 90 33 185 252 98 149 211] [240 1] [0 180 112 126 89 64 232 201 20] [240 3] [0 2]]",
        "ProcessID": 2319
      },
      {
        "Cycles": 0,
        "Agent": "edu.brown.cs.systems.xtrace.logging.BaggageWrappers",
        "ProcessName": "Read",
        "TaskID": "E85A21B9FC6295D3",
        "ParentEventID": [
          "1B53BA1DD7874CAE"
        ],
        "Label": "Forking current baggage with Baggage.fork()",
        "Title": "X-Trace Task",
        "Host": "pinky19.mpi-sws.org",
        "HRT": 26962632639237992,
        "Operation": "fork",
        "Timestamp": "1557746272579.688965",
        "TenantClass": 0,
        "Source": "DataTransferProtoUtil.java:94",
        "ThreadID": 1,
        "ThreadName": "",
        "EventID": "B4707E5940E8C914",
        "ProcessID": 36430
      },
      {
        "Cycles": 0,
        "Agent": "edu.brown.cs.systems.xtrace.logging.XTraceInit",
        "ProcessName": "Data",
        "TaskID": "E85A21B9FC6295D3",
        "ParentEventID": [
          "A180E7A1DBB8F9AE"
        ],
        "Label": "Thread.setName: DataXceiver for client DFSClient_NONMAPREDUCE_778905418_1 at /139.19.171.63:43130 [Sending block BP-1633380353-139.19.171.63-1554193446451:blk_1073762203_21379]",
        "Title": "X-Trace Task",
        "Host": "pinky19.mpi-sws.org",
        "HRT": 26962632639395259,
        "Timestamp": "1557746272579.830811",
        "TenantClass": 0,
        "Source": "DataXceiver.java:168",
        "ThreadID": 36633,
        "ThreadName": "",
        "EventID": "2A426B329EE2456C",
        "BaggageBytes": "[[248 5] [240 0] [0 232 90 33 185 252 98 149 211] [240 1] [0 161 128 231 161 219 184 249 174] [240 3] [0 2]]",
        "ProcessID": 2319
      },
      {
        "Cycles": 0,
        "Agent": "Execution-Sleep",
        "ProcessName": "Read",
        "TaskID": "E85A21B9FC6295D3",
        "ParentEventID": [
          "B4707E5940E8C914"
        ],
        "Label": "waited",
        "Title": "X-Trace Task",
        "Host": "pinky19.mpi-sws.org",
        "Duration": "222312",
        "HRT": 26962632639548402,
        "Operation": "waited",
        "Timestamp": "1557746272579.999268",
        "TenantClass": 0,
        "Source": "SocketIOWithTimeout.java:335",
        "ThreadID": 1,
        "ThreadName": "",
        "EventID": "2F5D4C4CB4122361",
        "ProcessID": 36430
      },
      {
        "Cycles": 0,
        "Agent": "edu.brown.cs.systems.xtrace.logging.BaggageWrappers",
        "ProcessName": "Data",
        "TaskID": "E85A21B9FC6295D3",
        "ParentEventID": [
          "9749AD7821F9A924"
        ],
        "Label": "Forking current baggage with Baggage.fork()",
        "Title": "X-Trace Task",
        "Host": "pinky19.mpi-sws.org",
        "HRT": 26962632639551792,
        "Operation": "fork",
        "Timestamp": "1557746272579.987305",
        "TenantClass": 0,
        "Source": "PacketHeader.java:95",
        "ThreadID": 36633,
        "ThreadName": "",
        "EventID": "1AD0E1FA0A305727",
        "BaggageBytes": "[[248 5] [240 0] [0 232 90 33 185 252 98 149 211] [240 1] [0 151 73 173 120 33 249 169 36] [240 3] [0 2]]",
        "ProcessID": 2319
      },
      {
        "Cycles": 0,
        "Agent": "edu.brown.cs.systems.xtrace.logging.BaggageWrappers",
        "ProcessName": "Data",
        "TaskID": "E85A21B9FC6295D3",
        "ParentEventID": [
          "2A426B329EE2456C"
        ],
        "Label": "Forking current baggage with Baggage.fork()",
        "Title": "X-Trace Task",
        "Host": "pinky19.mpi-sws.org",
        "HRT": 26962632639487891,
        "Operation": "fork",
        "Timestamp": "1557746272579.923584",
        "TenantClass": 0,
        "Source": "DataXceiver.java:1257",
        "ThreadID": 36633,
        "ThreadName": "",
        "EventID": "9749AD7821F9A924",
        "BaggageBytes": "[[248 5] [240 0] [0 232 90 33 185 252 98 149 211] [240 1] [0 42 66 107 50 158 226 69 108] [240 3] [0 2]]",
        "ProcessID": 2319
      },
      {
        "Cycles": 0,
        "Agent": "edu.brown.cs.systems.xtrace.logging.BaggageWrappers",
        "ProcessName": "Read",
        "TaskID": "E85A21B9FC6295D3",
        "ParentEventID": [
          "2F5D4C4CB4122361",
          "9749AD7821F9A924"
        ],
        "Label": "Merged current baggage with other baggage",
        "Title": "X-Trace Task",
        "Host": "pinky19.mpi-sws.org",
        "HRT": 26962632639618139,
        "Operation": "join",
        "Timestamp": "1557746272580.069092",
        "TenantClass": 0,
        "Source": "RemoteBlockReader2.java:429",
        "ThreadID": 1,
        "ThreadName": "",
        "EventID": "6D3591F2A7ACFBDE",
        "ProcessID": 36430
      },
      {
        "Cycles": 0,
        "Agent": "edu.brown.cs.systems.xtrace.logging.BaggageWrappers",
        "ProcessName": "Data",
        "TaskID": "E85A21B9FC6295D3",
        "ParentEventID": [
          "D361DC786095D3B3"
        ],
        "Label": "Forking current baggage with Baggage.fork()",
        "Title": "X-Trace Task",
        "Host": "pinky19.mpi-sws.org",
        "HRT": 26962632639697693,
        "Operation": "fork",
        "Timestamp": "1557746272580.133301",
        "TenantClass": 0,
        "Source": "PacketHeader.java:95",
        "ThreadID": 36633,
        "ThreadName": "",
        "EventID": "E6D6F5C555D3EB38",
        "BaggageBytes": "[[248 5] [240 0] [0 232 90 33 185 252 98 149 211] [240 1] [0 211 97 220 120 96 149 211 179] [240 3] [0 2]]",
        "ProcessID": 2319
      },
      {
        "Cycles": 0,
        "Agent": "Execution-Sleep",
        "ProcessName": "Data",
        "TaskID": "E85A21B9FC6295D3",
        "ParentEventID": [
          "1AD0E1FA0A305727"
        ],
        "Label": "waited",
        "Title": "X-Trace Task",
        "Host": "pinky19.mpi-sws.org",
        "Duration": "4096",
        "HRT": 26962632639620922,
        "Operation": "waited",
        "Timestamp": "1557746272580.056396",
        "TenantClass": 0,
        "Source": "SocketIOWithTimeout.java:335",
        "ThreadID": 36633,
        "ThreadName": "",
        "EventID": "D361DC786095D3B3",
        "BaggageBytes": "[[248 5] [240 0] [0 232 90 33 185 252 98 149 211] [240 1] [0 26 208 225 250 10 48 87 39] [240 3] [0 2]]",
        "ProcessID": 2319
      },
      {
        "Cycles": 0,
        "Agent": "edu.brown.cs.systems.xtrace.logging.BaggageWrappers",
        "ProcessName": "Read",
        "TaskID": "E85A21B9FC6295D3",
        "ParentEventID": [
          "E8FA575FA694444D",
          "E6D6F5C555D3EB38"
        ],
        "Label": "Merged current baggage with other baggage",
        "Title": "X-Trace Task",
        "Host": "pinky19.mpi-sws.org",
        "HRT": 26962632639776412,
        "Operation": "join",
        "Timestamp": "1557746272580.227295",
        "TenantClass": 0,
        "Source": "PacketHeader.java:168",
        "ThreadID": 1,
        "ThreadName": "",
        "EventID": "1859620841A1ABF3",
        "ProcessID": 36430
      },
      {
        "Cycles": 0,
        "Agent": "edu.brown.cs.systems.xtrace.logging.BaggageWrappers",
        "ProcessName": "Read",
        "TaskID": "E85A21B9FC6295D3",
        "ParentEventID": [
          "6D3591F2A7ACFBDE",
          "1AD0E1FA0A305727"
        ],
        "Label": "Merged current baggage with other baggage",
        "Title": "X-Trace Task",
        "Host": "pinky19.mpi-sws.org",
        "HRT": 26962632639713108,
        "Operation": "join",
        "Timestamp": "1557746272580.164062",
        "TenantClass": 0,
        "Source": "PacketHeader.java:168",
        "ThreadID": 1,
        "ThreadName": "",
        "EventID": "E8FA575FA694444D",
        "ProcessID": 36430
      },
      {
        "Cycles": 0,
        "Agent": "edu.brown.cs.systems.xtrace.logging.BaggageWrappers",
        "ProcessName": "Read",
        "TaskID": "E85A21B9FC6295D3",
        "ParentEventID": [
          "1859620841A1ABF3"
        ],
        "Label": "Forking current baggage with Baggage.fork()",
        "Title": "X-Trace Task",
        "Host": "pinky19.mpi-sws.org",
        "HRT": 26962632639787098,
        "Operation": "fork",
        "Timestamp": "1557746272580.238037",
        "TenantClass": 0,
        "Source": "RemoteBlockReader2.java:361",
        "ThreadID": 1,
        "ThreadName": "",
        "EventID": "21E7742ED6E34565",
        "ProcessID": 36430
      },
      {
        "Cycles": 0,
        "Agent": "edu.brown.cs.systems.xtrace.logging.BaggageWrappers",
        "ProcessName": "Data",
        "TaskID": "E85A21B9FC6295D3",
        "ParentEventID": [
          "21E7742ED6E34565",
          "EEE53535F371872E"
        ],
        "Label": "Merged current baggage with other baggage",
        "Title": "X-Trace Task",
        "Host": "pinky19.mpi-sws.org",
        "HRT": 26962632639896576,
        "Operation": "join",
        "Timestamp": "1557746272580.332275",
        "TenantClass": 0,
        "Source": "DataXceiver.java:574",
        "ThreadID": 36633,
        "ThreadName": "",
        "EventID": "2401EA2516F84CC0",
        "BaggageBytes": "[[248 5] [240 0] [0 232 90 33 185 252 98 149 211] [240 1] [0 238 229 53 53 243 113 135 46] [0 33 231 116 46 214 227 69 101] [240 3] [0 2]]",
        "ProcessID": 2319
      },
      {
        "Cycles": 0,
        "Agent": "Execution-Sleep",
        "ProcessName": "Data",
        "TaskID": "E85A21B9FC6295D3",
        "ParentEventID": [
          "E6D6F5C555D3EB38"
        ],
        "Label": "waited",
        "Title": "X-Trace Task",
        "Host": "pinky19.mpi-sws.org",
        "Duration": "23941",
        "HRT": 26962632639830175,
        "Operation": "waited",
        "Timestamp": "1557746272580.265869",
        "TenantClass": 0,
        "Source": "SocketIOWithTimeout.java:335",
        "ThreadID": 36633,
        "ThreadName": "",
        "EventID": "EEE53535F371872E",
        "BaggageBytes": "[[248 5] [240 0] [0 232 90 33 185 252 98 149 211] [240 1] [0 230 214 245 197 85 211 235 56] [240 3] [0 2]]",
        "ProcessID": 2319
      },
      {
        "Cycles": 0,
        "Agent": "Execution-CPU",
        "ProcessName": "Data",
        "TaskID": "E85A21B9FC6295D3",
        "ParentEventID": [
          "2401EA2516F84CC0"
        ],
        "Label": "unset",
        "Title": "X-Trace Task",
        "Host": "pinky19.mpi-sws.org",
        "Duration": "539900",
        "HRT": 26962632639924310,
        "Operation": "unset",
        "Timestamp": "1557746272580.359863",
        "TenantClass": 0,
        "Source": "DataXceiver.java:261",
        "ThreadID": 36633,
        "ThreadName": "",
        "EventID": "858993200AE155D1",
        "BaggageBytes": "[[248 5] [240 0] [0 232 90 33 185 252 98 149 211] [240 1] [0 36 1 234 37 22 248 76 192] [240 3] [0 2]]",
        "ProcessID": 2319
      },
      {
        "Cycles": 0,
        "Agent": "edu.brown.cs.systems.retro.benchmarks.hdfs_client.Reader",
        "ProcessName": "Read",
        "TaskID": "E85A21B9FC6295D3",
        "ParentEventID": [
          "0"
        ],
        "Label": "Reading file",
        "Title": "X-Trace Task",
        "Host": "pinky19.mpi-sws.org",
        "HRT": 26962632638437794,
        "Timestamp": "1557746272578.888672",
        "TenantClass": 0,
        "ThreadID": 1,
        "ThreadName": "",
        "EventID": "BD107490049B8913",
        "ProcessID": 36430,
        "Tag": [
          "reader_10kb",
          "Read Size: 10240"
        ]
      }
    ]
  }
]