[
  {
    "id": "61F87354C039894F",
    "reports": [
      {
        "Cycles": 0,
        "Agent": "org.apache.hadoop.ipc.ProtobufRpcEngine",
        "ProcessName": "Read",
        "TaskID": "61F87354C039894F",
        "ParentEventID": [
          "1FCBB068E9FC7E82"
        ],
        "Label": "Invoking org.apache.hadoop.hdfs.protocol.ClientProtocol.getBlockLocations",
        "Title": "X-Trace Task",
        "Host": "pinky19.mpi-sws.org",
        "HRT": 26962669456680393,
        "Timestamp": "1557746309396.884766",
        "TenantClass": 0,
        "Source": "ProtobufRpcEngine.java:228",
        "ThreadID": 1,
        "ThreadName": "",
        "EventID": "0852BBF002FE1A64",
        "ProcessID": 36430
      },
      {
        "Cycles": 0,
        "Agent": "edu.brown.cs.systems.retro.benchmarks.hdfs_client.Reader",
        "ProcessName": "Read",
        "TaskID": "61F87354C039894F",
        "ParentEventID": [
          "A13C6766D84D442D"
        ],
        "Label": "Reading file",
        "Title": "X-Trace Task",
        "Host": "pinky19.mpi-sws.org",
        "HRT": 26962669456661170,
        "Timestamp": "1557746309396.865479",
        "TenantClass": 0,
        "ThreadID": 1,
        "ThreadName": "",
        "EventID": "1FCBB068E9FC7E82",
        "ProcessID": 36430
      },
      {
        "Cycles": 0,
        "Agent": "Execution-CPU",
        "ProcessName": "Read",
        "TaskID": "61F87354C039894F",
        "ParentEventID": [
          "0852BBF002FE1A64"
        ],
        "Label": "unset",
        "Title": "X-Trace Task",
        "Host": "pinky19.mpi-sws.org",
        "Duration": "22205814",
        "HRT": 26962669456694155,
        "Operation": "unset",
        "Timestamp": "1557746309396.898438",
        "TenantClass": 0,
        "Source": "Client.java:1027",
        "ThreadID": 1,
        "ThreadName": "",
        "EventID": "7B97FDA0BF75AA58",
        "ProcessID": 36430
      },
      {
        "Cycles": 0,
        "Agent": "Execution-CPU",
        "ProcessName": "Read",
        "TaskID": "61F87354C039894F",
        "ParentEventID": [
          "7B97FDA0BF75AA58"
        ],
        "Label": "set",
        "Title": "X-Trace Task",
        "Host": "pinky19.mpi-sws.org",
        "HRT": 26962669456734703,
        "Operation": "set",
        "Timestamp": "1557746309396.938965",
        "TenantClass": 0,
        "Source": "Client.java:1032",
        "ThreadID": 41,
        "ThreadName": "",
        "EventID": "D07A891AD338D2BA",
        "ProcessID": 36430
      },
      {
        "Cycles": 0,
        "Agent": "edu.brown.cs.systems.xtrace.logging.BaggageWrappers",
        "ProcessName": "Read",
        "TaskID": "61F87354C039894F",
        "ParentEventID": [
          "D07A891AD338D2BA"
        ],
        "Label": "Forking current baggage with Baggage.fork()",
        "Title": "X-Trace Task",
        "Host": "pinky19.mpi-sws.org",
        "HRT": 26962669456753812,
        "Operation": "fork",
        "Timestamp": "1557746309396.958008",
        "TenantClass": 0,
        "Source": "Client.java:1043",
        "ThreadID": 41,
        "ThreadName": "",
        "EventID": "1BAE5841136E9CCE",
        "ProcessID": 36430
      },
      {
        "Cycles": 0,
        "Agent": "Execution-CPU",
        "ProcessName": "Read",
        "TaskID": "61F87354C039894F",
        "ParentEventID": [
          "93DFE5A0D5E2DB83"
        ],
        "Label": "set",
        "Title": "X-Trace Task",
        "Host": "pinky19.mpi-sws.org",
        "HRT": 26962669456839120,
        "Operation": "set",
        "Timestamp": "1557746309397.043457",
        "TenantClass": 0,
        "Source": "Client.java:1104",
        "ThreadID": 1,
        "ThreadName": "",
        "EventID": "F762BC0FDC466269",
        "ProcessID": 36430
      },
      {
        "Cycles": 0,
        "Agent": "Execution-CPU",
        "ProcessName": "Name",
        "TaskID": "61F87354C039894F",
        "ParentEventID": [
          "1BAE5841136E9CCE"
        ],
        "Label": "set",
        "Title": "X-Trace Task",
        "Host": "pinky19.mpi-sws.org",
        "HRT": 26962669456893152,
        "Operation": "set",
        "Timestamp": "1557746309397.102295",
        "TenantClass": 0,
        "Source": "Server.java:1840",
        "ThreadID": 48,
        "ThreadName": "",
        "EventID": "19DCAA48AF1C904D",
        "BaggageBytes": "[[248 5] [240 0] [0 97 248 115 84 192 57 137 79] [240 1] [0 27 174 88 65 19 110 156 206] [240 3] [0 2]]",
        "ProcessID": 2171
      },
      {
        "Cycles": 0,
        "Agent": "edu.brown.cs.systems.xtrace.logging.BaggageWrappers",
        "ProcessName": "Name",
        "TaskID": "61F87354C039894F",
        "ParentEventID": [
          "19DCAA48AF1C904D"
        ],
        "Label": "Forking current baggage with Baggage.fork()",
        "Title": "X-Trace Task",
        "Host": "pinky19.mpi-sws.org",
        "HRT": 26962669456923494,
        "Operation": "fork",
        "Timestamp": "1557746309397.132568",
        "TenantClass": 0,
        "Source": "Server.java:550",
        "ThreadID": 48,
        "ThreadName": "",
        "EventID": "6EC5FBEB87D31ABA",
        "BaggageBytes": "[[248 5] [240 0] [0 97 248 115 84 192 57 137 79] [240 1] [0 25 220 170 72 175 28 144 77] [240 3] [0 2]]",
        "ProcessID": 2171
      },
      {
        "Cycles": 0,
        "Agent": "Execution-CPU",
        "ProcessName": "Read",
        "TaskID": "61F87354C039894F",
        "ParentEventID": [
          "1BAE5841136E9CCE"
        ],
        "Label": "unset",
        "Title": "X-Trace Task",
        "Host": "pinky19.mpi-sws.org",
        "Duration": "65215",
        "HRT": 26962669456818053,
        "Operation": "unset",
        "Timestamp": "1557746309397.022217",
        "TenantClass": 0,
        "Source": "Client.java:1062",
        "ThreadID": 41,
        "ThreadName": "",
        "EventID": "93DFE5A0D5E2DB83",
        "ProcessID": 36430
      },
      {
        "Cycles": 0,
        "Agent": "Execution-CPU",
        "ProcessName": "Name",
        "TaskID": "61F87354C039894F",
        "ParentEventID": [
          "6EC5FBEB87D31ABA"
        ],
        "Label": "unset",
        "Title": "X-Trace Task",
        "Host": "pinky19.mpi-sws.org",
        "Duration": "23409",
        "HRT": 26962669456942830,
        "Operation": "unset",
        "Timestamp": "1557746309397.152100",
        "TenantClass": 0,
        "Source": "Server.java:1828",
        "ThreadID": 48,
        "ThreadName": "",
        "EventID": "E8E4401E7E9BCE88",
        "BaggageBytes": "[[248 5] [240 0] [0 97 248 115 84 192 57 137 79] [240 1] [0 110 197 251 235 135 211 26 186] [240 3] [0 2]]",
        "ProcessID": 2171
      },
      {
        "Cycles": 0,
        "Agent": "Execution-CPU",
        "ProcessName": "Name",
        "TaskID": "61F87354C039894F",
        "ParentEventID": [
          "6EC5FBEB87D31ABA"
        ],
        "Label": "set",
        "Title": "X-Trace Task",
        "Host": "pinky19.mpi-sws.org",
        "HRT": 26962669456949794,
        "Operation": "set",
        "Timestamp": "1557746309397.158936",
        "TenantClass": 0,
        "Source": "Server.java:2071",
        "ThreadID": 61,
        "ThreadName": "",
        "EventID": "B16337CCDDE2F688",
        "BaggageBytes": "[[248 5] [240 0] [0 97 248 115 84 192 57 137 79] [240 1] [0 110 197 251 235 135 211 26 186] [240 3] [0 2]]",
        "ProcessID": 2171
      },
      {
        "Cycles": 0,
        "Agent": "org.apache.hadoop.hdfs.server.namenode.FSNamesystem.audit",
        "ProcessName": "Name",
        "TaskID": "61F87354C039894F",
        "ParentEventID": [
          "2095CB97E45A13D9"
        ],
        "Label": "allowed=true\tugi=plascas (auth:SIMPLE)\tip=/139.19.171.63\tcmd=open\tsrc=/ds/Gvqr2IVg5SEPDsmR\tdst=null\tperm=null\tproto=rpc",
        "Title": "X-Trace Task",
        "Host": "pinky19.mpi-sws.org",
        "HRT": 26962669457031676,
        "Timestamp": "1557746309397.240967",
        "TenantClass": 0,
        "Source": "FSNamesystem.java:8313",
        "ThreadID": 61,
        "ThreadName": "",
        "EventID": "C7507FC02CEC84D0",
        "BaggageBytes": "[[248 5] [240 0] [0 97 248 115 84 192 57 137 79] [240 1] [0 32 149 203 151 228 90 19 217] [240 3] [0 2]]",
        "ProcessID": 2171
      },
      {
        "Cycles": 0,
        "Agent": "org.apache.hadoop.ipc.Server",
        "ProcessName": "Name",
        "TaskID": "61F87354C039894F",
        "ParentEventID": [
          "B16337CCDDE2F688"
        ],
        "Label": "getBlockLocations in org.apache.hadoop.hdfs.protocol.ClientProtocol",
        "Title": "X-Trace Task",
        "Host": "pinky19.mpi-sws.org",
        "HRT": 26962669456987382,
        "Timestamp": "1557746309397.196533",
        "TenantClass": 0,
        "Source": "ProtobufRpcEngine.java:601",
        "ThreadID": 61,
        "ThreadName": "",
        "EventID": "2095CB97E45A13D9",
        "BaggageBytes": "[[248 5] [240 0] [0 97 248 115 84 192 57 137 79] [240 1] [0 177 99 55 204 221 226 246 136] [240 3] [0 2]]",
        "ProcessID": 2171
      },
      {
        "Cycles": 0,
        "Agent": "edu.brown.cs.systems.xtrace.logging.BaggageWrappers",
        "ProcessName": "Name",
        "TaskID": "61F87354C039894F",
        "ParentEventID": [
          "C7507FC02CEC84D0"
        ],
        "Label": "Forking current baggage with Baggage.fork()",
        "Title": "X-Trace Task",
        "Host": "pinky19.mpi-sws.org",
        "HRT": 26962669457084676,
        "Operation": "fork",
        "Timestamp": "1557746309397.293945",
        "TenantClass": 0,
        "Source": "Server.java:2398",
        "ThreadID": 61,
        "ThreadName": "",
        "EventID": "49C691BEAE290B72",
        "BaggageBytes": "[[248 5] [240 0] [0 97 248 115 84 192 57 137 79] [240 1] [0 199 80 127 192 44 236 132 208] [240 3] [0 2]]",
        "ProcessID": 2171
      },
      {
        "Cycles": 0,
        "Agent": "Execution-CPU",
        "ProcessName": "Name",
        "TaskID": "61F87354C039894F",
        "ParentEventID": [
          "49C691BEAE290B72"
        ],
        "Label": "unset",
        "Title": "X-Trace Task",
        "Host": "pinky19.mpi-sws.org",
        "Duration": "215006",
        "HRT": 26962669457191188,
        "Operation": "unset",
        "Timestamp": "1557746309397.400391",
        "TenantClass": 0,
        "Source": "Server.java:1058",
        "ThreadID": 61,
        "ThreadName": "",
        "EventID": "13FEF2E9623686B7",
        "BaggageBytes": "[[248 5] [240 0] [0 97 248 115 84 192 57 137 79] [240 1] [0 73 198 145 190 174 41 11 114] [240 3] [0 2]]",
        "ProcessID": 2171
      },
      {
        "Cycles": 0,
        "Agent": "Execution-CPU",
        "ProcessName": "Read",
        "TaskID": "61F87354C039894F",
        "ParentEventID": [
          "49C691BEAE290B72"
        ],
        "Label": "set",
        "Title": "X-Trace Task",
        "Host": "pinky19.mpi-sws.org",
        "HRT": 26962669457234049,
        "Operation": "set",
        "Timestamp": "1557746309397.438232",
        "TenantClass": 0,
        "Source": "Client.java:302",
        "ThreadID": 37,
        "ThreadName": "",
        "EventID": "965257BA87270975",
        "ProcessID": 36430
      },
      {
        "Cycles": 0,
        "Agent": "Execution-CPU",
        "ProcessName": "Read",
        "TaskID": "61F87354C039894F",
        "ParentEventID": [
          "965257BA87270975"
        ],
        "Label": "unset",
        "Title": "X-Trace Task",
        "Host": "pinky19.mpi-sws.org",
        "Duration": "4919",
        "HRT": 26962669457255001,
        "Operation": "unset",
        "Timestamp": "1557746309397.459229",
        "TenantClass": 0,
        "Source": "Client.java:1168",
        "ThreadID": 37,
        "ThreadName": "",
        "EventID": "16A5022B63AADC7B",
        "ProcessID": 36430
      },
      {
        "Cycles": 0,
        "Agent": "edu.brown.cs.systems.xtrace.logging.BaggageWrappers",
        "ProcessName": "Read",
        "TaskID": "61F87354C039894F",
        "ParentEventID": [
          "F32C821C0C6D738D",
          "16A5022B63AADC7B"
        ],
        "Label": "Merged current baggage with other baggage",
        "Title": "X-Trace Task",
        "Host": "pinky19.mpi-sws.org",
        "HRT": 26962669457293992,
        "Operation": "join",
        "Timestamp": "1557746309397.498291",
        "TenantClass": 0,
        "Source": "Client.java:1545",
        "ThreadID": 1,
        "ThreadName": "",
        "EventID": "DE4859160158D9A4",
        "ProcessID": 36430
      },
      {
        "Cycles": 0,
        "Agent": "Execution-Sleep",
        "ProcessName": "Read",
        "TaskID": "61F87354C039894F",
        "ParentEventID": [
          "F762BC0FDC466269"
        ],
        "Label": "waited",
        "Title": "X-Trace Task",
        "Host": "pinky19.mpi-sws.org",
        "Duration": "425434",
        "HRT": 26962669457274825,
        "Operation": "waited",
        "Timestamp": "1557746309397.479004",
        "TenantClass": 0,
        "Source": "Client.java:1537",
        "ThreadID": 1,
        "ThreadName": "",
        "EventID": "F32C821C0C6D738D",
        "ProcessID": 36430
      },
      {
        "Cycles": 0,
        "Agent": "org.apache.hadoop.ipc.ProtobufRpcEngine",
        "ProcessName": "Read",
        "TaskID": "61F87354C039894F",
        "ParentEventID": [
          "DE4859160158D9A4"
        ],
        "Label": "org.apache.hadoop.hdfs.protocol.ClientProtocol.getBlockLocations completed",
        "Title": "X-Trace Task",
        "Host": "pinky19.mpi-sws.org",
        "HRT": 26962669457330302,
        "Timestamp": "1557746309397.534668",
        "TenantClass": 0,
        "Source": "ProtobufRpcEngine.java:275",
        "ThreadID": 1,
        "ThreadName": "",
        "EventID": "C8D52C214F9AA933",
        "ProcessID": 36430
      },
      {
        "Cycles": 0,
        "Agent": "edu.brown.cs.systems.xtrace.logging.BaggageWrappers",
        "ProcessName": "Read",
        "TaskID": "61F87354C039894F",
        "ParentEventID": [
          "C8D52C214F9AA933"
        ],
        "Label": "Forking current baggage with Baggage.fork()",
        "Title": "X-Trace Task",
        "Host": "pinky19.mpi-sws.org",
        "HRT": 26962669457383612,
        "Operation": "fork",
        "Timestamp": "1557746309397.587891",
        "TenantClass": 0,
        "Source": "DataTransferProtoUtil.java:94",
        "ThreadID": 1,
        "ThreadName": "",
        "EventID": "95C1AA135DA6B29B",
        "ProcessID": 36430
      },
      {
        "Cycles": 0,
        "Agent": "Execution-CPU",
        "ProcessName": "Data",
        "TaskID": "61F87354C039894F",
        "ParentEventID": [
          "95C1AA135DA6B29B"
        ],
        "Label": "set",
        "Title": "X-Trace Task",
        "Host": "pinky24.mpi-sws.org",
        "HRT": 6573922182033579,
        "Operation": "set",
        "Timestamp": "1557746309397.990723",
        "TenantClass": 0,
        "Source": "Receiver.java:117",
        "ThreadID": 14307,
        "ThreadName": "",
        "EventID": "60DDE621BD0254B7",
        "BaggageBytes": "[[248 5] [240 0] [0 97 248 115 84 192 57 137 79] [240 1] [0 149 193 170 19 93 166 178 155] [240 3] [0 2]]",
        "ProcessID": 28692
      },
      {
        "Cycles": 0,
        "Agent": "edu.brown.cs.systems.xtrace.logging.XTraceInit",
        "ProcessName": "Data",
        "TaskID": "61F87354C039894F",
        "ParentEventID": [
          "60DDE621BD0254B7"
        ],
        "Label": "Thread.setName: DataXceiver for client DFSClient_NONMAPREDUCE_778905418_1 at /139.19.171.63:58814 [Sending block BP-1633380353-139.19.171.63-1554193446451:blk_1073768734_27910]",
        "Title": "X-Trace Task",
        "Host": "pinky24.mpi-sws.org",
        "HRT": 6573922182131536,
        "Timestamp": "1557746309398.088623",
        "TenantClass": 0,
        "Source": "DataXceiver.java:168",
        "ThreadID": 14307,
        "ThreadName": "",
        "EventID": "9AB313F7513E317C",
        "BaggageBytes": "[[248 5] [240 0] [0 97 248 115 84 192 57 137 79] [240 1] [0 96 221 230 33 189 2 84 183] [240 3] [0 2]]",
        "ProcessID": 28692
      },
      {
        "Cycles": 0,
        "Agent": "edu.brown.cs.systems.retro.benchmarks.hdfs_client.Reader",
        "ProcessName": "Read",
        "TaskID": "61F87354C039894F",
        "ParentEventID": [
          "0"
        ],
        "Label": "Reading file",
        "Title": "X-Trace Task",
        "Host": "pinky19.mpi-sws.org",
        "HRT": 26962669456650474,
        "Timestamp": "1557746309396.854736",
        "TenantClass": 0,
        "ThreadID": 1,
        "ThreadName": "",
        "EventID": "A13C6766D84D442D",
        "ProcessID": 36430,
        "Tag": [
          "reader_10kb",
          "Read Size: 10240"
        ]
      },
      {
        "Cycles": 0,
        "Agent": "edu.brown.cs.systems.xtrace.logging.BaggageWrappers",
        "ProcessName": "Data",
        "TaskID": "61F87354C039894F",
        "ParentEventID": [
          "9AB313F7513E317C"
        ],
        "Label": "Forking current baggage with Baggage.fork()",
        "Title": "X-Trace Task",
        "Host": "pinky24.mpi-sws.org",
        "HRT": 6573922204320834,
        "Operation": "fork",
        "Timestamp": "1557746309420.277832",
        "TenantClass": 0,
        "Source": "DataXceiver.java:1257",
        "ThreadID": 14307,
        "ThreadName": "",
        "EventID": "675333E73586413A",
        "BaggageBytes": "[[248 5] [240 0] [0 97 248 115 84 192 57 137 79] [240 1] [0 154 179 19 247 81 62 49 124] [240 3] [0 2]]",
        "ProcessID": 28692
      },
      {
        "Cycles": 0,
        "Agent": "edu.brown.cs.systems.xtrace.logging.BaggageWrappers",
        "ProcessName": "Data",
        "TaskID": "61F87354C039894F",
        "ParentEventID": [
          "675333E73586413A"
        ],
        "Label": "Forking current baggage with Baggage.fork()",
        "Title": "X-Trace Task",
        "Host": "pinky24.mpi-sws.org",
        "HRT": 6573922204393589,
        "Operation": "fork",
        "Timestamp": "1557746309420.350586",
        "TenantClass": 0,
        "Source": "PacketHeader.java:95",
        "ThreadID": 14307,
        "ThreadName": "",
        "EventID": "C41D7AE98FE3A863",
        "BaggageBytes": "[[248 5] [240 0] [0 97 248 115 84 192 57 137 79] [240 1] [0 103 83 51 231 53 134 65 58] [240 3] [0 2]]",
        "ProcessID": 28692
      },
      {
        "Cycles": 0,
        "Agent": "Execution-Sleep",
        "ProcessName": "Read",
        "TaskID": "61F87354C039894F",
        "ParentEventID": [
          "95C1AA135DA6B29B"
        ],
        "Label": "waited",
        "Title": "X-Trace Task",
        "Host": "pinky19.mpi-sws.org",
        "Duration": "22683268",
        "HRT": 26962669480143303,
        "Operation": "waited",
        "Timestamp": "1557746309420.347656",
        "TenantClass": 0,
        "Source": "SocketIOWithTimeout.java:335",
        "ThreadID": 1,
        "ThreadName": "",
        "EventID": "934C19464D89A69C",
        "ProcessID": 36430
      },
      {
        "Cycles": 0,
        "Agent": "Execution-Sleep",
        "ProcessName": "Data",
        "TaskID": "61F87354C039894F",
        "ParentEventID": [
          "C41D7AE98FE3A863"
        ],
        "Label": "waited",
        "Title": "X-Trace Task",
        "Host": "pinky24.mpi-sws.org",
        "Duration": "4773",
        "HRT": 6573922204464478,
        "Operation": "waited",
        "Timestamp": "1557746309420.421631",
        "TenantClass": 0,
        "Source": "SocketIOWithTimeout.java:335",
        "ThreadID": 14307,
        "ThreadName": "",
        "EventID": "BBE8043459D8C35C",
        "BaggageBytes": "[[248 5] [240 0] [0 97 248 115 84 192 57 137 79] [240 1] [0 196 29 122 233 143 227 168 99] [240 3] [0 2]]",
        "ProcessID": 28692
      },
      {
        "Cycles": 0,
        "Agent": "edu.brown.cs.systems.xtrace.logging.BaggageWrappers",
        "ProcessName": "Read",
        "TaskID": "61F87354C039894F",
        "ParentEventID": [
          "675333E73586413A",
          "934C19464D89A69C"
        ],
        "Label": "Merged current baggage with other baggage",
        "Title": "X-Trace Task",
        "Host": "pinky19.mpi-sws.org",
        "HRT": 26962669480260892,
        "Operation": "join",
        "Timestamp": "1557746309420.465088",
        "TenantClass": 0,
        "Source": "RemoteBlockReader2.java:429",
        "ThreadID": 1,
        "ThreadName": "",
        "EventID": "66D67FB75A956F2E",
        "ProcessID": 36430
      },
      {
        "Cycles": 0,
        "Agent": "edu.brown.cs.systems.xtrace.logging.BaggageWrappers",
        "ProcessName": "Data",
        "TaskID": "61F87354C039894F",
        "ParentEventID": [
          "BBE8043459D8C35C"
        ],
        "Label": "Forking current baggage with Baggage.fork()",
        "Title": "X-Trace Task",
        "Host": "pinky24.mpi-sws.org",
        "HRT": 6573922213788591,
        "Operation": "fork",
        "Timestamp": "1557746309429.745605",
        "TenantClass": 0,
        "Source": "PacketHeader.java:95",
        "ThreadID": 14307,
        "ThreadName": "",
        "EventID": "6BCB2FCA2418CD24",
        "BaggageBytes": "[[248 5] [240 0] [0 97 248 115 84 192 57 137 79] [240 1] [0 187 232 4 52 89 216 195 92] [240 3] [0 2]]",
        "ProcessID": 28692
      },
      {
        "Cycles": 0,
        "Agent": "Execution-Sleep",
        "ProcessName": "Read",
        "TaskID": "61F87354C039894F",
        "ParentEventID": [
          "66D67FB75A956F2E"
        ],
        "Label": "waited",
        "Title": "X-Trace Task",
        "Host": "pinky19.mpi-sws.org",
        "Duration": "9321346",
        "HRT": 26962669489687791,
        "Operation": "waited",
        "Timestamp": "1557746309429.892090",
        "TenantClass": 0,
        "Source": "SocketIOWithTimeout.java:335",
        "ThreadID": 1,
        "ThreadName": "",
        "EventID": "676863DC0B062B6F",
        "ProcessID": 36430
      },
      {
        "Cycles": 0,
        "Agent": "edu.brown.cs.systems.xtrace.logging.BaggageWrappers",
        "ProcessName": "Read",
        "TaskID": "61F87354C039894F",
        "ParentEventID": [
          "C41D7AE98FE3A863",
          "676863DC0B062B6F"
        ],
        "Label": "Merged current baggage with other baggage",
        "Title": "X-Trace Task",
        "Host": "pinky19.mpi-sws.org",
        "HRT": 26962669489757841,
        "Operation": "join",
        "Timestamp": "1557746309429.962158",
        "TenantClass": 0,
        "Source": "PacketHeader.java:168",
        "ThreadID": 1,
        "ThreadName": "",
        "EventID": "AD3B41B92360B787",
        "ProcessID": 36430
      },
      {
        "Cycles": 0,
        "Agent": "edu.brown.cs.systems.xtrace.logging.BaggageWrappers",
        "ProcessName": "Read",
        "TaskID": "61F87354C039894F",
        "ParentEventID": [
          "6BCB2FCA2418CD24",
          "AD3B41B92360B787"
        ],
        "Label": "Merged current baggage with other baggage",
        "Title": "X-Trace Task",
        "Host": "pinky19.mpi-sws.org",
        "HRT": 26962669489831508,
        "Operation": "join",
        "Timestamp": "1557746309430.035889",
        "TenantClass": 0,
        "Source": "PacketHeader.java:168",
        "ThreadID": 1,
        "ThreadName": "",
        "EventID": "48954EF7DFC357AB",
        "ProcessID": 36430
      },
      {
        "Cycles": 0,
        "Agent": "edu.brown.cs.systems.xtrace.logging.BaggageWrappers",
        "ProcessName": "Read",
        "TaskID": "61F87354C039894F",
        "ParentEventID": [
          "48954EF7DFC357AB"
        ],
        "Label": "Forking current baggage with Baggage.fork()",
        "Title": "X-Trace Task",
        "Host": "pinky19.mpi-sws.org",
        "HRT": 26962669489845476,
        "Operation": "fork",
        "Timestamp": "1557746309430.049805",
        "TenantClass": 0,
        "Source": "RemoteBlockReader2.java:361",
        "ThreadID": 1,
        "ThreadName": "",
        "EventID": "CCB8DA0CB34615B0",
        "ProcessID": 36430
      },
      {
        "Cycles": 0,
        "Agent": "Execution-Sleep",
        "ProcessName": "Data",
        "TaskID": "61F87354C039894F",
        "ParentEventID": [
          "6BCB2FCA2418CD24"
        ],
        "Label": "waited",
        "Title": "X-Trace Task",
        "Host": "pinky24.mpi-sws.org",
        "Duration": "321868",
        "HRT": 6573922214215653,
        "Operation": "waited",
        "Timestamp": "1557746309430.172852",
        "TenantClass": 0,
        "Source": "SocketIOWithTimeout.java:335",
        "ThreadID": 14307,
        "ThreadName": "",
        "EventID": "F3094B58B639EFFF",
        "BaggageBytes": "[[248 5] [240 0] [0 97 248 115 84 192 57 137 79] [240 1] [0 107 203 47 202 36 24 205 36] [240 3] [0 2]]",
        "ProcessID": 28692
      },
      {
        "Cycles": 0,
        "Agent": "edu.brown.cs.systems.xtrace.logging.BaggageWrappers",
        "ProcessName": "Data",
        "TaskID": "61F87354C039894F",
        "ParentEventID": [
          "F3094B58B639EFFF",
          "CCB8DA0CB34615B0"
        ],
        "Label": "Merged current baggage with other baggage",
        "Title": "X-Trace Task",
        "Host": "pinky24.mpi-sws.org",
        "HRT": 6573922214280310,
        "Operation": "join",
        "Timestamp": "1557746309430.237305",
        "TenantClass": 0,
        "Source": "DataXceiver.java:574",
        "ThreadID": 14307,
        "ThreadName": "",
        "EventID": "A757100681A08735",
        "BaggageBytes": "[[248 5] [240 0] [0 97 248 115 84 192 57 137 79] [240 1] [0 204 184 218 12 179 70 21 176] [0 243 9 75 88 182 57 239 255] [240 3] [0 2]]",
        "ProcessID": 28692
      },
      {
        "Cycles": 0,
        "Agent": "Execution-CPU",
        "ProcessName": "Data",
        "TaskID": "61F87354C039894F",
        "ParentEventID": [
          "A757100681A08735"
        ],
        "Label": "unset",
        "Title": "X-Trace Task",
        "Host": "pinky24.mpi-sws.org",
        "Duration": "32204442",
        "HRT": 6573922214305318,
        "Operation": "unset",
        "Timestamp": "1557746309430.262451",
        "TenantClass": 0,
        "Source": "DataXceiver.java:261",
        "ThreadID": 14307,
        "ThreadName": "",
        "EventID": "830DB15F932AD166",
        "BaggageBytes": "[[248 5] [240 0] [0 97 248 115 84 192 57 137 79] [240 1] [0 167 87 16 6 129 160 135 53] [240 3] [0 2]]",
        "ProcessID": 28692
      }
    ]
  }
]