[
  {
    "id": "3AA9F0518B2A6C41",
    "reports": [
      {
        "Cycles": 0,
        "Agent": "Execution-CPU",
        "ProcessName": "Read",
        "TaskID": "3AA9F0518B2A6C41",
        "ParentEventID": [
          "8707DED2BD8EB33B"
        ],
        "Label": "unset",
        "Title": "X-Trace Task",
        "Host": "pinky19.mpi-sws.org",
        "Duration": "22201549",
        "HRT": 27726521594312625,
        "Operation": "unset",
        "Timestamp": "1558510161534.507080",
        "TenantClass": 0,
        "Source": "Client.java:1027",
        "ThreadID": 1,
        "ThreadName": "",
        "EventID": "6DBE2A399298FD0E",
        "ProcessID": 40748
      },
      {
        "Cycles": 0,
        "Agent": "org.apache.hadoop.ipc.ProtobufRpcEngine",
        "ProcessName": "Read",
        "TaskID": "3AA9F0518B2A6C41",
        "ParentEventID": [
          "B084E51903FE061A"
        ],
        "Label": "Invoking org.apache.hadoop.hdfs.protocol.ClientProtocol.getBlockLocations",
        "Title": "X-Trace Task",
        "Host": "pinky19.mpi-sws.org",
        "HRT": 27726521594275435,
        "Timestamp": "1558510161534.469971",
        "TenantClass": 0,
        "Source": "ProtobufRpcEngine.java:228",
        "ThreadID": 1,
        "ThreadName": "",
        "EventID": "8707DED2BD8EB33B",
        "ProcessID": 40748
      },
      {
        "Cycles": 0,
        "Agent": "edu.brown.cs.systems.retro.benchmarks.hdfs_client.ReaderRandomSize",
        "ProcessName": "Read",
        "TaskID": "3AA9F0518B2A6C41",
        "ParentEventID": [
          "0"
        ],
        "Label": "Reading file",
        "Title": "X-Trace Task",
        "Host": "pinky19.mpi-sws.org",
        "HRT": 27726521594205489,
        "Timestamp": "1558510161534.400146",
        "TenantClass": 0,
        "ThreadID": 1,
        "ThreadName": "",
        "EventID": "58A81BC3DD5E2E2E",
        "ProcessID": 40748,
        "Tag": [
          "/home/plascas/tracing-data/traceID-files/reader_small",
          "Read Size: 80896"
        ]
      },
      {
        "Cycles": 0,
        "Agent": "edu.brown.cs.systems.retro.benchmarks.hdfs_client.ReaderRandomSize",
        "ProcessName": "Read",
        "TaskID": "3AA9F0518B2A6C41",
        "ParentEventID": [
          "58A81BC3DD5E2E2E"
        ],
        "Label": "Reading file",
        "Title": "X-Trace Task",
        "Host": "pinky19.mpi-sws.org",
        "HRT": 27726521594224476,
        "Timestamp": "1558510161534.418945",
        "TenantClass": 0,
        "ThreadID": 1,
        "ThreadName": "",
        "EventID": "B084E51903FE061A",
        "ProcessID": 40748
      },
      {
        "Cycles": 0,
        "Agent": "edu.brown.cs.systems.xtrace.logging.BaggageWrappers",
        "ProcessName": "Read",
        "TaskID": "3AA9F0518B2A6C41",
        "ParentEventID": [
          "6151A4549DC33910"
        ],
        "Label": "Forking current baggage with Baggage.fork()",
        "Title": "X-Trace Task",
        "Host": "pinky19.mpi-sws.org",
        "HRT": 27726521594367194,
        "Operation": "fork",
        "Timestamp": "1558510161534.561768",
        "TenantClass": 0,
        "Source": "Client.java:1043",
        "ThreadID": 41,
        "ThreadName": "",
        "EventID": "D6A84237BEEE8890",
        "ProcessID": 40748
      },
      {
        "Cycles": 0,
        "Agent": "Execution-CPU",
        "ProcessName": "Read",
        "TaskID": "3AA9F0518B2A6C41",
        "ParentEventID": [
          "6DBE2A399298FD0E"
        ],
        "Label": "set",
        "Title": "X-Trace Task",
        "Host": "pinky19.mpi-sws.org",
        "HRT": 27726521594348706,
        "Operation": "set",
        "Timestamp": "1558510161534.543213",
        "TenantClass": 0,
        "Source": "Client.java:1032",
        "ThreadID": 41,
        "ThreadName": "",
        "EventID": "6151A4549DC33910",
        "ProcessID": 40748
      },
      {
        "Cycles": 0,
        "Agent": "Execution-CPU",
        "ProcessName": "Read",
        "TaskID": "3AA9F0518B2A6C41",
        "ParentEventID": [
          "D6A84237BEEE8890"
        ],
        "Label": "unset",
        "Title": "X-Trace Task",
        "Host": "pinky19.mpi-sws.org",
        "Duration": "81806",
        "HRT": 27726521594447377,
        "Operation": "unset",
        "Timestamp": "1558510161534.641846",
        "TenantClass": 0,
        "Source": "Client.java:1062",
        "ThreadID": 41,
        "ThreadName": "",
        "EventID": "9957AC33A3EB6923",
        "ProcessID": 40748
      },
      {
        "Cycles": 0,
        "Agent": "Execution-CPU",
        "ProcessName": "Name",
        "TaskID": "3AA9F0518B2A6C41",
        "ParentEventID": [
          "D6A84237BEEE8890"
        ],
        "Label": "set",
        "Title": "X-Trace Task",
        "Host": "pinky19.mpi-sws.org",
        "HRT": 27726521594507371,
        "Operation": "set",
        "Timestamp": "1558510161534.711670",
        "TenantClass": 0,
        "Source": "Server.java:1840",
        "ThreadID": 48,
        "ThreadName": "",
        "EventID": "52453F71715A827E",
        "BaggageBytes": "[[248 5] [240 0] [0 58 169 240 81 139 42 108 65] [240 1] [0 214 168 66 55 190 238 136 144] [240 3] [0 2]]",
        "ProcessID": 2171
      },
      {
        "Cycles": 0,
        "Agent": "edu.brown.cs.systems.xtrace.logging.BaggageWrappers",
        "ProcessName": "Name",
        "TaskID": "3AA9F0518B2A6C41",
        "ParentEventID": [
          "52453F71715A827E"
        ],
        "Label": "Forking current baggage with Baggage.fork()",
        "Title": "X-Trace Task",
        "Host": "pinky19.mpi-sws.org",
        "HRT": 27726521594541107,
        "Operation": "fork",
        "Timestamp": "1558510161534.745361",
        "TenantClass": 0,
        "Source": "Server.java:550",
        "ThreadID": 48,
        "ThreadName": "",
        "EventID": "7E9F78DA5F5CAD1A",
        "BaggageBytes": "[[248 5] [240 0] [0 58 169 240 81 139 42 108 65] [240 1] [0 82 69 63 113 113 90 130 126] [240 3] [0 2]]",
        "ProcessID": 2171
      },
      {
        "Cycles": 0,
        "Agent": "Execution-CPU",
        "ProcessName": "Name",
        "TaskID": "3AA9F0518B2A6C41",
        "ParentEventID": [
          "7E9F78DA5F5CAD1A"
        ],
        "Label": "unset",
        "Title": "X-Trace Task",
        "Host": "pinky19.mpi-sws.org",
        "Duration": "26999",
        "HRT": 27726521594564044,
        "Operation": "unset",
        "Timestamp": "1558510161534.768311",
        "TenantClass": 0,
        "Source": "Server.java:1828",
        "ThreadID": 48,
        "ThreadName": "",
        "EventID": "83EB1EE735998703",
        "BaggageBytes": "[[248 5] [240 0] [0 58 169 240 81 139 42 108 65] [240 1] [0 126 159 120 218 95 92 173 26] [240 3] [0 2]]",
        "ProcessID": 2171
      },
      {
        "Cycles": 0,
        "Agent": "Execution-CPU",
        "ProcessName": "Name",
        "TaskID": "3AA9F0518B2A6C41",
        "ParentEventID": [
          "7E9F78DA5F5CAD1A"
        ],
        "Label": "set",
        "Title": "X-Trace Task",
        "Host": "pinky19.mpi-sws.org",
        "HRT": 27726521594573872,
        "Operation": "set",
        "Timestamp": "1558510161534.778076",
        "TenantClass": 0,
        "Source": "Server.java:2071",
        "ThreadID": 60,
        "ThreadName": "",
        "EventID": "C76CF639A666363B",
        "BaggageBytes": "[[248 5] [240 0] [0 58 169 240 81 139 42 108 65] [240 1] [0 126 159 120 218 95 92 173 26] [240 3] [0 2]]",
        "ProcessID": 2171
      },
      {
        "Cycles": 0,
        "Agent": "Execution-CPU",
        "ProcessName": "Read",
        "TaskID": "3AA9F0518B2A6C41",
        "ParentEventID": [
          "9957AC33A3EB6923"
        ],
        "Label": "set",
        "Title": "X-Trace Task",
        "Host": "pinky19.mpi-sws.org",
        "HRT": 27726521594471842,
        "Operation": "set",
        "Timestamp": "1558510161534.666260",
        "TenantClass": 0,
        "Source": "Client.java:1104",
        "ThreadID": 1,
        "ThreadName": "",
        "EventID": "DE7C13EDB4594970",
        "ProcessID": 40748
      },
      {
        "Cycles": 0,
        "Agent": "edu.brown.cs.systems.xtrace.logging.BaggageWrappers",
        "ProcessName": "Name",
        "TaskID": "3AA9F0518B2A6C41",
        "ParentEventID": [
          "1155C89D01B3E707"
        ],
        "Label": "Forking current baggage with Baggage.fork()",
        "Title": "X-Trace Task",
        "Host": "pinky19.mpi-sws.org",
        "HRT": 27726521594710791,
        "Operation": "fork",
        "Timestamp": "1558510161534.915039",
        "TenantClass": 0,
        "Source": "Server.java:2398",
        "ThreadID": 60,
        "ThreadName": "",
        "EventID": "A73474A66E57CFF5",
        "BaggageBytes": "[[248 5] [240 0] [0 58 169 240 81 139 42 108 65] [240 1] [0 17 85 200 157 1 179 231 7] [240 3] [0 2]]",
        "ProcessID": 2171
      },
      {
        "Cycles": 0,
        "Agent": "Execution-CPU",
        "ProcessName": "Name",
        "TaskID": "3AA9F0518B2A6C41",
        "ParentEventID": [
          "A73474A66E57CFF5"
        ],
        "Label": "unset",
        "Title": "X-Trace Task",
        "Host": "pinky19.mpi-sws.org",
        "Duration": "217902",
        "HRT": 27726521594821140,
        "Operation": "unset",
        "Timestamp": "1558510161535.025391",
        "TenantClass": 0,
        "Source": "Server.java:1058",
        "ThreadID": 60,
        "ThreadName": "",
        "EventID": "8866D0241A02B733",
        "BaggageBytes": "[[248 5] [240 0] [0 58 169 240 81 139 42 108 65] [240 1] [0 167 52 116 166 110 87 207 245] [240 3] [0 2]]",
        "ProcessID": 2171
      },
      {
        "Cycles": 0,
        "Agent": "Execution-CPU",
        "ProcessName": "Read",
        "TaskID": "3AA9F0518B2A6C41",
        "ParentEventID": [
          "A73474A66E57CFF5"
        ],
        "Label": "set",
        "Title": "X-Trace Task",
        "Host": "pinky19.mpi-sws.org",
        "HRT": 27726521594870229,
        "Operation": "set",
        "Timestamp": "1558510161535.064697",
        "TenantClass": 0,
        "Source": "Client.java:302",
        "ThreadID": 40,
        "ThreadName": "",
        "EventID": "59EEA76A8236DD7B",
        "ProcessID": 40748
      },
      {
        "Cycles": 0,
        "Agent": "org.apache.hadoop.hdfs.server.namenode.FSNamesystem.audit",
        "ProcessName": "Name",
        "TaskID": "3AA9F0518B2A6C41",
        "ParentEventID": [
          "BA89E5CC371EB09A"
        ],
        "Label": "allowed=true\tugi=plascas (auth:SIMPLE)\tip=/139.19.171.63\tcmd=open\tsrc=/ds/zdAA6rlWzn4WEqK1\tdst=null\tperm=null\tproto=rpc",
        "Title": "X-Trace Task",
        "Host": "pinky19.mpi-sws.org",
        "HRT": 27726521594666067,
        "Timestamp": "1558510161534.870361",
        "TenantClass": 0,
        "Source": "FSNamesystem.java:8313",
        "ThreadID": 60,
        "ThreadName": "",
        "EventID": "1155C89D01B3E707",
        "BaggageBytes": "[[248 5] [240 0] [0 58 169 240 81 139 42 108 65] [240 1] [0 186 137 229 204 55 30 176 154] [240 3] [0 2]]",
        "ProcessID": 2171
      },
      {
        "Cycles": 0,
        "Agent": "Execution-CPU",
        "ProcessName": "Read",
        "TaskID": "3AA9F0518B2A6C41",
        "ParentEventID": [
          "59EEA76A8236DD7B"
        ],
        "Label": "unset",
        "Title": "X-Trace Task",
        "Host": "pinky19.mpi-sws.org",
        "Duration": "12217",
        "HRT": 27726521594901147,
        "Operation": "unset",
        "Timestamp": "1558510161535.095703",
        "TenantClass": 0,
        "Source": "Client.java:1168",
        "ThreadID": 40,
        "ThreadName": "",
        "EventID": "9D35738DFB4B3891",
        "ProcessID": 40748
      },
      {
        "Cycles": 0,
        "Agent": "edu.brown.cs.systems.xtrace.logging.BaggageWrappers",
        "ProcessName": "Read",
        "TaskID": "3AA9F0518B2A6C41",
        "ParentEventID": [
          "8D3C12A393111085",
          "9D35738DFB4B3891"
        ],
        "Label": "Merged current baggage with other baggage",
        "Title": "X-Trace Task",
        "Host": "pinky19.mpi-sws.org",
        "HRT": 27726521594969239,
        "Operation": "join",
        "Timestamp": "1558510161535.163818",
        "TenantClass": 0,
        "Source": "Client.java:1545",
        "ThreadID": 1,
        "ThreadName": "",
        "EventID": "82C0B7E6CA814CDF",
        "ProcessID": 40748
      },
      {
        "Cycles": 0,
        "Agent": "org.apache.hadoop.ipc.Server",
        "ProcessName": "Name",
        "TaskID": "3AA9F0518B2A6C41",
        "ParentEventID": [
          "C76CF639A666363B"
        ],
        "Label": "getBlockLocations in org.apache.hadoop.hdfs.protocol.ClientProtocol",
        "Title": "X-Trace Task",
        "Host": "pinky19.mpi-sws.org",
        "HRT": 27726521594616937,
        "Timestamp": "1558510161534.821045",
        "TenantClass": 0,
        "Source": "ProtobufRpcEngine.java:601",
        "ThreadID": 60,
        "ThreadName": "",
        "EventID": "BA89E5CC371EB09A",
        "BaggageBytes": "[[248 5] [240 0] [0 58 169 240 81 139 42 108 65] [240 1] [0 199 108 246 57 166 102 54 59] [240 3] [0 2]]",
        "ProcessID": 2171
      },
      {
        "Cycles": 0,
        "Agent": "org.apache.hadoop.ipc.ProtobufRpcEngine",
        "ProcessName": "Read",
        "TaskID": "3AA9F0518B2A6C41",
        "ParentEventID": [
          "82C0B7E6CA814CDF"
        ],
        "Label": "org.apache.hadoop.hdfs.protocol.ClientProtocol.getBlockLocations completed",
        "Title": "X-Trace Task",
        "Host": "pinky19.mpi-sws.org",
        "HRT": 27726521595036377,
        "Timestamp": "1558510161535.230957",
        "TenantClass": 0,
        "Source": "ProtobufRpcEngine.java:275",
        "ThreadID": 1,
        "ThreadName": "",
        "EventID": "6BBD1721F74BF627",
        "ProcessID": 40748
      },
      {
        "Cycles": 0,
        "Agent": "edu.brown.cs.systems.xtrace.logging.BaggageWrappers",
        "ProcessName": "Read",
        "TaskID": "3AA9F0518B2A6C41",
        "ParentEventID": [
          "6BBD1721F74BF627"
        ],
        "Label": "Forking current baggage with Baggage.fork()",
        "Title": "X-Trace Task",
        "Host": "pinky19.mpi-sws.org",
        "HRT": 27726521595133374,
        "Operation": "fork",
        "Timestamp": "1558510161535.327881",
        "TenantClass": 0,
        "Source": "DataTransferProtoUtil.java:94",
        "ThreadID": 1,
        "ThreadName": "",
        "EventID": "EB15DFE487F70C7F",
        "ProcessID": 40748
      },
      {
        "Cycles": 0,
        "Agent": "edu.brown.cs.systems.xtrace.logging.XTraceInit",
        "ProcessName": "Data",
        "TaskID": "3AA9F0518B2A6C41",
        "ParentEventID": [
          "DD0DB777833A8819"
        ],
        "Label": "Thread.setName: DataXceiver for client DFSClient_NONMAPREDUCE_1816546669_1 at /139.19.171.63:50370 [Sending block BP-1633380353-139.19.171.63-1554193446451:blk_1073762459_21635]",
        "Title": "X-Trace Task",
        "Host": "pinky24.mpi-sws.org",
        "HRT": 7337774319814241,
        "Timestamp": "1558510161535.728027",
        "TenantClass": 0,
        "Source": "DataXceiver.java:168",
        "ThreadID": 17872,
        "ThreadName": "",
        "EventID": "B41F871D34DBE32C",
        "BaggageBytes": "[[248 5] [240 0] [0 58 169 240 81 139 42 108 65] [240 1] [0 221 13 183 119 131 58 136 25] [240 3] [0 2]]",
        "ProcessID": 28692
      },
      {
        "Cycles": 0,
        "Agent": "Execution-Sleep",
        "ProcessName": "Read",
        "TaskID": "3AA9F0518B2A6C41",
        "ParentEventID": [
          "DE7C13EDB4594970"
        ],
        "Label": "waited",
        "Title": "X-Trace Task",
        "Host": "pinky19.mpi-sws.org",
        "Duration": "458993",
        "HRT": 27726521594941803,
        "Operation": "waited",
        "Timestamp": "1558510161535.136230",
        "TenantClass": 0,
        "Source": "Client.java:1537",
        "ThreadID": 1,
        "ThreadName": "",
        "EventID": "8D3C12A393111085",
        "ProcessID": 40748
      },
      {
        "Cycles": 0,
        "Agent": "edu.brown.cs.systems.xtrace.logging.BaggageWrappers",
        "ProcessName": "Data",
        "TaskID": "3AA9F0518B2A6C41",
        "ParentEventID": [
          "B41F871D34DBE32C"
        ],
        "Label": "Forking current baggage with Baggage.fork()",
        "Title": "X-Trace Task",
        "Host": "pinky24.mpi-sws.org",
        "HRT": 7337774320114461,
        "Operation": "fork",
        "Timestamp": "1558510161536.028320",
        "TenantClass": 0,
        "Source": "DataXceiver.java:1257",
        "ThreadID": 17872,
        "ThreadName": "",
        "EventID": "9542B64C94A1AEFC",
        "BaggageBytes": "[[248 5] [240 0] [0 58 169 240 81 139 42 108 65] [240 1] [0 180 31 135 29 52 219 227 44] [240 3] [0 2]]",
        "ProcessID": 28692
      },
      {
        "Cycles": 0,
        "Agent": "edu.brown.cs.systems.xtrace.logging.BaggageWrappers",
        "ProcessName": "Read",
        "TaskID": "3AA9F0518B2A6C41",
        "ParentEventID": [
          "9542B64C94A1AEFC",
          "2C6015E101329215"
        ],
        "Label": "Merged current baggage with other baggage",
        "Title": "X-Trace Task",
        "Host": "pinky19.mpi-sws.org",
        "HRT": 27726521596153180,
        "Operation": "join",
        "Timestamp": "1558510161536.347656",
        "TenantClass": 0,
        "Source": "RemoteBlockReader2.java:429",
        "ThreadID": 1,
        "ThreadName": "",
        "EventID": "D5A20C5DDCE57D47",
        "ProcessID": 40748
      },
      {
        "Cycles": 0,
        "Agent": "Execution-Sleep",
        "ProcessName": "Read",
        "TaskID": "3AA9F0518B2A6C41",
        "ParentEventID": [
          "EB15DFE487F70C7F"
        ],
        "Label": "waited",
        "Title": "X-Trace Task",
        "Host": "pinky19.mpi-sws.org",
        "Duration": "817711",
        "HRT": 27726521596064219,
        "Operation": "waited",
        "Timestamp": "1558510161536.258789",
        "TenantClass": 0,
        "Source": "SocketIOWithTimeout.java:335",
        "ThreadID": 1,
        "ThreadName": "",
        "EventID": "2C6015E101329215",
        "ProcessID": 40748
      },
      {
        "Cycles": 0,
        "Agent": "edu.brown.cs.systems.xtrace.logging.BaggageWrappers",
        "ProcessName": "Data",
        "TaskID": "3AA9F0518B2A6C41",
        "ParentEventID": [
          "9542B64C94A1AEFC"
        ],
        "Label": "Forking current baggage with Baggage.fork()",
        "Title": "X-Trace Task",
        "Host": "pinky24.mpi-sws.org",
        "HRT": 7337774320315798,
        "Operation": "fork",
        "Timestamp": "1558510161536.229492",
        "TenantClass": 0,
        "Source": "PacketHeader.java:95",
        "ThreadID": 17872,
        "ThreadName": "",
        "EventID": "0E224AAA6825FE54",
        "BaggageBytes": "[[248 5] [240 0] [0 58 169 240 81 139 42 108 65] [240 1] [0 149 66 182 76 148 161 174 252] [240 3] [0 2]]",
        "ProcessID": 28692
      },
      {
        "Cycles": 0,
        "Agent": "Execution-Sleep",
        "ProcessName": "Data",
        "TaskID": "3AA9F0518B2A6C41",
        "ParentEventID": [
          "0E224AAA6825FE54"
        ],
        "Label": "waited",
        "Title": "X-Trace Task",
        "Host": "pinky24.mpi-sws.org",
        "Duration": "11493",
        "HRT": 7337774320520235,
        "Operation": "waited",
        "Timestamp": "1558510161536.434082",
        "TenantClass": 0,
        "Source": "SocketIOWithTimeout.java:335",
        "ThreadID": 17872,
        "ThreadName": "",
        "EventID": "8AD509ADAA4FE1CD",
        "BaggageBytes": "[[248 5] [240 0] [0 58 169 240 81 139 42 108 65] [240 1] [0 14 34 74 170 104 37 254 84] [240 3] [0 2]]",
        "ProcessID": 28692
      },
      {
        "Cycles": 0,
        "Agent": "Execution-CPU",
        "ProcessName": "Data",
        "TaskID": "3AA9F0518B2A6C41",
        "ParentEventID": [
          "EB15DFE487F70C7F"
        ],
        "Label": "set",
        "Title": "X-Trace Task",
        "Host": "pinky24.mpi-sws.org",
        "HRT": 7337774319702937,
        "Operation": "set",
        "Timestamp": "1558510161535.616699",
        "TenantClass": 0,
        "Source": "Receiver.java:117",
        "ThreadID": 17872,
        "ThreadName": "",
        "EventID": "DD0DB777833A8819",
        "BaggageBytes": "[[248 5] [240 0] [0 58 169 240 81 139 42 108 65] [240 1] [0 235 21 223 228 135 247 12 127] [240 3] [0 2]]",
        "ProcessID": 28692
      },
      {
        "Cycles": 0,
        "Agent": "Execution-Sleep",
        "ProcessName": "Read",
        "TaskID": "3AA9F0518B2A6C41",
        "ParentEventID": [
          "D70940FB18FE1F63"
        ],
        "Label": "waited",
        "Title": "X-Trace Task",
        "Host": "pinky19.mpi-sws.org",
        "Duration": "414760",
        "HRT": 27726521596756934,
        "Operation": "waited",
        "Timestamp": "1558510161536.951416",
        "TenantClass": 0,
        "Source": "SocketIOWithTimeout.java:335",
        "ThreadID": 1,
        "ThreadName": "",
        "EventID": "4128520AE4DC286F",
        "ProcessID": 40748
      },
      {
        "Cycles": 0,
        "Agent": "Execution-Sleep",
        "ProcessName": "Read",
        "TaskID": "3AA9F0518B2A6C41",
        "ParentEventID": [
          "4128520AE4DC286F"
        ],
        "Label": "waited",
        "Title": "X-Trace Task",
        "Host": "pinky19.mpi-sws.org",
        "Duration": "105980",
        "HRT": 27726521596961131,
        "Operation": "waited",
        "Timestamp": "1558510161537.155762",
        "TenantClass": 0,
        "Source": "SocketIOWithTimeout.java:335",
        "ThreadID": 1,
        "ThreadName": "",
        "EventID": "4D7CE74BFBBD9D5C",
        "ProcessID": 40748
      },
      {
        "Cycles": 0,
        "Agent": "edu.brown.cs.systems.xtrace.logging.BaggageWrappers",
        "ProcessName": "Data",
        "TaskID": "3AA9F0518B2A6C41",
        "ParentEventID": [
          "8AD509ADAA4FE1CD"
        ],
        "Label": "Forking current baggage with Baggage.fork()",
        "Title": "X-Trace Task",
        "Host": "pinky24.mpi-sws.org",
        "HRT": 7337774320773262,
        "Operation": "fork",
        "Timestamp": "1558510161536.687012",
        "TenantClass": 0,
        "Source": "PacketHeader.java:95",
        "ThreadID": 17872,
        "ThreadName": "",
        "EventID": "3E3D678B003A138E",
        "BaggageBytes": "[[248 5] [240 0] [0 58 169 240 81 139 42 108 65] [240 1] [0 138 213 9 173 170 79 225 205] [240 3] [0 2]]",
        "ProcessID": 28692
      },
      {
        "Cycles": 0,
        "Agent": "Execution-Sleep",
        "ProcessName": "Read",
        "TaskID": "3AA9F0518B2A6C41",
        "ParentEventID": [
          "4D7CE74BFBBD9D5C"
        ],
        "Label": "waited",
        "Title": "X-Trace Task",
        "Host": "pinky19.mpi-sws.org",
        "Duration": "82266",
        "HRT": 27726521597103959,
        "Operation": "waited",
        "Timestamp": "1558510161537.298584",
        "TenantClass": 0,
        "Source": "SocketIOWithTimeout.java:335",
        "ThreadID": 1,
        "ThreadName": "",
        "EventID": "A84F27D2E5BA2589",
        "ProcessID": 40748
      },
      {
        "Cycles": 0,
        "Agent": "edu.brown.cs.systems.xtrace.logging.BaggageWrappers",
        "ProcessName": "Read",
        "TaskID": "3AA9F0518B2A6C41",
        "ParentEventID": [
          "113056589668D591",
          "3E3D678B003A138E"
        ],
        "Label": "Merged current baggage with other baggage",
        "Title": "X-Trace Task",
        "Host": "pinky19.mpi-sws.org",
        "HRT": 27726521597287163,
        "Operation": "join",
        "Timestamp": "1558510161537.481689",
        "TenantClass": 0,
        "Source": "PacketHeader.java:168",
        "ThreadID": 1,
        "ThreadName": "",
        "EventID": "529FF54F403860AE",
        "ProcessID": 40748
      },
      {
        "Cycles": 0,
        "Agent": "Execution-Sleep",
        "ProcessName": "Read",
        "TaskID": "3AA9F0518B2A6C41",
        "ParentEventID": [
          "D5A20C5DDCE57D47"
        ],
        "Label": "waited",
        "Title": "X-Trace Task",
        "Host": "pinky19.mpi-sws.org",
        "Duration": "47709",
        "HRT": 27726521596267007,
        "Operation": "waited",
        "Timestamp": "1558510161536.461670",
        "TenantClass": 0,
        "Source": "SocketIOWithTimeout.java:335",
        "ThreadID": 1,
        "ThreadName": "",
        "EventID": "D70940FB18FE1F63",
        "ProcessID": 40748
      },
      {
        "Cycles": 0,
        "Agent": "edu.brown.cs.systems.xtrace.logging.BaggageWrappers",
        "ProcessName": "Read",
        "TaskID": "3AA9F0518B2A6C41",
        "ParentEventID": [
          "529FF54F403860AE"
        ],
        "Label": "Forking current baggage with Baggage.fork()",
        "Title": "X-Trace Task",
        "Host": "pinky19.mpi-sws.org",
        "HRT": 27726521597322404,
        "Operation": "fork",
        "Timestamp": "1558510161537.516846",
        "TenantClass": 0,
        "Source": "RemoteBlockReader2.java:361",
        "ThreadID": 1,
        "ThreadName": "",
        "EventID": "B92C766CF8D52F34",
        "ProcessID": 40748
      },
      {
        "Cycles": 0,
        "Agent": "edu.brown.cs.systems.xtrace.logging.BaggageWrappers",
        "ProcessName": "Read",
        "TaskID": "3AA9F0518B2A6C41",
        "ParentEventID": [
          "B92C766CF8D52F34"
        ],
        "Label": "Forking current baggage with Baggage.fork()",
        "Title": "X-Trace Task",
        "Host": "pinky19.mpi-sws.org",
        "HRT": 27726521597454588,
        "Operation": "fork",
        "Timestamp": "1558510161537.649170",
        "TenantClass": 0,
        "Source": "DataTransferProtoUtil.java:94",
        "ThreadID": 1,
        "ThreadName": "",
        "EventID": "66128589F6158FF9",
        "ProcessID": 40748
      },
      {
        "Cycles": 0,
        "Agent": "Execution-Sleep",
        "ProcessName": "Data",
        "TaskID": "3AA9F0518B2A6C41",
        "ParentEventID": [
          "3E3D678B003A138E"
        ],
        "Label": "waited",
        "Title": "X-Trace Task",
        "Host": "pinky24.mpi-sws.org",
        "Duration": "730638",
        "HRT": 7337774321738204,
        "Operation": "waited",
        "Timestamp": "1558510161537.652100",
        "TenantClass": 0,
        "Source": "SocketIOWithTimeout.java:335",
        "ThreadID": 17872,
        "ThreadName": "",
        "EventID": "A6E337EF8740EF91",
        "BaggageBytes": "[[248 5] [240 0] [0 58 169 240 81 139 42 108 65] [240 1] [0 62 61 103 139 0 58 19 142] [240 3] [0 2]]",
        "ProcessID": 28692
      },
      {
        "Cycles": 0,
        "Agent": "edu.brown.cs.systems.xtrace.logging.BaggageWrappers",
        "ProcessName": "Read",
        "TaskID": "3AA9F0518B2A6C41",
        "ParentEventID": [
          "0E224AAA6825FE54",
          "A84F27D2E5BA2589"
        ],
        "Label": "Merged current baggage with other baggage",
        "Title": "X-Trace Task",
        "Host": "pinky19.mpi-sws.org",
        "HRT": 27726521597174087,
        "Operation": "join",
        "Timestamp": "1558510161537.368652",
        "TenantClass": 0,
        "Source": "PacketHeader.java:168",
        "ThreadID": 1,
        "ThreadName": "",
        "EventID": "113056589668D591",
        "ProcessID": 40748
      },
      {
        "Cycles": 0,
        "Agent": "edu.brown.cs.systems.xtrace.logging.BaggageWrappers",
        "ProcessName": "Data",
        "TaskID": "3AA9F0518B2A6C41",
        "ParentEventID": [
          "B92C766CF8D52F34",
          "A6E337EF8740EF91"
        ],
        "Label": "Merged current baggage with other baggage",
        "Title": "X-Trace Task",
        "Host": "pinky24.mpi-sws.org",
        "HRT": 7337774322015345,
        "Operation": "join",
        "Timestamp": "1558510161537.929199",
        "TenantClass": 0,
        "Source": "DataXceiver.java:574",
        "ThreadID": 17872,
        "ThreadName": "",
        "EventID": "BD30D7BC218BD6C9",
        "BaggageBytes": "[[248 5] [240 0] [0 58 169 240 81 139 42 108 65] [240 1] [0 166 227 55 239 135 64 239 145] [0 185 44 118 108 248 213 47 52] [240 3] [0 2]]",
        "ProcessID": 28692
      },
      {
        "Cycles": 0,
        "Agent": "Execution-CPU",
        "ProcessName": "Data",
        "TaskID": "3AA9F0518B2A6C41",
        "ParentEventID": [
          "BD30D7BC218BD6C9"
        ],
        "Label": "unset",
        "Title": "X-Trace Task",
        "Host": "pinky24.mpi-sws.org",
        "Duration": "2299301",
        "HRT": 7337774322079608,
        "Operation": "unset",
        "Timestamp": "1558510161537.993408",
        "TenantClass": 0,
        "Source": "DataXceiver.java:261",
        "ThreadID": 17872,
        "ThreadName": "",
        "EventID": "7B1631DF60C285E2",
        "BaggageBytes": "[[248 5] [240 0] [0 58 169 240 81 139 42 108 65] [240 1] [0 189 48 215 188 33 139 214 201] [240 3] [0 2]]",
        "ProcessID": 28692
      },
      {
        "Cycles": 0,
        "Agent": "edu.brown.cs.systems.xtrace.logging.BaggageWrappers",
        "ProcessName": "Data",
        "TaskID": "3AA9F0518B2A6C41",
        "ParentEventID": [
          "C657BEAA620D5FD1"
        ],
        "Label": "Forking current baggage with Baggage.fork()",
        "Title": "X-Trace Task",
        "Host": "pinky24.mpi-sws.org",
        "HRT": 7337774322601799,
        "Operation": "fork",
        "Timestamp": "1558510161538.515625",
        "TenantClass": 0,
        "Source": "DataXceiver.java:1257",
        "ThreadID": 17872,
        "ThreadName": "",
        "EventID": "96E939F657765CF6",
        "BaggageBytes": "[[248 5] [240 0] [0 58 169 240 81 139 42 108 65] [240 1] [0 198 87 190 170 98 13 95 209] [240 3] [0 2]]",
        "ProcessID": 28692
      },
      {
        "Cycles": 0,
        "Agent": "edu.brown.cs.systems.xtrace.logging.XTraceInit",
        "ProcessName": "Data",
        "TaskID": "3AA9F0518B2A6C41",
        "ParentEventID": [
          "80E2BF0152ACFC72"
        ],
        "Label": "Thread.setName: DataXceiver for client DFSClient_NONMAPREDUCE_1816546669_1 at /139.19.171.63:50370 [Sending block BP-1633380353-139.19.171.63-1554193446451:blk_1073762459_21635]",
        "Title": "X-Trace Task",
        "Host": "pinky24.mpi-sws.org",
        "HRT": 7337774322321345,
        "Timestamp": "1558510161538.235107",
        "TenantClass": 0,
        "Source": "DataXceiver.java:168",
        "ThreadID": 17872,
        "ThreadName": "",
        "EventID": "C657BEAA620D5FD1",
        "BaggageBytes": "[[248 5] [240 0] [0 58 169 240 81 139 42 108 65] [240 1] [0 128 226 191 1 82 172 252 114] [240 3] [0 2]]",
        "ProcessID": 28692
      },
      {
        "Cycles": 0,
        "Agent": "Execution-Sleep",
        "ProcessName": "Read",
        "TaskID": "3AA9F0518B2A6C41",
        "ParentEventID": [
          "66128589F6158FF9"
        ],
        "Label": "waited",
        "Title": "X-Trace Task",
        "Host": "pinky19.mpi-sws.org",
        "Duration": "986614",
        "HRT": 27726521598536759,
        "Operation": "waited",
        "Timestamp": "1558510161538.731201",
        "TenantClass": 0,
        "Source": "SocketIOWithTimeout.java:335",
        "ThreadID": 1,
        "ThreadName": "",
        "EventID": "703B8503B0D3E3A6",
        "ProcessID": 40748
      },
      {
        "Cycles": 0,
        "Agent": "edu.brown.cs.systems.xtrace.logging.BaggageWrappers",
        "ProcessName": "Data",
        "TaskID": "3AA9F0518B2A6C41",
        "ParentEventID": [
          "96E939F657765CF6"
        ],
        "Label": "Forking current baggage with Baggage.fork()",
        "Title": "X-Trace Task",
        "Host": "pinky24.mpi-sws.org",
        "HRT": 7337774322796733,
        "Operation": "fork",
        "Timestamp": "1558510161538.710449",
        "TenantClass": 0,
        "Source": "PacketHeader.java:95",
        "ThreadID": 17872,
        "ThreadName": "",
        "EventID": "F0EF331E4D07FF08",
        "BaggageBytes": "[[248 5] [240 0] [0 58 169 240 81 139 42 108 65] [240 1] [0 150 233 57 246 87 118 92 246] [240 3] [0 2]]",
        "ProcessID": 28692
      },
      {
        "Cycles": 0,
        "Agent": "Execution-CPU",
        "ProcessName": "Data",
        "TaskID": "3AA9F0518B2A6C41",
        "ParentEventID": [
          "66128589F6158FF9"
        ],
        "Label": "set",
        "Title": "X-Trace Task",
        "Host": "pinky24.mpi-sws.org",
        "HRT": 7337774322183315,
        "Operation": "set",
        "Timestamp": "1558510161538.097168",
        "TenantClass": 0,
        "Source": "Receiver.java:117",
        "ThreadID": 17872,
        "ThreadName": "",
        "EventID": "80E2BF0152ACFC72",
        "BaggageBytes": "[[248 5] [240 0] [0 58 169 240 81 139 42 108 65] [240 1] [0 102 18 133 137 246 21 143 249] [240 3] [0 2]]",
        "ProcessID": 28692
      },
      {
        "Cycles": 0,
        "Agent": "Execution-Sleep",
        "ProcessName": "Read",
        "TaskID": "3AA9F0518B2A6C41",
        "ParentEventID": [
          "A6966207FF078C39"
        ],
        "Label": "waited",
        "Title": "X-Trace Task",
        "Host": "pinky19.mpi-sws.org",
        "Duration": "117065",
        "HRT": 27726521598784351,
        "Operation": "waited",
        "Timestamp": "1558510161538.979004",
        "TenantClass": 0,
        "Source": "SocketIOWithTimeout.java:335",
        "ThreadID": 1,
        "ThreadName": "",
        "EventID": "D34D916CE226684D",
        "ProcessID": 40748
      },
      {
        "Cycles": 0,
        "Agent": "Execution-Sleep",
        "ProcessName": "Read",
        "TaskID": "3AA9F0518B2A6C41",
        "ParentEventID": [
          "D34D916CE226684D"
        ],
        "Label": "waited",
        "Title": "X-Trace Task",
        "Host": "pinky19.mpi-sws.org",
        "Duration": "412145",
        "HRT": 27726521599266839,
        "Operation": "waited",
        "Timestamp": "1558510161539.461426",
        "TenantClass": 0,
        "Source": "SocketIOWithTimeout.java:335",
        "ThreadID": 1,
        "ThreadName": "",
        "EventID": "A7A85A09679D00E1",
        "ProcessID": 40748
      },
      {
        "Cycles": 0,
        "Agent": "Execution-Sleep",
        "ProcessName": "Data",
        "TaskID": "3AA9F0518B2A6C41",
        "ParentEventID": [
          "F0EF331E4D07FF08"
        ],
        "Label": "waited",
        "Title": "X-Trace Task",
        "Host": "pinky24.mpi-sws.org",
        "Duration": "10852",
        "HRT": 7337774323035185,
        "Operation": "waited",
        "Timestamp": "1558510161538.948975",
        "TenantClass": 0,
        "Source": "SocketIOWithTimeout.java:335",
        "ThreadID": 17872,
        "ThreadName": "",
        "EventID": "6EF98A6379A14C86",
        "BaggageBytes": "[[248 5] [240 0] [0 58 169 240 81 139 42 108 65] [240 1] [0 240 239 51 30 77 7 255 8] [240 3] [0 2]]",
        "ProcessID": 28692
      },
      {
        "Cycles": 0,
        "Agent": "edu.brown.cs.systems.xtrace.logging.BaggageWrappers",
        "ProcessName": "Data",
        "TaskID": "3AA9F0518B2A6C41",
        "ParentEventID": [
          "6EF98A6379A14C86"
        ],
        "Label": "Forking current baggage with Baggage.fork()",
        "Title": "X-Trace Task",
        "Host": "pinky24.mpi-sws.org",
        "HRT": 7337774323266110,
        "Operation": "fork",
        "Timestamp": "1558510161539.179932",
        "TenantClass": 0,
        "Source": "PacketHeader.java:95",
        "ThreadID": 17872,
        "ThreadName": "",
        "EventID": "9B55E816F819532F",
        "BaggageBytes": "[[248 5] [240 0] [0 58 169 240 81 139 42 108 65] [240 1] [0 110 249 138 99 121 161 76 134] [240 3] [0 2]]",
        "ProcessID": 28692
      },
      {
        "Cycles": 0,
        "Agent": "Execution-Sleep",
        "ProcessName": "Data",
        "TaskID": "3AA9F0518B2A6C41",
        "ParentEventID": [
          "9B55E816F819532F"
        ],
        "Label": "waited",
        "Title": "X-Trace Task",
        "Host": "pinky24.mpi-sws.org",
        "Duration": "12367",
        "HRT": 7337774323417724,
        "Operation": "waited",
        "Timestamp": "1558510161539.331543",
        "TenantClass": 0,
        "Source": "SocketIOWithTimeout.java:335",
        "ThreadID": 17872,
        "ThreadName": "",
        "EventID": "B82D34D574382B19",
        "BaggageBytes": "[[248 5] [240 0] [0 58 169 240 81 139 42 108 65] [240 1] [0 155 85 232 22 248 25 83 47] [240 3] [0 2]]",
        "ProcessID": 28692
      },
      {
        "Cycles": 0,
        "Agent": "edu.brown.cs.systems.xtrace.logging.BaggageWrappers",
        "ProcessName": "Read",
        "TaskID": "3AA9F0518B2A6C41",
        "ParentEventID": [
          "703B8503B0D3E3A6",
          "96E939F657765CF6"
        ],
        "Label": "Merged current baggage with other baggage",
        "Title": "X-Trace Task",
        "Host": "pinky19.mpi-sws.org",
        "HRT": 27726521598609947,
        "Operation": "join",
        "Timestamp": "1558510161538.804443",
        "TenantClass": 0,
        "Source": "RemoteBlockReader2.java:429",
        "ThreadID": 1,
        "ThreadName": "",
        "EventID": "A6966207FF078C39",
        "ProcessID": 40748
      },
      {
        "Cycles": 0,
        "Agent": "Execution-Sleep",
        "ProcessName": "Read",
        "TaskID": "3AA9F0518B2A6C41",
        "ParentEventID": [
          "A8959FAA4D6F21AB"
        ],
        "Label": "waited",
        "Title": "X-Trace Task",
        "Host": "pinky19.mpi-sws.org",
        "Duration": "103031",
        "HRT": 27726521599629271,
        "Operation": "waited",
        "Timestamp": "1558510161539.823730",
        "TenantClass": 0,
        "Source": "SocketIOWithTimeout.java:335",
        "ThreadID": 1,
        "ThreadName": "",
        "EventID": "7022BA0DC875A743",
        "ProcessID": 40748
      },
      {
        "Cycles": 0,
        "Agent": "Execution-Sleep",
        "ProcessName": "Read",
        "TaskID": "3AA9F0518B2A6C41",
        "ParentEventID": [
          "A7A85A09679D00E1"
        ],
        "Label": "waited",
        "Title": "X-Trace Task",
        "Host": "pinky19.mpi-sws.org",
        "Duration": "154588",
        "HRT": 27726521599476241,
        "Operation": "waited",
        "Timestamp": "1558510161539.670898",
        "TenantClass": 0,
        "Source": "SocketIOWithTimeout.java:335",
        "ThreadID": 1,
        "ThreadName": "",
        "EventID": "A8959FAA4D6F21AB",
        "ProcessID": 40748
      },
      {
        "Cycles": 0,
        "Agent": "edu.brown.cs.systems.xtrace.logging.BaggageWrappers",
        "ProcessName": "Read",
        "TaskID": "3AA9F0518B2A6C41",
        "ParentEventID": [
          "7022BA0DC875A743",
          "F0EF331E4D07FF08"
        ],
        "Label": "Merged current baggage with other baggage",
        "Title": "X-Trace Task",
        "Host": "pinky19.mpi-sws.org",
        "HRT": 27726521599682469,
        "Operation": "join",
        "Timestamp": "1558510161539.876953",
        "TenantClass": 0,
        "Source": "PacketHeader.java:168",
        "ThreadID": 1,
        "ThreadName": "",
        "EventID": "D39B959A2C11B3AC",
        "ProcessID": 40748
      },
      {
        "Cycles": 0,
        "Agent": "edu.brown.cs.systems.xtrace.logging.BaggageWrappers",
        "ProcessName": "Data",
        "TaskID": "3AA9F0518B2A6C41",
        "ParentEventID": [
          "B82D34D574382B19"
        ],
        "Label": "Forking current baggage with Baggage.fork()",
        "Title": "X-Trace Task",
        "Host": "pinky24.mpi-sws.org",
        "HRT": 7337774323663661,
        "Operation": "fork",
        "Timestamp": "1558510161539.577393",
        "TenantClass": 0,
        "Source": "PacketHeader.java:95",
        "ThreadID": 17872,
        "ThreadName": "",
        "EventID": "3A3824321673F391",
        "BaggageBytes": "[[248 5] [240 0] [0 58 169 240 81 139 42 108 65] [240 1] [0 184 45 52 213 116 56 43 25] [240 3] [0 2]]",
        "ProcessID": 28692
      },
      {
        "Cycles": 0,
        "Agent": "Execution-Sleep",
        "ProcessName": "Data",
        "TaskID": "3AA9F0518B2A6C41",
        "ParentEventID": [
          "3A3824321673F391"
        ],
        "Label": "waited",
        "Title": "X-Trace Task",
        "Host": "pinky24.mpi-sws.org",
        "Duration": "10000",
        "HRT": 7337774323846421,
        "Operation": "waited",
        "Timestamp": "1558510161539.760254",
        "TenantClass": 0,
        "Source": "SocketIOWithTimeout.java:335",
        "ThreadID": 17872,
        "ThreadName": "",
        "EventID": "9A02E369783170B7",
        "BaggageBytes": "[[248 5] [240 0] [0 58 169 240 81 139 42 108 65] [240 1] [0 58 56 36 50 22 115 243 145] [240 3] [0 2]]",
        "ProcessID": 28692
      },
      {
        "Cycles": 0,
        "Agent": "Execution-CPU",
        "ProcessName": "Data",
        "TaskID": "3AA9F0518B2A6C41",
        "ParentEventID": [
          "9A02E369783170B7"
        ],
        "Label": "unset",
        "Title": "X-Trace Task",
        "Host": "pinky24.mpi-sws.org",
        "Duration": "2086094",
        "HRT": 7337774324364369,
        "Operation": "unset",
        "Timestamp": "1558510161540.278076",
        "TenantClass": 0,
        "Source": "DataXceiver.java:261",
        "ThreadID": 17872,
        "ThreadName": "",
        "EventID": "A02E6CC693A8CEFE",
        "BaggageBytes": "[[248 5] [240 0] [0 58 169 240 81 139 42 108 65] [240 1] [0 154 2 227 105 120 49 112 183] [240 3] [0 2]]",
        "ProcessID": 28692
      }
    ]
  }
]