[
  {
    "id": "454AA5BAAF762175",
    "reports": [
      {
        "Cycles": 0,
        "Agent": "edu.brown.cs.systems.retro.benchmarks.hdfs_client.Reader",
        "ProcessName": "Read",
        "TaskID": "454AA5BAAF762175",
        "ParentEventID": [
          "F62CF1ACF075D11B"
        ],
        "Label": "Reading file",
        "Title": "X-Trace Task",
        "Host": "pinky19.mpi-sws.org",
        "HRT": 25491849292653872,
        "Timestamp": "1556275489232.912598",
        "TenantClass": 0,
        "ThreadID": 1,
        "ThreadName": "",
        "EventID": "380E9E1E229CF60C",
        "ProcessID": 21035
      },
      {
        "Cycles": 0,
        "Agent": "Execution-CPU",
        "ProcessName": "Read",
        "TaskID": "454AA5BAAF762175",
        "ParentEventID": [
          "C9013DA790C770F5"
        ],
        "Label": "unset",
        "Title": "X-Trace Task",
        "Host": "pinky19.mpi-sws.org",
        "Duration": "22484027",
        "HRT": 25491849292709460,
        "Operation": "unset",
        "Timestamp": "1556275489232.968018",
        "TenantClass": 0,
        "Source": "Client.java:1027",
        "ThreadID": 1,
        "ThreadName": "",
        "EventID": "AE07F8C098084651",
        "ProcessID": 21035
      },
      {
        "Cycles": 0,
        "Agent": "org.apache.hadoop.ipc.ProtobufRpcEngine",
        "ProcessName": "Read",
        "TaskID": "454AA5BAAF762175",
        "ParentEventID": [
          "380E9E1E229CF60C"
        ],
        "Label": "Invoking org.apache.hadoop.hdfs.protocol.ClientProtocol.getBlockLocations",
        "Title": "X-Trace Task",
        "Host": "pinky19.mpi-sws.org",
        "HRT": 25491849292685724,
        "Timestamp": "1556275489232.944336",
        "TenantClass": 0,
        "Source": "ProtobufRpcEngine.java:228",
        "ThreadID": 1,
        "ThreadName": "",
        "EventID": "C9013DA790C770F5",
        "ProcessID": 21035
      },
      {
        "Cycles": 0,
        "Agent": "Execution-CPU",
        "ProcessName": "Read",
        "TaskID": "454AA5BAAF762175",
        "ParentEventID": [
          "AE07F8C098084651"
        ],
        "Label": "set",
        "Title": "X-Trace Task",
        "Host": "pinky19.mpi-sws.org",
        "HRT": 25491849292763569,
        "Operation": "set",
        "Timestamp": "1556275489233.022217",
        "TenantClass": 0,
        "Source": "Client.java:1032",
        "ThreadID": 41,
        "ThreadName": "",
        "EventID": "44906FD8B531CFA3",
        "ProcessID": 21035
      },
      {
        "Cycles": 0,
        "Agent": "edu.brown.cs.systems.xtrace.logging.BaggageWrappers",
        "ProcessName": "Read",
        "TaskID": "454AA5BAAF762175",
        "ParentEventID": [
          "44906FD8B531CFA3"
        ],
        "Label": "Forking current baggage with Baggage.fork()",
        "Title": "X-Trace Task",
        "Host": "pinky19.mpi-sws.org",
        "HRT": 25491849292783832,
        "Operation": "fork",
        "Timestamp": "1556275489233.042480",
        "TenantClass": 0,
        "Source": "Client.java:1043",
        "ThreadID": 41,
        "ThreadName": "",
        "EventID": "2E38B68F9ACA1251",
        "ProcessID": 21035
      },
      {
        "Cycles": 0,
        "Agent": "Execution-CPU",
        "ProcessName": "Read",
        "TaskID": "454AA5BAAF762175",
        "ParentEventID": [
          "C68F943316B2F930"
        ],
        "Label": "set",
        "Title": "X-Trace Task",
        "Host": "pinky19.mpi-sws.org",
        "HRT": 25491849292875718,
        "Operation": "set",
        "Timestamp": "1556275489233.134277",
        "TenantClass": 0,
        "Source": "Client.java:1104",
        "ThreadID": 1,
        "ThreadName": "",
        "EventID": "A38FB5DBD45548FD",
        "ProcessID": 21035
      },
      {
        "Cycles": 0,
        "Agent": "Execution-CPU",
        "ProcessName": "Name",
        "TaskID": "454AA5BAAF762175",
        "ParentEventID": [
          "2E38B68F9ACA1251"
        ],
        "Label": "set",
        "Title": "X-Trace Task",
        "Host": "pinky19.mpi-sws.org",
        "HRT": 25491849292901408,
        "Operation": "set",
        "Timestamp": "1556275489233.198975",
        "TenantClass": 0,
        "Source": "Server.java:1840",
        "ThreadID": 48,
        "ThreadName": "",
        "EventID": "9B0603AAF7592BC6",
        "BaggageBytes": "[[248 5] [240 0] [0 69 74 165 186 175 118 33 117] [240 1] [0 46 56 182 143 154 202 18 81] [240 3] [0 2]]",
        "ProcessID": 2171
      },
      {
        "Cycles": 0,
        "Agent": "edu.brown.cs.systems.xtrace.logging.BaggageWrappers",
        "ProcessName": "Name",
        "TaskID": "454AA5BAAF762175",
        "ParentEventID": [
          "9B0603AAF7592BC6"
        ],
        "Label": "Forking current baggage with Baggage.fork()",
        "Title": "X-Trace Task",
        "Host": "pinky19.mpi-sws.org",
        "HRT": 25491849292931382,
        "Operation": "fork",
        "Timestamp": "1556275489233.229004",
        "TenantClass": 0,
        "Source": "Server.java:550",
        "ThreadID": 48,
        "ThreadName": "",
        "EventID": "29B69262824E8C4E",
        "BaggageBytes": "[[248 5] [240 0] [0 69 74 165 186 175 118 33 117] [240 1] [0 155 6 3 170 247 89 43 198] [240 3] [0 2]]",
        "ProcessID": 2171
      },
      {
        "Cycles": 0,
        "Agent": "Execution-CPU",
        "ProcessName": "Name",
        "TaskID": "454AA5BAAF762175",
        "ParentEventID": [
          "29B69262824E8C4E"
        ],
        "Label": "unset",
        "Title": "X-Trace Task",
        "Host": "pinky19.mpi-sws.org",
        "Duration": "24196",
        "HRT": 25491849292952088,
        "Operation": "unset",
        "Timestamp": "1556275489233.249512",
        "TenantClass": 0,
        "Source": "Server.java:1828",
        "ThreadID": 48,
        "ThreadName": "",
        "EventID": "64E815A95407D4F4",
        "BaggageBytes": "[[248 5] [240 0] [0 69 74 165 186 175 118 33 117] [240 1] [0 41 182 146 98 130 78 140 78] [240 3] [0 2]]",
        "ProcessID": 2171
      },
      {
        "Cycles": 0,
        "Agent": "Execution-CPU",
        "ProcessName": "Read",
        "TaskID": "454AA5BAAF762175",
        "ParentEventID": [
          "2E38B68F9ACA1251"
        ],
        "Label": "unset",
        "Title": "X-Trace Task",
        "Host": "pinky19.mpi-sws.org",
        "Duration": "70103",
        "HRT": 25491849292852229,
        "Operation": "unset",
        "Timestamp": "1556275489233.110840",
        "TenantClass": 0,
        "Source": "Client.java:1062",
        "ThreadID": 41,
        "ThreadName": "",
        "EventID": "C68F943316B2F930",
        "ProcessID": 21035
      },
      {
        "Cycles": 0,
        "Agent": "Execution-CPU",
        "ProcessName": "Name",
        "TaskID": "454AA5BAAF762175",
        "ParentEventID": [
          "29B69262824E8C4E"
        ],
        "Label": "set",
        "Title": "X-Trace Task",
        "Host": "pinky19.mpi-sws.org",
        "HRT": 25491849292961247,
        "Operation": "set",
        "Timestamp": "1556275489233.258789",
        "TenantClass": 0,
        "Source": "Server.java:2071",
        "ThreadID": 59,
        "ThreadName": "",
        "EventID": "4576E9D95D71C059",
        "BaggageBytes": "[[248 5] [240 0] [0 69 74 165 186 175 118 33 117] [240 1] [0 41 182 146 98 130 78 140 78] [240 3] [0 2]]",
        "ProcessID": 2171
      },
      {
        "Cycles": 0,
        "Agent": "org.apache.hadoop.hdfs.server.namenode.FSNamesystem.audit",
        "ProcessName": "Name",
        "TaskID": "454AA5BAAF762175",
        "ParentEventID": [
          "DBA47C5DCF7C5A15"
        ],
        "Label": "allowed=true\tugi=plascas (auth:SIMPLE)\tip=/139.19.171.63\tcmd=open\tsrc=/ds/kEEk5ffRg1Xu61ip\tdst=null\tperm=null\tproto=rpc",
        "Title": "X-Trace Task",
        "Host": "pinky19.mpi-sws.org",
        "HRT": 25491849293060744,
        "Timestamp": "1556275489233.358154",
        "TenantClass": 0,
        "Source": "FSNamesystem.java:8313",
        "ThreadID": 59,
        "ThreadName": "",
        "EventID": "55CA42EEFAD8EE88",
        "BaggageBytes": "[[248 5] [240 0] [0 69 74 165 186 175 118 33 117] [240 1] [0 219 164 124 93 207 124 90 21] [240 3] [0 2]]",
        "ProcessID": 2171
      },
      {
        "Cycles": 0,
        "Agent": "edu.brown.cs.systems.xtrace.logging.BaggageWrappers",
        "ProcessName": "Name",
        "TaskID": "454AA5BAAF762175",
        "ParentEventID": [
          "55CA42EEFAD8EE88"
        ],
        "Label": "Forking current baggage with Baggage.fork()",
        "Title": "X-Trace Task",
        "Host": "pinky19.mpi-sws.org",
        "HRT": 25491849293106688,
        "Operation": "fork",
        "Timestamp": "1556275489233.404297",
        "TenantClass": 0,
        "Source": "Server.java:2398",
        "ThreadID": 59,
        "ThreadName": "",
        "EventID": "31C5A0E9B36BD15D",
        "BaggageBytes": "[[248 5] [240 0] [0 69 74 165 186 175 118 33 117] [240 1] [0 85 202 66 238 250 216 238 136] [240 3] [0 2]]",
        "ProcessID": 2171
      },
      {
        "Cycles": 0,
        "Agent": "org.apache.hadoop.ipc.Server",
        "ProcessName": "Name",
        "TaskID": "454AA5BAAF762175",
        "ParentEventID": [
          "4576E9D95D71C059"
        ],
        "Label": "getBlockLocations in org.apache.hadoop.hdfs.protocol.ClientProtocol",
        "Title": "X-Trace Task",
        "Host": "pinky19.mpi-sws.org",
        "HRT": 25491849293010067,
        "Timestamp": "1556275489233.307617",
        "TenantClass": 0,
        "Source": "ProtobufRpcEngine.java:601",
        "ThreadID": 59,
        "ThreadName": "",
        "EventID": "DBA47C5DCF7C5A15",
        "BaggageBytes": "[[248 5] [240 0] [0 69 74 165 186 175 118 33 117] [240 1] [0 69 118 233 217 93 113 192 89] [240 3] [0 2]]",
        "ProcessID": 2171
      },
      {
        "Cycles": 0,
        "Agent": "Execution-CPU",
        "ProcessName": "Name",
        "TaskID": "454AA5BAAF762175",
        "ParentEventID": [
          "31C5A0E9B36BD15D"
        ],
        "Label": "unset",
        "Title": "X-Trace Task",
        "Host": "pinky19.mpi-sws.org",
        "Duration": "232091",
        "HRT": 25491849293227475,
        "Operation": "unset",
        "Timestamp": "1556275489233.524902",
        "TenantClass": 0,
        "Source": "Server.java:1058",
        "ThreadID": 59,
        "ThreadName": "",
        "EventID": "0AEA6EEB40C39FAB",
        "BaggageBytes": "[[248 5] [240 0] [0 69 74 165 186 175 118 33 117] [240 1] [0 49 197 160 233 179 107 209 93] [240 3] [0 2]]",
        "ProcessID": 2171
      },
      {
        "Cycles": 0,
        "Agent": "Execution-CPU",
        "ProcessName": "Read",
        "TaskID": "454AA5BAAF762175",
        "ParentEventID": [
          "3D9898EA0B97D55F"
        ],
        "Label": "unset",
        "Title": "X-Trace Task",
        "Host": "pinky19.mpi-sws.org",
        "Duration": "9880",
        "HRT": 25491849293328716,
        "Operation": "unset",
        "Timestamp": "1556275489233.587402",
        "TenantClass": 0,
        "Source": "Client.java:1168",
        "ThreadID": 37,
        "ThreadName": "",
        "EventID": "C58B38A65D020B1E",
        "ProcessID": 21035
      },
      {
        "Cycles": 0,
        "Agent": "Execution-CPU",
        "ProcessName": "Read",
        "TaskID": "454AA5BAAF762175",
        "ParentEventID": [
          "31C5A0E9B36BD15D"
        ],
        "Label": "set",
        "Title": "X-Trace Task",
        "Host": "pinky19.mpi-sws.org",
        "HRT": 25491849293302209,
        "Operation": "set",
        "Timestamp": "1556275489233.560791",
        "TenantClass": 0,
        "Source": "Client.java:302",
        "ThreadID": 37,
        "ThreadName": "",
        "EventID": "3D9898EA0B97D55F",
        "ProcessID": 21035
      },
      {
        "Cycles": 0,
        "Agent": "Execution-Sleep",
        "ProcessName": "Read",
        "TaskID": "454AA5BAAF762175",
        "ParentEventID": [
          "A38FB5DBD45548FD"
        ],
        "Label": "waited",
        "Title": "X-Trace Task",
        "Host": "pinky19.mpi-sws.org",
        "Duration": "458102",
        "HRT": 25491849293349006,
        "Operation": "waited",
        "Timestamp": "1556275489233.607666",
        "TenantClass": 0,
        "Source": "Client.java:1537",
        "ThreadID": 1,
        "ThreadName": "",
        "EventID": "9692085963D925BA",
        "ProcessID": 21035
      },
      {
        "Cycles": 0,
        "Agent": "org.apache.hadoop.ipc.ProtobufRpcEngine",
        "ProcessName": "Read",
        "TaskID": "454AA5BAAF762175",
        "ParentEventID": [
          "0A870B1D179EA986"
        ],
        "Label": "org.apache.hadoop.hdfs.protocol.ClientProtocol.getBlockLocations completed",
        "Title": "X-Trace Task",
        "Host": "pinky19.mpi-sws.org",
        "HRT": 25491849293428895,
        "Timestamp": "1556275489233.687500",
        "TenantClass": 0,
        "Source": "ProtobufRpcEngine.java:275",
        "ThreadID": 1,
        "ThreadName": "",
        "EventID": "6DBDFD258501D0EA",
        "ProcessID": 21035
      },
      {
        "Cycles": 0,
        "Agent": "edu.brown.cs.systems.xtrace.logging.BaggageWrappers",
        "ProcessName": "Read",
        "TaskID": "454AA5BAAF762175",
        "ParentEventID": [
          "C58B38A65D020B1E",
          "9692085963D925BA"
        ],
        "Label": "Merged current baggage with other baggage",
        "Title": "X-Trace Task",
        "Host": "pinky19.mpi-sws.org",
        "HRT": 25491849293370649,
        "Operation": "join",
        "Timestamp": "1556275489233.629395",
        "TenantClass": 0,
        "Source": "Client.java:1545",
        "ThreadID": 1,
        "ThreadName": "",
        "EventID": "0A870B1D179EA986",
        "ProcessID": 21035
      },
      {
        "Cycles": 0,
        "Agent": "edu.brown.cs.systems.xtrace.logging.BaggageWrappers",
        "ProcessName": "Read",
        "TaskID": "454AA5BAAF762175",
        "ParentEventID": [
          "6DBDFD258501D0EA"
        ],
        "Label": "Forking current baggage with Baggage.fork()",
        "Title": "X-Trace Task",
        "Host": "pinky19.mpi-sws.org",
        "HRT": 25491849293500225,
        "Operation": "fork",
        "Timestamp": "1556275489233.758789",
        "TenantClass": 0,
        "Source": "DataTransferProtoUtil.java:94",
        "ThreadID": 1,
        "ThreadName": "",
        "EventID": "B9E80E647155D288",
        "ProcessID": 21035
      },
      {
        "Cycles": 0,
        "Agent": "edu.brown.cs.systems.xtrace.logging.XTraceInit",
        "ProcessName": "Data",
        "TaskID": "454AA5BAAF762175",
        "ParentEventID": [
          "69EAB06F12586C40"
        ],
        "Label": "Thread.setName: DataXceiver for client DFSClient_NONMAPREDUCE_1377588049_1 at /139.19.171.63:57972 [Sending block BP-1633380353-139.19.171.63-1554193446451:blk_1073768438_27614]",
        "Title": "X-Trace Task",
        "Host": "pinky23.mpi-sws.org",
        "HRT": 10893345267964425,
        "Timestamp": "1556275489234.229004",
        "TenantClass": 0,
        "Source": "DataXceiver.java:168",
        "ThreadID": 6296,
        "ThreadName": "",
        "EventID": "B279942D70ECA124",
        "BaggageBytes": "[[248 5] [240 0] [0 69 74 165 186 175 118 33 117] [240 1] [0 105 234 176 111 18 88 108 64] [240 3] [0 2]]",
        "ProcessID": 24612
      },
      {
        "Cycles": 0,
        "Agent": "Execution-CPU",
        "ProcessName": "Data",
        "TaskID": "454AA5BAAF762175",
        "ParentEventID": [
          "B9E80E647155D288"
        ],
        "Label": "set",
        "Title": "X-Trace Task",
        "Host": "pinky23.mpi-sws.org",
        "HRT": 10893345267863122,
        "Operation": "set",
        "Timestamp": "1556275489234.127686",
        "TenantClass": 0,
        "Source": "Receiver.java:117",
        "ThreadID": 6296,
        "ThreadName": "",
        "EventID": "69EAB06F12586C40",
        "BaggageBytes": "[[248 5] [240 0] [0 69 74 165 186 175 118 33 117] [240 1] [0 185 232 14 100 113 85 210 136] [240 3] [0 2]]",
        "ProcessID": 24612
      },
      {
        "Cycles": 0,
        "Agent": "Execution-Sleep",
        "ProcessName": "Read",
        "TaskID": "454AA5BAAF762175",
        "ParentEventID": [
          "B9E80E647155D288"
        ],
        "Label": "waited",
        "Title": "X-Trace Task",
        "Host": "pinky19.mpi-sws.org",
        "Duration": "777682",
        "HRT": 25491849294367207,
        "Operation": "waited",
        "Timestamp": "1556275489234.625732",
        "TenantClass": 0,
        "Source": "SocketIOWithTimeout.java:335",
        "ThreadID": 1,
        "ThreadName": "",
        "EventID": "0F81B4A2B8DE0F49",
        "ProcessID": 21035
      },
      {
        "Cycles": 0,
        "Agent": "edu.brown.cs.systems.xtrace.logging.BaggageWrappers",
        "ProcessName": "Read",
        "TaskID": "454AA5BAAF762175",
        "ParentEventID": [
          "24C9BBFD4419390D",
          "0F81B4A2B8DE0F49"
        ],
        "Label": "Merged current baggage with other baggage",
        "Title": "X-Trace Task",
        "Host": "pinky19.mpi-sws.org",
        "HRT": 25491849294450545,
        "Operation": "join",
        "Timestamp": "1556275489234.709229",
        "TenantClass": 0,
        "Source": "RemoteBlockReader2.java:429",
        "ThreadID": 1,
        "ThreadName": "",
        "EventID": "3F2F2B9746C5A2A9",
        "ProcessID": 21035
      },
      {
        "Cycles": 0,
        "Agent": "edu.brown.cs.systems.xtrace.logging.BaggageWrappers",
        "ProcessName": "Data",
        "TaskID": "454AA5BAAF762175",
        "ParentEventID": [
          "B279942D70ECA124"
        ],
        "Label": "Forking current baggage with Baggage.fork()",
        "Title": "X-Trace Task",
        "Host": "pinky23.mpi-sws.org",
        "HRT": 10893345268204146,
        "Operation": "fork",
        "Timestamp": "1556275489234.468750",
        "TenantClass": 0,
        "Source": "DataXceiver.java:1257",
        "ThreadID": 6296,
        "ThreadName": "",
        "EventID": "24C9BBFD4419390D",
        "BaggageBytes": "[[248 5] [240 0] [0 69 74 165 186 175 118 33 117] [240 1] [0 178 121 148 45 112 236 161 36] [240 3] [0 2]]",
        "ProcessID": 24612
      },
      {
        "Cycles": 0,
        "Agent": "edu.brown.cs.systems.xtrace.logging.BaggageWrappers",
        "ProcessName": "Data",
        "TaskID": "454AA5BAAF762175",
        "ParentEventID": [
          "24C9BBFD4419390D"
        ],
        "Label": "Forking current baggage with Baggage.fork()",
        "Title": "X-Trace Task",
        "Host": "pinky23.mpi-sws.org",
        "HRT": 10893345268367596,
        "Operation": "fork",
        "Timestamp": "1556275489234.632324",
        "TenantClass": 0,
        "Source": "PacketHeader.java:95",
        "ThreadID": 6296,
        "ThreadName": "",
        "EventID": "699BDA626B114808",
        "BaggageBytes": "[[248 5] [240 0] [0 69 74 165 186 175 118 33 117] [240 1] [0 36 201 187 253 68 25 57 13] [240 3] [0 2]]",
        "ProcessID": 24612
      },
      {
        "Cycles": 0,
        "Agent": "Execution-Sleep",
        "ProcessName": "Data",
        "TaskID": "454AA5BAAF762175",
        "ParentEventID": [
          "699BDA626B114808"
        ],
        "Label": "waited",
        "Title": "X-Trace Task",
        "Host": "pinky23.mpi-sws.org",
        "Duration": "12013",
        "HRT": 10893345268569443,
        "Operation": "waited",
        "Timestamp": "1556275489234.833984",
        "TenantClass": 0,
        "Source": "SocketIOWithTimeout.java:335",
        "ThreadID": 6296,
        "ThreadName": "",
        "EventID": "8E913BB462DCA690",
        "BaggageBytes": "[[248 5] [240 0] [0 69 74 165 186 175 118 33 117] [240 1] [0 105 155 218 98 107 17 72 8] [240 3] [0 2]]",
        "ProcessID": 24612
      },
      {
        "Cycles": 0,
        "Agent": "Execution-Sleep",
        "ProcessName": "Read",
        "TaskID": "454AA5BAAF762175",
        "ParentEventID": [
          "3F2F2B9746C5A2A9"
        ],
        "Label": "waited",
        "Title": "X-Trace Task",
        "Host": "pinky19.mpi-sws.org",
        "Duration": "203761",
        "HRT": 25491849294780079,
        "Operation": "waited",
        "Timestamp": "1556275489235.038818",
        "TenantClass": 0,
        "Source": "SocketIOWithTimeout.java:335",
        "ThreadID": 1,
        "ThreadName": "",
        "EventID": "3A296376DE184CB5",
        "ProcessID": 21035
      },
      {
        "Cycles": 0,
        "Agent": "edu.brown.cs.systems.xtrace.logging.BaggageWrappers",
        "ProcessName": "Data",
        "TaskID": "454AA5BAAF762175",
        "ParentEventID": [
          "8E913BB462DCA690"
        ],
        "Label": "Forking current baggage with Baggage.fork()",
        "Title": "X-Trace Task",
        "Host": "pinky23.mpi-sws.org",
        "HRT": 10893345268760130,
        "Operation": "fork",
        "Timestamp": "1556275489235.024658",
        "TenantClass": 0,
        "Source": "PacketHeader.java:95",
        "ThreadID": 6296,
        "ThreadName": "",
        "EventID": "555E01FE1D47A662",
        "BaggageBytes": "[[248 5] [240 0] [0 69 74 165 186 175 118 33 117] [240 1] [0 142 145 59 180 98 220 166 144] [240 3] [0 2]]",
        "ProcessID": 24612
      },
      {
        "Cycles": 0,
        "Agent": "edu.brown.cs.systems.xtrace.logging.BaggageWrappers",
        "ProcessName": "Read",
        "TaskID": "454AA5BAAF762175",
        "ParentEventID": [
          "3A296376DE184CB5",
          "699BDA626B114808"
        ],
        "Label": "Merged current baggage with other baggage",
        "Title": "X-Trace Task",
        "Host": "pinky19.mpi-sws.org",
        "HRT": 25491849294819785,
        "Operation": "join",
        "Timestamp": "1556275489235.078369",
        "TenantClass": 0,
        "Source": "PacketHeader.java:168",
        "ThreadID": 1,
        "ThreadName": "",
        "EventID": "5719F30F34AA8C97",
        "ProcessID": 21035
      },
      {
        "Cycles": 0,
        "Agent": "Execution-Sleep",
        "ProcessName": "Read",
        "TaskID": "454AA5BAAF762175",
        "ParentEventID": [
          "5719F30F34AA8C97"
        ],
        "Label": "waited",
        "Title": "X-Trace Task",
        "Host": "pinky19.mpi-sws.org",
        "Duration": "57033",
        "HRT": 25491849294906361,
        "Operation": "waited",
        "Timestamp": "1556275489235.165039",
        "TenantClass": 0,
        "Source": "SocketIOWithTimeout.java:335",
        "ThreadID": 1,
        "ThreadName": "",
        "EventID": "7002307CB6E1D3A7",
        "ProcessID": 21035
      },
      {
        "Cycles": 0,
        "Agent": "edu.brown.cs.systems.xtrace.logging.BaggageWrappers",
        "ProcessName": "Read",
        "TaskID": "454AA5BAAF762175",
        "ParentEventID": [
          "25976BE4A93C4C59"
        ],
        "Label": "Forking current baggage with Baggage.fork()",
        "Title": "X-Trace Task",
        "Host": "pinky19.mpi-sws.org",
        "HRT": 25491849294999605,
        "Operation": "fork",
        "Timestamp": "1556275489235.258301",
        "TenantClass": 0,
        "Source": "RemoteBlockReader2.java:361",
        "ThreadID": 1,
        "ThreadName": "",
        "EventID": "2A5E79EB6D129583",
        "ProcessID": 21035
      },
      {
        "Cycles": 0,
        "Agent": "edu.brown.cs.systems.xtrace.logging.BaggageWrappers",
        "ProcessName": "Read",
        "TaskID": "454AA5BAAF762175",
        "ParentEventID": [
          "555E01FE1D47A662",
          "7002307CB6E1D3A7"
        ],
        "Label": "Merged current baggage with other baggage",
        "Title": "X-Trace Task",
        "Host": "pinky19.mpi-sws.org",
        "HRT": 25491849294988970,
        "Operation": "join",
        "Timestamp": "1556275489235.247559",
        "TenantClass": 0,
        "Source": "PacketHeader.java:168",
        "ThreadID": 1,
        "ThreadName": "",
        "EventID": "25976BE4A93C4C59",
        "ProcessID": 21035
      },
      {
        "Cycles": 0,
        "Agent": "Execution-Sleep",
        "ProcessName": "Data",
        "TaskID": "454AA5BAAF762175",
        "ParentEventID": [
          "555E01FE1D47A662"
        ],
        "Label": "waited",
        "Title": "X-Trace Task",
        "Host": "pinky23.mpi-sws.org",
        "Duration": "92756",
        "HRT": 10893345269091040,
        "Operation": "waited",
        "Timestamp": "1556275489235.355713",
        "TenantClass": 0,
        "Source": "SocketIOWithTimeout.java:335",
        "ThreadID": 6296,
        "ThreadName": "",
        "EventID": "BED684CA5F306785",
        "BaggageBytes": "[[248 5] [240 0] [0 69 74 165 186 175 118 33 117] [240 1] [0 85 94 1 254 29 71 166 98] [240 3] [0 2]]",
        "ProcessID": 24612
      },
      {
        "Cycles": 0,
        "Agent": "edu.brown.cs.systems.xtrace.logging.BaggageWrappers",
        "ProcessName": "Data",
        "TaskID": "454AA5BAAF762175",
        "ParentEventID": [
          "BED684CA5F306785",
          "2A5E79EB6D129583"
        ],
        "Label": "Merged current baggage with other baggage",
        "Title": "X-Trace Task",
        "Host": "pinky23.mpi-sws.org",
        "HRT": 10893345269216454,
        "Operation": "join",
        "Timestamp": "1556275489235.481201",
        "TenantClass": 0,
        "Source": "DataXceiver.java:574",
        "ThreadID": 6296,
        "ThreadName": "",
        "EventID": "FDA5857DA45CF509",
        "BaggageBytes": "[[248 5] [240 0] [0 69 74 165 186 175 118 33 117] [240 1] [0 190 214 132 202 95 48 103 133] [0 42 94 121 235 109 18 149 131] [240 3] [0 2]]",
        "ProcessID": 24612
      },
      {
        "Cycles": 0,
        "Agent": "Execution-CPU",
        "ProcessName": "Data",
        "TaskID": "454AA5BAAF762175",
        "ParentEventID": [
          "FDA5857DA45CF509"
        ],
        "Label": "unset",
        "Title": "X-Trace Task",
        "Host": "pinky23.mpi-sws.org",
        "Duration": "1344635",
        "HRT": 10893345269281047,
        "Operation": "unset",
        "Timestamp": "1556275489235.545654",
        "TenantClass": 0,
        "Source": "DataXceiver.java:261",
        "ThreadID": 6296,
        "ThreadName": "",
        "EventID": "2FEF3D2DEB18B052",
        "BaggageBytes": "[[248 5] [240 0] [0 69 74 165 186 175 118 33 117] [240 1] [0 253 165 133 125 164 92 245 9] [240 3] [0 2]]",
        "ProcessID": 24612
      },
      {
        "Cycles": 0,
        "Agent": "edu.brown.cs.systems.retro.benchmarks.hdfs_client.Reader",
        "ProcessName": "Read",
        "TaskID": "454AA5BAAF762175",
        "ParentEventID": [
          "0"
        ],
        "Label": "Reading file",
        "Title": "X-Trace Task",
        "Host": "pinky19.mpi-sws.org",
        "HRT": 25491849292637438,
        "Timestamp": "1556275489232.895996",
        "TenantClass": 0,
        "ThreadID": 1,
        "ThreadName": "",
        "EventID": "F62CF1ACF075D11B",
        "ProcessID": 21035,
        "Tag": [
          "reader_1kb",
          "Read Size: 1024"
        ]
      }
    ]
  }
]