[
  {
    "id": "19DED3F62EF638BA",
    "reports": [
      {
        "Cycles": 0,
        "Agent": "edu.brown.cs.systems.retro.benchmarks.hdfs_client.Reader",
        "ProcessName": "Read",
        "TaskID": "19DED3F62EF638BA",
        "ParentEventID": [
          "820CCC0D274765D8"
        ],
        "Label": "Reading file",
        "Title": "X-Trace Task",
        "Host": "pinky19.mpi-sws.org",
        "HRT": 26966783859937559,
        "Timestamp": "1557750423800.222656",
        "TenantClass": 0,
        "ThreadID": 1,
        "ThreadName": "",
        "EventID": "C6B60266D945F172",
        "ProcessID": 2801
      },
      {
        "Cycles": 0,
        "Agent": "Execution-CPU",
        "ProcessName": "Read",
        "TaskID": "19DED3F62EF638BA",
        "ParentEventID": [
          "D5E57591210D6D69"
        ],
        "Label": "unset",
        "Title": "X-Trace Task",
        "Host": "pinky19.mpi-sws.org",
        "Duration": "24627077",
        "HRT": 26966783859980493,
        "Operation": "unset",
        "Timestamp": "1557750423800.265625",
        "TenantClass": 0,
        "Source": "Client.java:1027",
        "ThreadID": 1,
        "ThreadName": "",
        "EventID": "1F6BFED2B3D1B60F",
        "ProcessID": 2801
      },
      {
        "Cycles": 0,
        "Agent": "Execution-CPU",
        "ProcessName": "Read",
        "TaskID": "19DED3F62EF638BA",
        "ParentEventID": [
          "1F6BFED2B3D1B60F"
        ],
        "Label": "set",
        "Title": "X-Trace Task",
        "Host": "pinky19.mpi-sws.org",
        "HRT": 26966783860019962,
        "Operation": "set",
        "Timestamp": "1557750423800.304932",
        "TenantClass": 0,
        "Source": "Client.java:1032",
        "ThreadID": 41,
        "ThreadName": "",
        "EventID": "66EE0186DEE9075B",
        "ProcessID": 2801
      },
      {
        "Cycles": 0,
        "Agent": "org.apache.hadoop.ipc.ProtobufRpcEngine",
        "ProcessName": "Read",
        "TaskID": "19DED3F62EF638BA",
        "ParentEventID": [
          "C6B60266D945F172"
        ],
        "Label": "Invoking org.apache.hadoop.hdfs.protocol.ClientProtocol.getBlockLocations",
        "Title": "X-Trace Task",
        "Host": "pinky19.mpi-sws.org",
        "HRT": 26966783859960911,
        "Timestamp": "1557750423800.245850",
        "TenantClass": 0,
        "Source": "ProtobufRpcEngine.java:228",
        "ThreadID": 1,
        "ThreadName": "",
        "EventID": "D5E57591210D6D69",
        "ProcessID": 2801
      },
      {
        "Cycles": 0,
        "Agent": "Execution-CPU",
        "ProcessName": "Read",
        "TaskID": "19DED3F62EF638BA",
        "ParentEventID": [
          "68F5AD76962EC2EF"
        ],
        "Label": "unset",
        "Title": "X-Trace Task",
        "Host": "pinky19.mpi-sws.org",
        "Duration": "67186",
        "HRT": 26966783860102113,
        "Operation": "unset",
        "Timestamp": "1557750423800.387207",
        "TenantClass": 0,
        "Source": "Client.java:1062",
        "ThreadID": 41,
        "ThreadName": "",
        "EventID": "B203E9EA988F0F86",
        "ProcessID": 2801
      },
      {
        "Cycles": 0,
        "Agent": "edu.brown.cs.systems.xtrace.logging.BaggageWrappers",
        "ProcessName": "Read",
        "TaskID": "19DED3F62EF638BA",
        "ParentEventID": [
          "66EE0186DEE9075B"
        ],
        "Label": "Forking current baggage with Baggage.fork()",
        "Title": "X-Trace Task",
        "Host": "pinky19.mpi-sws.org",
        "HRT": 26966783860035705,
        "Operation": "fork",
        "Timestamp": "1557750423800.320801",
        "TenantClass": 0,
        "Source": "Client.java:1043",
        "ThreadID": 41,
        "ThreadName": "",
        "EventID": "68F5AD76962EC2EF",
        "ProcessID": 2801
      },
      {
        "Cycles": 0,
        "Agent": "Execution-CPU",
        "ProcessName": "Read",
        "TaskID": "19DED3F62EF638BA",
        "ParentEventID": [
          "B203E9EA988F0F86"
        ],
        "Label": "set",
        "Title": "X-Trace Task",
        "Host": "pinky19.mpi-sws.org",
        "HRT": 26966783860122887,
        "Operation": "set",
        "Timestamp": "1557750423800.407959",
        "TenantClass": 0,
        "Source": "Client.java:1104",
        "ThreadID": 1,
        "ThreadName": "",
        "EventID": "A00B5B532AB1417C",
        "ProcessID": 2801
      },
      {
        "Cycles": 0,
        "Agent": "edu.brown.cs.systems.xtrace.logging.BaggageWrappers",
        "ProcessName": "Name",
        "TaskID": "19DED3F62EF638BA",
        "ParentEventID": [
          "71BA17315FA4C60A"
        ],
        "Label": "Forking current baggage with Baggage.fork()",
        "Title": "X-Trace Task",
        "Host": "pinky19.mpi-sws.org",
        "HRT": 26966783860205551,
        "Operation": "fork",
        "Timestamp": "1557750423800.505615",
        "TenantClass": 0,
        "Source": "Server.java:550",
        "ThreadID": 48,
        "ThreadName": "",
        "EventID": "57A6B959CE20AB0E",
        "BaggageBytes": "[[248 5] [240 0] [0 25 222 211 246 46 246 56 186] [240 1] [0 113 186 23 49 95 164 198 10] [240 3] [0 2]]",
        "ProcessID": 2171
      },
      {
        "Cycles": 0,
        "Agent": "Execution-CPU",
        "ProcessName": "Name",
        "TaskID": "19DED3F62EF638BA",
        "ParentEventID": [
          "68F5AD76962EC2EF"
        ],
        "Label": "set",
        "Title": "X-Trace Task",
        "Host": "pinky19.mpi-sws.org",
        "HRT": 26966783860176847,
        "Operation": "set",
        "Timestamp": "1557750423800.476807",
        "TenantClass": 0,
        "Source": "Server.java:1840",
        "ThreadID": 48,
        "ThreadName": "",
        "EventID": "71BA17315FA4C60A",
        "BaggageBytes": "[[248 5] [240 0] [0 25 222 211 246 46 246 56 186] [240 1] [0 104 245 173 118 150 46 194 239] [240 3] [0 2]]",
        "ProcessID": 2171
      },
      {
        "Cycles": 0,
        "Agent": "Execution-CPU",
        "ProcessName": "Name",
        "TaskID": "19DED3F62EF638BA",
        "ParentEventID": [
          "57A6B959CE20AB0E"
        ],
        "Label": "unset",
        "Title": "X-Trace Task",
        "Host": "pinky19.mpi-sws.org",
        "Duration": "23451",
        "HRT": 26966783860225948,
        "Operation": "unset",
        "Timestamp": "1557750423800.525879",
        "TenantClass": 0,
        "Source": "Server.java:1828",
        "ThreadID": 48,
        "ThreadName": "",
        "EventID": "E53747B7C102B34C",
        "BaggageBytes": "[[248 5] [240 0] [0 25 222 211 246 46 246 56 186] [240 1] [0 87 166 185 89 206 32 171 14] [240 3] [0 2]]",
        "ProcessID": 2171
      },
      {
        "Cycles": 0,
        "Agent": "org.apache.hadoop.ipc.Server",
        "ProcessName": "Name",
        "TaskID": "19DED3F62EF638BA",
        "ParentEventID": [
          "7ABD8017410DE7AD"
        ],
        "Label": "getBlockLocations in org.apache.hadoop.hdfs.protocol.ClientProtocol",
        "Title": "X-Trace Task",
        "Host": "pinky19.mpi-sws.org",
        "HRT": 26966783860264222,
        "Timestamp": "1557750423800.564209",
        "TenantClass": 0,
        "Source": "ProtobufRpcEngine.java:601",
        "ThreadID": 55,
        "ThreadName": "",
        "EventID": "6C28262B76594BAD",
        "BaggageBytes": "[[248 5] [240 0] [0 25 222 211 246 46 246 56 186] [240 1] [0 122 189 128 23 65 13 231 173] [240 3] [0 2]]",
        "ProcessID": 2171
      },
      {
        "Cycles": 0,
        "Agent": "Execution-CPU",
        "ProcessName": "Name",
        "TaskID": "19DED3F62EF638BA",
        "ParentEventID": [
          "57A6B959CE20AB0E"
        ],
        "Label": "set",
        "Title": "X-Trace Task",
        "Host": "pinky19.mpi-sws.org",
        "HRT": 26966783860233309,
        "Operation": "set",
        "Timestamp": "1557750423800.533203",
        "TenantClass": 0,
        "Source": "Server.java:2071",
        "ThreadID": 55,
        "ThreadName": "",
        "EventID": "7ABD8017410DE7AD",
        "BaggageBytes": "[[248 5] [240 0] [0 25 222 211 246 46 246 56 186] [240 1] [0 87 166 185 89 206 32 171 14] [240 3] [0 2]]",
        "ProcessID": 2171
      },
      {
        "Cycles": 0,
        "Agent": "org.apache.hadoop.hdfs.server.namenode.FSNamesystem.audit",
        "ProcessName": "Name",
        "TaskID": "19DED3F62EF638BA",
        "ParentEventID": [
          "6C28262B76594BAD"
        ],
        "Label": "allowed=true\tugi=plascas (auth:SIMPLE)\tip=/139.19.171.63\tcmd=open\tsrc=/ds/l6vmnteOphOANk8Q\tdst=null\tperm=null\tproto=rpc",
        "Title": "X-Trace Task",
        "Host": "pinky19.mpi-sws.org",
        "HRT": 26966783860308410,
        "Timestamp": "1557750423800.608398",
        "TenantClass": 0,
        "Source": "FSNamesystem.java:8313",
        "ThreadID": 55,
        "ThreadName": "",
        "EventID": "6D91F22B57C2C759",
        "BaggageBytes": "[[248 5] [240 0] [0 25 222 211 246 46 246 56 186] [240 1] [0 108 40 38 43 118 89 75 173] [240 3] [0 2]]",
        "ProcessID": 2171
      },
      {
        "Cycles": 0,
        "Agent": "Execution-CPU",
        "ProcessName": "Name",
        "TaskID": "19DED3F62EF638BA",
        "ParentEventID": [
          "960F82E311E141DB"
        ],
        "Label": "unset",
        "Title": "X-Trace Task",
        "Host": "pinky19.mpi-sws.org",
        "Duration": "207317",
        "HRT": 26966783860456664,
        "Operation": "unset",
        "Timestamp": "1557750423800.756592",
        "TenantClass": 0,
        "Source": "Server.java:1058",
        "ThreadID": 55,
        "ThreadName": "",
        "EventID": "D9D876715EE6D48B",
        "BaggageBytes": "[[248 5] [240 0] [0 25 222 211 246 46 246 56 186] [240 1] [0 150 15 130 227 17 225 65 219] [240 3] [0 2]]",
        "ProcessID": 2171
      },
      {
        "Cycles": 0,
        "Agent": "edu.brown.cs.systems.xtrace.logging.BaggageWrappers",
        "ProcessName": "Name",
        "TaskID": "19DED3F62EF638BA",
        "ParentEventID": [
          "6D91F22B57C2C759"
        ],
        "Label": "Forking current baggage with Baggage.fork()",
        "Title": "X-Trace Task",
        "Host": "pinky19.mpi-sws.org",
        "HRT": 26966783860350302,
        "Operation": "fork",
        "Timestamp": "1557750423800.650391",
        "TenantClass": 0,
        "Source": "Server.java:2398",
        "ThreadID": 55,
        "ThreadName": "",
        "EventID": "960F82E311E141DB",
        "BaggageBytes": "[[248 5] [240 0] [0 25 222 211 246 46 246 56 186] [240 1] [0 109 145 242 43 87 194 199 89] [240 3] [0 2]]",
        "ProcessID": 2171
      },
      {
        "Cycles": 0,
        "Agent": "Execution-CPU",
        "ProcessName": "Read",
        "TaskID": "19DED3F62EF638BA",
        "ParentEventID": [
          "960F82E311E141DB"
        ],
        "Label": "set",
        "Title": "X-Trace Task",
        "Host": "pinky19.mpi-sws.org",
        "HRT": 26966783860521460,
        "Operation": "set",
        "Timestamp": "1557750423800.806396",
        "TenantClass": 0,
        "Source": "Client.java:302",
        "ThreadID": 40,
        "ThreadName": "",
        "EventID": "7BDA4BB309FE3587",
        "ProcessID": 2801
      },
      {
        "Cycles": 0,
        "Agent": "Execution-CPU",
        "ProcessName": "Read",
        "TaskID": "19DED3F62EF638BA",
        "ParentEventID": [
          "7BDA4BB309FE3587"
        ],
        "Label": "unset",
        "Title": "X-Trace Task",
        "Host": "pinky19.mpi-sws.org",
        "Duration": "5138",
        "HRT": 26966783860541208,
        "Operation": "unset",
        "Timestamp": "1557750423800.826172",
        "TenantClass": 0,
        "Source": "Client.java:1168",
        "ThreadID": 40,
        "ThreadName": "",
        "EventID": "74BB1E3089B2C1E5",
        "ProcessID": 2801
      },
      {
        "Cycles": 0,
        "Agent": "Execution-Sleep",
        "ProcessName": "Read",
        "TaskID": "19DED3F62EF638BA",
        "ParentEventID": [
          "A00B5B532AB1417C"
        ],
        "Label": "waited",
        "Title": "X-Trace Task",
        "Host": "pinky19.mpi-sws.org",
        "Duration": "445726",
        "HRT": 26966783860578934,
        "Operation": "waited",
        "Timestamp": "1557750423800.864014",
        "TenantClass": 0,
        "Source": "Client.java:1537",
        "ThreadID": 1,
        "ThreadName": "",
        "EventID": "8943707B17A7EF8B",
        "ProcessID": 2801
      },
      {
        "Cycles": 0,
        "Agent": "org.apache.hadoop.ipc.ProtobufRpcEngine",
        "ProcessName": "Read",
        "TaskID": "19DED3F62EF638BA",
        "ParentEventID": [
          "AD72B0E5475A1C11"
        ],
        "Label": "org.apache.hadoop.hdfs.protocol.ClientProtocol.getBlockLocations completed",
        "Title": "X-Trace Task",
        "Host": "pinky19.mpi-sws.org",
        "HRT": 26966783860684842,
        "Timestamp": "1557750423800.969971",
        "TenantClass": 0,
        "Source": "ProtobufRpcEngine.java:275",
        "ThreadID": 1,
        "ThreadName": "",
        "EventID": "0A56CE632FB5466E",
        "ProcessID": 2801
      },
      {
        "Cycles": 0,
        "Agent": "Execution-Sleep",
        "ProcessName": "Read",
        "TaskID": "19DED3F62EF638BA",
        "ParentEventID": [
          "0A56CE632FB5466E"
        ],
        "Label": "waited",
        "Title": "X-Trace Task",
        "Host": "pinky19.mpi-sws.org",
        "Duration": "97063",
        "HRT": 26966783860858458,
        "Operation": "waited",
        "Timestamp": "1557750423801.143555",
        "TenantClass": 0,
        "Source": "SocketIOWithTimeout.java:335",
        "ThreadID": 1,
        "ThreadName": "",
        "EventID": "DB144FD4A04BEBCF",
        "ProcessID": 2801
      },
      {
        "Cycles": 0,
        "Agent": "edu.brown.cs.systems.xtrace.logging.BaggageWrappers",
        "ProcessName": "Read",
        "TaskID": "19DED3F62EF638BA",
        "ParentEventID": [
          "8943707B17A7EF8B",
          "74BB1E3089B2C1E5"
        ],
        "Label": "Merged current baggage with other baggage",
        "Title": "X-Trace Task",
        "Host": "pinky19.mpi-sws.org",
        "HRT": 26966783860599667,
        "Operation": "join",
        "Timestamp": "1557750423800.884766",
        "TenantClass": 0,
        "Source": "Client.java:1545",
        "ThreadID": 1,
        "ThreadName": "",
        "EventID": "AD72B0E5475A1C11",
        "ProcessID": 2801
      },
      {
        "Cycles": 0,
        "Agent": "Execution-CPU",
        "ProcessName": "Data",
        "TaskID": "19DED3F62EF638BA",
        "ParentEventID": [
          "C91CA237A6C3CF04"
        ],
        "Label": "set",
        "Title": "X-Trace Task",
        "Host": "pinky23.mpi-sws.org",
        "HRT": 12368279834943650,
        "Operation": "set",
        "Timestamp": "1557750423801.624756",
        "TenantClass": 0,
        "Source": "Receiver.java:117",
        "ThreadID": 16300,
        "ThreadName": "",
        "EventID": "1E7FC5971F7A5621",
        "BaggageBytes": "[[248 5] [240 0] [0 25 222 211 246 46 246 56 186] [240 1] [0 201 28 162 55 166 195 207 4] [240 3] [0 2]]",
        "ProcessID": 24612
      },
      {
        "Cycles": 0,
        "Agent": "edu.brown.cs.systems.xtrace.logging.XTraceInit",
        "ProcessName": "Data",
        "TaskID": "19DED3F62EF638BA",
        "ParentEventID": [
          "1E7FC5971F7A5621"
        ],
        "Label": "Thread.setName: DataXceiver for client DFSClient_NONMAPREDUCE_310321604_1 at /139.19.171.63:55104 [Sending block BP-1633380353-139.19.171.63-1554193446451:blk_1073761571_20747]",
        "Title": "X-Trace Task",
        "Host": "pinky23.mpi-sws.org",
        "HRT": 12368279835050546,
        "Timestamp": "1557750423801.731689",
        "TenantClass": 0,
        "Source": "DataXceiver.java:168",
        "ThreadID": 16300,
        "ThreadName": "",
        "EventID": "3CDB04A88494D03E",
        "BaggageBytes": "[[248 5] [240 0] [0 25 222 211 246 46 246 56 186] [240 1] [0 30 127 197 151 31 122 86 33] [240 3] [0 2]]",
        "ProcessID": 24612
      },
      {
        "Cycles": 0,
        "Agent": "edu.brown.cs.systems.xtrace.logging.BaggageWrappers",
        "ProcessName": "Read",
        "TaskID": "19DED3F62EF638BA",
        "ParentEventID": [
          "DB144FD4A04BEBCF"
        ],
        "Label": "Forking current baggage with Baggage.fork()",
        "Title": "X-Trace Task",
        "Host": "pinky19.mpi-sws.org",
        "HRT": 26966783860897074,
        "Operation": "fork",
        "Timestamp": "1557750423801.182129",
        "TenantClass": 0,
        "Source": "DataTransferProtoUtil.java:94",
        "ThreadID": 1,
        "ThreadName": "",
        "EventID": "C91CA237A6C3CF04",
        "ProcessID": 2801
      },
      {
        "Cycles": 0,
        "Agent": "edu.brown.cs.systems.xtrace.logging.BaggageWrappers",
        "ProcessName": "Data",
        "TaskID": "19DED3F62EF638BA",
        "ParentEventID": [
          "3CDB04A88494D03E"
        ],
        "Label": "Forking current baggage with Baggage.fork()",
        "Title": "X-Trace Task",
        "Host": "pinky23.mpi-sws.org",
        "HRT": 12368279835276293,
        "Operation": "fork",
        "Timestamp": "1557750423801.957275",
        "TenantClass": 0,
        "Source": "DataXceiver.java:1257",
        "ThreadID": 16300,
        "ThreadName": "",
        "EventID": "7FCE673C7FCB60D0",
        "BaggageBytes": "[[248 5] [240 0] [0 25 222 211 246 46 246 56 186] [240 1] [0 60 219 4 168 132 148 208 62] [240 3] [0 2]]",
        "ProcessID": 24612
      },
      {
        "Cycles": 0,
        "Agent": "edu.brown.cs.systems.xtrace.logging.BaggageWrappers",
        "ProcessName": "Read",
        "TaskID": "19DED3F62EF638BA",
        "ParentEventID": [
          "7FCE673C7FCB60D0",
          "4EDE59BB746A1C51"
        ],
        "Label": "Merged current baggage with other baggage",
        "Title": "X-Trace Task",
        "Host": "pinky19.mpi-sws.org",
        "HRT": 26966783861942109,
        "Operation": "join",
        "Timestamp": "1557750423802.227051",
        "TenantClass": 0,
        "Source": "RemoteBlockReader2.java:429",
        "ThreadID": 1,
        "ThreadName": "",
        "EventID": "2B5687D0E76864B5",
        "ProcessID": 2801
      },
      {
        "Cycles": 0,
        "Agent": "Execution-Sleep",
        "ProcessName": "Read",
        "TaskID": "19DED3F62EF638BA",
        "ParentEventID": [
          "C91CA237A6C3CF04"
        ],
        "Label": "waited",
        "Title": "X-Trace Task",
        "Host": "pinky19.mpi-sws.org",
        "Duration": "920846",
        "HRT": 26966783861886223,
        "Operation": "waited",
        "Timestamp": "1557750423802.171143",
        "TenantClass": 0,
        "Source": "SocketIOWithTimeout.java:335",
        "ThreadID": 1,
        "ThreadName": "",
        "EventID": "4EDE59BB746A1C51",
        "ProcessID": 2801
      },
      {
        "Cycles": 0,
        "Agent": "edu.brown.cs.systems.xtrace.logging.BaggageWrappers",
        "ProcessName": "Data",
        "TaskID": "19DED3F62EF638BA",
        "ParentEventID": [
          "7FCE673C7FCB60D0"
        ],
        "Label": "Forking current baggage with Baggage.fork()",
        "Title": "X-Trace Task",
        "Host": "pinky23.mpi-sws.org",
        "HRT": 12368279835438064,
        "Operation": "fork",
        "Timestamp": "1557750423802.119141",
        "TenantClass": 0,
        "Source": "PacketHeader.java:95",
        "ThreadID": 16300,
        "ThreadName": "",
        "EventID": "DB6895A28FB4F368",
        "BaggageBytes": "[[248 5] [240 0] [0 25 222 211 246 46 246 56 186] [240 1] [0 127 206 103 60 127 203 96 208] [240 3] [0 2]]",
        "ProcessID": 24612
      },
      {
        "Cycles": 0,
        "Agent": "Execution-Sleep",
        "ProcessName": "Read",
        "TaskID": "19DED3F62EF638BA",
        "ParentEventID": [
          "2B5687D0E76864B5"
        ],
        "Label": "waited",
        "Title": "X-Trace Task",
        "Host": "pinky19.mpi-sws.org",
        "Duration": "52502",
        "HRT": 26966783862049436,
        "Operation": "waited",
        "Timestamp": "1557750423802.334473",
        "TenantClass": 0,
        "Source": "SocketIOWithTimeout.java:335",
        "ThreadID": 1,
        "ThreadName": "",
        "EventID": "2125B8A8E63C36DA",
        "ProcessID": 2801
      },
      {
        "Cycles": 0,
        "Agent": "Execution-Sleep",
        "ProcessName": "Data",
        "TaskID": "19DED3F62EF638BA",
        "ParentEventID": [
          "DB6895A28FB4F368"
        ],
        "Label": "waited",
        "Title": "X-Trace Task",
        "Host": "pinky23.mpi-sws.org",
        "Duration": "13360",
        "HRT": 12368279835590304,
        "Operation": "waited",
        "Timestamp": "1557750423802.271484",
        "TenantClass": 0,
        "Source": "SocketIOWithTimeout.java:335",
        "ThreadID": 16300,
        "ThreadName": "",
        "EventID": "D9933A2FF892645E",
        "BaggageBytes": "[[248 5] [240 0] [0 25 222 211 246 46 246 56 186] [240 1] [0 219 104 149 162 143 180 243 104] [240 3] [0 2]]",
        "ProcessID": 24612
      },
      {
        "Cycles": 0,
        "Agent": "Execution-Sleep",
        "ProcessName": "Read",
        "TaskID": "19DED3F62EF638BA",
        "ParentEventID": [
          "2125B8A8E63C36DA"
        ],
        "Label": "waited",
        "Title": "X-Trace Task",
        "Host": "pinky19.mpi-sws.org",
        "Duration": "347261",
        "HRT": 26966783862448314,
        "Operation": "waited",
        "Timestamp": "1557750423802.733398",
        "TenantClass": 0,
        "Source": "SocketIOWithTimeout.java:335",
        "ThreadID": 1,
        "ThreadName": "",
        "EventID": "6E8EB4BAFA8A794E",
        "ProcessID": 2801
      },
      {
        "Cycles": 0,
        "Agent": "edu.brown.cs.systems.xtrace.logging.BaggageWrappers",
        "ProcessName": "Data",
        "TaskID": "19DED3F62EF638BA",
        "ParentEventID": [
          "D9933A2FF892645E"
        ],
        "Label": "Forking current baggage with Baggage.fork()",
        "Title": "X-Trace Task",
        "Host": "pinky23.mpi-sws.org",
        "HRT": 12368279835781334,
        "Operation": "fork",
        "Timestamp": "1557750423802.462402",
        "TenantClass": 0,
        "Source": "PacketHeader.java:95",
        "ThreadID": 16300,
        "ThreadName": "",
        "EventID": "3565500FFF57CC89",
        "BaggageBytes": "[[248 5] [240 0] [0 25 222 211 246 46 246 56 186] [240 1] [0 217 147 58 47 248 146 100 94] [240 3] [0 2]]",
        "ProcessID": 24612
      },
      {
        "Cycles": 0,
        "Agent": "Execution-Sleep",
        "ProcessName": "Read",
        "TaskID": "19DED3F62EF638BA",
        "ParentEventID": [
          "6E8EB4BAFA8A794E"
        ],
        "Label": "waited",
        "Title": "X-Trace Task",
        "Host": "pinky19.mpi-sws.org",
        "Duration": "254806",
        "HRT": 26966783862747871,
        "Operation": "waited",
        "Timestamp": "1557750423803.032959",
        "TenantClass": 0,
        "Source": "SocketIOWithTimeout.java:335",
        "ThreadID": 1,
        "ThreadName": "",
        "EventID": "B95F574CD90168B6",
        "ProcessID": 2801
      },
      {
        "Cycles": 0,
        "Agent": "Execution-Sleep",
        "ProcessName": "Read",
        "TaskID": "19DED3F62EF638BA",
        "ParentEventID": [
          "9C0DB917BC840E16"
        ],
        "Label": "waited",
        "Title": "X-Trace Task",
        "Host": "pinky19.mpi-sws.org",
        "Duration": "27248",
        "HRT": 26966783863009769,
        "Operation": "waited",
        "Timestamp": "1557750423803.294678",
        "TenantClass": 0,
        "Source": "SocketIOWithTimeout.java:335",
        "ThreadID": 1,
        "ThreadName": "",
        "EventID": "1CF526767208746B",
        "ProcessID": 2801
      },
      {
        "Cycles": 0,
        "Agent": "Execution-Sleep",
        "ProcessName": "Read",
        "TaskID": "19DED3F62EF638BA",
        "ParentEventID": [
          "B95F574CD90168B6"
        ],
        "Label": "waited",
        "Title": "X-Trace Task",
        "Host": "pinky19.mpi-sws.org",
        "Duration": "111626",
        "HRT": 26966783862939335,
        "Operation": "waited",
        "Timestamp": "1557750423803.224365",
        "TenantClass": 0,
        "Source": "SocketIOWithTimeout.java:335",
        "ThreadID": 1,
        "ThreadName": "",
        "EventID": "9C0DB917BC840E16",
        "ProcessID": 2801
      },
      {
        "Cycles": 0,
        "Agent": "edu.brown.cs.systems.xtrace.logging.BaggageWrappers",
        "ProcessName": "Read",
        "TaskID": "19DED3F62EF638BA",
        "ParentEventID": [
          "1CF526767208746B",
          "DB6895A28FB4F368"
        ],
        "Label": "Merged current baggage with other baggage",
        "Title": "X-Trace Task",
        "Host": "pinky19.mpi-sws.org",
        "HRT": 26966783863045257,
        "Operation": "join",
        "Timestamp": "1557750423803.330322",
        "TenantClass": 0,
        "Source": "PacketHeader.java:168",
        "ThreadID": 1,
        "ThreadName": "",
        "EventID": "11F0EAC35D1FAA20",
        "ProcessID": 2801
      },
      {
        "Cycles": 0,
        "Agent": "edu.brown.cs.systems.xtrace.logging.BaggageWrappers",
        "ProcessName": "Read",
        "TaskID": "19DED3F62EF638BA",
        "ParentEventID": [
          "11F0EAC35D1FAA20",
          "3565500FFF57CC89"
        ],
        "Label": "Merged current baggage with other baggage",
        "Title": "X-Trace Task",
        "Host": "pinky19.mpi-sws.org",
        "HRT": 26966783863140044,
        "Operation": "join",
        "Timestamp": "1557750423803.425049",
        "TenantClass": 0,
        "Source": "PacketHeader.java:168",
        "ThreadID": 1,
        "ThreadName": "",
        "EventID": "872776D5F2F9022D",
        "ProcessID": 2801
      },
      {
        "Cycles": 0,
        "Agent": "edu.brown.cs.systems.xtrace.logging.BaggageWrappers",
        "ProcessName": "Read",
        "TaskID": "19DED3F62EF638BA",
        "ParentEventID": [
          "1599DEB7804EE1DF"
        ],
        "Label": "Forking current baggage with Baggage.fork()",
        "Title": "X-Trace Task",
        "Host": "pinky19.mpi-sws.org",
        "HRT": 26966783863198182,
        "Operation": "fork",
        "Timestamp": "1557750423803.483154",
        "TenantClass": 0,
        "Source": "DataTransferProtoUtil.java:94",
        "ThreadID": 1,
        "ThreadName": "",
        "EventID": "A903AB092D7D0396",
        "ProcessID": 2801
      },
      {
        "Cycles": 0,
        "Agent": "edu.brown.cs.systems.xtrace.logging.BaggageWrappers",
        "ProcessName": "Read",
        "TaskID": "19DED3F62EF638BA",
        "ParentEventID": [
          "872776D5F2F9022D"
        ],
        "Label": "Forking current baggage with Baggage.fork()",
        "Title": "X-Trace Task",
        "Host": "pinky19.mpi-sws.org",
        "HRT": 26966783863148726,
        "Operation": "fork",
        "Timestamp": "1557750423803.433838",
        "TenantClass": 0,
        "Source": "RemoteBlockReader2.java:361",
        "ThreadID": 1,
        "ThreadName": "",
        "EventID": "1599DEB7804EE1DF",
        "ProcessID": 2801
      },
      {
        "Cycles": 0,
        "Agent": "Execution-Sleep",
        "ProcessName": "Data",
        "TaskID": "19DED3F62EF638BA",
        "ParentEventID": [
          "3565500FFF57CC89"
        ],
        "Label": "waited",
        "Title": "X-Trace Task",
        "Host": "pinky23.mpi-sws.org",
        "Duration": "824974",
        "HRT": 12368279836786362,
        "Operation": "waited",
        "Timestamp": "1557750423803.467529",
        "TenantClass": 0,
        "Source": "SocketIOWithTimeout.java:335",
        "ThreadID": 16300,
        "ThreadName": "",
        "EventID": "7A361A0BB5FD6DBA",
        "BaggageBytes": "[[248 5] [240 0] [0 25 222 211 246 46 246 56 186] [240 1] [0 53 101 80 15 255 87 204 137] [240 3] [0 2]]",
        "ProcessID": 24612
      },
      {
        "Cycles": 0,
        "Agent": "Execution-CPU",
        "ProcessName": "Data",
        "TaskID": "19DED3F62EF638BA",
        "ParentEventID": [
          "DBA3BE8C9B59954B"
        ],
        "Label": "unset",
        "Title": "X-Trace Task",
        "Host": "pinky23.mpi-sws.org",
        "Duration": "2086957",
        "HRT": 12368279837102043,
        "Operation": "unset",
        "Timestamp": "1557750423803.783203",
        "TenantClass": 0,
        "Source": "DataXceiver.java:261",
        "ThreadID": 16300,
        "ThreadName": "",
        "EventID": "3D5D889363A43F53",
        "BaggageBytes": "[[248 5] [240 0] [0 25 222 211 246 46 246 56 186] [240 1] [0 219 163 190 140 155 89 149 75] [240 3] [0 2]]",
        "ProcessID": 24612
      },
      {
        "Cycles": 0,
        "Agent": "edu.brown.cs.systems.xtrace.logging.BaggageWrappers",
        "ProcessName": "Data",
        "TaskID": "19DED3F62EF638BA",
        "ParentEventID": [
          "7A361A0BB5FD6DBA",
          "1599DEB7804EE1DF"
        ],
        "Label": "Merged current baggage with other baggage",
        "Title": "X-Trace Task",
        "Host": "pinky23.mpi-sws.org",
        "HRT": 12368279837022553,
        "Operation": "join",
        "Timestamp": "1557750423803.703613",
        "TenantClass": 0,
        "Source": "DataXceiver.java:574",
        "ThreadID": 16300,
        "ThreadName": "",
        "EventID": "DBA3BE8C9B59954B",
        "BaggageBytes": "[[248 5] [240 0] [0 25 222 211 246 46 246 56 186] [240 1] [0 21 153 222 183 128 78 225 223] [0 122 54 26 11 181 253 109 186] [240 3] [0 2]]",
        "ProcessID": 24612
      },
      {
        "Cycles": 0,
        "Agent": "Execution-CPU",
        "ProcessName": "Data",
        "TaskID": "19DED3F62EF638BA",
        "ParentEventID": [
          "A903AB092D7D0396"
        ],
        "Label": "set",
        "Title": "X-Trace Task",
        "Host": "pinky23.mpi-sws.org",
        "HRT": 12368279837176870,
        "Operation": "set",
        "Timestamp": "1557750423803.857910",
        "TenantClass": 0,
        "Source": "Receiver.java:117",
        "ThreadID": 16300,
        "ThreadName": "",
        "EventID": "C4FE3989AF00DC37",
        "BaggageBytes": "[[248 5] [240 0] [0 25 222 211 246 46 246 56 186] [240 1] [0 169 3 171 9 45 125 3 150] [240 3] [0 2]]",
        "ProcessID": 24612
      },
      {
        "Cycles": 0,
        "Agent": "edu.brown.cs.systems.xtrace.logging.BaggageWrappers",
        "ProcessName": "Data",
        "TaskID": "19DED3F62EF638BA",
        "ParentEventID": [
          "9285BE1687C423AA"
        ],
        "Label": "Forking current baggage with Baggage.fork()",
        "Title": "X-Trace Task",
        "Host": "pinky23.mpi-sws.org",
        "HRT": 12368279837526150,
        "Operation": "fork",
        "Timestamp": "1557750423804.207275",
        "TenantClass": 0,
        "Source": "DataXceiver.java:1257",
        "ThreadID": 16300,
        "ThreadName": "",
        "EventID": "5E708852D241AB67",
        "BaggageBytes": "[[248 5] [240 0] [0 25 222 211 246 46 246 56 186] [240 1] [0 146 133 190 22 135 196 35 170] [240 3] [0 2]]",
        "ProcessID": 24612
      },
      {
        "Cycles": 0,
        "Agent": "edu.brown.cs.systems.xtrace.logging.XTraceInit",
        "ProcessName": "Data",
        "TaskID": "19DED3F62EF638BA",
        "ParentEventID": [
          "C4FE3989AF00DC37"
        ],
        "Label": "Thread.setName: DataXceiver for client DFSClient_NONMAPREDUCE_310321604_1 at /139.19.171.63:55104 [Sending block BP-1633380353-139.19.171.63-1554193446451:blk_1073761571_20747]",
        "Title": "X-Trace Task",
        "Host": "pinky23.mpi-sws.org",
        "HRT": 12368279837281210,
        "Timestamp": "1557750423803.962402",
        "TenantClass": 0,
        "Source": "DataXceiver.java:168",
        "ThreadID": 16300,
        "ThreadName": "",
        "EventID": "9285BE1687C423AA",
        "BaggageBytes": "[[248 5] [240 0] [0 25 222 211 246 46 246 56 186] [240 1] [0 196 254 57 137 175 0 220 55] [240 3] [0 2]]",
        "ProcessID": 24612
      },
      {
        "Cycles": 0,
        "Agent": "Execution-Sleep",
        "ProcessName": "Read",
        "TaskID": "19DED3F62EF638BA",
        "ParentEventID": [
          "A903AB092D7D0396"
        ],
        "Label": "waited",
        "Title": "X-Trace Task",
        "Host": "pinky19.mpi-sws.org",
        "Duration": "869572",
        "HRT": 26966783864146211,
        "Operation": "waited",
        "Timestamp": "1557750423804.431152",
        "TenantClass": 0,
        "Source": "SocketIOWithTimeout.java:335",
        "ThreadID": 1,
        "ThreadName": "",
        "EventID": "445194B3400943FF",
        "ProcessID": 2801
      },
      {
        "Cycles": 0,
        "Agent": "edu.brown.cs.systems.xtrace.logging.BaggageWrappers",
        "ProcessName": "Read",
        "TaskID": "19DED3F62EF638BA",
        "ParentEventID": [
          "445194B3400943FF",
          "5E708852D241AB67"
        ],
        "Label": "Merged current baggage with other baggage",
        "Title": "X-Trace Task",
        "Host": "pinky19.mpi-sws.org",
        "HRT": 26966783864199069,
        "Operation": "join",
        "Timestamp": "1557750423804.484131",
        "TenantClass": 0,
        "Source": "RemoteBlockReader2.java:429",
        "ThreadID": 1,
        "ThreadName": "",
        "EventID": "E98585D4DC701E96",
        "ProcessID": 2801
      },
      {
        "Cycles": 0,
        "Agent": "edu.brown.cs.systems.xtrace.logging.BaggageWrappers",
        "ProcessName": "Data",
        "TaskID": "19DED3F62EF638BA",
        "ParentEventID": [
          "5E708852D241AB67"
        ],
        "Label": "Forking current baggage with Baggage.fork()",
        "Title": "X-Trace Task",
        "Host": "pinky23.mpi-sws.org",
        "HRT": 12368279837705557,
        "Operation": "fork",
        "Timestamp": "1557750423804.386719",
        "TenantClass": 0,
        "Source": "PacketHeader.java:95",
        "ThreadID": 16300,
        "ThreadName": "",
        "EventID": "494DDC1AC2CDD522",
        "BaggageBytes": "[[248 5] [240 0] [0 25 222 211 246 46 246 56 186] [240 1] [0 94 112 136 82 210 65 171 103] [240 3] [0 2]]",
        "ProcessID": 24612
      },
      {
        "Cycles": 0,
        "Agent": "Execution-Sleep",
        "ProcessName": "Data",
        "TaskID": "19DED3F62EF638BA",
        "ParentEventID": [
          "494DDC1AC2CDD522"
        ],
        "Label": "waited",
        "Title": "X-Trace Task",
        "Host": "pinky23.mpi-sws.org",
        "Duration": "11904",
        "HRT": 12368279837872971,
        "Operation": "waited",
        "Timestamp": "1557750423804.553955",
        "TenantClass": 0,
        "Source": "SocketIOWithTimeout.java:335",
        "ThreadID": 16300,
        "ThreadName": "",
        "EventID": "A83C0E4D857FE67F",
        "BaggageBytes": "[[248 5] [240 0] [0 25 222 211 246 46 246 56 186] [240 1] [0 73 77 220 26 194 205 213 34] [240 3] [0 2]]",
        "ProcessID": 24612
      },
      {
        "Cycles": 0,
        "Agent": "Execution-Sleep",
        "ProcessName": "Read",
        "TaskID": "19DED3F62EF638BA",
        "ParentEventID": [
          "E98585D4DC701E96"
        ],
        "Label": "waited",
        "Title": "X-Trace Task",
        "Host": "pinky19.mpi-sws.org",
        "Duration": "72544",
        "HRT": 26966783864306238,
        "Operation": "waited",
        "Timestamp": "1557750423804.591309",
        "TenantClass": 0,
        "Source": "SocketIOWithTimeout.java:335",
        "ThreadID": 1,
        "ThreadName": "",
        "EventID": "57803916466CBF72",
        "ProcessID": 2801
      },
      {
        "Cycles": 0,
        "Agent": "edu.brown.cs.systems.xtrace.logging.BaggageWrappers",
        "ProcessName": "Data",
        "TaskID": "19DED3F62EF638BA",
        "ParentEventID": [
          "A83C0E4D857FE67F"
        ],
        "Label": "Forking current baggage with Baggage.fork()",
        "Title": "X-Trace Task",
        "Host": "pinky23.mpi-sws.org",
        "HRT": 12368279838089821,
        "Operation": "fork",
        "Timestamp": "1557750423804.770996",
        "TenantClass": 0,
        "Source": "PacketHeader.java:95",
        "ThreadID": 16300,
        "ThreadName": "",
        "EventID": "B893263915498F1A",
        "BaggageBytes": "[[248 5] [240 0] [0 25 222 211 246 46 246 56 186] [240 1] [0 168 60 14 77 133 127 230 127] [240 3] [0 2]]",
        "ProcessID": 24612
      },
      {
        "Cycles": 0,
        "Agent": "Execution-Sleep",
        "ProcessName": "Read",
        "TaskID": "19DED3F62EF638BA",
        "ParentEventID": [
          "138898B2F6A653A7"
        ],
        "Label": "waited",
        "Title": "X-Trace Task",
        "Host": "pinky19.mpi-sws.org",
        "Duration": "149401",
        "HRT": 26966783864967834,
        "Operation": "waited",
        "Timestamp": "1557750423805.252930",
        "TenantClass": 0,
        "Source": "SocketIOWithTimeout.java:335",
        "ThreadID": 1,
        "ThreadName": "",
        "EventID": "2C84A10F6735D6C8",
        "ProcessID": 2801
      },
      {
        "Cycles": 0,
        "Agent": "Execution-Sleep",
        "ProcessName": "Read",
        "TaskID": "19DED3F62EF638BA",
        "ParentEventID": [
          "57803916466CBF72"
        ],
        "Label": "waited",
        "Title": "X-Trace Task",
        "Host": "pinky19.mpi-sws.org",
        "Duration": "390035",
        "HRT": 26966783864757340,
        "Operation": "waited",
        "Timestamp": "1557750423805.042480",
        "TenantClass": 0,
        "Source": "SocketIOWithTimeout.java:335",
        "ThreadID": 1,
        "ThreadName": "",
        "EventID": "138898B2F6A653A7",
        "ProcessID": 2801
      },
      {
        "Cycles": 0,
        "Agent": "Execution-Sleep",
        "ProcessName": "Data",
        "TaskID": "19DED3F62EF638BA",
        "ParentEventID": [
          "B893263915498F1A"
        ],
        "Label": "waited",
        "Title": "X-Trace Task",
        "Host": "pinky23.mpi-sws.org",
        "Duration": "179800",
        "HRT": 12368279838394612,
        "Operation": "waited",
        "Timestamp": "1557750423805.075684",
        "TenantClass": 0,
        "Source": "SocketIOWithTimeout.java:335",
        "ThreadID": 16300,
        "ThreadName": "",
        "EventID": "F5CB08813C4513DD",
        "BaggageBytes": "[[248 5] [240 0] [0 25 222 211 246 46 246 56 186] [240 1] [0 184 147 38 57 21 73 143 26] [240 3] [0 2]]",
        "ProcessID": 24612
      },
      {
        "Cycles": 0,
        "Agent": "edu.brown.cs.systems.xtrace.logging.BaggageWrappers",
        "ProcessName": "Data",
        "TaskID": "19DED3F62EF638BA",
        "ParentEventID": [
          "F5CB08813C4513DD"
        ],
        "Label": "Forking current baggage with Baggage.fork()",
        "Title": "X-Trace Task",
        "Host": "pinky23.mpi-sws.org",
        "HRT": 12368279838539199,
        "Operation": "fork",
        "Timestamp": "1557750423805.220215",
        "TenantClass": 0,
        "Source": "PacketHeader.java:95",
        "ThreadID": 16300,
        "ThreadName": "",
        "EventID": "348C654661C29C3D",
        "BaggageBytes": "[[248 5] [240 0] [0 25 222 211 246 46 246 56 186] [240 1] [0 245 203 8 129 60 69 19 221] [240 3] [0 2]]",
        "ProcessID": 24612
      },
      {
        "Cycles": 0,
        "Agent": "Execution-Sleep",
        "ProcessName": "Read",
        "TaskID": "19DED3F62EF638BA",
        "ParentEventID": [
          "2C84A10F6735D6C8"
        ],
        "Label": "waited",
        "Title": "X-Trace Task",
        "Host": "pinky19.mpi-sws.org",
        "Duration": "143336",
        "HRT": 26966783865170938,
        "Operation": "waited",
        "Timestamp": "1557750423805.456055",
        "TenantClass": 0,
        "Source": "SocketIOWithTimeout.java:335",
        "ThreadID": 1,
        "ThreadName": "",
        "EventID": "D583968DA2BA5345",
        "ProcessID": 2801
      },
      {
        "Cycles": 0,
        "Agent": "Execution-Sleep",
        "ProcessName": "Read",
        "TaskID": "19DED3F62EF638BA",
        "ParentEventID": [
          "D583968DA2BA5345"
        ],
        "Label": "waited",
        "Title": "X-Trace Task",
        "Host": "pinky19.mpi-sws.org",
        "Duration": "234209",
        "HRT": 26966783865448560,
        "Operation": "waited",
        "Timestamp": "1557750423805.733643",
        "TenantClass": 0,
        "Source": "SocketIOWithTimeout.java:335",
        "ThreadID": 1,
        "ThreadName": "",
        "EventID": "5344E4F94A3734C3",
        "ProcessID": 2801
      },
      {
        "Cycles": 0,
        "Agent": "Execution-Sleep",
        "ProcessName": "Data",
        "TaskID": "19DED3F62EF638BA",
        "ParentEventID": [
          "348C654661C29C3D"
        ],
        "Label": "waited",
        "Title": "X-Trace Task",
        "Host": "pinky23.mpi-sws.org",
        "Duration": "9686",
        "HRT": 12368279838665695,
        "Operation": "waited",
        "Timestamp": "1557750423805.346680",
        "TenantClass": 0,
        "Source": "SocketIOWithTimeout.java:335",
        "ThreadID": 16300,
        "ThreadName": "",
        "EventID": "EE4B9F5749ED050F",
        "BaggageBytes": "[[248 5] [240 0] [0 25 222 211 246 46 246 56 186] [240 1] [0 52 140 101 70 97 194 156 61] [240 3] [0 2]]",
        "ProcessID": 24612
      },
      {
        "Cycles": 0,
        "Agent": "edu.brown.cs.systems.xtrace.logging.BaggageWrappers",
        "ProcessName": "Data",
        "TaskID": "19DED3F62EF638BA",
        "ParentEventID": [
          "EE4B9F5749ED050F"
        ],
        "Label": "Forking current baggage with Baggage.fork()",
        "Title": "X-Trace Task",
        "Host": "pinky23.mpi-sws.org",
        "HRT": 12368279838905263,
        "Operation": "fork",
        "Timestamp": "1557750423805.586426",
        "TenantClass": 0,
        "Source": "PacketHeader.java:95",
        "ThreadID": 16300,
        "ThreadName": "",
        "EventID": "D695D8B2F9ACF618",
        "BaggageBytes": "[[248 5] [240 0] [0 25 222 211 246 46 246 56 186] [240 1] [0 238 75 159 87 73 237 5 15] [240 3] [0 2]]",
        "ProcessID": 24612
      },
      {
        "Cycles": 0,
        "Agent": "edu.brown.cs.systems.xtrace.logging.BaggageWrappers",
        "ProcessName": "Read",
        "TaskID": "19DED3F62EF638BA",
        "ParentEventID": [
          "494DDC1AC2CDD522",
          "5344E4F94A3734C3"
        ],
        "Label": "Merged current baggage with other baggage",
        "Title": "X-Trace Task",
        "Host": "pinky19.mpi-sws.org",
        "HRT": 26966783865504229,
        "Operation": "join",
        "Timestamp": "1557750423805.789307",
        "TenantClass": 0,
        "Source": "PacketHeader.java:168",
        "ThreadID": 1,
        "ThreadName": "",
        "EventID": "165F8EC99567369D",
        "ProcessID": 2801
      },
      {
        "Cycles": 0,
        "Agent": "Execution-Sleep",
        "ProcessName": "Data",
        "TaskID": "19DED3F62EF638BA",
        "ParentEventID": [
          "D695D8B2F9ACF618"
        ],
        "Label": "waited",
        "Title": "X-Trace Task",
        "Host": "pinky23.mpi-sws.org",
        "Duration": "159733",
        "HRT": 12368279839212380,
        "Operation": "waited",
        "Timestamp": "1557750423805.893555",
        "TenantClass": 0,
        "Source": "SocketIOWithTimeout.java:335",
        "ThreadID": 16300,
        "ThreadName": "",
        "EventID": "4C43D0A28B901285",
        "BaggageBytes": "[[248 5] [240 0] [0 25 222 211 246 46 246 56 186] [240 1] [0 214 149 216 178 249 172 246 24] [240 3] [0 2]]",
        "ProcessID": 24612
      },
      {
        "Cycles": 0,
        "Agent": "Execution-CPU",
        "ProcessName": "Data",
        "TaskID": "19DED3F62EF638BA",
        "ParentEventID": [
          "4C43D0A28B901285"
        ],
        "Label": "unset",
        "Title": "X-Trace Task",
        "Host": "pinky23.mpi-sws.org",
        "Duration": "2413464",
        "HRT": 12368279839669744,
        "Operation": "unset",
        "Timestamp": "1557750423806.350830",
        "TenantClass": 0,
        "Source": "DataXceiver.java:261",
        "ThreadID": 16300,
        "ThreadName": "",
        "EventID": "69805A36684CC9EC",
        "BaggageBytes": "[[248 5] [240 0] [0 25 222 211 246 46 246 56 186] [240 1] [0 76 67 208 162 139 144 18 133] [240 3] [0 2]]",
        "ProcessID": 24612
      },
      {
        "Cycles": 0,
        "Agent": "edu.brown.cs.systems.retro.benchmarks.hdfs_client.Reader",
        "ProcessName": "Read",
        "TaskID": "19DED3F62EF638BA",
        "ParentEventID": [
          "0"
        ],
        "Label": "Reading file",
        "Title": "X-Trace Task",
        "Host": "pinky19.mpi-sws.org",
        "HRT": 26966783859921716,
        "Timestamp": "1557750423800.206787",
        "TenantClass": 0,
        "ThreadID": 1,
        "ThreadName": "",
        "EventID": "820CCC0D274765D8",
        "ProcessID": 2801,
        "Tag": [
          "reader_100kb",
          "Read Size: 102400"
        ]
      }
    ]
  }
]