[
  {
    "id": "5A3CEA749BED754B",
    "reports": [
      {
        "Cycles": 0,
        "Agent": "org.apache.hadoop.ipc.ProtobufRpcEngine",
        "ProcessName": "Read",
        "TaskID": "5A3CEA749BED754B",
        "ParentEventID": [
          "B5005FC488CD97F2"
        ],
        "Label": "Invoking org.apache.hadoop.hdfs.protocol.ClientProtocol.getBlockLocations",
        "Title": "X-Trace Task",
        "Host": "pinky19.mpi-sws.org",
        "HRT": 26962483760172238,
        "Timestamp": "1557746123700.259766",
        "TenantClass": 0,
        "Source": "ProtobufRpcEngine.java:228",
        "ThreadID": 1,
        "ThreadName": "",
        "EventID": "73883A363CC62F7E",
        "ProcessID": 36430
      },
      {
        "Cycles": 0,
        "Agent": "edu.brown.cs.systems.retro.benchmarks.hdfs_client.Reader",
        "ProcessName": "Read",
        "TaskID": "5A3CEA749BED754B",
        "ParentEventID": [
          "D8625266D01E68DD"
        ],
        "Label": "Reading file",
        "Title": "X-Trace Task",
        "Host": "pinky19.mpi-sws.org",
        "HRT": 26962483760117995,
        "Timestamp": "1557746123700.205566",
        "TenantClass": 0,
        "ThreadID": 1,
        "ThreadName": "",
        "EventID": "B5005FC488CD97F2",
        "ProcessID": 36430
      },
      {
        "Cycles": 0,
        "Agent": "edu.brown.cs.systems.retro.benchmarks.hdfs_client.Reader",
        "ProcessName": "Read",
        "TaskID": "5A3CEA749BED754B",
        "ParentEventID": [
          "0"
        ],
        "Label": "Reading file",
        "Title": "X-Trace Task",
        "Host": "pinky19.mpi-sws.org",
        "HRT": 26962483760057971,
        "Timestamp": "1557746123700.145508",
        "TenantClass": 0,
        "ThreadID": 1,
        "ThreadName": "",
        "EventID": "D8625266D01E68DD",
        "ProcessID": 36430,
        "Tag": [
          "reader_10kb",
          "Read Size: 10240"
        ]
      },
      {
        "Cycles": 0,
        "Agent": "Execution-CPU",
        "ProcessName": "Read",
        "TaskID": "5A3CEA749BED754B",
        "ParentEventID": [
          "73883A363CC62F7E"
        ],
        "Label": "unset",
        "Title": "X-Trace Task",
        "Host": "pinky19.mpi-sws.org",
        "Duration": "22247994",
        "HRT": 26962483760215938,
        "Operation": "unset",
        "Timestamp": "1557746123700.303467",
        "TenantClass": 0,
        "Source": "Client.java:1027",
        "ThreadID": 1,
        "ThreadName": "",
        "EventID": "3300DA434F909784",
        "ProcessID": 36430
      },
      {
        "Cycles": 0,
        "Agent": "Execution-CPU",
        "ProcessName": "Read",
        "TaskID": "5A3CEA749BED754B",
        "ParentEventID": [
          "3300DA434F909784"
        ],
        "Label": "set",
        "Title": "X-Trace Task",
        "Host": "pinky19.mpi-sws.org",
        "HRT": 26962483760243830,
        "Operation": "set",
        "Timestamp": "1557746123700.331299",
        "TenantClass": 0,
        "Source": "Client.java:1032",
        "ThreadID": 41,
        "ThreadName": "",
        "EventID": "7FE8484ACF1695AB",
        "ProcessID": 36430
      },
      {
        "Cycles": 0,
        "Agent": "edu.brown.cs.systems.xtrace.logging.BaggageWrappers",
        "ProcessName": "Read",
        "TaskID": "5A3CEA749BED754B",
        "ParentEventID": [
          "7FE8484ACF1695AB"
        ],
        "Label": "Forking current baggage with Baggage.fork()",
        "Title": "X-Trace Task",
        "Host": "pinky19.mpi-sws.org",
        "HRT": 26962483760266496,
        "Operation": "fork",
        "Timestamp": "1557746123700.354004",
        "TenantClass": 0,
        "Source": "Client.java:1043",
        "ThreadID": 41,
        "ThreadName": "",
        "EventID": "F237C3D04C0B20CB",
        "ProcessID": 36430
      },
      {
        "Cycles": 0,
        "Agent": "Execution-CPU",
        "ProcessName": "Read",
        "TaskID": "5A3CEA749BED754B",
        "ParentEventID": [
          "F237C3D04C0B20CB"
        ],
        "Label": "unset",
        "Title": "X-Trace Task",
        "Host": "pinky19.mpi-sws.org",
        "Duration": "69266",
        "HRT": 26962483760333980,
        "Operation": "unset",
        "Timestamp": "1557746123700.421631",
        "TenantClass": 0,
        "Source": "Client.java:1062",
        "ThreadID": 41,
        "ThreadName": "",
        "EventID": "0CAD2E3E65DFD7E8",
        "ProcessID": 36430
      },
      {
        "Cycles": 0,
        "Agent": "Execution-CPU",
        "ProcessName": "Name",
        "TaskID": "5A3CEA749BED754B",
        "ParentEventID": [
          "F237C3D04C0B20CB"
        ],
        "Label": "set",
        "Title": "X-Trace Task",
        "Host": "pinky19.mpi-sws.org",
        "HRT": 26962483760390230,
        "Operation": "set",
        "Timestamp": "1557746123700.490234",
        "TenantClass": 0,
        "Source": "Server.java:1840",
        "ThreadID": 48,
        "ThreadName": "",
        "EventID": "D3466D614A6CEC4D",
        "BaggageBytes": "[[248 5] [240 0] [0 90 60 234 116 155 237 117 75] [240 1] [0 242 55 195 208 76 11 32 203] [240 3] [0 2]]",
        "ProcessID": 2171
      },
      {
        "Cycles": 0,
        "Agent": "Execution-CPU",
        "ProcessName": "Read",
        "TaskID": "5A3CEA749BED754B",
        "ParentEventID": [
          "0CAD2E3E65DFD7E8"
        ],
        "Label": "set",
        "Title": "X-Trace Task",
        "Host": "pinky19.mpi-sws.org",
        "HRT": 26962483760362195,
        "Operation": "set",
        "Timestamp": "1557746123700.449707",
        "TenantClass": 0,
        "Source": "Client.java:1104",
        "ThreadID": 1,
        "ThreadName": "",
        "EventID": "82FF5F5E9F949941",
        "ProcessID": 36430
      },
      {
        "Cycles": 0,
        "Agent": "edu.brown.cs.systems.xtrace.logging.BaggageWrappers",
        "ProcessName": "Name",
        "TaskID": "5A3CEA749BED754B",
        "ParentEventID": [
          "D3466D614A6CEC4D"
        ],
        "Label": "Forking current baggage with Baggage.fork()",
        "Title": "X-Trace Task",
        "Host": "pinky19.mpi-sws.org",
        "HRT": 26962483760426258,
        "Operation": "fork",
        "Timestamp": "1557746123700.526367",
        "TenantClass": 0,
        "Source": "Server.java:550",
        "ThreadID": 48,
        "ThreadName": "",
        "EventID": "AF9078B2D45FFBE8",
        "BaggageBytes": "[[248 5] [240 0] [0 90 60 234 116 155 237 117 75] [240 1] [0 211 70 109 97 74 108 236 77] [240 3] [0 2]]",
        "ProcessID": 2171
      },
      {
        "Cycles": 0,
        "Agent": "Execution-CPU",
        "ProcessName": "Name",
        "TaskID": "5A3CEA749BED754B",
        "ParentEventID": [
          "AF9078B2D45FFBE8"
        ],
        "Label": "set",
        "Title": "X-Trace Task",
        "Host": "pinky19.mpi-sws.org",
        "HRT": 26962483760455220,
        "Operation": "set",
        "Timestamp": "1557746123700.555176",
        "TenantClass": 0,
        "Source": "Server.java:2071",
        "ThreadID": 56,
        "ThreadName": "",
        "EventID": "8A501F842C93EF89",
        "BaggageBytes": "[[248 5] [240 0] [0 90 60 234 116 155 237 117 75] [240 1] [0 175 144 120 178 212 95 251 232] [240 3] [0 2]]",
        "ProcessID": 2171
      },
      {
        "Cycles": 0,
        "Agent": "Execution-CPU",
        "ProcessName": "Name",
        "TaskID": "5A3CEA749BED754B",
        "ParentEventID": [
          "AF9078B2D45FFBE8"
        ],
        "Label": "unset",
        "Title": "X-Trace Task",
        "Host": "pinky19.mpi-sws.org",
        "Duration": "31980",
        "HRT": 26962483760447761,
        "Operation": "unset",
        "Timestamp": "1557746123700.547852",
        "TenantClass": 0,
        "Source": "Server.java:1828",
        "ThreadID": 48,
        "ThreadName": "",
        "EventID": "AB453598E15A5443",
        "BaggageBytes": "[[248 5] [240 0] [0 90 60 234 116 155 237 117 75] [240 1] [0 175 144 120 178 212 95 251 232] [240 3] [0 2]]",
        "ProcessID": 2171
      },
      {
        "Cycles": 0,
        "Agent": "org.apache.hadoop.ipc.Server",
        "ProcessName": "Name",
        "TaskID": "5A3CEA749BED754B",
        "ParentEventID": [
          "8A501F842C93EF89"
        ],
        "Label": "getBlockLocations in org.apache.hadoop.hdfs.protocol.ClientProtocol",
        "Title": "X-Trace Task",
        "Host": "pinky19.mpi-sws.org",
        "HRT": 26962483760488175,
        "Timestamp": "1557746123700.588135",
        "TenantClass": 0,
        "Source": "ProtobufRpcEngine.java:601",
        "ThreadID": 56,
        "ThreadName": "",
        "EventID": "496A2FF09FDE2EA7",
        "BaggageBytes": "[[248 5] [240 0] [0 90 60 234 116 155 237 117 75] [240 1] [0 138 80 31 132 44 147 239 137] [240 3] [0 2]]",
        "ProcessID": 2171
      },
      {
        "Cycles": 0,
        "Agent": "edu.brown.cs.systems.xtrace.logging.BaggageWrappers",
        "ProcessName": "Name",
        "TaskID": "5A3CEA749BED754B",
        "ParentEventID": [
          "32C3257DA6DCD7E1"
        ],
        "Label": "Forking current baggage with Baggage.fork()",
        "Title": "X-Trace Task",
        "Host": "pinky19.mpi-sws.org",
        "HRT": 26962483760597986,
        "Operation": "fork",
        "Timestamp": "1557746123700.697998",
        "TenantClass": 0,
        "Source": "Server.java:2398",
        "ThreadID": 56,
        "ThreadName": "",
        "EventID": "2DD230B83AC401ED",
        "BaggageBytes": "[[248 5] [240 0] [0 90 60 234 116 155 237 117 75] [240 1] [0 50 195 37 125 166 220 215 225] [240 3] [0 2]]",
        "ProcessID": 2171
      },
      {
        "Cycles": 0,
        "Agent": "Execution-CPU",
        "ProcessName": "Name",
        "TaskID": "5A3CEA749BED754B",
        "ParentEventID": [
          "2DD230B83AC401ED"
        ],
        "Label": "unset",
        "Title": "X-Trace Task",
        "Host": "pinky19.mpi-sws.org",
        "Duration": "225441",
        "HRT": 26962483760701969,
        "Operation": "unset",
        "Timestamp": "1557746123700.802002",
        "TenantClass": 0,
        "Source": "Server.java:1058",
        "ThreadID": 56,
        "ThreadName": "",
        "EventID": "5BA93A6849B8DA38",
        "BaggageBytes": "[[248 5] [240 0] [0 90 60 234 116 155 237 117 75] [240 1] [0 45 210 48 184 58 196 1 237] [240 3] [0 2]]",
        "ProcessID": 2171
      },
      {
        "Cycles": 0,
        "Agent": "Execution-CPU",
        "ProcessName": "Read",
        "TaskID": "5A3CEA749BED754B",
        "ParentEventID": [
          "2DD230B83AC401ED"
        ],
        "Label": "set",
        "Title": "X-Trace Task",
        "Host": "pinky19.mpi-sws.org",
        "HRT": 26962483760746425,
        "Operation": "set",
        "Timestamp": "1557746123700.833984",
        "TenantClass": 0,
        "Source": "Client.java:302",
        "ThreadID": 37,
        "ThreadName": "",
        "EventID": "CB6D670C959EEA51",
        "ProcessID": 36430
      },
      {
        "Cycles": 0,
        "Agent": "Execution-CPU",
        "ProcessName": "Read",
        "TaskID": "5A3CEA749BED754B",
        "ParentEventID": [
          "CB6D670C959EEA51"
        ],
        "Label": "unset",
        "Title": "X-Trace Task",
        "Host": "pinky19.mpi-sws.org",
        "Duration": "9807",
        "HRT": 26962483760768268,
        "Operation": "unset",
        "Timestamp": "1557746123700.855713",
        "TenantClass": 0,
        "Source": "Client.java:1168",
        "ThreadID": 37,
        "ThreadName": "",
        "EventID": "00BD7EEC661FCFF8",
        "ProcessID": 36430
      },
      {
        "Cycles": 0,
        "Agent": "org.apache.hadoop.hdfs.server.namenode.FSNamesystem.audit",
        "ProcessName": "Name",
        "TaskID": "5A3CEA749BED754B",
        "ParentEventID": [
          "496A2FF09FDE2EA7"
        ],
        "Label": "allowed=true\tugi=plascas (auth:SIMPLE)\tip=/139.19.171.63\tcmd=open\tsrc=/ds/znDFBzpadYgstQs9\tdst=null\tperm=null\tproto=rpc",
        "Title": "X-Trace Task",
        "Host": "pinky19.mpi-sws.org",
        "HRT": 26962483760536207,
        "Timestamp": "1557746123700.636230",
        "TenantClass": 0,
        "Source": "FSNamesystem.java:8313",
        "ThreadID": 56,
        "ThreadName": "",
        "EventID": "32C3257DA6DCD7E1",
        "BaggageBytes": "[[248 5] [240 0] [0 90 60 234 116 155 237 117 75] [240 1] [0 73 106 47 240 159 222 46 167] [240 3] [0 2]]",
        "ProcessID": 2171
      },
      {
        "Cycles": 0,
        "Agent": "Execution-Sleep",
        "ProcessName": "Read",
        "TaskID": "5A3CEA749BED754B",
        "ParentEventID": [
          "82FF5F5E9F949941"
        ],
        "Label": "waited",
        "Title": "X-Trace Task",
        "Host": "pinky19.mpi-sws.org",
        "Duration": "398947",
        "HRT": 26962483760785009,
        "Operation": "waited",
        "Timestamp": "1557746123700.872559",
        "TenantClass": 0,
        "Source": "Client.java:1537",
        "ThreadID": 1,
        "ThreadName": "",
        "EventID": "A4CB602D0C06EE27",
        "ProcessID": 36430
      },
      {
        "Cycles": 0,
        "Agent": "org.apache.hadoop.ipc.ProtobufRpcEngine",
        "ProcessName": "Read",
        "TaskID": "5A3CEA749BED754B",
        "ParentEventID": [
          "C0AF24ABC9B358BE"
        ],
        "Label": "org.apache.hadoop.hdfs.protocol.ClientProtocol.getBlockLocations completed",
        "Title": "X-Trace Task",
        "Host": "pinky19.mpi-sws.org",
        "HRT": 26962483760881883,
        "Timestamp": "1557746123700.969482",
        "TenantClass": 0,
        "Source": "ProtobufRpcEngine.java:275",
        "ThreadID": 1,
        "ThreadName": "",
        "EventID": "61C69FE1BD6DFB8A",
        "ProcessID": 36430
      },
      {
        "Cycles": 0,
        "Agent": "edu.brown.cs.systems.xtrace.logging.BaggageWrappers",
        "ProcessName": "Read",
        "TaskID": "5A3CEA749BED754B",
        "ParentEventID": [
          "00BD7EEC661FCFF8",
          "A4CB602D0C06EE27"
        ],
        "Label": "Merged current baggage with other baggage",
        "Title": "X-Trace Task",
        "Host": "pinky19.mpi-sws.org",
        "HRT": 26962483760809798,
        "Operation": "join",
        "Timestamp": "1557746123700.897461",
        "TenantClass": 0,
        "Source": "Client.java:1545",
        "ThreadID": 1,
        "ThreadName": "",
        "EventID": "C0AF24ABC9B358BE",
        "ProcessID": 36430
      },
      {
        "Cycles": 0,
        "Agent": "Execution-CPU",
        "ProcessName": "Data",
        "TaskID": "5A3CEA749BED754B",
        "ParentEventID": [
          "5F3083855D69F57B"
        ],
        "Label": "set",
        "Title": "X-Trace Task",
        "Host": "pinky19.mpi-sws.org",
        "HRT": 26962483761141506,
        "Operation": "set",
        "Timestamp": "1557746123701.300293",
        "TenantClass": 0,
        "Source": "Receiver.java:117",
        "ThreadID": 36633,
        "ThreadName": "",
        "EventID": "D1992785F01D5C20",
        "BaggageBytes": "[[248 5] [240 0] [0 90 60 234 116 155 237 117 75] [240 1] [0 95 48 131 133 93 105 245 123] [240 3] [0 2]]",
        "ProcessID": 2319
      },
      {
        "Cycles": 0,
        "Agent": "edu.brown.cs.systems.xtrace.logging.BaggageWrappers",
        "ProcessName": "Read",
        "TaskID": "5A3CEA749BED754B",
        "ParentEventID": [
          "61C69FE1BD6DFB8A"
        ],
        "Label": "Forking current baggage with Baggage.fork()",
        "Title": "X-Trace Task",
        "Host": "pinky19.mpi-sws.org",
        "HRT": 26962483760964446,
        "Operation": "fork",
        "Timestamp": "1557746123701.052002",
        "TenantClass": 0,
        "Source": "DataTransferProtoUtil.java:94",
        "ThreadID": 1,
        "ThreadName": "",
        "EventID": "5F3083855D69F57B",
        "ProcessID": 36430
      },
      {
        "Cycles": 0,
        "Agent": "edu.brown.cs.systems.xtrace.logging.XTraceInit",
        "ProcessName": "Data",
        "TaskID": "5A3CEA749BED754B",
        "ParentEventID": [
          "D1992785F01D5C20"
        ],
        "Label": "Thread.setName: DataXceiver for client DFSClient_NONMAPREDUCE_778905418_1 at /139.19.171.63:43130 [Sending block BP-1633380353-139.19.171.63-1554193446451:blk_1073761491_20667]",
        "Title": "X-Trace Task",
        "Host": "pinky19.mpi-sws.org",
        "HRT": 26962483761197946,
        "Timestamp": "1557746123701.356934",
        "TenantClass": 0,
        "Source": "DataXceiver.java:168",
        "ThreadID": 36633,
        "ThreadName": "",
        "EventID": "97164DBEB8598587",
        "BaggageBytes": "[[248 5] [240 0] [0 90 60 234 116 155 237 117 75] [240 1] [0 209 153 39 133 240 29 92 32] [240 3] [0 2]]",
        "ProcessID": 2319
      },
      {
        "Cycles": 0,
        "Agent": "Execution-Sleep",
        "ProcessName": "Read",
        "TaskID": "5A3CEA749BED754B",
        "ParentEventID": [
          "5F3083855D69F57B"
        ],
        "Label": "waited",
        "Title": "X-Trace Task",
        "Host": "pinky19.mpi-sws.org",
        "Duration": "268783",
        "HRT": 26962483761374231,
        "Operation": "waited",
        "Timestamp": "1557746123701.461670",
        "TenantClass": 0,
        "Source": "SocketIOWithTimeout.java:335",
        "ThreadID": 1,
        "ThreadName": "",
        "EventID": "A9C87CD011964387",
        "ProcessID": 36430
      },
      {
        "Cycles": 0,
        "Agent": "edu.brown.cs.systems.xtrace.logging.BaggageWrappers",
        "ProcessName": "Data",
        "TaskID": "5A3CEA749BED754B",
        "ParentEventID": [
          "97164DBEB8598587"
        ],
        "Label": "Forking current baggage with Baggage.fork()",
        "Title": "X-Trace Task",
        "Host": "pinky19.mpi-sws.org",
        "HRT": 26962483761297978,
        "Operation": "fork",
        "Timestamp": "1557746123701.456787",
        "TenantClass": 0,
        "Source": "DataXceiver.java:1257",
        "ThreadID": 36633,
        "ThreadName": "",
        "EventID": "657E5099D3A98638",
        "BaggageBytes": "[[248 5] [240 0] [0 90 60 234 116 155 237 117 75] [240 1] [0 151 22 77 190 184 89 133 135] [240 3] [0 2]]",
        "ProcessID": 2319
      },
      {
        "Cycles": 0,
        "Agent": "edu.brown.cs.systems.xtrace.logging.BaggageWrappers",
        "ProcessName": "Data",
        "TaskID": "5A3CEA749BED754B",
        "ParentEventID": [
          "657E5099D3A98638"
        ],
        "Label": "Forking current baggage with Baggage.fork()",
        "Title": "X-Trace Task",
        "Host": "pinky19.mpi-sws.org",
        "HRT": 26962483761378863,
        "Operation": "fork",
        "Timestamp": "1557746123701.537842",
        "TenantClass": 0,
        "Source": "PacketHeader.java:95",
        "ThreadID": 36633,
        "ThreadName": "",
        "EventID": "10AB90942CBF347E",
        "BaggageBytes": "[[248 5] [240 0] [0 90 60 234 116 155 237 117 75] [240 1] [0 101 126 80 153 211 169 134 56] [240 3] [0 2]]",
        "ProcessID": 2319
      },
      {
        "Cycles": 0,
        "Agent": "Execution-Sleep",
        "ProcessName": "Data",
        "TaskID": "5A3CEA749BED754B",
        "ParentEventID": [
          "10AB90942CBF347E"
        ],
        "Label": "waited",
        "Title": "X-Trace Task",
        "Host": "pinky19.mpi-sws.org",
        "Duration": "5553",
        "HRT": 26962483761467738,
        "Operation": "waited",
        "Timestamp": "1557746123701.626709",
        "TenantClass": 0,
        "Source": "SocketIOWithTimeout.java:335",
        "ThreadID": 36633,
        "ThreadName": "",
        "EventID": "AA69F6CC2E8AF655",
        "BaggageBytes": "[[248 5] [240 0] [0 90 60 234 116 155 237 117 75] [240 1] [0 16 171 144 148 44 191 52 126] [240 3] [0 2]]",
        "ProcessID": 2319
      },
      {
        "Cycles": 0,
        "Agent": "edu.brown.cs.systems.xtrace.logging.BaggageWrappers",
        "ProcessName": "Data",
        "TaskID": "5A3CEA749BED754B",
        "ParentEventID": [
          "AA69F6CC2E8AF655"
        ],
        "Label": "Forking current baggage with Baggage.fork()",
        "Title": "X-Trace Task",
        "Host": "pinky19.mpi-sws.org",
        "HRT": 26962483761560845,
        "Operation": "fork",
        "Timestamp": "1557746123701.719727",
        "TenantClass": 0,
        "Source": "PacketHeader.java:95",
        "ThreadID": 36633,
        "ThreadName": "",
        "EventID": "EA022FA55F6ABAFD",
        "BaggageBytes": "[[248 5] [240 0] [0 90 60 234 116 155 237 117 75] [240 1] [0 170 105 246 204 46 138 246 85] [240 3] [0 2]]",
        "ProcessID": 2319
      },
      {
        "Cycles": 0,
        "Agent": "edu.brown.cs.systems.xtrace.logging.BaggageWrappers",
        "ProcessName": "Read",
        "TaskID": "5A3CEA749BED754B",
        "ParentEventID": [
          "657E5099D3A98638",
          "A9C87CD011964387"
        ],
        "Label": "Merged current baggage with other baggage",
        "Title": "X-Trace Task",
        "Host": "pinky19.mpi-sws.org",
        "HRT": 26962483761654701,
        "Operation": "join",
        "Timestamp": "1557746123701.742188",
        "TenantClass": 0,
        "Source": "RemoteBlockReader2.java:429",
        "ThreadID": 1,
        "ThreadName": "",
        "EventID": "59A012BFE8C5B1DE",
        "ProcessID": 36430
      },
      {
        "Cycles": 0,
        "Agent": "edu.brown.cs.systems.xtrace.logging.BaggageWrappers",
        "ProcessName": "Read",
        "TaskID": "5A3CEA749BED754B",
        "ParentEventID": [
          "EA022FA55F6ABAFD",
          "F30C3AD03558CE55"
        ],
        "Label": "Merged current baggage with other baggage",
        "Title": "X-Trace Task",
        "Host": "pinky19.mpi-sws.org",
        "HRT": 26962483761880307,
        "Operation": "join",
        "Timestamp": "1557746123701.967773",
        "TenantClass": 0,
        "Source": "PacketHeader.java:168",
        "ThreadID": 1,
        "ThreadName": "",
        "EventID": "99B2A8FBBBA69538",
        "ProcessID": 36430
      },
      {
        "Cycles": 0,
        "Agent": "edu.brown.cs.systems.xtrace.logging.BaggageWrappers",
        "ProcessName": "Read",
        "TaskID": "5A3CEA749BED754B",
        "ParentEventID": [
          "59A012BFE8C5B1DE",
          "10AB90942CBF347E"
        ],
        "Label": "Merged current baggage with other baggage",
        "Title": "X-Trace Task",
        "Host": "pinky19.mpi-sws.org",
        "HRT": 26962483761788773,
        "Operation": "join",
        "Timestamp": "1557746123701.876221",
        "TenantClass": 0,
        "Source": "PacketHeader.java:168",
        "ThreadID": 1,
        "ThreadName": "",
        "EventID": "F30C3AD03558CE55",
        "ProcessID": 36430
      },
      {
        "Cycles": 0,
        "Agent": "edu.brown.cs.systems.xtrace.logging.BaggageWrappers",
        "ProcessName": "Read",
        "TaskID": "5A3CEA749BED754B",
        "ParentEventID": [
          "99B2A8FBBBA69538"
        ],
        "Label": "Forking current baggage with Baggage.fork()",
        "Title": "X-Trace Task",
        "Host": "pinky19.mpi-sws.org",
        "HRT": 26962483761903594,
        "Operation": "fork",
        "Timestamp": "1557746123701.991211",
        "TenantClass": 0,
        "Source": "RemoteBlockReader2.java:361",
        "ThreadID": 1,
        "ThreadName": "",
        "EventID": "9CABA107334759DC",
        "ProcessID": 36430
      },
      {
        "Cycles": 0,
        "Agent": "edu.brown.cs.systems.xtrace.logging.BaggageWrappers",
        "ProcessName": "Data",
        "TaskID": "5A3CEA749BED754B",
        "ParentEventID": [
          "A45B5034F839CEB0",
          "9CABA107334759DC"
        ],
        "Label": "Merged current baggage with other baggage",
        "Title": "X-Trace Task",
        "Host": "pinky19.mpi-sws.org",
        "HRT": 26962483762091970,
        "Operation": "join",
        "Timestamp": "1557746123702.250977",
        "TenantClass": 0,
        "Source": "DataXceiver.java:574",
        "ThreadID": 36633,
        "ThreadName": "",
        "EventID": "AE59CED807FFECD1",
        "BaggageBytes": "[[248 5] [240 0] [0 90 60 234 116 155 237 117 75] [240 1] [0 156 171 161 7 51 71 89 220] [0 164 91 80 52 248 57 206 176] [240 3] [0 2]]",
        "ProcessID": 2319
      },
      {
        "Cycles": 0,
        "Agent": "Execution-Sleep",
        "ProcessName": "Data",
        "TaskID": "5A3CEA749BED754B",
        "ParentEventID": [
          "EA022FA55F6ABAFD"
        ],
        "Label": "waited",
        "Title": "X-Trace Task",
        "Host": "pinky19.mpi-sws.org",
        "Duration": "334030",
        "HRT": 26962483762015480,
        "Operation": "waited",
        "Timestamp": "1557746123702.174316",
        "TenantClass": 0,
        "Source": "SocketIOWithTimeout.java:335",
        "ThreadID": 36633,
        "ThreadName": "",
        "EventID": "A45B5034F839CEB0",
        "BaggageBytes": "[[248 5] [240 0] [0 90 60 234 116 155 237 117 75] [240 1] [0 234 2 47 165 95 106 186 253] [240 3] [0 2]]",
        "ProcessID": 2319
      },
      {
        "Cycles": 0,
        "Agent": "Execution-CPU",
        "ProcessName": "Data",
        "TaskID": "5A3CEA749BED754B",
        "ParentEventID": [
          "AE59CED807FFECD1"
        ],
        "Label": "unset",
        "Title": "X-Trace Task",
        "Host": "pinky19.mpi-sws.org",
        "Duration": "938837",
        "HRT": 26962483762114938,
        "Operation": "unset",
        "Timestamp": "1557746123702.273926",
        "TenantClass": 0,
        "Source": "DataXceiver.java:261",
        "ThreadID": 36633,
        "ThreadName": "",
        "EventID": "BB0531902D418219",
        "BaggageBytes": "[[248 5] [240 0] [0 90 60 234 116 155 237 117 75] [240 1] [0 174 89 206 216 7 255 236 209] [240 3] [0 2]]",
        "ProcessID": 2319
      }
    ]
  }
]