[
  {
    "id": "20ECE4D7F263FC5A",
    "reports": [
      {
        "Cycles": 0,
        "Agent": "Execution-CPU",
        "ProcessName": "Read",
        "TaskID": "20ECE4D7F263FC5A",
        "ParentEventID": [
          "7A198E3BBF7022F1"
        ],
        "Label": "unset",
        "Title": "X-Trace Task",
        "Host": "pinky19.mpi-sws.org",
        "Duration": "49326921",
        "HRT": 26966630087153058,
        "Operation": "unset",
        "Timestamp": "1557750270027.252197",
        "TenantClass": 0,
        "Source": "Client.java:1027",
        "ThreadID": 1,
        "ThreadName": "",
        "EventID": "8104990C67D80E05",
        "ProcessID": 2801
      },
      {
        "Cycles": 0,
        "Agent": "org.apache.hadoop.ipc.ProtobufRpcEngine",
        "ProcessName": "Read",
        "TaskID": "20ECE4D7F263FC5A",
        "ParentEventID": [
          "F3956A69621C216B"
        ],
        "Label": "Invoking org.apache.hadoop.hdfs.protocol.ClientProtocol.getBlockLocations",
        "Title": "X-Trace Task",
        "Host": "pinky19.mpi-sws.org",
        "HRT": 26966630087131497,
        "Timestamp": "1557750270027.230713",
        "TenantClass": 0,
        "Source": "ProtobufRpcEngine.java:228",
        "ThreadID": 1,
        "ThreadName": "",
        "EventID": "7A198E3BBF7022F1",
        "ProcessID": 2801
      },
      {
        "Cycles": 0,
        "Agent": "edu.brown.cs.systems.retro.benchmarks.hdfs_client.Reader",
        "ProcessName": "Read",
        "TaskID": "20ECE4D7F263FC5A",
        "ParentEventID": [
          "E108E415474F63D2"
        ],
        "Label": "Reading file",
        "Title": "X-Trace Task",
        "Host": "pinky19.mpi-sws.org",
        "HRT": 26966630087100865,
        "Timestamp": "1557750270027.199951",
        "TenantClass": 0,
        "ThreadID": 1,
        "ThreadName": "",
        "EventID": "F3956A69621C216B",
        "ProcessID": 2801
      },
      {
        "Cycles": 0,
        "Agent": "edu.brown.cs.systems.xtrace.logging.BaggageWrappers",
        "ProcessName": "Read",
        "TaskID": "20ECE4D7F263FC5A",
        "ParentEventID": [
          "1D32F0772FC3D262"
        ],
        "Label": "Forking current baggage with Baggage.fork()",
        "Title": "X-Trace Task",
        "Host": "pinky19.mpi-sws.org",
        "HRT": 26966630087219721,
        "Operation": "fork",
        "Timestamp": "1557750270027.318848",
        "TenantClass": 0,
        "Source": "Client.java:1043",
        "ThreadID": 41,
        "ThreadName": "",
        "EventID": "83A85EB676C131CD",
        "ProcessID": 2801
      },
      {
        "Cycles": 0,
        "Agent": "Execution-CPU",
        "ProcessName": "Read",
        "TaskID": "20ECE4D7F263FC5A",
        "ParentEventID": [
          "8104990C67D80E05"
        ],
        "Label": "set",
        "Title": "X-Trace Task",
        "Host": "pinky19.mpi-sws.org",
        "HRT": 26966630087201041,
        "Operation": "set",
        "Timestamp": "1557750270027.300049",
        "TenantClass": 0,
        "Source": "Client.java:1032",
        "ThreadID": 41,
        "ThreadName": "",
        "EventID": "1D32F0772FC3D262",
        "ProcessID": 2801
      },
      {
        "Cycles": 0,
        "Agent": "Execution-CPU",
        "ProcessName": "Read",
        "TaskID": "20ECE4D7F263FC5A",
        "ParentEventID": [
          "83A85EB676C131CD"
        ],
        "Label": "unset",
        "Title": "X-Trace Task",
        "Host": "pinky19.mpi-sws.org",
        "Duration": "64540",
        "HRT": 26966630087283398,
        "Operation": "unset",
        "Timestamp": "1557750270027.382568",
        "TenantClass": 0,
        "Source": "Client.java:1062",
        "ThreadID": 41,
        "ThreadName": "",
        "EventID": "7248972FEA992150",
        "ProcessID": 2801
      },
      {
        "Cycles": 0,
        "Agent": "Execution-CPU",
        "ProcessName": "Read",
        "TaskID": "20ECE4D7F263FC5A",
        "ParentEventID": [
          "7248972FEA992150"
        ],
        "Label": "set",
        "Title": "X-Trace Task",
        "Host": "pinky19.mpi-sws.org",
        "HRT": 26966630087321979,
        "Operation": "set",
        "Timestamp": "1557750270027.421143",
        "TenantClass": 0,
        "Source": "Client.java:1104",
        "ThreadID": 1,
        "ThreadName": "",
        "EventID": "398F07F419D4A66D",
        "ProcessID": 2801
      },
      {
        "Cycles": 0,
        "Agent": "edu.brown.cs.systems.xtrace.logging.BaggageWrappers",
        "ProcessName": "Name",
        "TaskID": "20ECE4D7F263FC5A",
        "ParentEventID": [
          "115326A4A4565912"
        ],
        "Label": "Forking current baggage with Baggage.fork()",
        "Title": "X-Trace Task",
        "Host": "pinky19.mpi-sws.org",
        "HRT": 26966630087376321,
        "Operation": "fork",
        "Timestamp": "1557750270027.919678",
        "TenantClass": 0,
        "Source": "Server.java:550",
        "ThreadID": 48,
        "ThreadName": "",
        "EventID": "BA459360940D1CBF",
        "BaggageBytes": "[[248 5] [240 0] [0 32 236 228 215 242 99 252 90] [240 1] [0 17 83 38 164 164 86 89 18] [240 3] [0 2]]",
        "ProcessID": 2171
      },
      {
        "Cycles": 0,
        "Agent": "Execution-CPU",
        "ProcessName": "Name",
        "TaskID": "20ECE4D7F263FC5A",
        "ParentEventID": [
          "83A85EB676C131CD"
        ],
        "Label": "set",
        "Title": "X-Trace Task",
        "Host": "pinky19.mpi-sws.org",
        "HRT": 26966630087344558,
        "Operation": "set",
        "Timestamp": "1557750270027.887939",
        "TenantClass": 0,
        "Source": "Server.java:1840",
        "ThreadID": 48,
        "ThreadName": "",
        "EventID": "115326A4A4565912",
        "BaggageBytes": "[[248 5] [240 0] [0 32 236 228 215 242 99 252 90] [240 1] [0 131 168 94 182 118 193 49 205] [240 3] [0 2]]",
        "ProcessID": 2171
      },
      {
        "Cycles": 0,
        "Agent": "Execution-CPU",
        "ProcessName": "Name",
        "TaskID": "20ECE4D7F263FC5A",
        "ParentEventID": [
          "BA459360940D1CBF"
        ],
        "Label": "set",
        "Title": "X-Trace Task",
        "Host": "pinky19.mpi-sws.org",
        "HRT": 26966630087404651,
        "Operation": "set",
        "Timestamp": "1557750270027.947998",
        "TenantClass": 0,
        "Source": "Server.java:2071",
        "ThreadID": 58,
        "ThreadName": "",
        "EventID": "D4E6148B11969B6B",
        "BaggageBytes": "[[248 5] [240 0] [0 32 236 228 215 242 99 252 90] [240 1] [0 186 69 147 96 148 13 28 191] [240 3] [0 2]]",
        "ProcessID": 2171
      },
      {
        "Cycles": 0,
        "Agent": "Execution-CPU",
        "ProcessName": "Name",
        "TaskID": "20ECE4D7F263FC5A",
        "ParentEventID": [
          "BA459360940D1CBF"
        ],
        "Label": "unset",
        "Title": "X-Trace Task",
        "Host": "pinky19.mpi-sws.org",
        "Duration": "24378",
        "HRT": 26966630087397175,
        "Operation": "unset",
        "Timestamp": "1557750270027.940430",
        "TenantClass": 0,
        "Source": "Server.java:1828",
        "ThreadID": 48,
        "ThreadName": "",
        "EventID": "F1A6F16DA141CE67",
        "BaggageBytes": "[[248 5] [240 0] [0 32 236 228 215 242 99 252 90] [240 1] [0 186 69 147 96 148 13 28 191] [240 3] [0 2]]",
        "ProcessID": 2171
      },
      {
        "Cycles": 0,
        "Agent": "org.apache.hadoop.ipc.Server",
        "ProcessName": "Name",
        "TaskID": "20ECE4D7F263FC5A",
        "ParentEventID": [
          "D4E6148B11969B6B"
        ],
        "Label": "getBlockLocations in org.apache.hadoop.hdfs.protocol.ClientProtocol",
        "Title": "X-Trace Task",
        "Host": "pinky19.mpi-sws.org",
        "HRT": 26966630087433191,
        "Timestamp": "1557750270027.976562",
        "TenantClass": 0,
        "Source": "ProtobufRpcEngine.java:601",
        "ThreadID": 58,
        "ThreadName": "",
        "EventID": "D894BCA57DB091FA",
        "BaggageBytes": "[[248 5] [240 0] [0 32 236 228 215 242 99 252 90] [240 1] [0 212 230 20 139 17 150 155 107] [240 3] [0 2]]",
        "ProcessID": 2171
      },
      {
        "Cycles": 0,
        "Agent": "edu.brown.cs.systems.xtrace.logging.BaggageWrappers",
        "ProcessName": "Name",
        "TaskID": "20ECE4D7F263FC5A",
        "ParentEventID": [
          "95B6DDCE0EE28BFA"
        ],
        "Label": "Forking current baggage with Baggage.fork()",
        "Title": "X-Trace Task",
        "Host": "pinky19.mpi-sws.org",
        "HRT": 26966630087520888,
        "Operation": "fork",
        "Timestamp": "1557750270028.064209",
        "TenantClass": 0,
        "Source": "Server.java:2398",
        "ThreadID": 58,
        "ThreadName": "",
        "EventID": "1452B1D0C500997D",
        "BaggageBytes": "[[248 5] [240 0] [0 32 236 228 215 242 99 252 90] [240 1] [0 149 182 221 206 14 226 139 250] [240 3] [0 2]]",
        "ProcessID": 2171
      },
      {
        "Cycles": 0,
        "Agent": "Execution-CPU",
        "ProcessName": "Name",
        "TaskID": "20ECE4D7F263FC5A",
        "ParentEventID": [
          "1452B1D0C500997D"
        ],
        "Label": "unset",
        "Title": "X-Trace Task",
        "Host": "pinky19.mpi-sws.org",
        "Duration": "203229",
        "HRT": 26966630087624127,
        "Operation": "unset",
        "Timestamp": "1557750270028.167480",
        "TenantClass": 0,
        "Source": "Server.java:1058",
        "ThreadID": 58,
        "ThreadName": "",
        "EventID": "CDD3C6CEA2AB3E0F",
        "BaggageBytes": "[[248 5] [240 0] [0 32 236 228 215 242 99 252 90] [240 1] [0 20 82 177 208 197 0 153 125] [240 3] [0 2]]",
        "ProcessID": 2171
      },
      {
        "Cycles": 0,
        "Agent": "org.apache.hadoop.hdfs.server.namenode.FSNamesystem.audit",
        "ProcessName": "Name",
        "TaskID": "20ECE4D7F263FC5A",
        "ParentEventID": [
          "D894BCA57DB091FA"
        ],
        "Label": "allowed=true\tugi=plascas (auth:SIMPLE)\tip=/139.19.171.63\tcmd=open\tsrc=/ds/UvYjdW5ziLLncj9x\tdst=null\tperm=null\tproto=rpc",
        "Title": "X-Trace Task",
        "Host": "pinky19.mpi-sws.org",
        "HRT": 26966630087477927,
        "Timestamp": "1557750270028.021240",
        "TenantClass": 0,
        "Source": "FSNamesystem.java:8313",
        "ThreadID": 58,
        "ThreadName": "",
        "EventID": "95B6DDCE0EE28BFA",
        "BaggageBytes": "[[248 5] [240 0] [0 32 236 228 215 242 99 252 90] [240 1] [0 216 148 188 165 125 176 145 250] [240 3] [0 2]]",
        "ProcessID": 2171
      },
      {
        "Cycles": 0,
        "Agent": "Execution-CPU",
        "ProcessName": "Read",
        "TaskID": "20ECE4D7F263FC5A",
        "ParentEventID": [
          "1452B1D0C500997D"
        ],
        "Label": "set",
        "Title": "X-Trace Task",
        "Host": "pinky19.mpi-sws.org",
        "HRT": 26966630087699690,
        "Operation": "set",
        "Timestamp": "1557750270027.798828",
        "TenantClass": 0,
        "Source": "Client.java:302",
        "ThreadID": 40,
        "ThreadName": "",
        "EventID": "B95EF769286BC464",
        "ProcessID": 2801
      },
      {
        "Cycles": 0,
        "Agent": "Execution-Sleep",
        "ProcessName": "Read",
        "TaskID": "20ECE4D7F263FC5A",
        "ParentEventID": [
          "398F07F419D4A66D"
        ],
        "Label": "waited",
        "Title": "X-Trace Task",
        "Host": "pinky19.mpi-sws.org",
        "Duration": "408645",
        "HRT": 26966630087744907,
        "Operation": "waited",
        "Timestamp": "1557750270027.843994",
        "TenantClass": 0,
        "Source": "Client.java:1537",
        "ThreadID": 1,
        "ThreadName": "",
        "EventID": "237CB9E02D53CC0E",
        "ProcessID": 2801
      },
      {
        "Cycles": 0,
        "Agent": "edu.brown.cs.systems.xtrace.logging.BaggageWrappers",
        "ProcessName": "Read",
        "TaskID": "20ECE4D7F263FC5A",
        "ParentEventID": [
          "C6242575553580CC",
          "237CB9E02D53CC0E"
        ],
        "Label": "Merged current baggage with other baggage",
        "Title": "X-Trace Task",
        "Host": "pinky19.mpi-sws.org",
        "HRT": 26966630087755395,
        "Operation": "join",
        "Timestamp": "1557750270027.854492",
        "TenantClass": 0,
        "Source": "Client.java:1545",
        "ThreadID": 1,
        "ThreadName": "",
        "EventID": "9797C5CAC9B6817F",
        "ProcessID": 2801
      },
      {
        "Cycles": 0,
        "Agent": "org.apache.hadoop.ipc.ProtobufRpcEngine",
        "ProcessName": "Read",
        "TaskID": "20ECE4D7F263FC5A",
        "ParentEventID": [
          "9797C5CAC9B6817F"
        ],
        "Label": "org.apache.hadoop.hdfs.protocol.ClientProtocol.getBlockLocations completed",
        "Title": "X-Trace Task",
        "Host": "pinky19.mpi-sws.org",
        "HRT": 26966630087794828,
        "Timestamp": "1557750270027.894043",
        "TenantClass": 0,
        "Source": "ProtobufRpcEngine.java:275",
        "ThreadID": 1,
        "ThreadName": "",
        "EventID": "EBC3146CF8E38C25",
        "ProcessID": 2801
      },
      {
        "Cycles": 0,
        "Agent": "Execution-Sleep",
        "ProcessName": "Read",
        "TaskID": "20ECE4D7F263FC5A",
        "ParentEventID": [
          "EBC3146CF8E38C25"
        ],
        "Label": "waited",
        "Title": "X-Trace Task",
        "Host": "pinky19.mpi-sws.org",
        "Duration": "92086",
        "HRT": 26966630088012769,
        "Operation": "waited",
        "Timestamp": "1557750270028.111816",
        "TenantClass": 0,
        "Source": "SocketIOWithTimeout.java:335",
        "ThreadID": 1,
        "ThreadName": "",
        "EventID": "7AD907726969D87E",
        "ProcessID": 2801
      },
      {
        "Cycles": 0,
        "Agent": "edu.brown.cs.systems.xtrace.logging.BaggageWrappers",
        "ProcessName": "Read",
        "TaskID": "20ECE4D7F263FC5A",
        "ParentEventID": [
          "7AD907726969D87E"
        ],
        "Label": "Forking current baggage with Baggage.fork()",
        "Title": "X-Trace Task",
        "Host": "pinky19.mpi-sws.org",
        "HRT": 26966630088053390,
        "Operation": "fork",
        "Timestamp": "1557750270028.152588",
        "TenantClass": 0,
        "Source": "DataTransferProtoUtil.java:94",
        "ThreadID": 1,
        "ThreadName": "",
        "EventID": "E467D5AEE643E8B3",
        "ProcessID": 2801
      },
      {
        "Cycles": 0,
        "Agent": "Execution-CPU",
        "ProcessName": "Read",
        "TaskID": "20ECE4D7F263FC5A",
        "ParentEventID": [
          "B95EF769286BC464"
        ],
        "Label": "unset",
        "Title": "X-Trace Task",
        "Host": "pinky19.mpi-sws.org",
        "Duration": "9621",
        "HRT": 26966630087725740,
        "Operation": "unset",
        "Timestamp": "1557750270027.824951",
        "TenantClass": 0,
        "Source": "Client.java:1168",
        "ThreadID": 40,
        "ThreadName": "",
        "EventID": "C6242575553580CC",
        "ProcessID": 2801
      },
      {
        "Cycles": 0,
        "Agent": "Execution-CPU",
        "ProcessName": "Data",
        "TaskID": "20ECE4D7F263FC5A",
        "ParentEventID": [
          "E467D5AEE643E8B3"
        ],
        "Label": "set",
        "Title": "X-Trace Task",
        "Host": "pinky25.mpi-sws.org",
        "HRT": 47515735329737295,
        "Operation": "set",
        "Timestamp": "1557750270028.069824",
        "TenantClass": 0,
        "Source": "Receiver.java:117",
        "ThreadID": 14423,
        "ThreadName": "",
        "EventID": "E5E969BC632D5CE8",
        "BaggageBytes": "[[248 5] [240 0] [0 32 236 228 215 242 99 252 90] [240 1] [0 228 103 213 174 230 67 232 179] [240 3] [0 2]]",
        "ProcessID": 28198
      },
      {
        "Cycles": 0,
        "Agent": "edu.brown.cs.systems.xtrace.logging.BaggageWrappers",
        "ProcessName": "Data",
        "TaskID": "20ECE4D7F263FC5A",
        "ParentEventID": [
          "CFF037A82E1A96FE"
        ],
        "Label": "Forking current baggage with Baggage.fork()",
        "Title": "X-Trace Task",
        "Host": "pinky25.mpi-sws.org",
        "HRT": 47515735329983511,
        "Operation": "fork",
        "Timestamp": "1557750270028.315918",
        "TenantClass": 0,
        "Source": "DataXceiver.java:1257",
        "ThreadID": 14423,
        "ThreadName": "",
        "EventID": "45A3CB4D40C504D7",
        "BaggageBytes": "[[248 5] [240 0] [0 32 236 228 215 242 99 252 90] [240 1] [0 207 240 55 168 46 26 150 254] [240 3] [0 2]]",
        "ProcessID": 28198
      },
      {
        "Cycles": 0,
        "Agent": "Execution-Sleep",
        "ProcessName": "Read",
        "TaskID": "20ECE4D7F263FC5A",
        "ParentEventID": [
          "E467D5AEE643E8B3"
        ],
        "Label": "waited",
        "Title": "X-Trace Task",
        "Host": "pinky19.mpi-sws.org",
        "Duration": "663516",
        "HRT": 26966630088778167,
        "Operation": "waited",
        "Timestamp": "1557750270028.877197",
        "TenantClass": 0,
        "Source": "SocketIOWithTimeout.java:335",
        "ThreadID": 1,
        "ThreadName": "",
        "EventID": "E01947101DBCF01A",
        "ProcessID": 2801
      },
      {
        "Cycles": 0,
        "Agent": "edu.brown.cs.systems.xtrace.logging.BaggageWrappers",
        "ProcessName": "Data",
        "TaskID": "20ECE4D7F263FC5A",
        "ParentEventID": [
          "45A3CB4D40C504D7"
        ],
        "Label": "Forking current baggage with Baggage.fork()",
        "Title": "X-Trace Task",
        "Host": "pinky25.mpi-sws.org",
        "HRT": 47515735330090561,
        "Operation": "fork",
        "Timestamp": "1557750270028.423096",
        "TenantClass": 0,
        "Source": "PacketHeader.java:95",
        "ThreadID": 14423,
        "ThreadName": "",
        "EventID": "125FD5CBE566A61A",
        "BaggageBytes": "[[248 5] [240 0] [0 32 236 228 215 242 99 252 90] [240 1] [0 69 163 203 77 64 197 4 215] [240 3] [0 2]]",
        "ProcessID": 28198
      },
      {
        "Cycles": 0,
        "Agent": "edu.brown.cs.systems.xtrace.logging.XTraceInit",
        "ProcessName": "Data",
        "TaskID": "20ECE4D7F263FC5A",
        "ParentEventID": [
          "E5E969BC632D5CE8"
        ],
        "Label": "Thread.setName: DataXceiver for client DFSClient_NONMAPREDUCE_310321604_1 at /139.19.171.63:47934 [Sending block BP-1633380353-139.19.171.63-1554193446451:blk_1073767694_26870]",
        "Title": "X-Trace Task",
        "Host": "pinky25.mpi-sws.org",
        "HRT": 47515735329825401,
        "Timestamp": "1557750270028.157959",
        "TenantClass": 0,
        "Source": "DataXceiver.java:168",
        "ThreadID": 14423,
        "ThreadName": "",
        "EventID": "CFF037A82E1A96FE",
        "BaggageBytes": "[[248 5] [240 0] [0 32 236 228 215 242 99 252 90] [240 1] [0 229 233 105 188 99 45 92 232] [240 3] [0 2]]",
        "ProcessID": 28198
      },
      {
        "Cycles": 0,
        "Agent": "edu.brown.cs.systems.xtrace.logging.BaggageWrappers",
        "ProcessName": "Read",
        "TaskID": "20ECE4D7F263FC5A",
        "ParentEventID": [
          "45A3CB4D40C504D7",
          "E01947101DBCF01A"
        ],
        "Label": "Merged current baggage with other baggage",
        "Title": "X-Trace Task",
        "Host": "pinky19.mpi-sws.org",
        "HRT": 26966630088840725,
        "Operation": "join",
        "Timestamp": "1557750270028.939941",
        "TenantClass": 0,
        "Source": "RemoteBlockReader2.java:429",
        "ThreadID": 1,
        "ThreadName": "",
        "EventID": "D9D206E68F081C09",
        "ProcessID": 2801
      },
      {
        "Cycles": 0,
        "Agent": "Execution-Sleep",
        "ProcessName": "Data",
        "TaskID": "20ECE4D7F263FC5A",
        "ParentEventID": [
          "125FD5CBE566A61A"
        ],
        "Label": "waited",
        "Title": "X-Trace Task",
        "Host": "pinky25.mpi-sws.org",
        "Duration": "8553",
        "HRT": 47515735330207568,
        "Operation": "waited",
        "Timestamp": "1557750270028.540039",
        "TenantClass": 0,
        "Source": "SocketIOWithTimeout.java:335",
        "ThreadID": 14423,
        "ThreadName": "",
        "EventID": "5EE024EA06F01181",
        "BaggageBytes": "[[248 5] [240 0] [0 32 236 228 215 242 99 252 90] [240 1] [0 18 95 213 203 229 102 166 26] [240 3] [0 2]]",
        "ProcessID": 28198
      },
      {
        "Cycles": 0,
        "Agent": "Execution-Sleep",
        "ProcessName": "Read",
        "TaskID": "20ECE4D7F263FC5A",
        "ParentEventID": [
          "D9D206E68F081C09"
        ],
        "Label": "waited",
        "Title": "X-Trace Task",
        "Host": "pinky19.mpi-sws.org",
        "Duration": "303491",
        "HRT": 26966630089242586,
        "Operation": "waited",
        "Timestamp": "1557750270029.341797",
        "TenantClass": 0,
        "Source": "SocketIOWithTimeout.java:335",
        "ThreadID": 1,
        "ThreadName": "",
        "EventID": "A55D6DFE6D91732E",
        "ProcessID": 2801
      },
      {
        "Cycles": 0,
        "Agent": "edu.brown.cs.systems.xtrace.logging.BaggageWrappers",
        "ProcessName": "Data",
        "TaskID": "20ECE4D7F263FC5A",
        "ParentEventID": [
          "5EE024EA06F01181"
        ],
        "Label": "Forking current baggage with Baggage.fork()",
        "Title": "X-Trace Task",
        "Host": "pinky25.mpi-sws.org",
        "HRT": 47515735330330011,
        "Operation": "fork",
        "Timestamp": "1557750270028.662598",
        "TenantClass": 0,
        "Source": "PacketHeader.java:95",
        "ThreadID": 14423,
        "ThreadName": "",
        "EventID": "004C3D74DC1FFFD9",
        "BaggageBytes": "[[248 5] [240 0] [0 32 236 228 215 242 99 252 90] [240 1] [0 94 224 36 234 6 240 17 129] [240 3] [0 2]]",
        "ProcessID": 28198
      },
      {
        "Cycles": 0,
        "Agent": "Execution-Sleep",
        "ProcessName": "Read",
        "TaskID": "20ECE4D7F263FC5A",
        "ParentEventID": [
          "96C44822C92F4A18"
        ],
        "Label": "waited",
        "Title": "X-Trace Task",
        "Host": "pinky19.mpi-sws.org",
        "Duration": "146264",
        "HRT": 26966630089717370,
        "Operation": "waited",
        "Timestamp": "1557750270029.816406",
        "TenantClass": 0,
        "Source": "SocketIOWithTimeout.java:335",
        "ThreadID": 1,
        "ThreadName": "",
        "EventID": "50F725070B240294",
        "ProcessID": 2801
      },
      {
        "Cycles": 0,
        "Agent": "Execution-Sleep",
        "ProcessName": "Read",
        "TaskID": "20ECE4D7F263FC5A",
        "ParentEventID": [
          "A55D6DFE6D91732E"
        ],
        "Label": "waited",
        "Title": "X-Trace Task",
        "Host": "pinky19.mpi-sws.org",
        "Duration": "225749",
        "HRT": 26966630089513585,
        "Operation": "waited",
        "Timestamp": "1557750270029.612793",
        "TenantClass": 0,
        "Source": "SocketIOWithTimeout.java:335",
        "ThreadID": 1,
        "ThreadName": "",
        "EventID": "96C44822C92F4A18",
        "ProcessID": 2801
      },
      {
        "Cycles": 0,
        "Agent": "edu.brown.cs.systems.xtrace.logging.BaggageWrappers",
        "ProcessName": "Read",
        "TaskID": "20ECE4D7F263FC5A",
        "ParentEventID": [
          "50F725070B240294",
          "125FD5CBE566A61A"
        ],
        "Label": "Merged current baggage with other baggage",
        "Title": "X-Trace Task",
        "Host": "pinky19.mpi-sws.org",
        "HRT": 26966630089778925,
        "Operation": "join",
        "Timestamp": "1557750270029.877930",
        "TenantClass": 0,
        "Source": "PacketHeader.java:168",
        "ThreadID": 1,
        "ThreadName": "",
        "EventID": "758E4A9E795B7503",
        "ProcessID": 2801
      },
      {
        "Cycles": 0,
        "Agent": "edu.brown.cs.systems.xtrace.logging.BaggageWrappers",
        "ProcessName": "Read",
        "TaskID": "20ECE4D7F263FC5A",
        "ParentEventID": [
          "C317EF6DF9A44DDB"
        ],
        "Label": "Forking current baggage with Baggage.fork()",
        "Title": "X-Trace Task",
        "Host": "pinky19.mpi-sws.org",
        "HRT": 26966630089903840,
        "Operation": "fork",
        "Timestamp": "1557750270030.002930",
        "TenantClass": 0,
        "Source": "RemoteBlockReader2.java:361",
        "ThreadID": 1,
        "ThreadName": "",
        "EventID": "E5F10D65C2AAA6EF",
        "ProcessID": 2801
      },
      {
        "Cycles": 0,
        "Agent": "edu.brown.cs.systems.xtrace.logging.BaggageWrappers",
        "ProcessName": "Read",
        "TaskID": "20ECE4D7F263FC5A",
        "ParentEventID": [
          "758E4A9E795B7503",
          "004C3D74DC1FFFD9"
        ],
        "Label": "Merged current baggage with other baggage",
        "Title": "X-Trace Task",
        "Host": "pinky19.mpi-sws.org",
        "HRT": 26966630089894850,
        "Operation": "join",
        "Timestamp": "1557750270029.993896",
        "TenantClass": 0,
        "Source": "PacketHeader.java:168",
        "ThreadID": 1,
        "ThreadName": "",
        "EventID": "C317EF6DF9A44DDB",
        "ProcessID": 2801
      },
      {
        "Cycles": 0,
        "Agent": "Execution-Sleep",
        "ProcessName": "Data",
        "TaskID": "20ECE4D7F263FC5A",
        "ParentEventID": [
          "004C3D74DC1FFFD9"
        ],
        "Label": "waited",
        "Title": "X-Trace Task",
        "Host": "pinky25.mpi-sws.org",
        "Duration": "857174",
        "HRT": 47515735331311628,
        "Operation": "waited",
        "Timestamp": "1557750270029.644043",
        "TenantClass": 0,
        "Source": "SocketIOWithTimeout.java:335",
        "ThreadID": 14423,
        "ThreadName": "",
        "EventID": "B29DA737BC058462",
        "BaggageBytes": "[[248 5] [240 0] [0 32 236 228 215 242 99 252 90] [240 1] [0 0 76 61 116 220 31 255 217] [240 3] [0 2]]",
        "ProcessID": 28198
      },
      {
        "Cycles": 0,
        "Agent": "edu.brown.cs.systems.xtrace.logging.BaggageWrappers",
        "ProcessName": "Data",
        "TaskID": "20ECE4D7F263FC5A",
        "ParentEventID": [
          "E5F10D65C2AAA6EF",
          "B29DA737BC058462"
        ],
        "Label": "Merged current baggage with other baggage",
        "Title": "X-Trace Task",
        "Host": "pinky25.mpi-sws.org",
        "HRT": 47515735331468849,
        "Operation": "join",
        "Timestamp": "1557750270029.801270",
        "TenantClass": 0,
        "Source": "DataXceiver.java:574",
        "ThreadID": 14423,
        "ThreadName": "",
        "EventID": "4D886415DDE8AF04",
        "BaggageBytes": "[[248 5] [240 0] [0 32 236 228 215 242 99 252 90] [240 1] [0 178 157 167 55 188 5 132 98] [0 229 241 13 101 194 170 166 239] [240 3] [0 2]]",
        "ProcessID": 28198
      },
      {
        "Cycles": 0,
        "Agent": "Execution-CPU",
        "ProcessName": "Data",
        "TaskID": "20ECE4D7F263FC5A",
        "ParentEventID": [
          "4D886415DDE8AF04"
        ],
        "Label": "unset",
        "Title": "X-Trace Task",
        "Host": "pinky25.mpi-sws.org",
        "Duration": "1717592",
        "HRT": 47515735331507349,
        "Operation": "unset",
        "Timestamp": "1557750270029.839844",
        "TenantClass": 0,
        "Source": "DataXceiver.java:261",
        "ThreadID": 14423,
        "ThreadName": "",
        "EventID": "74D70843BD373C29",
        "BaggageBytes": "[[248 5] [240 0] [0 32 236 228 215 242 99 252 90] [240 1] [0 77 136 100 21 221 232 175 4] [240 3] [0 2]]",
        "ProcessID": 28198
      },
      {
        "Cycles": 0,
        "Agent": "edu.brown.cs.systems.xtrace.logging.BaggageWrappers",
        "ProcessName": "Read",
        "TaskID": "20ECE4D7F263FC5A",
        "ParentEventID": [
          "E5F10D65C2AAA6EF"
        ],
        "Label": "Forking current baggage with Baggage.fork()",
        "Title": "X-Trace Task",
        "Host": "pinky19.mpi-sws.org",
        "HRT": 26966630089977329,
        "Operation": "fork",
        "Timestamp": "1557750270030.076416",
        "TenantClass": 0,
        "Source": "DataTransferProtoUtil.java:94",
        "ThreadID": 1,
        "ThreadName": "",
        "EventID": "184C723568698336",
        "ProcessID": 2801
      },
      {
        "Cycles": 0,
        "Agent": "Execution-CPU",
        "ProcessName": "Data",
        "TaskID": "20ECE4D7F263FC5A",
        "ParentEventID": [
          "184C723568698336"
        ],
        "Label": "set",
        "Title": "X-Trace Task",
        "Host": "pinky25.mpi-sws.org",
        "HRT": 47515735331551922,
        "Operation": "set",
        "Timestamp": "1557750270029.884521",
        "TenantClass": 0,
        "Source": "Receiver.java:117",
        "ThreadID": 14423,
        "ThreadName": "",
        "EventID": "6CDEDFC20D834F49",
        "BaggageBytes": "[[248 5] [240 0] [0 32 236 228 215 242 99 252 90] [240 1] [0 24 76 114 53 104 105 131 54] [240 3] [0 2]]",
        "ProcessID": 28198
      },
      {
        "Cycles": 0,
        "Agent": "edu.brown.cs.systems.xtrace.logging.BaggageWrappers",
        "ProcessName": "Data",
        "TaskID": "20ECE4D7F263FC5A",
        "ParentEventID": [
          "59B60D801F335066"
        ],
        "Label": "Forking current baggage with Baggage.fork()",
        "Title": "X-Trace Task",
        "Host": "pinky25.mpi-sws.org",
        "HRT": 47515735331735375,
        "Operation": "fork",
        "Timestamp": "1557750270030.067871",
        "TenantClass": 0,
        "Source": "DataXceiver.java:1257",
        "ThreadID": 14423,
        "ThreadName": "",
        "EventID": "4F19AACCC816B209",
        "BaggageBytes": "[[248 5] [240 0] [0 32 236 228 215 242 99 252 90] [240 1] [0 89 182 13 128 31 51 80 102] [240 3] [0 2]]",
        "ProcessID": 28198
      },
      {
        "Cycles": 0,
        "Agent": "edu.brown.cs.systems.xtrace.logging.XTraceInit",
        "ProcessName": "Data",
        "TaskID": "20ECE4D7F263FC5A",
        "ParentEventID": [
          "6CDEDFC20D834F49"
        ],
        "Label": "Thread.setName: DataXceiver for client DFSClient_NONMAPREDUCE_310321604_1 at /139.19.171.63:47934 [Sending block BP-1633380353-139.19.171.63-1554193446451:blk_1073767694_26870]",
        "Title": "X-Trace Task",
        "Host": "pinky25.mpi-sws.org",
        "HRT": 47515735331597067,
        "Timestamp": "1557750270029.929443",
        "TenantClass": 0,
        "Source": "DataXceiver.java:168",
        "ThreadID": 14423,
        "ThreadName": "",
        "EventID": "59B60D801F335066",
        "BaggageBytes": "[[248 5] [240 0] [0 32 236 228 215 242 99 252 90] [240 1] [0 108 222 223 194 13 131 79 73] [240 3] [0 2]]",
        "ProcessID": 28198
      },
      {
        "Cycles": 0,
        "Agent": "Execution-Sleep",
        "ProcessName": "Read",
        "TaskID": "20ECE4D7F263FC5A",
        "ParentEventID": [
          "184C723568698336"
        ],
        "Label": "waited",
        "Title": "X-Trace Task",
        "Host": "pinky19.mpi-sws.org",
        "Duration": "482957",
        "HRT": 26966630090536912,
        "Operation": "waited",
        "Timestamp": "1557750270030.635986",
        "TenantClass": 0,
        "Source": "SocketIOWithTimeout.java:335",
        "ThreadID": 1,
        "ThreadName": "",
        "EventID": "ABF7C03E8718651D",
        "ProcessID": 2801
      },
      {
        "Cycles": 0,
        "Agent": "edu.brown.cs.systems.xtrace.logging.BaggageWrappers",
        "ProcessName": "Data",
        "TaskID": "20ECE4D7F263FC5A",
        "ParentEventID": [
          "4F19AACCC816B209"
        ],
        "Label": "Forking current baggage with Baggage.fork()",
        "Title": "X-Trace Task",
        "Host": "pinky25.mpi-sws.org",
        "HRT": 47515735331856841,
        "Operation": "fork",
        "Timestamp": "1557750270030.189209",
        "TenantClass": 0,
        "Source": "PacketHeader.java:95",
        "ThreadID": 14423,
        "ThreadName": "",
        "EventID": "EAE7320B68D2F481",
        "BaggageBytes": "[[248 5] [240 0] [0 32 236 228 215 242 99 252 90] [240 1] [0 79 25 170 204 200 22 178 9] [240 3] [0 2]]",
        "ProcessID": 28198
      },
      {
        "Cycles": 0,
        "Agent": "edu.brown.cs.systems.xtrace.logging.BaggageWrappers",
        "ProcessName": "Read",
        "TaskID": "20ECE4D7F263FC5A",
        "ParentEventID": [
          "4F19AACCC816B209",
          "ABF7C03E8718651D"
        ],
        "Label": "Merged current baggage with other baggage",
        "Title": "X-Trace Task",
        "Host": "pinky19.mpi-sws.org",
        "HRT": 26966630090598012,
        "Operation": "join",
        "Timestamp": "1557750270030.697021",
        "TenantClass": 0,
        "Source": "RemoteBlockReader2.java:429",
        "ThreadID": 1,
        "ThreadName": "",
        "EventID": "4ECE6B9C60E94AB6",
        "ProcessID": 2801
      },
      {
        "Cycles": 0,
        "Agent": "Execution-Sleep",
        "ProcessName": "Read",
        "TaskID": "20ECE4D7F263FC5A",
        "ParentEventID": [
          "4ECE6B9C60E94AB6"
        ],
        "Label": "waited",
        "Title": "X-Trace Task",
        "Host": "pinky19.mpi-sws.org",
        "Duration": "306313",
        "HRT": 26966630091001368,
        "Operation": "waited",
        "Timestamp": "1557750270031.100586",
        "TenantClass": 0,
        "Source": "SocketIOWithTimeout.java:335",
        "ThreadID": 1,
        "ThreadName": "",
        "EventID": "83C170C72B1AC03B",
        "ProcessID": 2801
      },
      {
        "Cycles": 0,
        "Agent": "Execution-Sleep",
        "ProcessName": "Data",
        "TaskID": "20ECE4D7F263FC5A",
        "ParentEventID": [
          "EAE7320B68D2F481"
        ],
        "Label": "waited",
        "Title": "X-Trace Task",
        "Host": "pinky25.mpi-sws.org",
        "Duration": "7143",
        "HRT": 47515735331957451,
        "Operation": "waited",
        "Timestamp": "1557750270030.290039",
        "TenantClass": 0,
        "Source": "SocketIOWithTimeout.java:335",
        "ThreadID": 14423,
        "ThreadName": "",
        "EventID": "D04FFDB2B7467C70",
        "BaggageBytes": "[[248 5] [240 0] [0 32 236 228 215 242 99 252 90] [240 1] [0 234 231 50 11 104 210 244 129] [240 3] [0 2]]",
        "ProcessID": 28198
      },
      {
        "Cycles": 0,
        "Agent": "edu.brown.cs.systems.xtrace.logging.BaggageWrappers",
        "ProcessName": "Data",
        "TaskID": "20ECE4D7F263FC5A",
        "ParentEventID": [
          "D04FFDB2B7467C70"
        ],
        "Label": "Forking current baggage with Baggage.fork()",
        "Title": "X-Trace Task",
        "Host": "pinky25.mpi-sws.org",
        "HRT": 47515735332081987,
        "Operation": "fork",
        "Timestamp": "1557750270030.414551",
        "TenantClass": 0,
        "Source": "PacketHeader.java:95",
        "ThreadID": 14423,
        "ThreadName": "",
        "EventID": "6C8AED344CE015ED",
        "BaggageBytes": "[[248 5] [240 0] [0 32 236 228 215 242 99 252 90] [240 1] [0 208 79 253 178 183 70 124 112] [240 3] [0 2]]",
        "ProcessID": 28198
      },
      {
        "Cycles": 0,
        "Agent": "Execution-Sleep",
        "ProcessName": "Read",
        "TaskID": "20ECE4D7F263FC5A",
        "ParentEventID": [
          "83C170C72B1AC03B"
        ],
        "Label": "waited",
        "Title": "X-Trace Task",
        "Host": "pinky19.mpi-sws.org",
        "Duration": "161072",
        "HRT": 26966630091208046,
        "Operation": "waited",
        "Timestamp": "1557750270031.307129",
        "TenantClass": 0,
        "Source": "SocketIOWithTimeout.java:335",
        "ThreadID": 1,
        "ThreadName": "",
        "EventID": "92801EE75446C0BB",
        "ProcessID": 2801
      },
      {
        "Cycles": 0,
        "Agent": "Execution-Sleep",
        "ProcessName": "Data",
        "TaskID": "20ECE4D7F263FC5A",
        "ParentEventID": [
          "6C8AED344CE015ED"
        ],
        "Label": "waited",
        "Title": "X-Trace Task",
        "Host": "pinky25.mpi-sws.org",
        "Duration": "205302",
        "HRT": 47515735332362469,
        "Operation": "waited",
        "Timestamp": "1557750270030.695068",
        "TenantClass": 0,
        "Source": "SocketIOWithTimeout.java:335",
        "ThreadID": 14423,
        "ThreadName": "",
        "EventID": "15165D3FB2DA299E",
        "BaggageBytes": "[[248 5] [240 0] [0 32 236 228 215 242 99 252 90] [240 1] [0 108 138 237 52 76 224 21 237] [240 3] [0 2]]",
        "ProcessID": 28198
      },
      {
        "Cycles": 0,
        "Agent": "edu.brown.cs.systems.xtrace.logging.BaggageWrappers",
        "ProcessName": "Read",
        "TaskID": "20ECE4D7F263FC5A",
        "ParentEventID": [
          "EAE7320B68D2F481",
          "5755E5D9B68F95F6"
        ],
        "Label": "Merged current baggage with other baggage",
        "Title": "X-Trace Task",
        "Host": "pinky19.mpi-sws.org",
        "HRT": 26966630091408296,
        "Operation": "join",
        "Timestamp": "1557750270031.507324",
        "TenantClass": 0,
        "Source": "PacketHeader.java:168",
        "ThreadID": 1,
        "ThreadName": "",
        "EventID": "374C386388B223A8",
        "ProcessID": 2801
      },
      {
        "Cycles": 0,
        "Agent": "edu.brown.cs.systems.xtrace.logging.BaggageWrappers",
        "ProcessName": "Data",
        "TaskID": "20ECE4D7F263FC5A",
        "ParentEventID": [
          "15165D3FB2DA299E"
        ],
        "Label": "Forking current baggage with Baggage.fork()",
        "Title": "X-Trace Task",
        "Host": "pinky25.mpi-sws.org",
        "HRT": 47515735332467067,
        "Operation": "fork",
        "Timestamp": "1557750270030.799561",
        "TenantClass": 0,
        "Source": "PacketHeader.java:95",
        "ThreadID": 14423,
        "ThreadName": "",
        "EventID": "2DF36ACF41646504",
        "BaggageBytes": "[[248 5] [240 0] [0 32 236 228 215 242 99 252 90] [240 1] [0 21 22 93 63 178 218 41 158] [240 3] [0 2]]",
        "ProcessID": 28198
      },
      {
        "Cycles": 0,
        "Agent": "Execution-Sleep",
        "ProcessName": "Read",
        "TaskID": "20ECE4D7F263FC5A",
        "ParentEventID": [
          "92801EE75446C0BB"
        ],
        "Label": "waited",
        "Title": "X-Trace Task",
        "Host": "pinky19.mpi-sws.org",
        "Duration": "105255",
        "HRT": 26966630091366042,
        "Operation": "waited",
        "Timestamp": "1557750270031.465088",
        "TenantClass": 0,
        "Source": "SocketIOWithTimeout.java:335",
        "ThreadID": 1,
        "ThreadName": "",
        "EventID": "5755E5D9B68F95F6",
        "ProcessID": 2801
      },
      {
        "Cycles": 0,
        "Agent": "Execution-Sleep",
        "ProcessName": "Data",
        "TaskID": "20ECE4D7F263FC5A",
        "ParentEventID": [
          "2DF36ACF41646504"
        ],
        "Label": "waited",
        "Title": "X-Trace Task",
        "Host": "pinky25.mpi-sws.org",
        "Duration": "4856",
        "HRT": 47515735332550671,
        "Operation": "waited",
        "Timestamp": "1557750270030.883057",
        "TenantClass": 0,
        "Source": "SocketIOWithTimeout.java:335",
        "ThreadID": 14423,
        "ThreadName": "",
        "EventID": "984D5A6A9035DCB8",
        "BaggageBytes": "[[248 5] [240 0] [0 32 236 228 215 242 99 252 90] [240 1] [0 45 243 106 207 65 100 101 4] [240 3] [0 2]]",
        "ProcessID": 28198
      },
      {
        "Cycles": 0,
        "Agent": "edu.brown.cs.systems.xtrace.logging.BaggageWrappers",
        "ProcessName": "Data",
        "TaskID": "20ECE4D7F263FC5A",
        "ParentEventID": [
          "984D5A6A9035DCB8"
        ],
        "Label": "Forking current baggage with Baggage.fork()",
        "Title": "X-Trace Task",
        "Host": "pinky25.mpi-sws.org",
        "HRT": 47515735332636481,
        "Operation": "fork",
        "Timestamp": "1557750270030.968994",
        "TenantClass": 0,
        "Source": "PacketHeader.java:95",
        "ThreadID": 14423,
        "ThreadName": "",
        "EventID": "9DE99D3ECAF870AA",
        "BaggageBytes": "[[248 5] [240 0] [0 32 236 228 215 242 99 252 90] [240 1] [0 152 77 90 106 144 53 220 184] [240 3] [0 2]]",
        "ProcessID": 28198
      },
      {
        "Cycles": 0,
        "Agent": "edu.brown.cs.systems.xtrace.logging.BaggageWrappers",
        "ProcessName": "Data",
        "TaskID": "20ECE4D7F263FC5A",
        "ParentEventID": [
          "4F9C362C031A9C88"
        ],
        "Label": "Forking current baggage with Baggage.fork()",
        "Title": "X-Trace Task",
        "Host": "pinky25.mpi-sws.org",
        "HRT": 47515735332747626,
        "Operation": "fork",
        "Timestamp": "1557750270031.080078",
        "TenantClass": 0,
        "Source": "PacketHeader.java:95",
        "ThreadID": 14423,
        "ThreadName": "",
        "EventID": "22859782BC878BCF",
        "BaggageBytes": "[[248 5] [240 0] [0 32 236 228 215 242 99 252 90] [240 1] [0 79 156 54 44 3 26 156 136] [240 3] [0 2]]",
        "ProcessID": 28198
      },
      {
        "Cycles": 0,
        "Agent": "Execution-Sleep",
        "ProcessName": "Data",
        "TaskID": "20ECE4D7F263FC5A",
        "ParentEventID": [
          "9DE99D3ECAF870AA"
        ],
        "Label": "waited",
        "Title": "X-Trace Task",
        "Host": "pinky25.mpi-sws.org",
        "Duration": "3644",
        "HRT": 47515735332690188,
        "Operation": "waited",
        "Timestamp": "1557750270031.022705",
        "TenantClass": 0,
        "Source": "SocketIOWithTimeout.java:335",
        "ThreadID": 14423,
        "ThreadName": "",
        "EventID": "4F9C362C031A9C88",
        "BaggageBytes": "[[248 5] [240 0] [0 32 236 228 215 242 99 252 90] [240 1] [0 157 233 157 62 202 248 112 170] [240 3] [0 2]]",
        "ProcessID": 28198
      },
      {
        "Cycles": 0,
        "Agent": "Execution-Sleep",
        "ProcessName": "Data",
        "TaskID": "20ECE4D7F263FC5A",
        "ParentEventID": [
          "22859782BC878BCF"
        ],
        "Label": "waited",
        "Title": "X-Trace Task",
        "Host": "pinky25.mpi-sws.org",
        "Duration": "4428",
        "HRT": 47515735332828728,
        "Operation": "waited",
        "Timestamp": "1557750270031.161133",
        "TenantClass": 0,
        "Source": "SocketIOWithTimeout.java:335",
        "ThreadID": 14423,
        "ThreadName": "",
        "EventID": "B1B7AABD385C29B7",
        "BaggageBytes": "[[248 5] [240 0] [0 32 236 228 215 242 99 252 90] [240 1] [0 34 133 151 130 188 135 139 207] [240 3] [0 2]]",
        "ProcessID": 28198
      },
      {
        "Cycles": 0,
        "Agent": "Execution-CPU",
        "ProcessName": "Data",
        "TaskID": "20ECE4D7F263FC5A",
        "ParentEventID": [
          "B1B7AABD385C29B7"
        ],
        "Label": "unset",
        "Title": "X-Trace Task",
        "Host": "pinky25.mpi-sws.org",
        "Duration": "1526289",
        "HRT": 47515735333108406,
        "Operation": "unset",
        "Timestamp": "1557750270031.440918",
        "TenantClass": 0,
        "Source": "DataXceiver.java:261",
        "ThreadID": 14423,
        "ThreadName": "",
        "EventID": "8D2F6FF0C215CD79",
        "BaggageBytes": "[[248 5] [240 0] [0 32 236 228 215 242 99 252 90] [240 1] [0 177 183 170 189 56 92 41 183] [240 3] [0 2]]",
        "ProcessID": 28198
      },
      {
        "Cycles": 0,
        "Agent": "edu.brown.cs.systems.retro.benchmarks.hdfs_client.Reader",
        "ProcessName": "Read",
        "TaskID": "20ECE4D7F263FC5A",
        "ParentEventID": [
          "0"
        ],
        "Label": "Reading file",
        "Title": "X-Trace Task",
        "Host": "pinky19.mpi-sws.org",
        "HRT": 26966630087088426,
        "Timestamp": "1557750270027.187500",
        "TenantClass": 0,
        "ThreadID": 1,
        "ThreadName": "",
        "EventID": "E108E415474F63D2",
        "ProcessID": 2801,
        "Tag": [
          "reader_100kb",
          "Read Size: 102400"
        ]
      }
    ]
  }
]