[
  {
    "id": "C593771FAF8A3557",
    "reports": [
      {
        "Cycles": 0,
        "Agent": "edu.brown.cs.systems.retro.benchmarks.hdfs_client.Reader",
        "ProcessName": "Read",
        "TaskID": "C593771FAF8A3557",
        "ParentEventID": [
          "C45F6637E8A47685"
        ],
        "Label": "Reading file",
        "Title": "X-Trace Task",
        "Host": "pinky19.mpi-sws.org",
        "HRT": 26966623043112369,
        "Timestamp": "1557750262983.259521",
        "TenantClass": 0,
        "ThreadID": 1,
        "ThreadName": "",
        "EventID": "954E0E698DC98141",
        "ProcessID": 2801
      },
      {
        "Cycles": 0,
        "Agent": "Execution-CPU",
        "ProcessName": "Read",
        "TaskID": "C593771FAF8A3557",
        "ParentEventID": [
          "7694465A7CF70A72"
        ],
        "Label": "set",
        "Title": "X-Trace Task",
        "Host": "pinky19.mpi-sws.org",
        "HRT": 26966623043193785,
        "Operation": "set",
        "Timestamp": "1557750262983.340820",
        "TenantClass": 0,
        "Source": "Client.java:1032",
        "ThreadID": 41,
        "ThreadName": "",
        "EventID": "66D8CE730837D0F8",
        "ProcessID": 2801
      },
      {
        "Cycles": 0,
        "Agent": "edu.brown.cs.systems.xtrace.logging.BaggageWrappers",
        "ProcessName": "Read",
        "TaskID": "C593771FAF8A3557",
        "ParentEventID": [
          "66D8CE730837D0F8"
        ],
        "Label": "Forking current baggage with Baggage.fork()",
        "Title": "X-Trace Task",
        "Host": "pinky19.mpi-sws.org",
        "HRT": 26966623043214298,
        "Operation": "fork",
        "Timestamp": "1557750262983.361328",
        "TenantClass": 0,
        "Source": "Client.java:1043",
        "ThreadID": 41,
        "ThreadName": "",
        "EventID": "FE8476EEA922D2EF",
        "ProcessID": 2801
      },
      {
        "Cycles": 0,
        "Agent": "Execution-CPU",
        "ProcessName": "Read",
        "TaskID": "C593771FAF8A3557",
        "ParentEventID": [
          "FE8476EEA922D2EF"
        ],
        "Label": "unset",
        "Title": "X-Trace Task",
        "Host": "pinky19.mpi-sws.org",
        "Duration": "79867",
        "HRT": 26966623043293702,
        "Operation": "unset",
        "Timestamp": "1557750262983.440918",
        "TenantClass": 0,
        "Source": "Client.java:1062",
        "ThreadID": 41,
        "ThreadName": "",
        "EventID": "ECB565B8C4B7D278",
        "ProcessID": 2801
      },
      {
        "Cycles": 0,
        "Agent": "Execution-CPU",
        "ProcessName": "Read",
        "TaskID": "C593771FAF8A3557",
        "ParentEventID": [
          "0E8402A3AAC02BEF"
        ],
        "Label": "unset",
        "Title": "X-Trace Task",
        "Host": "pinky19.mpi-sws.org",
        "Duration": "22345218",
        "HRT": 26966623043167347,
        "Operation": "unset",
        "Timestamp": "1557750262983.314453",
        "TenantClass": 0,
        "Source": "Client.java:1027",
        "ThreadID": 1,
        "ThreadName": "",
        "EventID": "7694465A7CF70A72",
        "ProcessID": 2801
      },
      {
        "Cycles": 0,
        "Agent": "org.apache.hadoop.ipc.ProtobufRpcEngine",
        "ProcessName": "Read",
        "TaskID": "C593771FAF8A3557",
        "ParentEventID": [
          "954E0E698DC98141"
        ],
        "Label": "Invoking org.apache.hadoop.hdfs.protocol.ClientProtocol.getBlockLocations",
        "Title": "X-Trace Task",
        "Host": "pinky19.mpi-sws.org",
        "HRT": 26966623043142340,
        "Timestamp": "1557750262983.289551",
        "TenantClass": 0,
        "Source": "ProtobufRpcEngine.java:228",
        "ThreadID": 1,
        "ThreadName": "",
        "EventID": "0E8402A3AAC02BEF",
        "ProcessID": 2801
      },
      {
        "Cycles": 0,
        "Agent": "Execution-CPU",
        "ProcessName": "Read",
        "TaskID": "C593771FAF8A3557",
        "ParentEventID": [
          "ECB565B8C4B7D278"
        ],
        "Label": "set",
        "Title": "X-Trace Task",
        "Host": "pinky19.mpi-sws.org",
        "HRT": 26966623043317080,
        "Operation": "set",
        "Timestamp": "1557750262983.464111",
        "TenantClass": 0,
        "Source": "Client.java:1104",
        "ThreadID": 1,
        "ThreadName": "",
        "EventID": "7157CD4D575961CE",
        "ProcessID": 2801
      },
      {
        "Cycles": 0,
        "Agent": "Execution-CPU",
        "ProcessName": "Name",
        "TaskID": "C593771FAF8A3557",
        "ParentEventID": [
          "FE8476EEA922D2EF"
        ],
        "Label": "set",
        "Title": "X-Trace Task",
        "Host": "pinky19.mpi-sws.org",
        "HRT": 26966623043337380,
        "Operation": "set",
        "Timestamp": "1557750262983.737793",
        "TenantClass": 0,
        "Source": "Server.java:1840",
        "ThreadID": 48,
        "ThreadName": "",
        "EventID": "7E8D46EC605E8FC3",
        "BaggageBytes": "[[248 5] [240 0] [0 197 147 119 31 175 138 53 87] [240 1] [0 254 132 118 238 169 34 210 239] [240 3] [0 2]]",
        "ProcessID": 2171
      },
      {
        "Cycles": 0,
        "Agent": "edu.brown.cs.systems.xtrace.logging.BaggageWrappers",
        "ProcessName": "Name",
        "TaskID": "C593771FAF8A3557",
        "ParentEventID": [
          "7E8D46EC605E8FC3"
        ],
        "Label": "Forking current baggage with Baggage.fork()",
        "Title": "X-Trace Task",
        "Host": "pinky19.mpi-sws.org",
        "HRT": 26966623043375270,
        "Operation": "fork",
        "Timestamp": "1557750262983.775635",
        "TenantClass": 0,
        "Source": "Server.java:550",
        "ThreadID": 48,
        "ThreadName": "",
        "EventID": "8F5C6234D71FB5CA",
        "BaggageBytes": "[[248 5] [240 0] [0 197 147 119 31 175 138 53 87] [240 1] [0 126 141 70 236 96 94 143 195] [240 3] [0 2]]",
        "ProcessID": 2171
      },
      {
        "Cycles": 0,
        "Agent": "Execution-CPU",
        "ProcessName": "Name",
        "TaskID": "C593771FAF8A3557",
        "ParentEventID": [
          "8F5C6234D71FB5CA"
        ],
        "Label": "set",
        "Title": "X-Trace Task",
        "Host": "pinky19.mpi-sws.org",
        "HRT": 26966623043406094,
        "Operation": "set",
        "Timestamp": "1557750262983.806396",
        "TenantClass": 0,
        "Source": "Server.java:2071",
        "ThreadID": 55,
        "ThreadName": "",
        "EventID": "6325D38356A2B29A",
        "BaggageBytes": "[[248 5] [240 0] [0 197 147 119 31 175 138 53 87] [240 1] [0 143 92 98 52 215 31 181 202] [240 3] [0 2]]",
        "ProcessID": 2171
      },
      {
        "Cycles": 0,
        "Agent": "Execution-CPU",
        "ProcessName": "Name",
        "TaskID": "C593771FAF8A3557",
        "ParentEventID": [
          "8F5C6234D71FB5CA"
        ],
        "Label": "unset",
        "Title": "X-Trace Task",
        "Host": "pinky19.mpi-sws.org",
        "Duration": "22688",
        "HRT": 26966623043394823,
        "Operation": "unset",
        "Timestamp": "1557750262983.795166",
        "TenantClass": 0,
        "Source": "Server.java:1828",
        "ThreadID": 48,
        "ThreadName": "",
        "EventID": "05AE14F3AEA2324A",
        "BaggageBytes": "[[248 5] [240 0] [0 197 147 119 31 175 138 53 87] [240 1] [0 143 92 98 52 215 31 181 202] [240 3] [0 2]]",
        "ProcessID": 2171
      },
      {
        "Cycles": 0,
        "Agent": "org.apache.hadoop.ipc.Server",
        "ProcessName": "Name",
        "TaskID": "C593771FAF8A3557",
        "ParentEventID": [
          "6325D38356A2B29A"
        ],
        "Label": "getBlockLocations in org.apache.hadoop.hdfs.protocol.ClientProtocol",
        "Title": "X-Trace Task",
        "Host": "pinky19.mpi-sws.org",
        "HRT": 26966623043446567,
        "Timestamp": "1557750262983.846924",
        "TenantClass": 0,
        "Source": "ProtobufRpcEngine.java:601",
        "ThreadID": 55,
        "ThreadName": "",
        "EventID": "7CAA3CC0772959E0",
        "BaggageBytes": "[[248 5] [240 0] [0 197 147 119 31 175 138 53 87] [240 1] [0 99 37 211 131 86 162 178 154] [240 3] [0 2]]",
        "ProcessID": 2171
      },
      {
        "Cycles": 0,
        "Agent": "edu.brown.cs.systems.xtrace.logging.BaggageWrappers",
        "ProcessName": "Name",
        "TaskID": "C593771FAF8A3557",
        "ParentEventID": [
          "A2650E54F98B509D"
        ],
        "Label": "Forking current baggage with Baggage.fork()",
        "Title": "X-Trace Task",
        "Host": "pinky19.mpi-sws.org",
        "HRT": 26966623043555364,
        "Operation": "fork",
        "Timestamp": "1557750262983.955566",
        "TenantClass": 0,
        "Source": "Server.java:2398",
        "ThreadID": 55,
        "ThreadName": "",
        "EventID": "1BC5419BEA75DFEC",
        "BaggageBytes": "[[248 5] [240 0] [0 197 147 119 31 175 138 53 87] [240 1] [0 162 101 14 84 249 139 80 157] [240 3] [0 2]]",
        "ProcessID": 2171
      },
      {
        "Cycles": 0,
        "Agent": "org.apache.hadoop.hdfs.server.namenode.FSNamesystem.audit",
        "ProcessName": "Name",
        "TaskID": "C593771FAF8A3557",
        "ParentEventID": [
          "7CAA3CC0772959E0"
        ],
        "Label": "allowed=true\tugi=plascas (auth:SIMPLE)\tip=/139.19.171.63\tcmd=open\tsrc=/ds/wKPO64pxLB3MgQXx\tdst=null\tperm=null\tproto=rpc",
        "Title": "X-Trace Task",
        "Host": "pinky19.mpi-sws.org",
        "HRT": 26966623043492115,
        "Timestamp": "1557750262983.892334",
        "TenantClass": 0,
        "Source": "FSNamesystem.java:8313",
        "ThreadID": 55,
        "ThreadName": "",
        "EventID": "A2650E54F98B509D",
        "BaggageBytes": "[[248 5] [240 0] [0 197 147 119 31 175 138 53 87] [240 1] [0 124 170 60 192 119 41 89 224] [240 3] [0 2]]",
        "ProcessID": 2171
      },
      {
        "Cycles": 0,
        "Agent": "Execution-CPU",
        "ProcessName": "Name",
        "TaskID": "C593771FAF8A3557",
        "ParentEventID": [
          "1BC5419BEA75DFEC"
        ],
        "Label": "unset",
        "Title": "X-Trace Task",
        "Host": "pinky19.mpi-sws.org",
        "Duration": "232811",
        "HRT": 26966623043666953,
        "Operation": "unset",
        "Timestamp": "1557750262984.067139",
        "TenantClass": 0,
        "Source": "Server.java:1058",
        "ThreadID": 55,
        "ThreadName": "",
        "EventID": "585975EB0B393F4A",
        "BaggageBytes": "[[248 5] [240 0] [0 197 147 119 31 175 138 53 87] [240 1] [0 27 197 65 155 234 117 223 236] [240 3] [0 2]]",
        "ProcessID": 2171
      },
      {
        "Cycles": 0,
        "Agent": "Execution-CPU",
        "ProcessName": "Read",
        "TaskID": "C593771FAF8A3557",
        "ParentEventID": [
          "9F9E261199AA077C"
        ],
        "Label": "unset",
        "Title": "X-Trace Task",
        "Host": "pinky19.mpi-sws.org",
        "Duration": "10542",
        "HRT": 26966623043732820,
        "Operation": "unset",
        "Timestamp": "1557750262983.879883",
        "TenantClass": 0,
        "Source": "Client.java:1168",
        "ThreadID": 40,
        "ThreadName": "",
        "EventID": "F6CA539AAB35F752",
        "ProcessID": 2801
      },
      {
        "Cycles": 0,
        "Agent": "Execution-CPU",
        "ProcessName": "Read",
        "TaskID": "C593771FAF8A3557",
        "ParentEventID": [
          "1BC5419BEA75DFEC"
        ],
        "Label": "set",
        "Title": "X-Trace Task",
        "Host": "pinky19.mpi-sws.org",
        "HRT": 26966623043708926,
        "Operation": "set",
        "Timestamp": "1557750262983.855957",
        "TenantClass": 0,
        "Source": "Client.java:302",
        "ThreadID": 40,
        "ThreadName": "",
        "EventID": "9F9E261199AA077C",
        "ProcessID": 2801
      },
      {
        "Cycles": 0,
        "Agent": "Execution-Sleep",
        "ProcessName": "Read",
        "TaskID": "C593771FAF8A3557",
        "ParentEventID": [
          "7157CD4D575961CE"
        ],
        "Label": "waited",
        "Title": "X-Trace Task",
        "Host": "pinky19.mpi-sws.org",
        "Duration": "427443",
        "HRT": 26966623043751152,
        "Operation": "waited",
        "Timestamp": "1557750262983.898193",
        "TenantClass": 0,
        "Source": "Client.java:1537",
        "ThreadID": 1,
        "ThreadName": "",
        "EventID": "33BE532A8CB5D57E",
        "ProcessID": 2801
      },
      {
        "Cycles": 0,
        "Agent": "edu.brown.cs.systems.xtrace.logging.BaggageWrappers",
        "ProcessName": "Read",
        "TaskID": "C593771FAF8A3557",
        "ParentEventID": [
          "F6CA539AAB35F752",
          "33BE532A8CB5D57E"
        ],
        "Label": "Merged current baggage with other baggage",
        "Title": "X-Trace Task",
        "Host": "pinky19.mpi-sws.org",
        "HRT": 26966623043762792,
        "Operation": "join",
        "Timestamp": "1557750262983.909912",
        "TenantClass": 0,
        "Source": "Client.java:1545",
        "ThreadID": 1,
        "ThreadName": "",
        "EventID": "0721132E465B6E38",
        "ProcessID": 2801
      },
      {
        "Cycles": 0,
        "Agent": "org.apache.hadoop.ipc.ProtobufRpcEngine",
        "ProcessName": "Read",
        "TaskID": "C593771FAF8A3557",
        "ParentEventID": [
          "0721132E465B6E38"
        ],
        "Label": "org.apache.hadoop.hdfs.protocol.ClientProtocol.getBlockLocations completed",
        "Title": "X-Trace Task",
        "Host": "pinky19.mpi-sws.org",
        "HRT": 26966623043798564,
        "Timestamp": "1557750262983.945801",
        "TenantClass": 0,
        "Source": "ProtobufRpcEngine.java:275",
        "ThreadID": 1,
        "ThreadName": "",
        "EventID": "24417F86A0A1E3D6",
        "ProcessID": 2801
      },
      {
        "Cycles": 0,
        "Agent": "edu.brown.cs.systems.xtrace.logging.BaggageWrappers",
        "ProcessName": "Read",
        "TaskID": "C593771FAF8A3557",
        "ParentEventID": [
          "896DB4E581895E50"
        ],
        "Label": "Forking current baggage with Baggage.fork()",
        "Title": "X-Trace Task",
        "Host": "pinky19.mpi-sws.org",
        "HRT": 26966623044016183,
        "Operation": "fork",
        "Timestamp": "1557750262984.163330",
        "TenantClass": 0,
        "Source": "DataTransferProtoUtil.java:94",
        "ThreadID": 1,
        "ThreadName": "",
        "EventID": "36D43D8019D91270",
        "ProcessID": 2801
      },
      {
        "Cycles": 0,
        "Agent": "Execution-CPU",
        "ProcessName": "Data",
        "TaskID": "C593771FAF8A3557",
        "ParentEventID": [
          "36D43D8019D91270"
        ],
        "Label": "set",
        "Title": "X-Trace Task",
        "Host": "pinky26.mpi-sws.org",
        "HRT": 47516279774054506,
        "Operation": "set",
        "Timestamp": "1557750262984.762695",
        "TenantClass": 0,
        "Source": "Receiver.java:117",
        "ThreadID": 8549,
        "ThreadName": "",
        "EventID": "BDD2E8F4293F5C2B",
        "BaggageBytes": "[[248 5] [240 0] [0 197 147 119 31 175 138 53 87] [240 1] [0 54 212 61 128 25 217 18 112] [240 3] [0 2]]",
        "ProcessID": 17069
      },
      {
        "Cycles": 0,
        "Agent": "Execution-Sleep",
        "ProcessName": "Read",
        "TaskID": "C593771FAF8A3557",
        "ParentEventID": [
          "24417F86A0A1E3D6"
        ],
        "Label": "waited",
        "Title": "X-Trace Task",
        "Host": "pinky19.mpi-sws.org",
        "Duration": "87811",
        "HRT": 26966623043962138,
        "Operation": "waited",
        "Timestamp": "1557750262984.109375",
        "TenantClass": 0,
        "Source": "SocketIOWithTimeout.java:335",
        "ThreadID": 1,
        "ThreadName": "",
        "EventID": "896DB4E581895E50",
        "ProcessID": 2801
      },
      {
        "Cycles": 0,
        "Agent": "edu.brown.cs.systems.xtrace.logging.XTraceInit",
        "ProcessName": "Data",
        "TaskID": "C593771FAF8A3557",
        "ParentEventID": [
          "BDD2E8F4293F5C2B"
        ],
        "Label": "Thread.setName: DataXceiver for client DFSClient_NONMAPREDUCE_310321604_1 at /139.19.171.63:43116 [Sending block BP-1633380353-139.19.171.63-1554193446451:blk_1073760515_19691]",
        "Title": "X-Trace Task",
        "Host": "pinky26.mpi-sws.org",
        "HRT": 47516279774215596,
        "Timestamp": "1557750262984.923828",
        "TenantClass": 0,
        "Source": "DataXceiver.java:168",
        "ThreadID": 8549,
        "ThreadName": "",
        "EventID": "3CEB0D772D244CAE",
        "BaggageBytes": "[[248 5] [240 0] [0 197 147 119 31 175 138 53 87] [240 1] [0 189 210 232 244 41 63 92 43] [240 3] [0 2]]",
        "ProcessID": 17069
      },
      {
        "Cycles": 0,
        "Agent": "edu.brown.cs.systems.retro.benchmarks.hdfs_client.Reader",
        "ProcessName": "Read",
        "TaskID": "C593771FAF8A3557",
        "ParentEventID": [
          "0"
        ],
        "Label": "Reading file",
        "Title": "X-Trace Task",
        "Host": "pinky19.mpi-sws.org",
        "HRT": 26966623043100930,
        "Timestamp": "1557750262983.248047",
        "TenantClass": 0,
        "ThreadID": 1,
        "ThreadName": "",
        "EventID": "C45F6637E8A47685",
        "ProcessID": 2801,
        "Tag": [
          "reader_100kb",
          "Read Size: 102400"
        ]
      },
      {
        "Cycles": 0,
        "Agent": "edu.brown.cs.systems.xtrace.logging.BaggageWrappers",
        "ProcessName": "Data",
        "TaskID": "C593771FAF8A3557",
        "ParentEventID": [
          "3CEB0D772D244CAE"
        ],
        "Label": "Forking current baggage with Baggage.fork()",
        "Title": "X-Trace Task",
        "Host": "pinky26.mpi-sws.org",
        "HRT": 47516279784855965,
        "Operation": "fork",
        "Timestamp": "1557750262995.564209",
        "TenantClass": 0,
        "Source": "DataXceiver.java:1257",
        "ThreadID": 8549,
        "ThreadName": "",
        "EventID": "BBE50589537D62DB",
        "BaggageBytes": "[[248 5] [240 0] [0 197 147 119 31 175 138 53 87] [240 1] [0 60 235 13 119 45 36 76 174] [240 3] [0 2]]",
        "ProcessID": 17069
      },
      {
        "Cycles": 0,
        "Agent": "Execution-Sleep",
        "ProcessName": "Read",
        "TaskID": "C593771FAF8A3557",
        "ParentEventID": [
          "36D43D8019D91270"
        ],
        "Label": "waited",
        "Title": "X-Trace Task",
        "Host": "pinky19.mpi-sws.org",
        "Duration": "11554837",
        "HRT": 26966623055678212,
        "Operation": "waited",
        "Timestamp": "1557750262995.825439",
        "TenantClass": 0,
        "Source": "SocketIOWithTimeout.java:335",
        "ThreadID": 1,
        "ThreadName": "",
        "EventID": "FBC143D7CC48544E",
        "ProcessID": 2801
      },
      {
        "Cycles": 0,
        "Agent": "edu.brown.cs.systems.xtrace.logging.BaggageWrappers",
        "ProcessName": "Read",
        "TaskID": "C593771FAF8A3557",
        "ParentEventID": [
          "BBE50589537D62DB",
          "FBC143D7CC48544E"
        ],
        "Label": "Merged current baggage with other baggage",
        "Title": "X-Trace Task",
        "Host": "pinky19.mpi-sws.org",
        "HRT": 26966623055747158,
        "Operation": "join",
        "Timestamp": "1557750262995.894287",
        "TenantClass": 0,
        "Source": "RemoteBlockReader2.java:429",
        "ThreadID": 1,
        "ThreadName": "",
        "EventID": "41905C8A75BBA7BF",
        "ProcessID": 2801
      },
      {
        "Cycles": 0,
        "Agent": "edu.brown.cs.systems.xtrace.logging.BaggageWrappers",
        "ProcessName": "Data",
        "TaskID": "C593771FAF8A3557",
        "ParentEventID": [
          "BBE50589537D62DB"
        ],
        "Label": "Forking current baggage with Baggage.fork()",
        "Title": "X-Trace Task",
        "Host": "pinky26.mpi-sws.org",
        "HRT": 47516279785116345,
        "Operation": "fork",
        "Timestamp": "1557750262995.824463",
        "TenantClass": 0,
        "Source": "PacketHeader.java:95",
        "ThreadID": 8549,
        "ThreadName": "",
        "EventID": "C72136CE1797A758",
        "BaggageBytes": "[[248 5] [240 0] [0 197 147 119 31 175 138 53 87] [240 1] [0 187 229 5 137 83 125 98 219] [240 3] [0 2]]",
        "ProcessID": 17069
      },
      {
        "Cycles": 0,
        "Agent": "Execution-Sleep",
        "ProcessName": "Read",
        "TaskID": "C593771FAF8A3557",
        "ParentEventID": [
          "41905C8A75BBA7BF"
        ],
        "Label": "waited",
        "Title": "X-Trace Task",
        "Host": "pinky19.mpi-sws.org",
        "Duration": "38685",
        "HRT": 26966623055848711,
        "Operation": "waited",
        "Timestamp": "1557750262995.995850",
        "TenantClass": 0,
        "Source": "SocketIOWithTimeout.java:335",
        "ThreadID": 1,
        "ThreadName": "",
        "EventID": "A4F5F62D148132E1",
        "ProcessID": 2801
      },
      {
        "Cycles": 0,
        "Agent": "Execution-Sleep",
        "ProcessName": "Data",
        "TaskID": "C593771FAF8A3557",
        "ParentEventID": [
          "C72136CE1797A758"
        ],
        "Label": "waited",
        "Title": "X-Trace Task",
        "Host": "pinky26.mpi-sws.org",
        "Duration": "14463",
        "HRT": 47516279785262373,
        "Operation": "waited",
        "Timestamp": "1557750262995.970459",
        "TenantClass": 0,
        "Source": "SocketIOWithTimeout.java:335",
        "ThreadID": 8549,
        "ThreadName": "",
        "EventID": "41049F3A54A25D50",
        "BaggageBytes": "[[248 5] [240 0] [0 197 147 119 31 175 138 53 87] [240 1] [0 199 33 54 206 23 151 167 88] [240 3] [0 2]]",
        "ProcessID": 17069
      },
      {
        "Cycles": 0,
        "Agent": "edu.brown.cs.systems.xtrace.logging.BaggageWrappers",
        "ProcessName": "Data",
        "TaskID": "C593771FAF8A3557",
        "ParentEventID": [
          "41049F3A54A25D50"
        ],
        "Label": "Forking current baggage with Baggage.fork()",
        "Title": "X-Trace Task",
        "Host": "pinky26.mpi-sws.org",
        "HRT": 47516279788870655,
        "Operation": "fork",
        "Timestamp": "1557750262999.578857",
        "TenantClass": 0,
        "Source": "PacketHeader.java:95",
        "ThreadID": 8549,
        "ThreadName": "",
        "EventID": "CB5B6A901BD36CFA",
        "BaggageBytes": "[[248 5] [240 0] [0 197 147 119 31 175 138 53 87] [240 1] [0 65 4 159 58 84 162 93 80] [240 3] [0 2]]",
        "ProcessID": 17069
      },
      {
        "Cycles": 0,
        "Agent": "Execution-Sleep",
        "ProcessName": "Read",
        "TaskID": "C593771FAF8A3557",
        "ParentEventID": [
          "A4F5F62D148132E1"
        ],
        "Label": "waited",
        "Title": "X-Trace Task",
        "Host": "pinky19.mpi-sws.org",
        "Duration": "3750405",
        "HRT": 26966623059654678,
        "Operation": "waited",
        "Timestamp": "1557750262999.801758",
        "TenantClass": 0,
        "Source": "SocketIOWithTimeout.java:335",
        "ThreadID": 1,
        "ThreadName": "",
        "EventID": "1E1936BF4900E9F1",
        "ProcessID": 2801
      },
      {
        "Cycles": 0,
        "Agent": "Execution-Sleep",
        "ProcessName": "Read",
        "TaskID": "C593771FAF8A3557",
        "ParentEventID": [
          "1E1936BF4900E9F1"
        ],
        "Label": "waited",
        "Title": "X-Trace Task",
        "Host": "pinky19.mpi-sws.org",
        "Duration": "228247",
        "HRT": 26966623059945783,
        "Operation": "waited",
        "Timestamp": "1557750263000.093018",
        "TenantClass": 0,
        "Source": "SocketIOWithTimeout.java:335",
        "ThreadID": 1,
        "ThreadName": "",
        "EventID": "47D22048D0011105",
        "ProcessID": 2801
      },
      {
        "Cycles": 0,
        "Agent": "Execution-Sleep",
        "ProcessName": "Read",
        "TaskID": "C593771FAF8A3557",
        "ParentEventID": [
          "47D22048D0011105"
        ],
        "Label": "waited",
        "Title": "X-Trace Task",
        "Host": "pinky19.mpi-sws.org",
        "Duration": "148767",
        "HRT": 26966623060153773,
        "Operation": "waited",
        "Timestamp": "1557750263000.301025",
        "TenantClass": 0,
        "Source": "SocketIOWithTimeout.java:335",
        "ThreadID": 1,
        "ThreadName": "",
        "EventID": "FDF0D296BCFC9764",
        "ProcessID": 2801
      },
      {
        "Cycles": 0,
        "Agent": "edu.brown.cs.systems.xtrace.logging.BaggageWrappers",
        "ProcessName": "Read",
        "TaskID": "C593771FAF8A3557",
        "ParentEventID": [
          "C72136CE1797A758",
          "FDF0D296BCFC9764"
        ],
        "Label": "Merged current baggage with other baggage",
        "Title": "X-Trace Task",
        "Host": "pinky19.mpi-sws.org",
        "HRT": 26966623060222260,
        "Operation": "join",
        "Timestamp": "1557750263000.369385",
        "TenantClass": 0,
        "Source": "PacketHeader.java:168",
        "ThreadID": 1,
        "ThreadName": "",
        "EventID": "86C4B62ED02C2995",
        "ProcessID": 2801
      },
      {
        "Cycles": 0,
        "Agent": "edu.brown.cs.systems.xtrace.logging.BaggageWrappers",
        "ProcessName": "Read",
        "TaskID": "C593771FAF8A3557",
        "ParentEventID": [
          "86C4B62ED02C2995",
          "CB5B6A901BD36CFA"
        ],
        "Label": "Merged current baggage with other baggage",
        "Title": "X-Trace Task",
        "Host": "pinky19.mpi-sws.org",
        "HRT": 26966623060318926,
        "Operation": "join",
        "Timestamp": "1557750263000.466064",
        "TenantClass": 0,
        "Source": "PacketHeader.java:168",
        "ThreadID": 1,
        "ThreadName": "",
        "EventID": "8556DCF648DEF258",
        "ProcessID": 2801
      },
      {
        "Cycles": 0,
        "Agent": "edu.brown.cs.systems.xtrace.logging.BaggageWrappers",
        "ProcessName": "Read",
        "TaskID": "C593771FAF8A3557",
        "ParentEventID": [
          "8556DCF648DEF258"
        ],
        "Label": "Forking current baggage with Baggage.fork()",
        "Title": "X-Trace Task",
        "Host": "pinky19.mpi-sws.org",
        "HRT": 26966623060328755,
        "Operation": "fork",
        "Timestamp": "1557750263000.475830",
        "TenantClass": 0,
        "Source": "RemoteBlockReader2.java:361",
        "ThreadID": 1,
        "ThreadName": "",
        "EventID": "309DFF22B137B023",
        "ProcessID": 2801
      },
      {
        "Cycles": 0,
        "Agent": "edu.brown.cs.systems.xtrace.logging.BaggageWrappers",
        "ProcessName": "Read",
        "TaskID": "C593771FAF8A3557",
        "ParentEventID": [
          "309DFF22B137B023"
        ],
        "Label": "Forking current baggage with Baggage.fork()",
        "Title": "X-Trace Task",
        "Host": "pinky19.mpi-sws.org",
        "HRT": 26966623060395542,
        "Operation": "fork",
        "Timestamp": "1557750263000.542725",
        "TenantClass": 0,
        "Source": "DataTransferProtoUtil.java:94",
        "ThreadID": 1,
        "ThreadName": "",
        "EventID": "278EBF6B723D53E4",
        "ProcessID": 2801
      },
      {
        "Cycles": 0,
        "Agent": "Execution-Sleep",
        "ProcessName": "Data",
        "TaskID": "C593771FAF8A3557",
        "ParentEventID": [
          "CB5B6A901BD36CFA"
        ],
        "Label": "waited",
        "Title": "X-Trace Task",
        "Host": "pinky26.mpi-sws.org",
        "Duration": "768358",
        "HRT": 47516279789822639,
        "Operation": "waited",
        "Timestamp": "1557750263000.530762",
        "TenantClass": 0,
        "Source": "SocketIOWithTimeout.java:335",
        "ThreadID": 8549,
        "ThreadName": "",
        "EventID": "6CBB017C536C711B",
        "BaggageBytes": "[[248 5] [240 0] [0 197 147 119 31 175 138 53 87] [240 1] [0 203 91 106 144 27 211 108 250] [240 3] [0 2]]",
        "ProcessID": 17069
      },
      {
        "Cycles": 0,
        "Agent": "edu.brown.cs.systems.xtrace.logging.BaggageWrappers",
        "ProcessName": "Data",
        "TaskID": "C593771FAF8A3557",
        "ParentEventID": [
          "309DFF22B137B023",
          "6CBB017C536C711B"
        ],
        "Label": "Merged current baggage with other baggage",
        "Title": "X-Trace Task",
        "Host": "pinky26.mpi-sws.org",
        "HRT": 47516279789973578,
        "Operation": "join",
        "Timestamp": "1557750263000.681641",
        "TenantClass": 0,
        "Source": "DataXceiver.java:574",
        "ThreadID": 8549,
        "ThreadName": "",
        "EventID": "3FCD9910E0202CF9",
        "BaggageBytes": "[[248 5] [240 0] [0 197 147 119 31 175 138 53 87] [240 1] [0 48 157 255 34 177 55 176 35] [0 108 187 1 124 83 108 113 27] [240 3] [0 2]]",
        "ProcessID": 17069
      },
      {
        "Cycles": 0,
        "Agent": "Execution-CPU",
        "ProcessName": "Data",
        "TaskID": "C593771FAF8A3557",
        "ParentEventID": [
          "3FCD9910E0202CF9"
        ],
        "Label": "unset",
        "Title": "X-Trace Task",
        "Host": "pinky26.mpi-sws.org",
        "Duration": "15877366",
        "HRT": 47516279790024225,
        "Operation": "unset",
        "Timestamp": "1557750263000.732422",
        "TenantClass": 0,
        "Source": "DataXceiver.java:261",
        "ThreadID": 8549,
        "ThreadName": "",
        "EventID": "64C68D6D66F7BFA4",
        "BaggageBytes": "[[248 5] [240 0] [0 197 147 119 31 175 138 53 87] [240 1] [0 63 205 153 16 224 32 44 249] [240 3] [0 2]]",
        "ProcessID": 17069
      },
      {
        "Cycles": 0,
        "Agent": "Execution-CPU",
        "ProcessName": "Data",
        "TaskID": "C593771FAF8A3557",
        "ParentEventID": [
          "278EBF6B723D53E4"
        ],
        "Label": "set",
        "Title": "X-Trace Task",
        "Host": "pinky26.mpi-sws.org",
        "HRT": 47516279790113911,
        "Operation": "set",
        "Timestamp": "1557750263000.822021",
        "TenantClass": 0,
        "Source": "Receiver.java:117",
        "ThreadID": 8549,
        "ThreadName": "",
        "EventID": "F6E250CC16E12A7E",
        "BaggageBytes": "[[248 5] [240 0] [0 197 147 119 31 175 138 53 87] [240 1] [0 39 142 191 107 114 61 83 228] [240 3] [0 2]]",
        "ProcessID": 17069
      },
      {
        "Cycles": 0,
        "Agent": "edu.brown.cs.systems.xtrace.logging.XTraceInit",
        "ProcessName": "Data",
        "TaskID": "C593771FAF8A3557",
        "ParentEventID": [
          "F6E250CC16E12A7E"
        ],
        "Label": "Thread.setName: DataXceiver for client DFSClient_NONMAPREDUCE_310321604_1 at /139.19.171.63:43116 [Sending block BP-1633380353-139.19.171.63-1554193446451:blk_1073760515_19691]",
        "Title": "X-Trace Task",
        "Host": "pinky26.mpi-sws.org",
        "HRT": 47516279790190921,
        "Timestamp": "1557750263000.899170",
        "TenantClass": 0,
        "Source": "DataXceiver.java:168",
        "ThreadID": 8549,
        "ThreadName": "",
        "EventID": "F6D2005B94D2045E",
        "BaggageBytes": "[[248 5] [240 0] [0 197 147 119 31 175 138 53 87] [240 1] [0 246 226 80 204 22 225 42 126] [240 3] [0 2]]",
        "ProcessID": 17069
      },
      {
        "Cycles": 0,
        "Agent": "edu.brown.cs.systems.xtrace.logging.BaggageWrappers",
        "ProcessName": "Data",
        "TaskID": "C593771FAF8A3557",
        "ParentEventID": [
          "F6D2005B94D2045E"
        ],
        "Label": "Forking current baggage with Baggage.fork()",
        "Title": "X-Trace Task",
        "Host": "pinky26.mpi-sws.org",
        "HRT": 47516279790373984,
        "Operation": "fork",
        "Timestamp": "1557750263001.082031",
        "TenantClass": 0,
        "Source": "DataXceiver.java:1257",
        "ThreadID": 8549,
        "ThreadName": "",
        "EventID": "5DA7D2875C4E47D2",
        "BaggageBytes": "[[248 5] [240 0] [0 197 147 119 31 175 138 53 87] [240 1] [0 246 210 0 91 148 210 4 94] [240 3] [0 2]]",
        "ProcessID": 17069
      },
      {
        "Cycles": 0,
        "Agent": "Execution-Sleep",
        "ProcessName": "Read",
        "TaskID": "C593771FAF8A3557",
        "ParentEventID": [
          "278EBF6B723D53E4"
        ],
        "Label": "waited",
        "Title": "X-Trace Task",
        "Host": "pinky19.mpi-sws.org",
        "Duration": "598098",
        "HRT": 26966623061066033,
        "Operation": "waited",
        "Timestamp": "1557750263001.213135",
        "TenantClass": 0,
        "Source": "SocketIOWithTimeout.java:335",
        "ThreadID": 1,
        "ThreadName": "",
        "EventID": "FFAD5F8FD36B9F0B",
        "ProcessID": 2801
      },
      {
        "Cycles": 0,
        "Agent": "edu.brown.cs.systems.xtrace.logging.BaggageWrappers",
        "ProcessName": "Read",
        "TaskID": "C593771FAF8A3557",
        "ParentEventID": [
          "FFAD5F8FD36B9F0B",
          "5DA7D2875C4E47D2"
        ],
        "Label": "Merged current baggage with other baggage",
        "Title": "X-Trace Task",
        "Host": "pinky19.mpi-sws.org",
        "HRT": 26966623061118273,
        "Operation": "join",
        "Timestamp": "1557750263001.265381",
        "TenantClass": 0,
        "Source": "RemoteBlockReader2.java:429",
        "ThreadID": 1,
        "ThreadName": "",
        "EventID": "B97A56B5F29C7A2E",
        "ProcessID": 2801
      },
      {
        "Cycles": 0,
        "Agent": "edu.brown.cs.systems.xtrace.logging.BaggageWrappers",
        "ProcessName": "Data",
        "TaskID": "C593771FAF8A3557",
        "ParentEventID": [
          "5DA7D2875C4E47D2"
        ],
        "Label": "Forking current baggage with Baggage.fork()",
        "Title": "X-Trace Task",
        "Host": "pinky26.mpi-sws.org",
        "HRT": 47516279790483828,
        "Operation": "fork",
        "Timestamp": "1557750263001.191895",
        "TenantClass": 0,
        "Source": "PacketHeader.java:95",
        "ThreadID": 8549,
        "ThreadName": "",
        "EventID": "D37B1E8F54ED623D",
        "BaggageBytes": "[[248 5] [240 0] [0 197 147 119 31 175 138 53 87] [240 1] [0 93 167 210 135 92 78 71 210] [240 3] [0 2]]",
        "ProcessID": 17069
      },
      {
        "Cycles": 0,
        "Agent": "Execution-Sleep",
        "ProcessName": "Data",
        "TaskID": "C593771FAF8A3557",
        "ParentEventID": [
          "D37B1E8F54ED623D"
        ],
        "Label": "waited",
        "Title": "X-Trace Task",
        "Host": "pinky26.mpi-sws.org",
        "Duration": "7395",
        "HRT": 47516279790583338,
        "Operation": "waited",
        "Timestamp": "1557750263001.291504",
        "TenantClass": 0,
        "Source": "SocketIOWithTimeout.java:335",
        "ThreadID": 8549,
        "ThreadName": "",
        "EventID": "CDB7C3B46C90D2EE",
        "BaggageBytes": "[[248 5] [240 0] [0 197 147 119 31 175 138 53 87] [240 1] [0 211 123 30 143 84 237 98 61] [240 3] [0 2]]",
        "ProcessID": 17069
      },
      {
        "Cycles": 0,
        "Agent": "edu.brown.cs.systems.xtrace.logging.BaggageWrappers",
        "ProcessName": "Data",
        "TaskID": "C593771FAF8A3557",
        "ParentEventID": [
          "CDB7C3B46C90D2EE"
        ],
        "Label": "Forking current baggage with Baggage.fork()",
        "Title": "X-Trace Task",
        "Host": "pinky26.mpi-sws.org",
        "HRT": 47516279790700366,
        "Operation": "fork",
        "Timestamp": "1557750263001.408447",
        "TenantClass": 0,
        "Source": "PacketHeader.java:95",
        "ThreadID": 8549,
        "ThreadName": "",
        "EventID": "68D2C63EAAEE1465",
        "BaggageBytes": "[[248 5] [240 0] [0 197 147 119 31 175 138 53 87] [240 1] [0 205 183 195 180 108 144 210 238] [240 3] [0 2]]",
        "ProcessID": 17069
      },
      {
        "Cycles": 0,
        "Agent": "Execution-Sleep",
        "ProcessName": "Read",
        "TaskID": "C593771FAF8A3557",
        "ParentEventID": [
          "B97A56B5F29C7A2E"
        ],
        "Label": "waited",
        "Title": "X-Trace Task",
        "Host": "pinky19.mpi-sws.org",
        "Duration": "305321",
        "HRT": 26966623061512953,
        "Operation": "waited",
        "Timestamp": "1557750263001.660156",
        "TenantClass": 0,
        "Source": "SocketIOWithTimeout.java:335",
        "ThreadID": 1,
        "ThreadName": "",
        "EventID": "07D75D2C0B6AD2C5",
        "ProcessID": 2801
      },
      {
        "Cycles": 0,
        "Agent": "Execution-Sleep",
        "ProcessName": "Data",
        "TaskID": "C593771FAF8A3557",
        "ParentEventID": [
          "68D2C63EAAEE1465"
        ],
        "Label": "waited",
        "Title": "X-Trace Task",
        "Host": "pinky26.mpi-sws.org",
        "Duration": "194119",
        "HRT": 47516279790964977,
        "Operation": "waited",
        "Timestamp": "1557750263001.673096",
        "TenantClass": 0,
        "Source": "SocketIOWithTimeout.java:335",
        "ThreadID": 8549,
        "ThreadName": "",
        "EventID": "1DFD231A61080752",
        "BaggageBytes": "[[248 5] [240 0] [0 197 147 119 31 175 138 53 87] [240 1] [0 104 210 198 62 170 238 20 101] [240 3] [0 2]]",
        "ProcessID": 17069
      },
      {
        "Cycles": 0,
        "Agent": "Execution-Sleep",
        "ProcessName": "Read",
        "TaskID": "C593771FAF8A3557",
        "ParentEventID": [
          "07D75D2C0B6AD2C5"
        ],
        "Label": "waited",
        "Title": "X-Trace Task",
        "Host": "pinky19.mpi-sws.org",
        "Duration": "153928",
        "HRT": 26966623061723590,
        "Operation": "waited",
        "Timestamp": "1557750263001.870850",
        "TenantClass": 0,
        "Source": "SocketIOWithTimeout.java:335",
        "ThreadID": 1,
        "ThreadName": "",
        "EventID": "524B0D8B259505D6",
        "ProcessID": 2801
      },
      {
        "Cycles": 0,
        "Agent": "Execution-Sleep",
        "ProcessName": "Read",
        "TaskID": "C593771FAF8A3557",
        "ParentEventID": [
          "524B0D8B259505D6"
        ],
        "Label": "waited",
        "Title": "X-Trace Task",
        "Host": "pinky19.mpi-sws.org",
        "Duration": "221628",
        "HRT": 26966623061986641,
        "Operation": "waited",
        "Timestamp": "1557750263002.133789",
        "TenantClass": 0,
        "Source": "SocketIOWithTimeout.java:335",
        "ThreadID": 1,
        "ThreadName": "",
        "EventID": "A3C54158D791067B",
        "ProcessID": 2801
      },
      {
        "Cycles": 0,
        "Agent": "edu.brown.cs.systems.xtrace.logging.BaggageWrappers",
        "ProcessName": "Read",
        "TaskID": "C593771FAF8A3557",
        "ParentEventID": [
          "A3C54158D791067B",
          "D37B1E8F54ED623D"
        ],
        "Label": "Merged current baggage with other baggage",
        "Title": "X-Trace Task",
        "Host": "pinky19.mpi-sws.org",
        "HRT": 26966623062028760,
        "Operation": "join",
        "Timestamp": "1557750263002.175781",
        "TenantClass": 0,
        "Source": "PacketHeader.java:168",
        "ThreadID": 1,
        "ThreadName": "",
        "EventID": "A5E35F955FBDDAB2",
        "ProcessID": 2801
      },
      {
        "Cycles": 0,
        "Agent": "Execution-Sleep",
        "ProcessName": "Data",
        "TaskID": "C593771FAF8A3557",
        "ParentEventID": [
          "0C9CAEE6B3D5F623"
        ],
        "Label": "waited",
        "Title": "X-Trace Task",
        "Host": "pinky26.mpi-sws.org",
        "Duration": "5667",
        "HRT": 47516279791202093,
        "Operation": "waited",
        "Timestamp": "1557750263001.910156",
        "TenantClass": 0,
        "Source": "SocketIOWithTimeout.java:335",
        "ThreadID": 8549,
        "ThreadName": "",
        "EventID": "FDD263B40A735915",
        "BaggageBytes": "[[248 5] [240 0] [0 197 147 119 31 175 138 53 87] [240 1] [0 12 156 174 230 179 213 246 35] [240 3] [0 2]]",
        "ProcessID": 17069
      },
      {
        "Cycles": 0,
        "Agent": "edu.brown.cs.systems.xtrace.logging.BaggageWrappers",
        "ProcessName": "Data",
        "TaskID": "C593771FAF8A3557",
        "ParentEventID": [
          "1DFD231A61080752"
        ],
        "Label": "Forking current baggage with Baggage.fork()",
        "Title": "X-Trace Task",
        "Host": "pinky26.mpi-sws.org",
        "HRT": 47516279791124408,
        "Operation": "fork",
        "Timestamp": "1557750263001.832520",
        "TenantClass": 0,
        "Source": "PacketHeader.java:95",
        "ThreadID": 8549,
        "ThreadName": "",
        "EventID": "0C9CAEE6B3D5F623",
        "BaggageBytes": "[[248 5] [240 0] [0 197 147 119 31 175 138 53 87] [240 1] [0 29 253 35 26 97 8 7 82] [240 3] [0 2]]",
        "ProcessID": 17069
      },
      {
        "Cycles": 0,
        "Agent": "Execution-CPU",
        "ProcessName": "Data",
        "TaskID": "C593771FAF8A3557",
        "ParentEventID": [
          "FDD263B40A735915"
        ],
        "Label": "unset",
        "Title": "X-Trace Task",
        "Host": "pinky26.mpi-sws.org",
        "Duration": "2398268",
        "HRT": 47516279792546990,
        "Operation": "unset",
        "Timestamp": "1557750263003.255127",
        "TenantClass": 0,
        "Source": "DataXceiver.java:261",
        "ThreadID": 8549,
        "ThreadName": "",
        "EventID": "EE3558BD7FCC1620",
        "BaggageBytes": "[[248 5] [240 0] [0 197 147 119 31 175 138 53 87] [240 1] [0 253 210 99 180 10 115 89 21] [240 3] [0 2]]",
        "ProcessID": 17069
      }
    ]
  }
]