[
  {
    "id": "24381292BA022E14",
    "reports": [
      {
        "Cycles": 0,
        "Agent": "edu.brown.cs.systems.retro.benchmarks.hdfs_client.Reader",
        "ProcessName": "Read",
        "TaskID": "24381292BA022E14",
        "ParentEventID": [
          "E3121D24CDDFCA6F"
        ],
        "Label": "Reading file",
        "Title": "X-Trace Task",
        "Host": "pinky19.mpi-sws.org",
        "HRT": 25491834931492015,
        "Timestamp": "1556275474871.311523",
        "TenantClass": 0,
        "ThreadID": 1,
        "ThreadName": "",
        "EventID": "6EDC7A3B9C197C62",
        "ProcessID": 21035
      },
      {
        "Cycles": 0,
        "Agent": "Execution-CPU",
        "ProcessName": "Read",
        "TaskID": "24381292BA022E14",
        "ParentEventID": [
          "98CEFA747B492867"
        ],
        "Label": "set",
        "Title": "X-Trace Task",
        "Host": "pinky19.mpi-sws.org",
        "HRT": 25491834931614538,
        "Operation": "set",
        "Timestamp": "1556275474871.434082",
        "TenantClass": 0,
        "Source": "Client.java:1032",
        "ThreadID": 41,
        "ThreadName": "",
        "EventID": "DA069B0A8947B036",
        "ProcessID": 21035
      },
      {
        "Cycles": 0,
        "Agent": "org.apache.hadoop.ipc.ProtobufRpcEngine",
        "ProcessName": "Read",
        "TaskID": "24381292BA022E14",
        "ParentEventID": [
          "6EDC7A3B9C197C62"
        ],
        "Label": "Invoking org.apache.hadoop.hdfs.protocol.ClientProtocol.getBlockLocations",
        "Title": "X-Trace Task",
        "Host": "pinky19.mpi-sws.org",
        "HRT": 25491834931528934,
        "Timestamp": "1556275474871.348389",
        "TenantClass": 0,
        "Source": "ProtobufRpcEngine.java:228",
        "ThreadID": 1,
        "ThreadName": "",
        "EventID": "063E3BADCC3499E3",
        "ProcessID": 21035
      },
      {
        "Cycles": 0,
        "Agent": "edu.brown.cs.systems.xtrace.logging.BaggageWrappers",
        "ProcessName": "Read",
        "TaskID": "24381292BA022E14",
        "ParentEventID": [
          "DA069B0A8947B036"
        ],
        "Label": "Forking current baggage with Baggage.fork()",
        "Title": "X-Trace Task",
        "Host": "pinky19.mpi-sws.org",
        "HRT": 25491834931633400,
        "Operation": "fork",
        "Timestamp": "1556275474871.452881",
        "TenantClass": 0,
        "Source": "Client.java:1043",
        "ThreadID": 41,
        "ThreadName": "",
        "EventID": "AC5CA9BF4DCA13EF",
        "ProcessID": 21035
      },
      {
        "Cycles": 0,
        "Agent": "Execution-CPU",
        "ProcessName": "Read",
        "TaskID": "24381292BA022E14",
        "ParentEventID": [
          "5F3C1F880AF333CE"
        ],
        "Label": "set",
        "Title": "X-Trace Task",
        "Host": "pinky19.mpi-sws.org",
        "HRT": 25491834931723073,
        "Operation": "set",
        "Timestamp": "1556275474871.542480",
        "TenantClass": 0,
        "Source": "Client.java:1104",
        "ThreadID": 1,
        "ThreadName": "",
        "EventID": "DC8BB45D33358371",
        "ProcessID": 21035
      },
      {
        "Cycles": 0,
        "Agent": "Execution-CPU",
        "ProcessName": "Name",
        "TaskID": "24381292BA022E14",
        "ParentEventID": [
          "AC5CA9BF4DCA13EF"
        ],
        "Label": "set",
        "Title": "X-Trace Task",
        "Host": "pinky19.mpi-sws.org",
        "HRT": 25491834931757514,
        "Operation": "set",
        "Timestamp": "1556275474871.602539",
        "TenantClass": 0,
        "Source": "Server.java:1840",
        "ThreadID": 48,
        "ThreadName": "",
        "EventID": "29E87E3C58947614",
        "BaggageBytes": "[[248 5] [240 0] [0 36 56 18 146 186 2 46 20] [240 1] [0 172 92 169 191 77 202 19 239] [240 3] [0 2]]",
        "ProcessID": 2171
      },
      {
        "Cycles": 0,
        "Agent": "Execution-CPU",
        "ProcessName": "Read",
        "TaskID": "24381292BA022E14",
        "ParentEventID": [
          "063E3BADCC3499E3"
        ],
        "Label": "unset",
        "Title": "X-Trace Task",
        "Host": "pinky19.mpi-sws.org",
        "Duration": "22226405",
        "HRT": 25491834931561612,
        "Operation": "unset",
        "Timestamp": "1556275474871.381104",
        "TenantClass": 0,
        "Source": "Client.java:1027",
        "ThreadID": 1,
        "ThreadName": "",
        "EventID": "98CEFA747B492867",
        "ProcessID": 21035
      },
      {
        "Cycles": 0,
        "Agent": "edu.brown.cs.systems.xtrace.logging.BaggageWrappers",
        "ProcessName": "Name",
        "TaskID": "24381292BA022E14",
        "ParentEventID": [
          "29E87E3C58947614"
        ],
        "Label": "Forking current baggage with Baggage.fork()",
        "Title": "X-Trace Task",
        "Host": "pinky19.mpi-sws.org",
        "HRT": 25491834931786713,
        "Operation": "fork",
        "Timestamp": "1556275474871.631592",
        "TenantClass": 0,
        "Source": "Server.java:550",
        "ThreadID": 48,
        "ThreadName": "",
        "EventID": "0571C477A4E4E851",
        "BaggageBytes": "[[248 5] [240 0] [0 36 56 18 146 186 2 46 20] [240 1] [0 41 232 126 60 88 148 118 20] [240 3] [0 2]]",
        "ProcessID": 2171
      },
      {
        "Cycles": 0,
        "Agent": "Execution-CPU",
        "ProcessName": "Read",
        "TaskID": "24381292BA022E14",
        "ParentEventID": [
          "AC5CA9BF4DCA13EF"
        ],
        "Label": "unset",
        "Title": "X-Trace Task",
        "Host": "pinky19.mpi-sws.org",
        "Duration": "67244",
        "HRT": 25491834931699712,
        "Operation": "unset",
        "Timestamp": "1556275474871.519043",
        "TenantClass": 0,
        "Source": "Client.java:1062",
        "ThreadID": 41,
        "ThreadName": "",
        "EventID": "5F3C1F880AF333CE",
        "ProcessID": 21035
      },
      {
        "Cycles": 0,
        "Agent": "Execution-CPU",
        "ProcessName": "Name",
        "TaskID": "24381292BA022E14",
        "ParentEventID": [
          "0571C477A4E4E851"
        ],
        "Label": "unset",
        "Title": "X-Trace Task",
        "Host": "pinky19.mpi-sws.org",
        "Duration": "24885",
        "HRT": 25491834931807915,
        "Operation": "unset",
        "Timestamp": "1556275474871.652832",
        "TenantClass": 0,
        "Source": "Server.java:1828",
        "ThreadID": 48,
        "ThreadName": "",
        "EventID": "1E9653A3DC5B1C85",
        "BaggageBytes": "[[248 5] [240 0] [0 36 56 18 146 186 2 46 20] [240 1] [0 5 113 196 119 164 228 232 81] [240 3] [0 2]]",
        "ProcessID": 2171
      },
      {
        "Cycles": 0,
        "Agent": "Execution-CPU",
        "ProcessName": "Name",
        "TaskID": "24381292BA022E14",
        "ParentEventID": [
          "0571C477A4E4E851"
        ],
        "Label": "set",
        "Title": "X-Trace Task",
        "Host": "pinky19.mpi-sws.org",
        "HRT": 25491834931819043,
        "Operation": "set",
        "Timestamp": "1556275474871.664062",
        "TenantClass": 0,
        "Source": "Server.java:2071",
        "ThreadID": 57,
        "ThreadName": "",
        "EventID": "DB132844C1FE179F",
        "BaggageBytes": "[[248 5] [240 0] [0 36 56 18 146 186 2 46 20] [240 1] [0 5 113 196 119 164 228 232 81] [240 3] [0 2]]",
        "ProcessID": 2171
      },
      {
        "Cycles": 0,
        "Agent": "org.apache.hadoop.hdfs.server.namenode.FSNamesystem.audit",
        "ProcessName": "Name",
        "TaskID": "24381292BA022E14",
        "ParentEventID": [
          "3F378B57D305DAC4"
        ],
        "Label": "allowed=true\tugi=plascas (auth:SIMPLE)\tip=/139.19.171.63\tcmd=open\tsrc=/ds/Q2nUSf4vIBfLswk5\tdst=null\tperm=null\tproto=rpc",
        "Title": "X-Trace Task",
        "Host": "pinky19.mpi-sws.org",
        "HRT": 25491834931909185,
        "Timestamp": "1556275474871.754150",
        "TenantClass": 0,
        "Source": "FSNamesystem.java:8313",
        "ThreadID": 57,
        "ThreadName": "",
        "EventID": "998E354D84CB8D7E",
        "BaggageBytes": "[[248 5] [240 0] [0 36 56 18 146 186 2 46 20] [240 1] [0 63 55 139 87 211 5 218 196] [240 3] [0 2]]",
        "ProcessID": 2171
      },
      {
        "Cycles": 0,
        "Agent": "edu.brown.cs.systems.xtrace.logging.BaggageWrappers",
        "ProcessName": "Name",
        "TaskID": "24381292BA022E14",
        "ParentEventID": [
          "998E354D84CB8D7E"
        ],
        "Label": "Forking current baggage with Baggage.fork()",
        "Title": "X-Trace Task",
        "Host": "pinky19.mpi-sws.org",
        "HRT": 25491834931965411,
        "Operation": "fork",
        "Timestamp": "1556275474871.810303",
        "TenantClass": 0,
        "Source": "Server.java:2398",
        "ThreadID": 57,
        "ThreadName": "",
        "EventID": "AE969AB87C3C6E3E",
        "BaggageBytes": "[[248 5] [240 0] [0 36 56 18 146 186 2 46 20] [240 1] [0 153 142 53 77 132 203 141 126] [240 3] [0 2]]",
        "ProcessID": 2171
      },
      {
        "Cycles": 0,
        "Agent": "org.apache.hadoop.ipc.Server",
        "ProcessName": "Name",
        "TaskID": "24381292BA022E14",
        "ParentEventID": [
          "DB132844C1FE179F"
        ],
        "Label": "getBlockLocations in org.apache.hadoop.hdfs.protocol.ClientProtocol",
        "Title": "X-Trace Task",
        "Host": "pinky19.mpi-sws.org",
        "HRT": 25491834931859566,
        "Timestamp": "1556275474871.704590",
        "TenantClass": 0,
        "Source": "ProtobufRpcEngine.java:601",
        "ThreadID": 57,
        "ThreadName": "",
        "EventID": "3F378B57D305DAC4",
        "BaggageBytes": "[[248 5] [240 0] [0 36 56 18 146 186 2 46 20] [240 1] [0 219 19 40 68 193 254 23 159] [240 3] [0 2]]",
        "ProcessID": 2171
      },
      {
        "Cycles": 0,
        "Agent": "Execution-CPU",
        "ProcessName": "Name",
        "TaskID": "24381292BA022E14",
        "ParentEventID": [
          "AE969AB87C3C6E3E"
        ],
        "Label": "unset",
        "Title": "X-Trace Task",
        "Host": "pinky19.mpi-sws.org",
        "Duration": "231583",
        "HRT": 25491834932077065,
        "Operation": "unset",
        "Timestamp": "1556275474871.922119",
        "TenantClass": 0,
        "Source": "Server.java:1058",
        "ThreadID": 57,
        "ThreadName": "",
        "EventID": "23203C96FE8FC10E",
        "BaggageBytes": "[[248 5] [240 0] [0 36 56 18 146 186 2 46 20] [240 1] [0 174 150 154 184 124 60 110 62] [240 3] [0 2]]",
        "ProcessID": 2171
      },
      {
        "Cycles": 0,
        "Agent": "Execution-CPU",
        "ProcessName": "Read",
        "TaskID": "24381292BA022E14",
        "ParentEventID": [
          "AE969AB87C3C6E3E"
        ],
        "Label": "set",
        "Title": "X-Trace Task",
        "Host": "pinky19.mpi-sws.org",
        "HRT": 25491834932116104,
        "Operation": "set",
        "Timestamp": "1556275474871.935547",
        "TenantClass": 0,
        "Source": "Client.java:302",
        "ThreadID": 37,
        "ThreadName": "",
        "EventID": "090AF229AB2C4A2D",
        "ProcessID": 21035
      },
      {
        "Cycles": 0,
        "Agent": "Execution-CPU",
        "ProcessName": "Read",
        "TaskID": "24381292BA022E14",
        "ParentEventID": [
          "090AF229AB2C4A2D"
        ],
        "Label": "unset",
        "Title": "X-Trace Task",
        "Host": "pinky19.mpi-sws.org",
        "Duration": "9475",
        "HRT": 25491834932137520,
        "Operation": "unset",
        "Timestamp": "1556275474871.957031",
        "TenantClass": 0,
        "Source": "Client.java:1168",
        "ThreadID": 37,
        "ThreadName": "",
        "EventID": "BDD893CF42A6593B",
        "ProcessID": 21035
      },
      {
        "Cycles": 0,
        "Agent": "Execution-Sleep",
        "ProcessName": "Read",
        "TaskID": "24381292BA022E14",
        "ParentEventID": [
          "DC8BB45D33358371"
        ],
        "Label": "waited",
        "Title": "X-Trace Task",
        "Host": "pinky19.mpi-sws.org",
        "Duration": "419623",
        "HRT": 25491834932154372,
        "Operation": "waited",
        "Timestamp": "1556275474871.973877",
        "TenantClass": 0,
        "Source": "Client.java:1537",
        "ThreadID": 1,
        "ThreadName": "",
        "EventID": "08416DCEB374683F",
        "ProcessID": 21035
      },
      {
        "Cycles": 0,
        "Agent": "org.apache.hadoop.ipc.ProtobufRpcEngine",
        "ProcessName": "Read",
        "TaskID": "24381292BA022E14",
        "ParentEventID": [
          "2910BA99E8D64FEF"
        ],
        "Label": "org.apache.hadoop.hdfs.protocol.ClientProtocol.getBlockLocations completed",
        "Title": "X-Trace Task",
        "Host": "pinky19.mpi-sws.org",
        "HRT": 25491834932205856,
        "Timestamp": "1556275474872.025391",
        "TenantClass": 0,
        "Source": "ProtobufRpcEngine.java:275",
        "ThreadID": 1,
        "ThreadName": "",
        "EventID": "1B363A93969ED3F2",
        "ProcessID": 21035
      },
      {
        "Cycles": 0,
        "Agent": "edu.brown.cs.systems.xtrace.logging.BaggageWrappers",
        "ProcessName": "Read",
        "TaskID": "24381292BA022E14",
        "ParentEventID": [
          "1B363A93969ED3F2"
        ],
        "Label": "Forking current baggage with Baggage.fork()",
        "Title": "X-Trace Task",
        "Host": "pinky19.mpi-sws.org",
        "HRT": 25491834932266461,
        "Operation": "fork",
        "Timestamp": "1556275474872.085938",
        "TenantClass": 0,
        "Source": "DataTransferProtoUtil.java:94",
        "ThreadID": 1,
        "ThreadName": "",
        "EventID": "1345B849F8AFE82D",
        "ProcessID": 21035
      },
      {
        "Cycles": 0,
        "Agent": "edu.brown.cs.systems.xtrace.logging.BaggageWrappers",
        "ProcessName": "Read",
        "TaskID": "24381292BA022E14",
        "ParentEventID": [
          "BDD893CF42A6593B",
          "08416DCEB374683F"
        ],
        "Label": "Merged current baggage with other baggage",
        "Title": "X-Trace Task",
        "Host": "pinky19.mpi-sws.org",
        "HRT": 25491834932166032,
        "Operation": "join",
        "Timestamp": "1556275474871.985352",
        "TenantClass": 0,
        "Source": "Client.java:1545",
        "ThreadID": 1,
        "ThreadName": "",
        "EventID": "2910BA99E8D64FEF",
        "ProcessID": 21035
      },
      {
        "Cycles": 0,
        "Agent": "Execution-CPU",
        "ProcessName": "Data",
        "TaskID": "24381292BA022E14",
        "ParentEventID": [
          "1345B849F8AFE82D"
        ],
        "Label": "set",
        "Title": "X-Trace Task",
        "Host": "pinky21.mpi-sws.org",
        "HRT": 9338144639591471,
        "Operation": "set",
        "Timestamp": "1556275474872.671387",
        "TenantClass": 0,
        "Source": "Receiver.java:117",
        "ThreadID": 5977,
        "ThreadName": "",
        "EventID": "0393BA51440BDF59",
        "BaggageBytes": "[[248 5] [240 0] [0 36 56 18 146 186 2 46 20] [240 1] [0 19 69 184 73 248 175 232 45] [240 3] [0 2]]",
        "ProcessID": 20775
      },
      {
        "Cycles": 0,
        "Agent": "edu.brown.cs.systems.xtrace.logging.BaggageWrappers",
        "ProcessName": "Data",
        "TaskID": "24381292BA022E14",
        "ParentEventID": [
          "F755EC13F359C99F"
        ],
        "Label": "Forking current baggage with Baggage.fork()",
        "Title": "X-Trace Task",
        "Host": "pinky21.mpi-sws.org",
        "HRT": 9338144639896019,
        "Operation": "fork",
        "Timestamp": "1556275474872.976074",
        "TenantClass": 0,
        "Source": "DataXceiver.java:1257",
        "ThreadID": 5977,
        "ThreadName": "",
        "EventID": "B2665AD539D6BC23",
        "BaggageBytes": "[[248 5] [240 0] [0 36 56 18 146 186 2 46 20] [240 1] [0 247 85 236 19 243 89 201 159] [240 3] [0 2]]",
        "ProcessID": 20775
      },
      {
        "Cycles": 0,
        "Agent": "Execution-Sleep",
        "ProcessName": "Read",
        "TaskID": "24381292BA022E14",
        "ParentEventID": [
          "1345B849F8AFE82D"
        ],
        "Label": "waited",
        "Title": "X-Trace Task",
        "Host": "pinky19.mpi-sws.org",
        "Duration": "729735",
        "HRT": 25491834933072990,
        "Operation": "waited",
        "Timestamp": "1556275474872.892334",
        "TenantClass": 0,
        "Source": "SocketIOWithTimeout.java:335",
        "ThreadID": 1,
        "ThreadName": "",
        "EventID": "F16A3B7623742B0C",
        "ProcessID": 21035
      },
      {
        "Cycles": 0,
        "Agent": "edu.brown.cs.systems.xtrace.logging.XTraceInit",
        "ProcessName": "Data",
        "TaskID": "24381292BA022E14",
        "ParentEventID": [
          "0393BA51440BDF59"
        ],
        "Label": "Thread.setName: DataXceiver for client DFSClient_NONMAPREDUCE_1377588049_1 at /139.19.171.63:56492 [Sending block BP-1633380353-139.19.171.63-1554193446451:blk_1073768878_28054]",
        "Title": "X-Trace Task",
        "Host": "pinky21.mpi-sws.org",
        "HRT": 9338144639692465,
        "Timestamp": "1556275474872.772461",
        "TenantClass": 0,
        "Source": "DataXceiver.java:168",
        "ThreadID": 5977,
        "ThreadName": "",
        "EventID": "F755EC13F359C99F",
        "BaggageBytes": "[[248 5] [240 0] [0 36 56 18 146 186 2 46 20] [240 1] [0 3 147 186 81 68 11 223 89] [240 3] [0 2]]",
        "ProcessID": 20775
      },
      {
        "Cycles": 0,
        "Agent": "edu.brown.cs.systems.xtrace.logging.BaggageWrappers",
        "ProcessName": "Read",
        "TaskID": "24381292BA022E14",
        "ParentEventID": [
          "F16A3B7623742B0C",
          "B2665AD539D6BC23"
        ],
        "Label": "Merged current baggage with other baggage",
        "Title": "X-Trace Task",
        "Host": "pinky19.mpi-sws.org",
        "HRT": 25491834933128187,
        "Operation": "join",
        "Timestamp": "1556275474872.947510",
        "TenantClass": 0,
        "Source": "RemoteBlockReader2.java:429",
        "ThreadID": 1,
        "ThreadName": "",
        "EventID": "2C0019B97324FD91",
        "ProcessID": 21035
      },
      {
        "Cycles": 0,
        "Agent": "edu.brown.cs.systems.xtrace.logging.BaggageWrappers",
        "ProcessName": "Data",
        "TaskID": "24381292BA022E14",
        "ParentEventID": [
          "B2665AD539D6BC23"
        ],
        "Label": "Forking current baggage with Baggage.fork()",
        "Title": "X-Trace Task",
        "Host": "pinky21.mpi-sws.org",
        "HRT": 9338144640089836,
        "Operation": "fork",
        "Timestamp": "1556275474873.169922",
        "TenantClass": 0,
        "Source": "PacketHeader.java:95",
        "ThreadID": 5977,
        "ThreadName": "",
        "EventID": "77F1CB3713646787",
        "BaggageBytes": "[[248 5] [240 0] [0 36 56 18 146 186 2 46 20] [240 1] [0 178 102 90 213 57 214 188 35] [240 3] [0 2]]",
        "ProcessID": 20775
      },
      {
        "Cycles": 0,
        "Agent": "Execution-Sleep",
        "ProcessName": "Read",
        "TaskID": "24381292BA022E14",
        "ParentEventID": [
          "2C0019B97324FD91"
        ],
        "Label": "waited",
        "Title": "X-Trace Task",
        "Host": "pinky19.mpi-sws.org",
        "Duration": "76202",
        "HRT": 25491834933247676,
        "Operation": "waited",
        "Timestamp": "1556275474873.067139",
        "TenantClass": 0,
        "Source": "SocketIOWithTimeout.java:335",
        "ThreadID": 1,
        "ThreadName": "",
        "EventID": "F4A9323B49070338",
        "ProcessID": 21035
      },
      {
        "Cycles": 0,
        "Agent": "Execution-Sleep",
        "ProcessName": "Read",
        "TaskID": "24381292BA022E14",
        "ParentEventID": [
          "F4A9323B49070338"
        ],
        "Label": "waited",
        "Title": "X-Trace Task",
        "Host": "pinky19.mpi-sws.org",
        "Duration": "157112",
        "HRT": 25491834933467226,
        "Operation": "waited",
        "Timestamp": "1556275474873.286621",
        "TenantClass": 0,
        "Source": "SocketIOWithTimeout.java:335",
        "ThreadID": 1,
        "ThreadName": "",
        "EventID": "6789899173A536E0",
        "ProcessID": 21035
      },
      {
        "Cycles": 0,
        "Agent": "Execution-Sleep",
        "ProcessName": "Data",
        "TaskID": "24381292BA022E14",
        "ParentEventID": [
          "77F1CB3713646787"
        ],
        "Label": "waited",
        "Title": "X-Trace Task",
        "Host": "pinky21.mpi-sws.org",
        "Duration": "11581",
        "HRT": 9338144640249043,
        "Operation": "waited",
        "Timestamp": "1556275474873.329102",
        "TenantClass": 0,
        "Source": "SocketIOWithTimeout.java:335",
        "ThreadID": 5977,
        "ThreadName": "",
        "EventID": "B264EDB627329972",
        "BaggageBytes": "[[248 5] [240 0] [0 36 56 18 146 186 2 46 20] [240 1] [0 119 241 203 55 19 100 103 135] [240 3] [0 2]]",
        "ProcessID": 20775
      },
      {
        "Cycles": 0,
        "Agent": "edu.brown.cs.systems.xtrace.logging.BaggageWrappers",
        "ProcessName": "Read",
        "TaskID": "24381292BA022E14",
        "ParentEventID": [
          "77F1CB3713646787",
          "6789899173A536E0"
        ],
        "Label": "Merged current baggage with other baggage",
        "Title": "X-Trace Task",
        "Host": "pinky19.mpi-sws.org",
        "HRT": 25491834933504206,
        "Operation": "join",
        "Timestamp": "1556275474873.323730",
        "TenantClass": 0,
        "Source": "PacketHeader.java:168",
        "ThreadID": 1,
        "ThreadName": "",
        "EventID": "E8363D925729F761",
        "ProcessID": 21035
      },
      {
        "Cycles": 0,
        "Agent": "Execution-Sleep",
        "ProcessName": "Read",
        "TaskID": "24381292BA022E14",
        "ParentEventID": [
          "E8363D925729F761"
        ],
        "Label": "waited",
        "Title": "X-Trace Task",
        "Host": "pinky19.mpi-sws.org",
        "Duration": "60651",
        "HRT": 25491834933595982,
        "Operation": "waited",
        "Timestamp": "1556275474873.415527",
        "TenantClass": 0,
        "Source": "SocketIOWithTimeout.java:335",
        "ThreadID": 1,
        "ThreadName": "",
        "EventID": "A299F50E4C8EC57D",
        "ProcessID": 21035
      },
      {
        "Cycles": 0,
        "Agent": "edu.brown.cs.systems.xtrace.logging.BaggageWrappers",
        "ProcessName": "Data",
        "TaskID": "24381292BA022E14",
        "ParentEventID": [
          "B264EDB627329972"
        ],
        "Label": "Forking current baggage with Baggage.fork()",
        "Title": "X-Trace Task",
        "Host": "pinky21.mpi-sws.org",
        "HRT": 9338144640436624,
        "Operation": "fork",
        "Timestamp": "1556275474873.516602",
        "TenantClass": 0,
        "Source": "PacketHeader.java:95",
        "ThreadID": 5977,
        "ThreadName": "",
        "EventID": "252A2C3956B68C81",
        "BaggageBytes": "[[248 5] [240 0] [0 36 56 18 146 186 2 46 20] [240 1] [0 178 100 237 182 39 50 153 114] [240 3] [0 2]]",
        "ProcessID": 20775
      },
      {
        "Cycles": 0,
        "Agent": "edu.brown.cs.systems.xtrace.logging.BaggageWrappers",
        "ProcessName": "Read",
        "TaskID": "24381292BA022E14",
        "ParentEventID": [
          "252A2C3956B68C81",
          "A299F50E4C8EC57D"
        ],
        "Label": "Merged current baggage with other baggage",
        "Title": "X-Trace Task",
        "Host": "pinky19.mpi-sws.org",
        "HRT": 25491834933640860,
        "Operation": "join",
        "Timestamp": "1556275474873.460205",
        "TenantClass": 0,
        "Source": "PacketHeader.java:168",
        "ThreadID": 1,
        "ThreadName": "",
        "EventID": "67BF95796BA8B642",
        "ProcessID": 21035
      },
      {
        "Cycles": 0,
        "Agent": "edu.brown.cs.systems.xtrace.logging.BaggageWrappers",
        "ProcessName": "Read",
        "TaskID": "24381292BA022E14",
        "ParentEventID": [
          "67BF95796BA8B642"
        ],
        "Label": "Forking current baggage with Baggage.fork()",
        "Title": "X-Trace Task",
        "Host": "pinky19.mpi-sws.org",
        "HRT": 25491834933649986,
        "Operation": "fork",
        "Timestamp": "1556275474873.469482",
        "TenantClass": 0,
        "Source": "RemoteBlockReader2.java:361",
        "ThreadID": 1,
        "ThreadName": "",
        "EventID": "2F2BB90815A72821",
        "ProcessID": 21035
      },
      {
        "Cycles": 0,
        "Agent": "Execution-Sleep",
        "ProcessName": "Data",
        "TaskID": "24381292BA022E14",
        "ParentEventID": [
          "252A2C3956B68C81"
        ],
        "Label": "waited",
        "Title": "X-Trace Task",
        "Host": "pinky21.mpi-sws.org",
        "Duration": "63794",
        "HRT": 9338144640728671,
        "Operation": "waited",
        "Timestamp": "1556275474873.808594",
        "TenantClass": 0,
        "Source": "SocketIOWithTimeout.java:335",
        "ThreadID": 5977,
        "ThreadName": "",
        "EventID": "92D6B0422396611A",
        "BaggageBytes": "[[248 5] [240 0] [0 36 56 18 146 186 2 46 20] [240 1] [0 37 42 44 57 86 182 140 129] [240 3] [0 2]]",
        "ProcessID": 20775
      },
      {
        "Cycles": 0,
        "Agent": "Execution-CPU",
        "ProcessName": "Data",
        "TaskID": "24381292BA022E14",
        "ParentEventID": [
          "1C0BC381AEB1D13D"
        ],
        "Label": "unset",
        "Title": "X-Trace Task",
        "Host": "pinky21.mpi-sws.org",
        "Duration": "1245017",
        "HRT": 9338144640909075,
        "Operation": "unset",
        "Timestamp": "1556275474873.989014",
        "TenantClass": 0,
        "Source": "DataXceiver.java:261",
        "ThreadID": 5977,
        "ThreadName": "",
        "EventID": "55B935DA7CD621C2",
        "BaggageBytes": "[[248 5] [240 0] [0 36 56 18 146 186 2 46 20] [240 1] [0 28 11 195 129 174 177 209 61] [240 3] [0 2]]",
        "ProcessID": 20775
      },
      {
        "Cycles": 0,
        "Agent": "edu.brown.cs.systems.xtrace.logging.BaggageWrappers",
        "ProcessName": "Data",
        "TaskID": "24381292BA022E14",
        "ParentEventID": [
          "2F2BB90815A72821",
          "92D6B0422396611A"
        ],
        "Label": "Merged current baggage with other baggage",
        "Title": "X-Trace Task",
        "Host": "pinky21.mpi-sws.org",
        "HRT": 9338144640855305,
        "Operation": "join",
        "Timestamp": "1556275474873.935303",
        "TenantClass": 0,
        "Source": "DataXceiver.java:574",
        "ThreadID": 5977,
        "ThreadName": "",
        "EventID": "1C0BC381AEB1D13D",
        "BaggageBytes": "[[248 5] [240 0] [0 36 56 18 146 186 2 46 20] [240 1] [0 146 214 176 66 35 150 97 26] [0 47 43 185 8 21 167 40 33] [240 3] [0 2]]",
        "ProcessID": 20775
      },
      {
        "Cycles": 0,
        "Agent": "edu.brown.cs.systems.retro.benchmarks.hdfs_client.Reader",
        "ProcessName": "Read",
        "TaskID": "24381292BA022E14",
        "ParentEventID": [
          "0"
        ],
        "Label": "Reading file",
        "Title": "X-Trace Task",
        "Host": "pinky19.mpi-sws.org",
        "HRT": 25491834931478866,
        "Timestamp": "1556275474871.298340",
        "TenantClass": 0,
        "ThreadID": 1,
        "ThreadName": "",
        "EventID": "E3121D24CDDFCA6F",
        "ProcessID": 21035,
        "Tag": [
          "reader_1kb",
          "Read Size: 1024"
        ]
      }
    ]
  }
]