[
  {
    "id": "C68B538C1D6F08DB",
    "reports": [
      {
        "Cycles": 0,
        "Agent": "edu.brown.cs.systems.retro.benchmarks.hdfs_client.Reader",
        "ProcessName": "Read",
        "TaskID": "C68B538C1D6F08DB",
        "ParentEventID": [
          "192F6DCC03707412"
        ],
        "Label": "Reading file",
        "Title": "X-Trace Task",
        "Host": "pinky19.mpi-sws.org",
        "HRT": 26962459360174746,
        "Timestamp": "1557746099300.712402",
        "TenantClass": 0,
        "ThreadID": 1,
        "ThreadName": "",
        "EventID": "4B7A07D182CF2BF6",
        "ProcessID": 36430
      },
      {
        "Cycles": 0,
        "Agent": "Execution-CPU",
        "ProcessName": "Read",
        "TaskID": "C68B538C1D6F08DB",
        "ParentEventID": [
          "B306AF3E84AF6A27"
        ],
        "Label": "unset",
        "Title": "X-Trace Task",
        "Host": "pinky19.mpi-sws.org",
        "Duration": "22328749",
        "HRT": 26962459360242652,
        "Operation": "unset",
        "Timestamp": "1557746099300.780273",
        "TenantClass": 0,
        "Source": "Client.java:1027",
        "ThreadID": 1,
        "ThreadName": "",
        "EventID": "A8FF80AECBDC0D17",
        "ProcessID": 36430
      },
      {
        "Cycles": 0,
        "Agent": "org.apache.hadoop.ipc.ProtobufRpcEngine",
        "ProcessName": "Read",
        "TaskID": "C68B538C1D6F08DB",
        "ParentEventID": [
          "4B7A07D182CF2BF6"
        ],
        "Label": "Invoking org.apache.hadoop.hdfs.protocol.ClientProtocol.getBlockLocations",
        "Title": "X-Trace Task",
        "Host": "pinky19.mpi-sws.org",
        "HRT": 26962459360216711,
        "Timestamp": "1557746099300.754395",
        "TenantClass": 0,
        "Source": "ProtobufRpcEngine.java:228",
        "ThreadID": 1,
        "ThreadName": "",
        "EventID": "B306AF3E84AF6A27",
        "ProcessID": 36430
      },
      {
        "Cycles": 0,
        "Agent": "Execution-CPU",
        "ProcessName": "Read",
        "TaskID": "C68B538C1D6F08DB",
        "ParentEventID": [
          "A8FF80AECBDC0D17"
        ],
        "Label": "set",
        "Title": "X-Trace Task",
        "Host": "pinky19.mpi-sws.org",
        "HRT": 26962459360268895,
        "Operation": "set",
        "Timestamp": "1557746099300.806641",
        "TenantClass": 0,
        "Source": "Client.java:1032",
        "ThreadID": 41,
        "ThreadName": "",
        "EventID": "72E47277BF5B2245",
        "ProcessID": 36430
      },
      {
        "Cycles": 0,
        "Agent": "Execution-CPU",
        "ProcessName": "Read",
        "TaskID": "C68B538C1D6F08DB",
        "ParentEventID": [
          "7540A8614BDD2B6D"
        ],
        "Label": "unset",
        "Title": "X-Trace Task",
        "Host": "pinky19.mpi-sws.org",
        "Duration": "94507",
        "HRT": 26962459360381752,
        "Operation": "unset",
        "Timestamp": "1557746099300.919434",
        "TenantClass": 0,
        "Source": "Client.java:1062",
        "ThreadID": 41,
        "ThreadName": "",
        "EventID": "023AB2809B902744",
        "ProcessID": 36430
      },
      {
        "Cycles": 0,
        "Agent": "edu.brown.cs.systems.xtrace.logging.BaggageWrappers",
        "ProcessName": "Read",
        "TaskID": "C68B538C1D6F08DB",
        "ParentEventID": [
          "72E47277BF5B2245"
        ],
        "Label": "Forking current baggage with Baggage.fork()",
        "Title": "X-Trace Task",
        "Host": "pinky19.mpi-sws.org",
        "HRT": 26962459360289803,
        "Operation": "fork",
        "Timestamp": "1557746099300.827393",
        "TenantClass": 0,
        "Source": "Client.java:1043",
        "ThreadID": 41,
        "ThreadName": "",
        "EventID": "7540A8614BDD2B6D",
        "ProcessID": 36430
      },
      {
        "Cycles": 0,
        "Agent": "Execution-CPU",
        "ProcessName": "Name",
        "TaskID": "C68B538C1D6F08DB",
        "ParentEventID": [
          "7540A8614BDD2B6D"
        ],
        "Label": "set",
        "Title": "X-Trace Task",
        "Host": "pinky19.mpi-sws.org",
        "HRT": 26962459360435856,
        "Operation": "set",
        "Timestamp": "1557746099300.994141",
        "TenantClass": 0,
        "Source": "Server.java:1840",
        "ThreadID": 48,
        "ThreadName": "",
        "EventID": "E1D718420B547AE6",
        "BaggageBytes": "[[248 5] [240 0] [0 198 139 83 140 29 111 8 219] [240 1] [0 117 64 168 97 75 221 43 109] [240 3] [0 2]]",
        "ProcessID": 2171
      },
      {
        "Cycles": 0,
        "Agent": "edu.brown.cs.systems.xtrace.logging.BaggageWrappers",
        "ProcessName": "Name",
        "TaskID": "C68B538C1D6F08DB",
        "ParentEventID": [
          "E1D718420B547AE6"
        ],
        "Label": "Forking current baggage with Baggage.fork()",
        "Title": "X-Trace Task",
        "Host": "pinky19.mpi-sws.org",
        "HRT": 26962459360460363,
        "Operation": "fork",
        "Timestamp": "1557746099301.018555",
        "TenantClass": 0,
        "Source": "Server.java:550",
        "ThreadID": 48,
        "ThreadName": "",
        "EventID": "DC018C2F2F290152",
        "BaggageBytes": "[[248 5] [240 0] [0 198 139 83 140 29 111 8 219] [240 1] [0 225 215 24 66 11 84 122 230] [240 3] [0 2]]",
        "ProcessID": 2171
      },
      {
        "Cycles": 0,
        "Agent": "Execution-CPU",
        "ProcessName": "Name",
        "TaskID": "C68B538C1D6F08DB",
        "ParentEventID": [
          "DC018C2F2F290152"
        ],
        "Label": "unset",
        "Title": "X-Trace Task",
        "Host": "pinky19.mpi-sws.org",
        "Duration": "20963",
        "HRT": 26962459360478046,
        "Operation": "unset",
        "Timestamp": "1557746099301.036377",
        "TenantClass": 0,
        "Source": "Server.java:1828",
        "ThreadID": 48,
        "ThreadName": "",
        "EventID": "7765E4C169223D2B",
        "BaggageBytes": "[[248 5] [240 0] [0 198 139 83 140 29 111 8 219] [240 1] [0 220 1 140 47 47 41 1 82] [240 3] [0 2]]",
        "ProcessID": 2171
      },
      {
        "Cycles": 0,
        "Agent": "Execution-CPU",
        "ProcessName": "Name",
        "TaskID": "C68B538C1D6F08DB",
        "ParentEventID": [
          "DC018C2F2F290152"
        ],
        "Label": "set",
        "Title": "X-Trace Task",
        "Host": "pinky19.mpi-sws.org",
        "HRT": 26962459360485909,
        "Operation": "set",
        "Timestamp": "1557746099301.044189",
        "TenantClass": 0,
        "Source": "Server.java:2071",
        "ThreadID": 59,
        "ThreadName": "",
        "EventID": "A8F29189836C7705",
        "BaggageBytes": "[[248 5] [240 0] [0 198 139 83 140 29 111 8 219] [240 1] [0 220 1 140 47 47 41 1 82] [240 3] [0 2]]",
        "ProcessID": 2171
      },
      {
        "Cycles": 0,
        "Agent": "org.apache.hadoop.ipc.Server",
        "ProcessName": "Name",
        "TaskID": "C68B538C1D6F08DB",
        "ParentEventID": [
          "A8F29189836C7705"
        ],
        "Label": "getBlockLocations in org.apache.hadoop.hdfs.protocol.ClientProtocol",
        "Title": "X-Trace Task",
        "Host": "pinky19.mpi-sws.org",
        "HRT": 26962459360520437,
        "Timestamp": "1557746099301.078613",
        "TenantClass": 0,
        "Source": "ProtobufRpcEngine.java:601",
        "ThreadID": 59,
        "ThreadName": "",
        "EventID": "C7ABEE7492B98308",
        "BaggageBytes": "[[248 5] [240 0] [0 198 139 83 140 29 111 8 219] [240 1] [0 168 242 145 137 131 108 119 5] [240 3] [0 2]]",
        "ProcessID": 2171
      },
      {
        "Cycles": 0,
        "Agent": "org.apache.hadoop.hdfs.server.namenode.FSNamesystem.audit",
        "ProcessName": "Name",
        "TaskID": "C68B538C1D6F08DB",
        "ParentEventID": [
          "C7ABEE7492B98308"
        ],
        "Label": "allowed=true\tugi=plascas (auth:SIMPLE)\tip=/139.19.171.63\tcmd=open\tsrc=/ds/LS9e6ZyiPdxMs2qs\tdst=null\tperm=null\tproto=rpc",
        "Title": "X-Trace Task",
        "Host": "pinky19.mpi-sws.org",
        "HRT": 26962459360570431,
        "Timestamp": "1557746099301.128662",
        "TenantClass": 0,
        "Source": "FSNamesystem.java:8313",
        "ThreadID": 59,
        "ThreadName": "",
        "EventID": "BBF15C20FA388B1B",
        "BaggageBytes": "[[248 5] [240 0] [0 198 139 83 140 29 111 8 219] [240 1] [0 199 171 238 116 146 185 131 8] [240 3] [0 2]]",
        "ProcessID": 2171
      },
      {
        "Cycles": 0,
        "Agent": "edu.brown.cs.systems.xtrace.logging.BaggageWrappers",
        "ProcessName": "Name",
        "TaskID": "C68B538C1D6F08DB",
        "ParentEventID": [
          "BBF15C20FA388B1B"
        ],
        "Label": "Forking current baggage with Baggage.fork()",
        "Title": "X-Trace Task",
        "Host": "pinky19.mpi-sws.org",
        "HRT": 26962459360615772,
        "Operation": "fork",
        "Timestamp": "1557746099301.174072",
        "TenantClass": 0,
        "Source": "Server.java:2398",
        "ThreadID": 59,
        "ThreadName": "",
        "EventID": "6A639339E88A11F8",
        "BaggageBytes": "[[248 5] [240 0] [0 198 139 83 140 29 111 8 219] [240 1] [0 187 241 92 32 250 56 139 27] [240 3] [0 2]]",
        "ProcessID": 2171
      },
      {
        "Cycles": 0,
        "Agent": "Execution-CPU",
        "ProcessName": "Read",
        "TaskID": "C68B538C1D6F08DB",
        "ParentEventID": [
          "023AB2809B902744"
        ],
        "Label": "set",
        "Title": "X-Trace Task",
        "Host": "pinky19.mpi-sws.org",
        "HRT": 26962459360405581,
        "Operation": "set",
        "Timestamp": "1557746099300.943359",
        "TenantClass": 0,
        "Source": "Client.java:1104",
        "ThreadID": 1,
        "ThreadName": "",
        "EventID": "19FF56E9ECE17AA6",
        "ProcessID": 36430
      },
      {
        "Cycles": 0,
        "Agent": "Execution-CPU",
        "ProcessName": "Name",
        "TaskID": "C68B538C1D6F08DB",
        "ParentEventID": [
          "6A639339E88A11F8"
        ],
        "Label": "unset",
        "Title": "X-Trace Task",
        "Host": "pinky19.mpi-sws.org",
        "Duration": "213906",
        "HRT": 26962459360722690,
        "Operation": "unset",
        "Timestamp": "1557746099301.281006",
        "TenantClass": 0,
        "Source": "Server.java:1058",
        "ThreadID": 59,
        "ThreadName": "",
        "EventID": "579A888F623F978D",
        "BaggageBytes": "[[248 5] [240 0] [0 198 139 83 140 29 111 8 219] [240 1] [0 106 99 147 57 232 138 17 248] [240 3] [0 2]]",
        "ProcessID": 2171
      },
      {
        "Cycles": 0,
        "Agent": "Execution-CPU",
        "ProcessName": "Read",
        "TaskID": "C68B538C1D6F08DB",
        "ParentEventID": [
          "6A639339E88A11F8"
        ],
        "Label": "set",
        "Title": "X-Trace Task",
        "Host": "pinky19.mpi-sws.org",
        "HRT": 26962459360803279,
        "Operation": "set",
        "Timestamp": "1557746099301.341064",
        "TenantClass": 0,
        "Source": "Client.java:302",
        "ThreadID": 37,
        "ThreadName": "",
        "EventID": "D21AA4CAAF5EA574",
        "ProcessID": 36430
      },
      {
        "Cycles": 0,
        "Agent": "Execution-Sleep",
        "ProcessName": "Read",
        "TaskID": "C68B538C1D6F08DB",
        "ParentEventID": [
          "19FF56E9ECE17AA6"
        ],
        "Label": "waited",
        "Title": "X-Trace Task",
        "Host": "pinky19.mpi-sws.org",
        "Duration": "436733",
        "HRT": 26962459360851322,
        "Operation": "waited",
        "Timestamp": "1557746099301.388916",
        "TenantClass": 0,
        "Source": "Client.java:1537",
        "ThreadID": 1,
        "ThreadName": "",
        "EventID": "7453B060FF0263C0",
        "ProcessID": 36430
      },
      {
        "Cycles": 0,
        "Agent": "Execution-CPU",
        "ProcessName": "Read",
        "TaskID": "C68B538C1D6F08DB",
        "ParentEventID": [
          "D21AA4CAAF5EA574"
        ],
        "Label": "unset",
        "Title": "X-Trace Task",
        "Host": "pinky19.mpi-sws.org",
        "Duration": "12346",
        "HRT": 26962459360832377,
        "Operation": "unset",
        "Timestamp": "1557746099301.370117",
        "TenantClass": 0,
        "Source": "Client.java:1168",
        "ThreadID": 37,
        "ThreadName": "",
        "EventID": "994C6127278BC66D",
        "ProcessID": 36430
      },
      {
        "Cycles": 0,
        "Agent": "org.apache.hadoop.ipc.ProtobufRpcEngine",
        "ProcessName": "Read",
        "TaskID": "C68B538C1D6F08DB",
        "ParentEventID": [
          "94630520C7434A34"
        ],
        "Label": "org.apache.hadoop.hdfs.protocol.ClientProtocol.getBlockLocations completed",
        "Title": "X-Trace Task",
        "Host": "pinky19.mpi-sws.org",
        "HRT": 26962459360904315,
        "Timestamp": "1557746099301.441895",
        "TenantClass": 0,
        "Source": "ProtobufRpcEngine.java:275",
        "ThreadID": 1,
        "ThreadName": "",
        "EventID": "AD2E2460143EAB10",
        "ProcessID": 36430
      },
      {
        "Cycles": 0,
        "Agent": "edu.brown.cs.systems.xtrace.logging.BaggageWrappers",
        "ProcessName": "Read",
        "TaskID": "C68B538C1D6F08DB",
        "ParentEventID": [
          "7453B060FF0263C0",
          "994C6127278BC66D"
        ],
        "Label": "Merged current baggage with other baggage",
        "Title": "X-Trace Task",
        "Host": "pinky19.mpi-sws.org",
        "HRT": 26962459360863233,
        "Operation": "join",
        "Timestamp": "1557746099301.400879",
        "TenantClass": 0,
        "Source": "Client.java:1545",
        "ThreadID": 1,
        "ThreadName": "",
        "EventID": "94630520C7434A34",
        "ProcessID": 36430
      },
      {
        "Cycles": 0,
        "Agent": "edu.brown.cs.systems.xtrace.logging.BaggageWrappers",
        "ProcessName": "Read",
        "TaskID": "C68B538C1D6F08DB",
        "ParentEventID": [
          "AD2E2460143EAB10"
        ],
        "Label": "Forking current baggage with Baggage.fork()",
        "Title": "X-Trace Task",
        "Host": "pinky19.mpi-sws.org",
        "HRT": 26962459360976548,
        "Operation": "fork",
        "Timestamp": "1557746099301.514160",
        "TenantClass": 0,
        "Source": "DataTransferProtoUtil.java:94",
        "ThreadID": 1,
        "ThreadName": "",
        "EventID": "D7DE47A22B6F8133",
        "ProcessID": 36430
      },
      {
        "Cycles": 0,
        "Agent": "edu.brown.cs.systems.xtrace.logging.XTraceInit",
        "ProcessName": "Data",
        "TaskID": "C68B538C1D6F08DB",
        "ParentEventID": [
          "B0F6D5B7F8738C88"
        ],
        "Label": "Thread.setName: DataXceiver for client DFSClient_NONMAPREDUCE_778905418_1 at /139.19.171.63:43130 [Sending block BP-1633380353-139.19.171.63-1554193446451:blk_1073760931_20107]",
        "Title": "X-Trace Task",
        "Host": "pinky19.mpi-sws.org",
        "HRT": 26962459361146583,
        "Timestamp": "1557746099301.686035",
        "TenantClass": 0,
        "Source": "DataXceiver.java:168",
        "ThreadID": 36633,
        "ThreadName": "",
        "EventID": "E3356120EBC32F46",
        "BaggageBytes": "[[248 5] [240 0] [0 198 139 83 140 29 111 8 219] [240 1] [0 176 246 213 183 248 115 140 136] [240 3] [0 2]]",
        "ProcessID": 2319
      },
      {
        "Cycles": 0,
        "Agent": "Execution-CPU",
        "ProcessName": "Data",
        "TaskID": "C68B538C1D6F08DB",
        "ParentEventID": [
          "D7DE47A22B6F8133"
        ],
        "Label": "set",
        "Title": "X-Trace Task",
        "Host": "pinky19.mpi-sws.org",
        "HRT": 26962459361105852,
        "Operation": "set",
        "Timestamp": "1557746099301.645264",
        "TenantClass": 0,
        "Source": "Receiver.java:117",
        "ThreadID": 36633,
        "ThreadName": "",
        "EventID": "B0F6D5B7F8738C88",
        "BaggageBytes": "[[248 5] [240 0] [0 198 139 83 140 29 111 8 219] [240 1] [0 215 222 71 162 43 111 129 51] [240 3] [0 2]]",
        "ProcessID": 2319
      },
      {
        "Cycles": 0,
        "Agent": "edu.brown.cs.systems.xtrace.logging.BaggageWrappers",
        "ProcessName": "Data",
        "TaskID": "C68B538C1D6F08DB",
        "ParentEventID": [
          "E3356120EBC32F46"
        ],
        "Label": "Forking current baggage with Baggage.fork()",
        "Title": "X-Trace Task",
        "Host": "pinky19.mpi-sws.org",
        "HRT": 26962459361218377,
        "Operation": "fork",
        "Timestamp": "1557746099301.757812",
        "TenantClass": 0,
        "Source": "DataXceiver.java:1257",
        "ThreadID": 36633,
        "ThreadName": "",
        "EventID": "76B31BE4F425954F",
        "BaggageBytes": "[[248 5] [240 0] [0 198 139 83 140 29 111 8 219] [240 1] [0 227 53 97 32 235 195 47 70] [240 3] [0 2]]",
        "ProcessID": 2319
      },
      {
        "Cycles": 0,
        "Agent": "edu.brown.cs.systems.xtrace.logging.BaggageWrappers",
        "ProcessName": "Data",
        "TaskID": "C68B538C1D6F08DB",
        "ParentEventID": [
          "76B31BE4F425954F"
        ],
        "Label": "Forking current baggage with Baggage.fork()",
        "Title": "X-Trace Task",
        "Host": "pinky19.mpi-sws.org",
        "HRT": 26962459361281267,
        "Operation": "fork",
        "Timestamp": "1557746099301.820801",
        "TenantClass": 0,
        "Source": "PacketHeader.java:95",
        "ThreadID": 36633,
        "ThreadName": "",
        "EventID": "120AE40A2F0666A7",
        "BaggageBytes": "[[248 5] [240 0] [0 198 139 83 140 29 111 8 219] [240 1] [0 118 179 27 228 244 37 149 79] [240 3] [0 2]]",
        "ProcessID": 2319
      },
      {
        "Cycles": 0,
        "Agent": "Execution-Sleep",
        "ProcessName": "Data",
        "TaskID": "C68B538C1D6F08DB",
        "ParentEventID": [
          "120AE40A2F0666A7"
        ],
        "Label": "waited",
        "Title": "X-Trace Task",
        "Host": "pinky19.mpi-sws.org",
        "Duration": "4040",
        "HRT": 26962459361339790,
        "Operation": "waited",
        "Timestamp": "1557746099301.879150",
        "TenantClass": 0,
        "Source": "SocketIOWithTimeout.java:335",
        "ThreadID": 36633,
        "ThreadName": "",
        "EventID": "8542F8143567D558",
        "BaggageBytes": "[[248 5] [240 0] [0 198 139 83 140 29 111 8 219] [240 1] [0 18 10 228 10 47 6 102 167] [240 3] [0 2]]",
        "ProcessID": 2319
      },
      {
        "Cycles": 0,
        "Agent": "edu.brown.cs.systems.xtrace.logging.BaggageWrappers",
        "ProcessName": "Read",
        "TaskID": "C68B538C1D6F08DB",
        "ParentEventID": [
          "327661A5E786BFEF",
          "76B31BE4F425954F"
        ],
        "Label": "Merged current baggage with other baggage",
        "Title": "X-Trace Task",
        "Host": "pinky19.mpi-sws.org",
        "HRT": 26962459361352146,
        "Operation": "join",
        "Timestamp": "1557746099301.889893",
        "TenantClass": 0,
        "Source": "RemoteBlockReader2.java:429",
        "ThreadID": 1,
        "ThreadName": "",
        "EventID": "5A6E170B6B5272AF",
        "ProcessID": 36430
      },
      {
        "Cycles": 0,
        "Agent": "Execution-Sleep",
        "ProcessName": "Read",
        "TaskID": "C68B538C1D6F08DB",
        "ParentEventID": [
          "D7DE47A22B6F8133"
        ],
        "Label": "waited",
        "Title": "X-Trace Task",
        "Host": "pinky19.mpi-sws.org",
        "Duration": "190202",
        "HRT": 26962459361278115,
        "Operation": "waited",
        "Timestamp": "1557746099301.815918",
        "TenantClass": 0,
        "Source": "SocketIOWithTimeout.java:335",
        "ThreadID": 1,
        "ThreadName": "",
        "EventID": "327661A5E786BFEF",
        "ProcessID": 36430
      },
      {
        "Cycles": 0,
        "Agent": "edu.brown.cs.systems.xtrace.logging.BaggageWrappers",
        "ProcessName": "Data",
        "TaskID": "C68B538C1D6F08DB",
        "ParentEventID": [
          "8542F8143567D558"
        ],
        "Label": "Forking current baggage with Baggage.fork()",
        "Title": "X-Trace Task",
        "Host": "pinky19.mpi-sws.org",
        "HRT": 26962459361402394,
        "Operation": "fork",
        "Timestamp": "1557746099301.941895",
        "TenantClass": 0,
        "Source": "PacketHeader.java:95",
        "ThreadID": 36633,
        "ThreadName": "",
        "EventID": "BF129128EE728D3D",
        "BaggageBytes": "[[248 5] [240 0] [0 198 139 83 140 29 111 8 219] [240 1] [0 133 66 248 20 53 103 213 88] [240 3] [0 2]]",
        "ProcessID": 2319
      },
      {
        "Cycles": 0,
        "Agent": "edu.brown.cs.systems.xtrace.logging.BaggageWrappers",
        "ProcessName": "Read",
        "TaskID": "C68B538C1D6F08DB",
        "ParentEventID": [
          "5A6E170B6B5272AF",
          "120AE40A2F0666A7"
        ],
        "Label": "Merged current baggage with other baggage",
        "Title": "X-Trace Task",
        "Host": "pinky19.mpi-sws.org",
        "HRT": 26962459361437474,
        "Operation": "join",
        "Timestamp": "1557746099301.975098",
        "TenantClass": 0,
        "Source": "PacketHeader.java:168",
        "ThreadID": 1,
        "ThreadName": "",
        "EventID": "56A46BC78501D26E",
        "ProcessID": 36430
      },
      {
        "Cycles": 0,
        "Agent": "edu.brown.cs.systems.xtrace.logging.BaggageWrappers",
        "ProcessName": "Read",
        "TaskID": "C68B538C1D6F08DB",
        "ParentEventID": [
          "BF129128EE728D3D",
          "56A46BC78501D26E"
        ],
        "Label": "Merged current baggage with other baggage",
        "Title": "X-Trace Task",
        "Host": "pinky19.mpi-sws.org",
        "HRT": 26962459361520782,
        "Operation": "join",
        "Timestamp": "1557746099302.058594",
        "TenantClass": 0,
        "Source": "PacketHeader.java:168",
        "ThreadID": 1,
        "ThreadName": "",
        "EventID": "E73B47647184FE7F",
        "ProcessID": 36430
      },
      {
        "Cycles": 0,
        "Agent": "Execution-Sleep",
        "ProcessName": "Data",
        "TaskID": "C68B538C1D6F08DB",
        "ParentEventID": [
          "BF129128EE728D3D"
        ],
        "Label": "waited",
        "Title": "X-Trace Task",
        "Host": "pinky19.mpi-sws.org",
        "Duration": "107374",
        "HRT": 26962459361589291,
        "Operation": "waited",
        "Timestamp": "1557746099302.128662",
        "TenantClass": 0,
        "Source": "SocketIOWithTimeout.java:335",
        "ThreadID": 36633,
        "ThreadName": "",
        "EventID": "610F94C31048BF18",
        "BaggageBytes": "[[248 5] [240 0] [0 198 139 83 140 29 111 8 219] [240 1] [0 191 18 145 40 238 114 141 61] [240 3] [0 2]]",
        "ProcessID": 2319
      },
      {
        "Cycles": 0,
        "Agent": "edu.brown.cs.systems.xtrace.logging.BaggageWrappers",
        "ProcessName": "Data",
        "TaskID": "C68B538C1D6F08DB",
        "ParentEventID": [
          "6B371548AF038847",
          "610F94C31048BF18"
        ],
        "Label": "Merged current baggage with other baggage",
        "Title": "X-Trace Task",
        "Host": "pinky19.mpi-sws.org",
        "HRT": 26962459361646014,
        "Operation": "join",
        "Timestamp": "1557746099302.185547",
        "TenantClass": 0,
        "Source": "DataXceiver.java:574",
        "ThreadID": 36633,
        "ThreadName": "",
        "EventID": "B9594789BD50B38C",
        "BaggageBytes": "[[248 5] [240 0] [0 198 139 83 140 29 111 8 219] [240 1] [0 97 15 148 195 16 72 191 24] [0 107 55 21 72 175 3 136 71] [240 3] [0 2]]",
        "ProcessID": 2319
      },
      {
        "Cycles": 0,
        "Agent": "Execution-CPU",
        "ProcessName": "Data",
        "TaskID": "C68B538C1D6F08DB",
        "ParentEventID": [
          "B9594789BD50B38C"
        ],
        "Label": "unset",
        "Title": "X-Trace Task",
        "Host": "pinky19.mpi-sws.org",
        "Duration": "534088",
        "HRT": 26962459361670636,
        "Operation": "unset",
        "Timestamp": "1557746099302.209961",
        "TenantClass": 0,
        "Source": "DataXceiver.java:261",
        "ThreadID": 36633,
        "ThreadName": "",
        "EventID": "24F46753D0B4B9B6",
        "BaggageBytes": "[[248 5] [240 0] [0 198 139 83 140 29 111 8 219] [240 1] [0 185 89 71 137 189 80 179 140] [240 3] [0 2]]",
        "ProcessID": 2319
      },
      {
        "Cycles": 0,
        "Agent": "edu.brown.cs.systems.xtrace.logging.BaggageWrappers",
        "ProcessName": "Read",
        "TaskID": "C68B538C1D6F08DB",
        "ParentEventID": [
          "E73B47647184FE7F"
        ],
        "Label": "Forking current baggage with Baggage.fork()",
        "Title": "X-Trace Task",
        "Host": "pinky19.mpi-sws.org",
        "HRT": 26962459361531481,
        "Operation": "fork",
        "Timestamp": "1557746099302.069092",
        "TenantClass": 0,
        "Source": "RemoteBlockReader2.java:361",
        "ThreadID": 1,
        "ThreadName": "",
        "EventID": "6B371548AF038847",
        "ProcessID": 36430
      },
      {
        "Cycles": 0,
        "Agent": "edu.brown.cs.systems.retro.benchmarks.hdfs_client.Reader",
        "ProcessName": "Read",
        "TaskID": "C68B538C1D6F08DB",
        "ParentEventID": [
          "0"
        ],
        "Label": "Reading file",
        "Title": "X-Trace Task",
        "Host": "pinky19.mpi-sws.org",
        "HRT": 26962459360158262,
        "Timestamp": "1557746099300.696045",
        "TenantClass": 0,
        "ThreadID": 1,
        "ThreadName": "",
        "EventID": "192F6DCC03707412",
        "ProcessID": 36430,
        "Tag": [
          "reader_10kb",
          "Read Size: 10240"
        ]
      }
    ]
  }
]