[
  {
    "id": "E32E77FB5B1BDE8F",
    "reports": [
      {
        "Cycles": 0,
        "Agent": "Execution-CPU",
        "ProcessName": "Read",
        "TaskID": "E32E77FB5B1BDE8F",
        "ParentEventID": [
          "6A7371654C83A795"
        ],
        "Label": "unset",
        "Title": "X-Trace Task",
        "Host": "pinky19.mpi-sws.org",
        "Duration": "22705977",
        "HRT": 25491948412430103,
        "Operation": "unset",
        "Timestamp": "1556275588352.569336",
        "TenantClass": 0,
        "Source": "Client.java:1027",
        "ThreadID": 1,
        "ThreadName": "",
        "EventID": "CFB43EA8AB179073",
        "ProcessID": 21035
      },
      {
        "Cycles": 0,
        "Agent": "edu.brown.cs.systems.retro.benchmarks.hdfs_client.Reader",
        "ProcessName": "Read",
        "TaskID": "E32E77FB5B1BDE8F",
        "ParentEventID": [
          "D9AA2DC5661AB803"
        ],
        "Label": "Reading file",
        "Title": "X-Trace Task",
        "Host": "pinky19.mpi-sws.org",
        "HRT": 25491948412287863,
        "Timestamp": "1556275588352.427246",
        "TenantClass": 0,
        "ThreadID": 1,
        "ThreadName": "",
        "EventID": "8B15A37C5FEAD8DD",
        "ProcessID": 21035
      },
      {
        "Cycles": 0,
        "Agent": "org.apache.hadoop.ipc.ProtobufRpcEngine",
        "ProcessName": "Read",
        "TaskID": "E32E77FB5B1BDE8F",
        "ParentEventID": [
          "8B15A37C5FEAD8DD"
        ],
        "Label": "Invoking org.apache.hadoop.hdfs.protocol.ClientProtocol.getBlockLocations",
        "Title": "X-Trace Task",
        "Host": "pinky19.mpi-sws.org",
        "HRT": 25491948412379644,
        "Timestamp": "1556275588352.519043",
        "TenantClass": 0,
        "Source": "ProtobufRpcEngine.java:228",
        "ThreadID": 1,
        "ThreadName": "",
        "EventID": "6A7371654C83A795",
        "ProcessID": 21035
      },
      {
        "Cycles": 0,
        "Agent": "edu.brown.cs.systems.xtrace.logging.BaggageWrappers",
        "ProcessName": "Read",
        "TaskID": "E32E77FB5B1BDE8F",
        "ParentEventID": [
          "D3D71ACA762FFDAB"
        ],
        "Label": "Forking current baggage with Baggage.fork()",
        "Title": "X-Trace Task",
        "Host": "pinky19.mpi-sws.org",
        "HRT": 25491948412529253,
        "Operation": "fork",
        "Timestamp": "1556275588352.668701",
        "TenantClass": 0,
        "Source": "Client.java:1043",
        "ThreadID": 41,
        "ThreadName": "",
        "EventID": "3B68E65E17E33425",
        "ProcessID": 21035
      },
      {
        "Cycles": 0,
        "Agent": "Execution-CPU",
        "ProcessName": "Read",
        "TaskID": "E32E77FB5B1BDE8F",
        "ParentEventID": [
          "CFB43EA8AB179073"
        ],
        "Label": "set",
        "Title": "X-Trace Task",
        "Host": "pinky19.mpi-sws.org",
        "HRT": 25491948412510166,
        "Operation": "set",
        "Timestamp": "1556275588352.649414",
        "TenantClass": 0,
        "Source": "Client.java:1032",
        "ThreadID": 41,
        "ThreadName": "",
        "EventID": "D3D71ACA762FFDAB",
        "ProcessID": 21035
      },
      {
        "Cycles": 0,
        "Agent": "Execution-CPU",
        "ProcessName": "Read",
        "TaskID": "E32E77FB5B1BDE8F",
        "ParentEventID": [
          "3B68E65E17E33425"
        ],
        "Label": "unset",
        "Title": "X-Trace Task",
        "Host": "pinky19.mpi-sws.org",
        "Duration": "67660",
        "HRT": 25491948412595883,
        "Operation": "unset",
        "Timestamp": "1556275588352.735352",
        "TenantClass": 0,
        "Source": "Client.java:1062",
        "ThreadID": 41,
        "ThreadName": "",
        "EventID": "68F9876FE477BD3D",
        "ProcessID": 21035
      },
      {
        "Cycles": 0,
        "Agent": "Execution-CPU",
        "ProcessName": "Name",
        "TaskID": "E32E77FB5B1BDE8F",
        "ParentEventID": [
          "3B68E65E17E33425"
        ],
        "Label": "set",
        "Title": "X-Trace Task",
        "Host": "pinky19.mpi-sws.org",
        "HRT": 25491948412654435,
        "Operation": "set",
        "Timestamp": "1556275588352.826416",
        "TenantClass": 0,
        "Source": "Server.java:1840",
        "ThreadID": 48,
        "ThreadName": "",
        "EventID": "18EF31C0474A4368",
        "BaggageBytes": "[[248 5] [240 0] [0 227 46 119 251 91 27 222 143] [240 1] [0 59 104 230 94 23 227 52 37] [240 3] [0 2]]",
        "ProcessID": 2171
      },
      {
        "Cycles": 0,
        "Agent": "Execution-CPU",
        "ProcessName": "Read",
        "TaskID": "E32E77FB5B1BDE8F",
        "ParentEventID": [
          "68F9876FE477BD3D"
        ],
        "Label": "set",
        "Title": "X-Trace Task",
        "Host": "pinky19.mpi-sws.org",
        "HRT": 25491948412618957,
        "Operation": "set",
        "Timestamp": "1556275588352.758301",
        "TenantClass": 0,
        "Source": "Client.java:1104",
        "ThreadID": 1,
        "ThreadName": "",
        "EventID": "60B640361F5832FD",
        "ProcessID": 21035
      },
      {
        "Cycles": 0,
        "Agent": "edu.brown.cs.systems.xtrace.logging.BaggageWrappers",
        "ProcessName": "Name",
        "TaskID": "E32E77FB5B1BDE8F",
        "ParentEventID": [
          "18EF31C0474A4368"
        ],
        "Label": "Forking current baggage with Baggage.fork()",
        "Title": "X-Trace Task",
        "Host": "pinky19.mpi-sws.org",
        "HRT": 25491948412696609,
        "Operation": "fork",
        "Timestamp": "1556275588352.868408",
        "TenantClass": 0,
        "Source": "Server.java:550",
        "ThreadID": 48,
        "ThreadName": "",
        "EventID": "7FA278001BCA537F",
        "BaggageBytes": "[[248 5] [240 0] [0 227 46 119 251 91 27 222 143] [240 1] [0 24 239 49 192 71 74 67 104] [240 3] [0 2]]",
        "ProcessID": 2171
      },
      {
        "Cycles": 0,
        "Agent": "Execution-CPU",
        "ProcessName": "Name",
        "TaskID": "E32E77FB5B1BDE8F",
        "ParentEventID": [
          "7FA278001BCA537F"
        ],
        "Label": "unset",
        "Title": "X-Trace Task",
        "Host": "pinky19.mpi-sws.org",
        "Duration": "36776",
        "HRT": 25491948412722020,
        "Operation": "unset",
        "Timestamp": "1556275588352.893799",
        "TenantClass": 0,
        "Source": "Server.java:1828",
        "ThreadID": 48,
        "ThreadName": "",
        "EventID": "D89590BA87F99AA5",
        "BaggageBytes": "[[248 5] [240 0] [0 227 46 119 251 91 27 222 143] [240 1] [0 127 162 120 0 27 202 83 127] [240 3] [0 2]]",
        "ProcessID": 2171
      },
      {
        "Cycles": 0,
        "Agent": "Execution-CPU",
        "ProcessName": "Name",
        "TaskID": "E32E77FB5B1BDE8F",
        "ParentEventID": [
          "7FA278001BCA537F"
        ],
        "Label": "set",
        "Title": "X-Trace Task",
        "Host": "pinky19.mpi-sws.org",
        "HRT": 25491948412732470,
        "Operation": "set",
        "Timestamp": "1556275588352.904297",
        "TenantClass": 0,
        "Source": "Server.java:2071",
        "ThreadID": 59,
        "ThreadName": "",
        "EventID": "7A5590D2146C9A0D",
        "BaggageBytes": "[[248 5] [240 0] [0 227 46 119 251 91 27 222 143] [240 1] [0 127 162 120 0 27 202 83 127] [240 3] [0 2]]",
        "ProcessID": 2171
      },
      {
        "Cycles": 0,
        "Agent": "org.apache.hadoop.ipc.Server",
        "ProcessName": "Name",
        "TaskID": "E32E77FB5B1BDE8F",
        "ParentEventID": [
          "7A5590D2146C9A0D"
        ],
        "Label": "getBlockLocations in org.apache.hadoop.hdfs.protocol.ClientProtocol",
        "Title": "X-Trace Task",
        "Host": "pinky19.mpi-sws.org",
        "HRT": 25491948412768830,
        "Timestamp": "1556275588352.940674",
        "TenantClass": 0,
        "Source": "ProtobufRpcEngine.java:601",
        "ThreadID": 59,
        "ThreadName": "",
        "EventID": "8466A8F34FCF5E16",
        "BaggageBytes": "[[248 5] [240 0] [0 227 46 119 251 91 27 222 143] [240 1] [0 122 85 144 210 20 108 154 13] [240 3] [0 2]]",
        "ProcessID": 2171
      },
      {
        "Cycles": 0,
        "Agent": "edu.brown.cs.systems.xtrace.logging.BaggageWrappers",
        "ProcessName": "Name",
        "TaskID": "E32E77FB5B1BDE8F",
        "ParentEventID": [
          "3D071F4C06317E29"
        ],
        "Label": "Forking current baggage with Baggage.fork()",
        "Title": "X-Trace Task",
        "Host": "pinky19.mpi-sws.org",
        "HRT": 25491948412859754,
        "Operation": "fork",
        "Timestamp": "1556275588353.031738",
        "TenantClass": 0,
        "Source": "Server.java:2398",
        "ThreadID": 59,
        "ThreadName": "",
        "EventID": "70C46B2A48DC498A",
        "BaggageBytes": "[[248 5] [240 0] [0 227 46 119 251 91 27 222 143] [240 1] [0 61 7 31 76 6 49 126 41] [240 3] [0 2]]",
        "ProcessID": 2171
      },
      {
        "Cycles": 0,
        "Agent": "org.apache.hadoop.hdfs.server.namenode.FSNamesystem.audit",
        "ProcessName": "Name",
        "TaskID": "E32E77FB5B1BDE8F",
        "ParentEventID": [
          "8466A8F34FCF5E16"
        ],
        "Label": "allowed=true\tugi=plascas (auth:SIMPLE)\tip=/139.19.171.63\tcmd=open\tsrc=/ds/clEwhDOtQ718L1Uf\tdst=null\tperm=null\tproto=rpc",
        "Title": "X-Trace Task",
        "Host": "pinky19.mpi-sws.org",
        "HRT": 25491948412816127,
        "Timestamp": "1556275588352.988037",
        "TenantClass": 0,
        "Source": "FSNamesystem.java:8313",
        "ThreadID": 59,
        "ThreadName": "",
        "EventID": "3D071F4C06317E29",
        "BaggageBytes": "[[248 5] [240 0] [0 227 46 119 251 91 27 222 143] [240 1] [0 132 102 168 243 79 207 94 22] [240 3] [0 2]]",
        "ProcessID": 2171
      },
      {
        "Cycles": 0,
        "Agent": "Execution-CPU",
        "ProcessName": "Name",
        "TaskID": "E32E77FB5B1BDE8F",
        "ParentEventID": [
          "70C46B2A48DC498A"
        ],
        "Label": "unset",
        "Title": "X-Trace Task",
        "Host": "pinky19.mpi-sws.org",
        "Duration": "218283",
        "HRT": 25491948412974381,
        "Operation": "unset",
        "Timestamp": "1556275588353.146240",
        "TenantClass": 0,
        "Source": "Server.java:1058",
        "ThreadID": 59,
        "ThreadName": "",
        "EventID": "97F3F9C3CA779D3E",
        "BaggageBytes": "[[248 5] [240 0] [0 227 46 119 251 91 27 222 143] [240 1] [0 112 196 107 42 72 220 73 138] [240 3] [0 2]]",
        "ProcessID": 2171
      },
      {
        "Cycles": 0,
        "Agent": "Execution-CPU",
        "ProcessName": "Read",
        "TaskID": "E32E77FB5B1BDE8F",
        "ParentEventID": [
          "19F642FCB1B8539C"
        ],
        "Label": "unset",
        "Title": "X-Trace Task",
        "Host": "pinky19.mpi-sws.org",
        "Duration": "5735",
        "HRT": 25491948413072031,
        "Operation": "unset",
        "Timestamp": "1556275588353.211426",
        "TenantClass": 0,
        "Source": "Client.java:1168",
        "ThreadID": 37,
        "ThreadName": "",
        "EventID": "48E69C74ED99024E",
        "ProcessID": 21035
      },
      {
        "Cycles": 0,
        "Agent": "Execution-CPU",
        "ProcessName": "Read",
        "TaskID": "E32E77FB5B1BDE8F",
        "ParentEventID": [
          "70C46B2A48DC498A"
        ],
        "Label": "set",
        "Title": "X-Trace Task",
        "Host": "pinky19.mpi-sws.org",
        "HRT": 25491948413050143,
        "Operation": "set",
        "Timestamp": "1556275588353.189453",
        "TenantClass": 0,
        "Source": "Client.java:302",
        "ThreadID": 37,
        "ThreadName": "",
        "EventID": "19F642FCB1B8539C",
        "ProcessID": 21035
      },
      {
        "Cycles": 0,
        "Agent": "Execution-Sleep",
        "ProcessName": "Read",
        "TaskID": "E32E77FB5B1BDE8F",
        "ParentEventID": [
          "60B640361F5832FD"
        ],
        "Label": "waited",
        "Title": "X-Trace Task",
        "Host": "pinky19.mpi-sws.org",
        "Duration": "461713",
        "HRT": 25491948413090352,
        "Operation": "waited",
        "Timestamp": "1556275588353.229736",
        "TenantClass": 0,
        "Source": "Client.java:1537",
        "ThreadID": 1,
        "ThreadName": "",
        "EventID": "3ED055CA39E09EA3",
        "ProcessID": 21035
      },
      {
        "Cycles": 0,
        "Agent": "edu.brown.cs.systems.xtrace.logging.BaggageWrappers",
        "ProcessName": "Read",
        "TaskID": "E32E77FB5B1BDE8F",
        "ParentEventID": [
          "3ED055CA39E09EA3",
          "48E69C74ED99024E"
        ],
        "Label": "Merged current baggage with other baggage",
        "Title": "X-Trace Task",
        "Host": "pinky19.mpi-sws.org",
        "HRT": 25491948413101478,
        "Operation": "join",
        "Timestamp": "1556275588353.240723",
        "TenantClass": 0,
        "Source": "Client.java:1545",
        "ThreadID": 1,
        "ThreadName": "",
        "EventID": "552D52285F0CB109",
        "ProcessID": 21035
      },
      {
        "Cycles": 0,
        "Agent": "org.apache.hadoop.ipc.ProtobufRpcEngine",
        "ProcessName": "Read",
        "TaskID": "E32E77FB5B1BDE8F",
        "ParentEventID": [
          "552D52285F0CB109"
        ],
        "Label": "org.apache.hadoop.hdfs.protocol.ClientProtocol.getBlockLocations completed",
        "Title": "X-Trace Task",
        "Host": "pinky19.mpi-sws.org",
        "HRT": 25491948413139353,
        "Timestamp": "1556275588353.278809",
        "TenantClass": 0,
        "Source": "ProtobufRpcEngine.java:275",
        "ThreadID": 1,
        "ThreadName": "",
        "EventID": "193A77A0FEFAA22D",
        "ProcessID": 21035
      },
      {
        "Cycles": 0,
        "Agent": "Execution-CPU",
        "ProcessName": "Data",
        "TaskID": "E32E77FB5B1BDE8F",
        "ParentEventID": [
          "253F398AB970DC4E"
        ],
        "Label": "set",
        "Title": "X-Trace Task",
        "Host": "pinky27.mpi-sws.org",
        "HRT": 14091223459715754,
        "Operation": "set",
        "Timestamp": "1556275588353.588867",
        "TenantClass": 0,
        "Source": "Receiver.java:117",
        "ThreadID": 6493,
        "ThreadName": "",
        "EventID": "8DFA576AD96A4A6C",
        "BaggageBytes": "[[248 5] [240 0] [0 227 46 119 251 91 27 222 143] [240 1] [0 37 63 57 138 185 112 220 78] [240 3] [0 2]]",
        "ProcessID": 31438
      },
      {
        "Cycles": 0,
        "Agent": "edu.brown.cs.systems.xtrace.logging.BaggageWrappers",
        "ProcessName": "Read",
        "TaskID": "E32E77FB5B1BDE8F",
        "ParentEventID": [
          "193A77A0FEFAA22D"
        ],
        "Label": "Forking current baggage with Baggage.fork()",
        "Title": "X-Trace Task",
        "Host": "pinky19.mpi-sws.org",
        "HRT": 25491948413213847,
        "Operation": "fork",
        "Timestamp": "1556275588353.353271",
        "TenantClass": 0,
        "Source": "DataTransferProtoUtil.java:94",
        "ThreadID": 1,
        "ThreadName": "",
        "EventID": "253F398AB970DC4E",
        "ProcessID": 21035
      },
      {
        "Cycles": 0,
        "Agent": "edu.brown.cs.systems.xtrace.logging.XTraceInit",
        "ProcessName": "Data",
        "TaskID": "E32E77FB5B1BDE8F",
        "ParentEventID": [
          "8DFA576AD96A4A6C"
        ],
        "Label": "Thread.setName: DataXceiver for client DFSClient_NONMAPREDUCE_1377588049_1 at /139.19.171.63:35816 [Sending block BP-1633380353-139.19.171.63-1554193446451:blk_1073757227_16403]",
        "Title": "X-Trace Task",
        "Host": "pinky27.mpi-sws.org",
        "HRT": 14091223459796514,
        "Timestamp": "1556275588353.669678",
        "TenantClass": 0,
        "Source": "DataXceiver.java:168",
        "ThreadID": 6493,
        "ThreadName": "",
        "EventID": "9650B896FEFB3414",
        "BaggageBytes": "[[248 5] [240 0] [0 227 46 119 251 91 27 222 143] [240 1] [0 141 250 87 106 217 106 74 108] [240 3] [0 2]]",
        "ProcessID": 31438
      },
      {
        "Cycles": 0,
        "Agent": "Execution-Sleep",
        "ProcessName": "Read",
        "TaskID": "E32E77FB5B1BDE8F",
        "ParentEventID": [
          "253F398AB970DC4E"
        ],
        "Label": "waited",
        "Title": "X-Trace Task",
        "Host": "pinky19.mpi-sws.org",
        "Duration": "600369",
        "HRT": 25491948413898829,
        "Operation": "waited",
        "Timestamp": "1556275588354.038086",
        "TenantClass": 0,
        "Source": "SocketIOWithTimeout.java:335",
        "ThreadID": 1,
        "ThreadName": "",
        "EventID": "93692AC80C96A0C6",
        "ProcessID": 21035
      },
      {
        "Cycles": 0,
        "Agent": "edu.brown.cs.systems.xtrace.logging.BaggageWrappers",
        "ProcessName": "Data",
        "TaskID": "E32E77FB5B1BDE8F",
        "ParentEventID": [
          "EBCE559BB37966D5"
        ],
        "Label": "Forking current baggage with Baggage.fork()",
        "Title": "X-Trace Task",
        "Host": "pinky27.mpi-sws.org",
        "HRT": 14091223460130028,
        "Operation": "fork",
        "Timestamp": "1556275588354.003174",
        "TenantClass": 0,
        "Source": "PacketHeader.java:95",
        "ThreadID": 6493,
        "ThreadName": "",
        "EventID": "2AAA9D0C8EC03AB7",
        "BaggageBytes": "[[248 5] [240 0] [0 227 46 119 251 91 27 222 143] [240 1] [0 235 206 85 155 179 121 102 213] [240 3] [0 2]]",
        "ProcessID": 31438
      },
      {
        "Cycles": 0,
        "Agent": "edu.brown.cs.systems.xtrace.logging.BaggageWrappers",
        "ProcessName": "Data",
        "TaskID": "E32E77FB5B1BDE8F",
        "ParentEventID": [
          "9650B896FEFB3414"
        ],
        "Label": "Forking current baggage with Baggage.fork()",
        "Title": "X-Trace Task",
        "Host": "pinky27.mpi-sws.org",
        "HRT": 14091223459997402,
        "Operation": "fork",
        "Timestamp": "1556275588353.870605",
        "TenantClass": 0,
        "Source": "DataXceiver.java:1257",
        "ThreadID": 6493,
        "ThreadName": "",
        "EventID": "EBCE559BB37966D5",
        "BaggageBytes": "[[248 5] [240 0] [0 227 46 119 251 91 27 222 143] [240 1] [0 150 80 184 150 254 251 52 20] [240 3] [0 2]]",
        "ProcessID": 31438
      },
      {
        "Cycles": 0,
        "Agent": "edu.brown.cs.systems.xtrace.logging.BaggageWrappers",
        "ProcessName": "Read",
        "TaskID": "E32E77FB5B1BDE8F",
        "ParentEventID": [
          "EBCE559BB37966D5",
          "93692AC80C96A0C6"
        ],
        "Label": "Merged current baggage with other baggage",
        "Title": "X-Trace Task",
        "Host": "pinky19.mpi-sws.org",
        "HRT": 25491948413968036,
        "Operation": "join",
        "Timestamp": "1556275588354.107422",
        "TenantClass": 0,
        "Source": "RemoteBlockReader2.java:429",
        "ThreadID": 1,
        "ThreadName": "",
        "EventID": "020DE8AA753DD946",
        "ProcessID": 21035
      },
      {
        "Cycles": 0,
        "Agent": "Execution-Sleep",
        "ProcessName": "Read",
        "TaskID": "E32E77FB5B1BDE8F",
        "ParentEventID": [
          "020DE8AA753DD946"
        ],
        "Label": "waited",
        "Title": "X-Trace Task",
        "Host": "pinky19.mpi-sws.org",
        "Duration": "16862",
        "HRT": 25491948414038691,
        "Operation": "waited",
        "Timestamp": "1556275588354.177979",
        "TenantClass": 0,
        "Source": "SocketIOWithTimeout.java:335",
        "ThreadID": 1,
        "ThreadName": "",
        "EventID": "64BD033E3B028BA4",
        "ProcessID": 21035
      },
      {
        "Cycles": 0,
        "Agent": "Execution-Sleep",
        "ProcessName": "Data",
        "TaskID": "E32E77FB5B1BDE8F",
        "ParentEventID": [
          "2AAA9D0C8EC03AB7"
        ],
        "Label": "waited",
        "Title": "X-Trace Task",
        "Host": "pinky27.mpi-sws.org",
        "Duration": "8715",
        "HRT": 14091223460280243,
        "Operation": "waited",
        "Timestamp": "1556275588354.153564",
        "TenantClass": 0,
        "Source": "SocketIOWithTimeout.java:335",
        "ThreadID": 6493,
        "ThreadName": "",
        "EventID": "90331530C4D9D4A1",
        "BaggageBytes": "[[248 5] [240 0] [0 227 46 119 251 91 27 222 143] [240 1] [0 42 170 157 12 142 192 58 183] [240 3] [0 2]]",
        "ProcessID": 31438
      },
      {
        "Cycles": 0,
        "Agent": "Execution-Sleep",
        "ProcessName": "Read",
        "TaskID": "E32E77FB5B1BDE8F",
        "ParentEventID": [
          "64BD033E3B028BA4"
        ],
        "Label": "waited",
        "Title": "X-Trace Task",
        "Host": "pinky19.mpi-sws.org",
        "Duration": "15588",
        "HRT": 25491948414187016,
        "Operation": "waited",
        "Timestamp": "1556275588354.326416",
        "TenantClass": 0,
        "Source": "SocketIOWithTimeout.java:335",
        "ThreadID": 1,
        "ThreadName": "",
        "EventID": "17E796498543282F",
        "ProcessID": 21035
      },
      {
        "Cycles": 0,
        "Agent": "edu.brown.cs.systems.xtrace.logging.BaggageWrappers",
        "ProcessName": "Read",
        "TaskID": "E32E77FB5B1BDE8F",
        "ParentEventID": [
          "17E796498543282F",
          "2AAA9D0C8EC03AB7"
        ],
        "Label": "Merged current baggage with other baggage",
        "Title": "X-Trace Task",
        "Host": "pinky19.mpi-sws.org",
        "HRT": 25491948414231124,
        "Operation": "join",
        "Timestamp": "1556275588354.370361",
        "TenantClass": 0,
        "Source": "PacketHeader.java:168",
        "ThreadID": 1,
        "ThreadName": "",
        "EventID": "8D339E43E273FDD8",
        "ProcessID": 21035
      },
      {
        "Cycles": 0,
        "Agent": "edu.brown.cs.systems.xtrace.logging.BaggageWrappers",
        "ProcessName": "Data",
        "TaskID": "E32E77FB5B1BDE8F",
        "ParentEventID": [
          "90331530C4D9D4A1"
        ],
        "Label": "Forking current baggage with Baggage.fork()",
        "Title": "X-Trace Task",
        "Host": "pinky27.mpi-sws.org",
        "HRT": 14091223460428364,
        "Operation": "fork",
        "Timestamp": "1556275588354.301514",
        "TenantClass": 0,
        "Source": "PacketHeader.java:95",
        "ThreadID": 6493,
        "ThreadName": "",
        "EventID": "DCD78E6A31FA82EE",
        "BaggageBytes": "[[248 5] [240 0] [0 227 46 119 251 91 27 222 143] [240 1] [0 144 51 21 48 196 217 212 161] [240 3] [0 2]]",
        "ProcessID": 31438
      },
      {
        "Cycles": 0,
        "Agent": "Execution-Sleep",
        "ProcessName": "Read",
        "TaskID": "E32E77FB5B1BDE8F",
        "ParentEventID": [
          "8D339E43E273FDD8"
        ],
        "Label": "waited",
        "Title": "X-Trace Task",
        "Host": "pinky19.mpi-sws.org",
        "Duration": "23674",
        "HRT": 25491948414297388,
        "Operation": "waited",
        "Timestamp": "1556275588354.436768",
        "TenantClass": 0,
        "Source": "SocketIOWithTimeout.java:335",
        "ThreadID": 1,
        "ThreadName": "",
        "EventID": "22F7C7083A2F84B8",
        "ProcessID": 21035
      },
      {
        "Cycles": 0,
        "Agent": "edu.brown.cs.systems.xtrace.logging.BaggageWrappers",
        "ProcessName": "Read",
        "TaskID": "E32E77FB5B1BDE8F",
        "ParentEventID": [
          "5A720E1DADFA36C0"
        ],
        "Label": "Forking current baggage with Baggage.fork()",
        "Title": "X-Trace Task",
        "Host": "pinky19.mpi-sws.org",
        "HRT": 25491948414368130,
        "Operation": "fork",
        "Timestamp": "1556275588354.507568",
        "TenantClass": 0,
        "Source": "RemoteBlockReader2.java:361",
        "ThreadID": 1,
        "ThreadName": "",
        "EventID": "224328C2B719278E",
        "ProcessID": 21035
      },
      {
        "Cycles": 0,
        "Agent": "edu.brown.cs.systems.xtrace.logging.BaggageWrappers",
        "ProcessName": "Read",
        "TaskID": "E32E77FB5B1BDE8F",
        "ParentEventID": [
          "22F7C7083A2F84B8",
          "DCD78E6A31FA82EE"
        ],
        "Label": "Merged current baggage with other baggage",
        "Title": "X-Trace Task",
        "Host": "pinky19.mpi-sws.org",
        "HRT": 25491948414357098,
        "Operation": "join",
        "Timestamp": "1556275588354.496338",
        "TenantClass": 0,
        "Source": "PacketHeader.java:168",
        "ThreadID": 1,
        "ThreadName": "",
        "EventID": "5A720E1DADFA36C0",
        "ProcessID": 21035
      },
      {
        "Cycles": 0,
        "Agent": "Execution-Sleep",
        "ProcessName": "Data",
        "TaskID": "E32E77FB5B1BDE8F",
        "ParentEventID": [
          "DCD78E6A31FA82EE"
        ],
        "Label": "waited",
        "Title": "X-Trace Task",
        "Host": "pinky27.mpi-sws.org",
        "Duration": "97636",
        "HRT": 14091223460688622,
        "Operation": "waited",
        "Timestamp": "1556275588354.561768",
        "TenantClass": 0,
        "Source": "SocketIOWithTimeout.java:335",
        "ThreadID": 6493,
        "ThreadName": "",
        "EventID": "2B5EBCB6C5C3A914",
        "BaggageBytes": "[[248 5] [240 0] [0 227 46 119 251 91 27 222 143] [240 1] [0 220 215 142 106 49 250 130 238] [240 3] [0 2]]",
        "ProcessID": 31438
      },
      {
        "Cycles": 0,
        "Agent": "edu.brown.cs.systems.xtrace.logging.BaggageWrappers",
        "ProcessName": "Data",
        "TaskID": "E32E77FB5B1BDE8F",
        "ParentEventID": [
          "2B5EBCB6C5C3A914",
          "224328C2B719278E"
        ],
        "Label": "Merged current baggage with other baggage",
        "Title": "X-Trace Task",
        "Host": "pinky27.mpi-sws.org",
        "HRT": 14091223460829135,
        "Operation": "join",
        "Timestamp": "1556275588354.702393",
        "TenantClass": 0,
        "Source": "DataXceiver.java:574",
        "ThreadID": 6493,
        "ThreadName": "",
        "EventID": "CA1467C79756D99C",
        "BaggageBytes": "[[248 5] [240 0] [0 227 46 119 251 91 27 222 143] [240 1] [0 34 67 40 194 183 25 39 142] [0 43 94 188 182 197 195 169 20] [240 3] [0 2]]",
        "ProcessID": 31438
      },
      {
        "Cycles": 0,
        "Agent": "Execution-CPU",
        "ProcessName": "Data",
        "TaskID": "E32E77FB5B1BDE8F",
        "ParentEventID": [
          "CA1467C79756D99C"
        ],
        "Label": "unset",
        "Title": "X-Trace Task",
        "Host": "pinky27.mpi-sws.org",
        "Duration": "1101109",
        "HRT": 14091223460874733,
        "Operation": "unset",
        "Timestamp": "1556275588354.748047",
        "TenantClass": 0,
        "Source": "DataXceiver.java:261",
        "ThreadID": 6493,
        "ThreadName": "",
        "EventID": "6A97B3377C7B42FC",
        "BaggageBytes": "[[248 5] [240 0] [0 227 46 119 251 91 27 222 143] [240 1] [0 202 20 103 199 151 86 217 156] [240 3] [0 2]]",
        "ProcessID": 31438
      },
      {
        "Cycles": 0,
        "Agent": "edu.brown.cs.systems.retro.benchmarks.hdfs_client.Reader",
        "ProcessName": "Read",
        "TaskID": "E32E77FB5B1BDE8F",
        "ParentEventID": [
          "0"
        ],
        "Label": "Reading file",
        "Title": "X-Trace Task",
        "Host": "pinky19.mpi-sws.org",
        "HRT": 25491948412270061,
        "Timestamp": "1556275588352.409424",
        "TenantClass": 0,
        "ThreadID": 1,
        "ThreadName": "",
        "EventID": "D9AA2DC5661AB803",
        "ProcessID": 21035,
        "Tag": [
          "reader_1kb",
          "Read Size: 1024"
        ]
      }
    ]
  }
]