[
  {
    "id": "116BFAA07B3036E4",
    "reports": [
      {
        "Cycles": 0,
        "Agent": "Execution-CPU",
        "ProcessName": "Read",
        "TaskID": "116BFAA07B3036E4",
        "ParentEventID": [
          "0635D354E71F6DB9"
        ],
        "Label": "unset",
        "Title": "X-Trace Task",
        "Host": "pinky19.mpi-sws.org",
        "Duration": "24855523",
        "HRT": 26966761701082016,
        "Operation": "unset",
        "Timestamp": "1557750401641.054688",
        "TenantClass": 0,
        "Source": "Client.java:1027",
        "ThreadID": 1,
        "ThreadName": "",
        "EventID": "C22FAD3C9C4E82E7",
        "ProcessID": 2801
      },
      {
        "Cycles": 0,
        "Agent": "org.apache.hadoop.ipc.ProtobufRpcEngine",
        "ProcessName": "Read",
        "TaskID": "116BFAA07B3036E4",
        "ParentEventID": [
          "53A5EDC1DCB18709"
        ],
        "Label": "Invoking org.apache.hadoop.hdfs.protocol.ClientProtocol.getBlockLocations",
        "Title": "X-Trace Task",
        "Host": "pinky19.mpi-sws.org",
        "HRT": 26966761701049414,
        "Timestamp": "1557750401641.021973",
        "TenantClass": 0,
        "Source": "ProtobufRpcEngine.java:228",
        "ThreadID": 1,
        "ThreadName": "",
        "EventID": "0635D354E71F6DB9",
        "ProcessID": 2801
      },
      {
        "Cycles": 0,
        "Agent": "edu.brown.cs.systems.retro.benchmarks.hdfs_client.Reader",
        "ProcessName": "Read",
        "TaskID": "116BFAA07B3036E4",
        "ParentEventID": [
          "F4725802635181A6"
        ],
        "Label": "Reading file",
        "Title": "X-Trace Task",
        "Host": "pinky19.mpi-sws.org",
        "HRT": 26966761700999789,
        "Timestamp": "1557750401640.972412",
        "TenantClass": 0,
        "ThreadID": 1,
        "ThreadName": "",
        "EventID": "53A5EDC1DCB18709",
        "ProcessID": 2801
      },
      {
        "Cycles": 0,
        "Agent": "Execution-CPU",
        "ProcessName": "Read",
        "TaskID": "116BFAA07B3036E4",
        "ParentEventID": [
          "C22FAD3C9C4E82E7"
        ],
        "Label": "set",
        "Title": "X-Trace Task",
        "Host": "pinky19.mpi-sws.org",
        "HRT": 26966761701175692,
        "Operation": "set",
        "Timestamp": "1557750401641.148438",
        "TenantClass": 0,
        "Source": "Client.java:1032",
        "ThreadID": 41,
        "ThreadName": "",
        "EventID": "4648F35DE65680E8",
        "ProcessID": 2801
      },
      {
        "Cycles": 0,
        "Agent": "edu.brown.cs.systems.xtrace.logging.BaggageWrappers",
        "ProcessName": "Read",
        "TaskID": "116BFAA07B3036E4",
        "ParentEventID": [
          "4648F35DE65680E8"
        ],
        "Label": "Forking current baggage with Baggage.fork()",
        "Title": "X-Trace Task",
        "Host": "pinky19.mpi-sws.org",
        "HRT": 26966761701218809,
        "Operation": "fork",
        "Timestamp": "1557750401641.191406",
        "TenantClass": 0,
        "Source": "Client.java:1043",
        "ThreadID": 41,
        "ThreadName": "",
        "EventID": "A3282CC6D85EDCF7",
        "ProcessID": 2801
      },
      {
        "Cycles": 0,
        "Agent": "Execution-CPU",
        "ProcessName": "Read",
        "TaskID": "116BFAA07B3036E4",
        "ParentEventID": [
          "EE2040D0481721D6"
        ],
        "Label": "set",
        "Title": "X-Trace Task",
        "Host": "pinky19.mpi-sws.org",
        "HRT": 26966761701456873,
        "Operation": "set",
        "Timestamp": "1557750401641.429443",
        "TenantClass": 0,
        "Source": "Client.java:1104",
        "ThreadID": 1,
        "ThreadName": "",
        "EventID": "3DEC03C1D7AA8662",
        "ProcessID": 2801
      },
      {
        "Cycles": 0,
        "Agent": "Execution-CPU",
        "ProcessName": "Read",
        "TaskID": "116BFAA07B3036E4",
        "ParentEventID": [
          "A3282CC6D85EDCF7"
        ],
        "Label": "unset",
        "Title": "X-Trace Task",
        "Host": "pinky19.mpi-sws.org",
        "Duration": "168576",
        "HRT": 26966761701383433,
        "Operation": "unset",
        "Timestamp": "1557750401641.355957",
        "TenantClass": 0,
        "Source": "Client.java:1062",
        "ThreadID": 41,
        "ThreadName": "",
        "EventID": "EE2040D0481721D6",
        "ProcessID": 2801
      },
      {
        "Cycles": 0,
        "Agent": "Execution-CPU",
        "ProcessName": "Name",
        "TaskID": "116BFAA07B3036E4",
        "ParentEventID": [
          "A3282CC6D85EDCF7"
        ],
        "Label": "set",
        "Title": "X-Trace Task",
        "Host": "pinky19.mpi-sws.org",
        "HRT": 26966761701502396,
        "Operation": "set",
        "Timestamp": "1557750401641.491211",
        "TenantClass": 0,
        "Source": "Server.java:1840",
        "ThreadID": 48,
        "ThreadName": "",
        "EventID": "2063B86B6DF1605D",
        "BaggageBytes": "[[248 5] [240 0] [0 17 107 250 160 123 48 54 228] [240 1] [0 163 40 44 198 216 94 220 247] [240 3] [0 2]]",
        "ProcessID": 2171
      },
      {
        "Cycles": 0,
        "Agent": "edu.brown.cs.systems.xtrace.logging.BaggageWrappers",
        "ProcessName": "Name",
        "TaskID": "116BFAA07B3036E4",
        "ParentEventID": [
          "2063B86B6DF1605D"
        ],
        "Label": "Forking current baggage with Baggage.fork()",
        "Title": "X-Trace Task",
        "Host": "pinky19.mpi-sws.org",
        "HRT": 26966761701562824,
        "Operation": "fork",
        "Timestamp": "1557750401641.551758",
        "TenantClass": 0,
        "Source": "Server.java:550",
        "ThreadID": 48,
        "ThreadName": "",
        "EventID": "3E82870C5121DAEC",
        "BaggageBytes": "[[248 5] [240 0] [0 17 107 250 160 123 48 54 228] [240 1] [0 32 99 184 107 109 241 96 93] [240 3] [0 2]]",
        "ProcessID": 2171
      },
      {
        "Cycles": 0,
        "Agent": "Execution-CPU",
        "ProcessName": "Name",
        "TaskID": "116BFAA07B3036E4",
        "ParentEventID": [
          "3E82870C5121DAEC"
        ],
        "Label": "unset",
        "Title": "X-Trace Task",
        "Host": "pinky19.mpi-sws.org",
        "Duration": "51350",
        "HRT": 26966761701605986,
        "Operation": "unset",
        "Timestamp": "1557750401641.594971",
        "TenantClass": 0,
        "Source": "Server.java:1828",
        "ThreadID": 48,
        "ThreadName": "",
        "EventID": "50EEAAE0844C77F5",
        "BaggageBytes": "[[248 5] [240 0] [0 17 107 250 160 123 48 54 228] [240 1] [0 62 130 135 12 81 33 218 236] [240 3] [0 2]]",
        "ProcessID": 2171
      },
      {
        "Cycles": 0,
        "Agent": "org.apache.hadoop.ipc.Server",
        "ProcessName": "Name",
        "TaskID": "116BFAA07B3036E4",
        "ParentEventID": [
          "6DA1167B118298AF"
        ],
        "Label": "getBlockLocations in org.apache.hadoop.hdfs.protocol.ClientProtocol",
        "Title": "X-Trace Task",
        "Host": "pinky19.mpi-sws.org",
        "HRT": 26966761701747350,
        "Timestamp": "1557750401641.736328",
        "TenantClass": 0,
        "Source": "ProtobufRpcEngine.java:601",
        "ThreadID": 62,
        "ThreadName": "",
        "EventID": "D83DED22F4AD79D7",
        "BaggageBytes": "[[248 5] [240 0] [0 17 107 250 160 123 48 54 228] [240 1] [0 109 161 22 123 17 130 152 175] [240 3] [0 2]]",
        "ProcessID": 2171
      },
      {
        "Cycles": 0,
        "Agent": "Execution-CPU",
        "ProcessName": "Name",
        "TaskID": "116BFAA07B3036E4",
        "ParentEventID": [
          "3E82870C5121DAEC"
        ],
        "Label": "set",
        "Title": "X-Trace Task",
        "Host": "pinky19.mpi-sws.org",
        "HRT": 26966761701654749,
        "Operation": "set",
        "Timestamp": "1557750401641.643555",
        "TenantClass": 0,
        "Source": "Server.java:2071",
        "ThreadID": 62,
        "ThreadName": "",
        "EventID": "6DA1167B118298AF",
        "BaggageBytes": "[[248 5] [240 0] [0 17 107 250 160 123 48 54 228] [240 1] [0 62 130 135 12 81 33 218 236] [240 3] [0 2]]",
        "ProcessID": 2171
      },
      {
        "Cycles": 0,
        "Agent": "org.apache.hadoop.hdfs.server.namenode.FSNamesystem.audit",
        "ProcessName": "Name",
        "TaskID": "116BFAA07B3036E4",
        "ParentEventID": [
          "D83DED22F4AD79D7"
        ],
        "Label": "allowed=true\tugi=plascas (auth:SIMPLE)\tip=/139.19.171.63\tcmd=open\tsrc=/ds/CQALFEMETeUV9Otq\tdst=null\tperm=null\tproto=rpc",
        "Title": "X-Trace Task",
        "Host": "pinky19.mpi-sws.org",
        "HRT": 26966761701843895,
        "Timestamp": "1557750401641.832764",
        "TenantClass": 0,
        "Source": "FSNamesystem.java:8313",
        "ThreadID": 62,
        "ThreadName": "",
        "EventID": "B2F8F35BEA26109F",
        "BaggageBytes": "[[248 5] [240 0] [0 17 107 250 160 123 48 54 228] [240 1] [0 216 61 237 34 244 173 121 215] [240 3] [0 2]]",
        "ProcessID": 2171
      },
      {
        "Cycles": 0,
        "Agent": "Execution-CPU",
        "ProcessName": "Name",
        "TaskID": "116BFAA07B3036E4",
        "ParentEventID": [
          "CDC8C44A7E8C14D6"
        ],
        "Label": "unset",
        "Title": "X-Trace Task",
        "Host": "pinky19.mpi-sws.org",
        "Duration": "431790",
        "HRT": 26966761702153794,
        "Operation": "unset",
        "Timestamp": "1557750401642.142578",
        "TenantClass": 0,
        "Source": "Server.java:1058",
        "ThreadID": 62,
        "ThreadName": "",
        "EventID": "A2F9E4B0912AA7C7",
        "BaggageBytes": "[[248 5] [240 0] [0 17 107 250 160 123 48 54 228] [240 1] [0 205 200 196 74 126 140 20 214] [240 3] [0 2]]",
        "ProcessID": 2171
      },
      {
        "Cycles": 0,
        "Agent": "Execution-CPU",
        "ProcessName": "Read",
        "TaskID": "116BFAA07B3036E4",
        "ParentEventID": [
          "CDC8C44A7E8C14D6"
        ],
        "Label": "set",
        "Title": "X-Trace Task",
        "Host": "pinky19.mpi-sws.org",
        "HRT": 26966761702252089,
        "Operation": "set",
        "Timestamp": "1557750401642.224609",
        "TenantClass": 0,
        "Source": "Client.java:302",
        "ThreadID": 40,
        "ThreadName": "",
        "EventID": "083535590F765A59",
        "ProcessID": 2801
      },
      {
        "Cycles": 0,
        "Agent": "edu.brown.cs.systems.xtrace.logging.BaggageWrappers",
        "ProcessName": "Name",
        "TaskID": "116BFAA07B3036E4",
        "ParentEventID": [
          "B2F8F35BEA26109F"
        ],
        "Label": "Forking current baggage with Baggage.fork()",
        "Title": "X-Trace Task",
        "Host": "pinky19.mpi-sws.org",
        "HRT": 26966761701935893,
        "Operation": "fork",
        "Timestamp": "1557750401641.924805",
        "TenantClass": 0,
        "Source": "Server.java:2398",
        "ThreadID": 62,
        "ThreadName": "",
        "EventID": "CDC8C44A7E8C14D6",
        "BaggageBytes": "[[248 5] [240 0] [0 17 107 250 160 123 48 54 228] [240 1] [0 178 248 243 91 234 38 16 159] [240 3] [0 2]]",
        "ProcessID": 2171
      },
      {
        "Cycles": 0,
        "Agent": "Execution-Sleep",
        "ProcessName": "Read",
        "TaskID": "116BFAA07B3036E4",
        "ParentEventID": [
          "3DEC03C1D7AA8662"
        ],
        "Label": "waited",
        "Title": "X-Trace Task",
        "Host": "pinky19.mpi-sws.org",
        "Duration": "850502",
        "HRT": 26966761702352270,
        "Operation": "waited",
        "Timestamp": "1557750401642.324951",
        "TenantClass": 0,
        "Source": "Client.java:1537",
        "ThreadID": 1,
        "ThreadName": "",
        "EventID": "E62C6ADD82E70F6D",
        "ProcessID": 2801
      },
      {
        "Cycles": 0,
        "Agent": "edu.brown.cs.systems.xtrace.logging.BaggageWrappers",
        "ProcessName": "Read",
        "TaskID": "116BFAA07B3036E4",
        "ParentEventID": [
          "B06051E522E860D8",
          "E62C6ADD82E70F6D"
        ],
        "Label": "Merged current baggage with other baggage",
        "Title": "X-Trace Task",
        "Host": "pinky19.mpi-sws.org",
        "HRT": 26966761702382165,
        "Operation": "join",
        "Timestamp": "1557750401642.354736",
        "TenantClass": 0,
        "Source": "Client.java:1545",
        "ThreadID": 1,
        "ThreadName": "",
        "EventID": "6BF4CA1B5695B9A1",
        "ProcessID": 2801
      },
      {
        "Cycles": 0,
        "Agent": "Execution-CPU",
        "ProcessName": "Read",
        "TaskID": "116BFAA07B3036E4",
        "ParentEventID": [
          "083535590F765A59"
        ],
        "Label": "unset",
        "Title": "X-Trace Task",
        "Host": "pinky19.mpi-sws.org",
        "Duration": "16723",
        "HRT": 26966761702305312,
        "Operation": "unset",
        "Timestamp": "1557750401642.277832",
        "TenantClass": 0,
        "Source": "Client.java:1168",
        "ThreadID": 40,
        "ThreadName": "",
        "EventID": "B06051E522E860D8",
        "ProcessID": 2801
      },
      {
        "Cycles": 0,
        "Agent": "org.apache.hadoop.ipc.ProtobufRpcEngine",
        "ProcessName": "Read",
        "TaskID": "116BFAA07B3036E4",
        "ParentEventID": [
          "6BF4CA1B5695B9A1"
        ],
        "Label": "org.apache.hadoop.hdfs.protocol.ClientProtocol.getBlockLocations completed",
        "Title": "X-Trace Task",
        "Host": "pinky19.mpi-sws.org",
        "HRT": 26966761702455035,
        "Timestamp": "1557750401642.427734",
        "TenantClass": 0,
        "Source": "ProtobufRpcEngine.java:275",
        "ThreadID": 1,
        "ThreadName": "",
        "EventID": "E098FB0ADFEA446A",
        "ProcessID": 2801
      },
      {
        "Cycles": 0,
        "Agent": "edu.brown.cs.systems.xtrace.logging.BaggageWrappers",
        "ProcessName": "Read",
        "TaskID": "116BFAA07B3036E4",
        "ParentEventID": [
          "200107AA7C61E1F1"
        ],
        "Label": "Forking current baggage with Baggage.fork()",
        "Title": "X-Trace Task",
        "Host": "pinky19.mpi-sws.org",
        "HRT": 26966761702819113,
        "Operation": "fork",
        "Timestamp": "1557750401642.791748",
        "TenantClass": 0,
        "Source": "DataTransferProtoUtil.java:94",
        "ThreadID": 1,
        "ThreadName": "",
        "EventID": "5A17D30A6BA3DD79",
        "ProcessID": 2801
      },
      {
        "Cycles": 0,
        "Agent": "Execution-Sleep",
        "ProcessName": "Read",
        "TaskID": "116BFAA07B3036E4",
        "ParentEventID": [
          "E098FB0ADFEA446A"
        ],
        "Label": "waited",
        "Title": "X-Trace Task",
        "Host": "pinky19.mpi-sws.org",
        "Duration": "146702",
        "HRT": 26966761702755753,
        "Operation": "waited",
        "Timestamp": "1557750401642.728271",
        "TenantClass": 0,
        "Source": "SocketIOWithTimeout.java:335",
        "ThreadID": 1,
        "ThreadName": "",
        "EventID": "200107AA7C61E1F1",
        "ProcessID": 2801
      },
      {
        "Cycles": 0,
        "Agent": "Execution-CPU",
        "ProcessName": "Data",
        "TaskID": "116BFAA07B3036E4",
        "ParentEventID": [
          "5A17D30A6BA3DD79"
        ],
        "Label": "set",
        "Title": "X-Trace Task",
        "Host": "pinky26.mpi-sws.org",
        "HRT": 47516418432906340,
        "Operation": "set",
        "Timestamp": "1557750401643.427734",
        "TenantClass": 0,
        "Source": "Receiver.java:117",
        "ThreadID": 9034,
        "ThreadName": "",
        "EventID": "39D55AAE7A362BCE",
        "BaggageBytes": "[[248 5] [240 0] [0 17 107 250 160 123 48 54 228] [240 1] [0 90 23 211 10 107 163 221 121] [240 3] [0 2]]",
        "ProcessID": 17069
      },
      {
        "Cycles": 0,
        "Agent": "edu.brown.cs.systems.xtrace.logging.BaggageWrappers",
        "ProcessName": "Data",
        "TaskID": "116BFAA07B3036E4",
        "ParentEventID": [
          "B7EAD3D359374C13"
        ],
        "Label": "Forking current baggage with Baggage.fork()",
        "Title": "X-Trace Task",
        "Host": "pinky26.mpi-sws.org",
        "HRT": 47516418433394442,
        "Operation": "fork",
        "Timestamp": "1557750401643.915771",
        "TenantClass": 0,
        "Source": "DataXceiver.java:1257",
        "ThreadID": 9034,
        "ThreadName": "",
        "EventID": "465C04A78F1224EA",
        "BaggageBytes": "[[248 5] [240 0] [0 17 107 250 160 123 48 54 228] [240 1] [0 183 234 211 211 89 55 76 19] [240 3] [0 2]]",
        "ProcessID": 17069
      },
      {
        "Cycles": 0,
        "Agent": "edu.brown.cs.systems.xtrace.logging.XTraceInit",
        "ProcessName": "Data",
        "TaskID": "116BFAA07B3036E4",
        "ParentEventID": [
          "39D55AAE7A362BCE"
        ],
        "Label": "Thread.setName: DataXceiver for client DFSClient_NONMAPREDUCE_310321604_1 at /139.19.171.63:53470 [Sending block BP-1633380353-139.19.171.63-1554193446451:blk_1073766670_25846]",
        "Title": "X-Trace Task",
        "Host": "pinky26.mpi-sws.org",
        "HRT": 47516418433097516,
        "Timestamp": "1557750401643.618896",
        "TenantClass": 0,
        "Source": "DataXceiver.java:168",
        "ThreadID": 9034,
        "ThreadName": "",
        "EventID": "B7EAD3D359374C13",
        "BaggageBytes": "[[248 5] [240 0] [0 17 107 250 160 123 48 54 228] [240 1] [0 57 213 90 174 122 54 43 206] [240 3] [0 2]]",
        "ProcessID": 17069
      },
      {
        "Cycles": 0,
        "Agent": "Execution-Sleep",
        "ProcessName": "Read",
        "TaskID": "116BFAA07B3036E4",
        "ParentEventID": [
          "5A17D30A6BA3DD79"
        ],
        "Label": "waited",
        "Title": "X-Trace Task",
        "Host": "pinky19.mpi-sws.org",
        "Duration": "1254401",
        "HRT": 26966761704159133,
        "Operation": "waited",
        "Timestamp": "1557750401644.131836",
        "TenantClass": 0,
        "Source": "SocketIOWithTimeout.java:335",
        "ThreadID": 1,
        "ThreadName": "",
        "EventID": "4ABF9198234A787F",
        "ProcessID": 2801
      },
      {
        "Cycles": 0,
        "Agent": "edu.brown.cs.systems.xtrace.logging.BaggageWrappers",
        "ProcessName": "Read",
        "TaskID": "116BFAA07B3036E4",
        "ParentEventID": [
          "4ABF9198234A787F",
          "465C04A78F1224EA"
        ],
        "Label": "Merged current baggage with other baggage",
        "Title": "X-Trace Task",
        "Host": "pinky19.mpi-sws.org",
        "HRT": 26966761704239579,
        "Operation": "join",
        "Timestamp": "1557750401644.212158",
        "TenantClass": 0,
        "Source": "RemoteBlockReader2.java:429",
        "ThreadID": 1,
        "ThreadName": "",
        "EventID": "99E5FF9118D49544",
        "ProcessID": 2801
      },
      {
        "Cycles": 0,
        "Agent": "edu.brown.cs.systems.xtrace.logging.BaggageWrappers",
        "ProcessName": "Data",
        "TaskID": "116BFAA07B3036E4",
        "ParentEventID": [
          "465C04A78F1224EA"
        ],
        "Label": "Forking current baggage with Baggage.fork()",
        "Title": "X-Trace Task",
        "Host": "pinky26.mpi-sws.org",
        "HRT": 47516418433599939,
        "Operation": "fork",
        "Timestamp": "1557750401644.121338",
        "TenantClass": 0,
        "Source": "PacketHeader.java:95",
        "ThreadID": 9034,
        "ThreadName": "",
        "EventID": "EC3DFD56464D732F",
        "BaggageBytes": "[[248 5] [240 0] [0 17 107 250 160 123 48 54 228] [240 1] [0 70 92 4 167 143 18 36 234] [240 3] [0 2]]",
        "ProcessID": 17069
      },
      {
        "Cycles": 0,
        "Agent": "Execution-Sleep",
        "ProcessName": "Data",
        "TaskID": "116BFAA07B3036E4",
        "ParentEventID": [
          "EC3DFD56464D732F"
        ],
        "Label": "waited",
        "Title": "X-Trace Task",
        "Host": "pinky26.mpi-sws.org",
        "Duration": "14240",
        "HRT": 47516418433730493,
        "Operation": "waited",
        "Timestamp": "1557750401644.251709",
        "TenantClass": 0,
        "Source": "SocketIOWithTimeout.java:335",
        "ThreadID": 9034,
        "ThreadName": "",
        "EventID": "3E5054C57A4EF0BE",
        "BaggageBytes": "[[248 5] [240 0] [0 17 107 250 160 123 48 54 228] [240 1] [0 236 61 253 86 70 77 115 47] [240 3] [0 2]]",
        "ProcessID": 17069
      },
      {
        "Cycles": 0,
        "Agent": "Execution-Sleep",
        "ProcessName": "Read",
        "TaskID": "116BFAA07B3036E4",
        "ParentEventID": [
          "99E5FF9118D49544"
        ],
        "Label": "waited",
        "Title": "X-Trace Task",
        "Host": "pinky19.mpi-sws.org",
        "Duration": "347424",
        "HRT": 26966761704697791,
        "Operation": "waited",
        "Timestamp": "1557750401644.670410",
        "TenantClass": 0,
        "Source": "SocketIOWithTimeout.java:335",
        "ThreadID": 1,
        "ThreadName": "",
        "EventID": "116B3048EA3A3858",
        "ProcessID": 2801
      },
      {
        "Cycles": 0,
        "Agent": "edu.brown.cs.systems.xtrace.logging.BaggageWrappers",
        "ProcessName": "Data",
        "TaskID": "116BFAA07B3036E4",
        "ParentEventID": [
          "3E5054C57A4EF0BE"
        ],
        "Label": "Forking current baggage with Baggage.fork()",
        "Title": "X-Trace Task",
        "Host": "pinky26.mpi-sws.org",
        "HRT": 47516418433897018,
        "Operation": "fork",
        "Timestamp": "1557750401644.418213",
        "TenantClass": 0,
        "Source": "PacketHeader.java:95",
        "ThreadID": 9034,
        "ThreadName": "",
        "EventID": "1FA4FCE6D763AA48",
        "BaggageBytes": "[[248 5] [240 0] [0 17 107 250 160 123 48 54 228] [240 1] [0 62 80 84 197 122 78 240 190] [240 3] [0 2]]",
        "ProcessID": 17069
      },
      {
        "Cycles": 0,
        "Agent": "Execution-Sleep",
        "ProcessName": "Read",
        "TaskID": "116BFAA07B3036E4",
        "ParentEventID": [
          "116B3048EA3A3858"
        ],
        "Label": "waited",
        "Title": "X-Trace Task",
        "Host": "pinky19.mpi-sws.org",
        "Duration": "224271",
        "HRT": 26966761704979372,
        "Operation": "waited",
        "Timestamp": "1557750401644.951904",
        "TenantClass": 0,
        "Source": "SocketIOWithTimeout.java:335",
        "ThreadID": 1,
        "ThreadName": "",
        "EventID": "02C13522369119EC",
        "ProcessID": 2801
      },
      {
        "Cycles": 0,
        "Agent": "edu.brown.cs.systems.xtrace.logging.BaggageWrappers",
        "ProcessName": "Read",
        "TaskID": "116BFAA07B3036E4",
        "ParentEventID": [
          "7129796BBBC560EF",
          "EC3DFD56464D732F"
        ],
        "Label": "Merged current baggage with other baggage",
        "Title": "X-Trace Task",
        "Host": "pinky19.mpi-sws.org",
        "HRT": 26966761705265885,
        "Operation": "join",
        "Timestamp": "1557750401645.238525",
        "TenantClass": 0,
        "Source": "PacketHeader.java:168",
        "ThreadID": 1,
        "ThreadName": "",
        "EventID": "1212188E6419853F",
        "ProcessID": 2801
      },
      {
        "Cycles": 0,
        "Agent": "edu.brown.cs.systems.xtrace.logging.BaggageWrappers",
        "ProcessName": "Read",
        "TaskID": "116BFAA07B3036E4",
        "ParentEventID": [
          "1212188E6419853F",
          "1FA4FCE6D763AA48"
        ],
        "Label": "Merged current baggage with other baggage",
        "Title": "X-Trace Task",
        "Host": "pinky19.mpi-sws.org",
        "HRT": 26966761705381282,
        "Operation": "join",
        "Timestamp": "1557750401645.354004",
        "TenantClass": 0,
        "Source": "PacketHeader.java:168",
        "ThreadID": 1,
        "ThreadName": "",
        "EventID": "8FB7B617DFBC0B79",
        "ProcessID": 2801
      },
      {
        "Cycles": 0,
        "Agent": "Execution-Sleep",
        "ProcessName": "Read",
        "TaskID": "116BFAA07B3036E4",
        "ParentEventID": [
          "02C13522369119EC"
        ],
        "Label": "waited",
        "Title": "X-Trace Task",
        "Host": "pinky19.mpi-sws.org",
        "Duration": "131414",
        "HRT": 26966761705185631,
        "Operation": "waited",
        "Timestamp": "1557750401645.158203",
        "TenantClass": 0,
        "Source": "SocketIOWithTimeout.java:335",
        "ThreadID": 1,
        "ThreadName": "",
        "EventID": "7129796BBBC560EF",
        "ProcessID": 2801
      },
      {
        "Cycles": 0,
        "Agent": "edu.brown.cs.systems.xtrace.logging.BaggageWrappers",
        "ProcessName": "Read",
        "TaskID": "116BFAA07B3036E4",
        "ParentEventID": [
          "8FB7B617DFBC0B79"
        ],
        "Label": "Forking current baggage with Baggage.fork()",
        "Title": "X-Trace Task",
        "Host": "pinky19.mpi-sws.org",
        "HRT": 26966761705391392,
        "Operation": "fork",
        "Timestamp": "1557750401645.364014",
        "TenantClass": 0,
        "Source": "RemoteBlockReader2.java:361",
        "ThreadID": 1,
        "ThreadName": "",
        "EventID": "D5540BB98CB3A42A",
        "ProcessID": 2801
      },
      {
        "Cycles": 0,
        "Agent": "Execution-Sleep",
        "ProcessName": "Data",
        "TaskID": "116BFAA07B3036E4",
        "ParentEventID": [
          "1FA4FCE6D763AA48"
        ],
        "Label": "waited",
        "Title": "X-Trace Task",
        "Host": "pinky26.mpi-sws.org",
        "Duration": "855303",
        "HRT": 47516418434908869,
        "Operation": "waited",
        "Timestamp": "1557750401645.430176",
        "TenantClass": 0,
        "Source": "SocketIOWithTimeout.java:335",
        "ThreadID": 9034,
        "ThreadName": "",
        "EventID": "97BD15EEDED167BF",
        "BaggageBytes": "[[248 5] [240 0] [0 17 107 250 160 123 48 54 228] [240 1] [0 31 164 252 230 215 99 170 72] [240 3] [0 2]]",
        "ProcessID": 17069
      },
      {
        "Cycles": 0,
        "Agent": "edu.brown.cs.systems.xtrace.logging.BaggageWrappers",
        "ProcessName": "Read",
        "TaskID": "116BFAA07B3036E4",
        "ParentEventID": [
          "D5540BB98CB3A42A"
        ],
        "Label": "Forking current baggage with Baggage.fork()",
        "Title": "X-Trace Task",
        "Host": "pinky19.mpi-sws.org",
        "HRT": 26966761705459878,
        "Operation": "fork",
        "Timestamp": "1557750401645.432617",
        "TenantClass": 0,
        "Source": "DataTransferProtoUtil.java:94",
        "ThreadID": 1,
        "ThreadName": "",
        "EventID": "8A7D873129FC0177",
        "ProcessID": 2801
      },
      {
        "Cycles": 0,
        "Agent": "edu.brown.cs.systems.xtrace.logging.BaggageWrappers",
        "ProcessName": "Data",
        "TaskID": "116BFAA07B3036E4",
        "ParentEventID": [
          "D5540BB98CB3A42A",
          "97BD15EEDED167BF"
        ],
        "Label": "Merged current baggage with other baggage",
        "Title": "X-Trace Task",
        "Host": "pinky26.mpi-sws.org",
        "HRT": 47516418435078886,
        "Operation": "join",
        "Timestamp": "1557750401645.600098",
        "TenantClass": 0,
        "Source": "DataXceiver.java:574",
        "ThreadID": 9034,
        "ThreadName": "",
        "EventID": "15F7BC5FAC3AD92F",
        "BaggageBytes": "[[248 5] [240 0] [0 17 107 250 160 123 48 54 228] [240 1] [0 151 189 21 238 222 209 103 191] [0 213 84 11 185 140 179 164 42] [240 3] [0 2]]",
        "ProcessID": 17069
      },
      {
        "Cycles": 0,
        "Agent": "Execution-CPU",
        "ProcessName": "Data",
        "TaskID": "116BFAA07B3036E4",
        "ParentEventID": [
          "15F7BC5FAC3AD92F"
        ],
        "Label": "unset",
        "Title": "X-Trace Task",
        "Host": "pinky26.mpi-sws.org",
        "Duration": "2100687",
        "HRT": 47516418435121160,
        "Operation": "unset",
        "Timestamp": "1557750401645.642578",
        "TenantClass": 0,
        "Source": "DataXceiver.java:261",
        "ThreadID": 9034,
        "ThreadName": "",
        "EventID": "64CD3420CB8242F6",
        "BaggageBytes": "[[248 5] [240 0] [0 17 107 250 160 123 48 54 228] [240 1] [0 21 247 188 95 172 58 217 47] [240 3] [0 2]]",
        "ProcessID": 17069
      },
      {
        "Cycles": 0,
        "Agent": "edu.brown.cs.systems.xtrace.logging.XTraceInit",
        "ProcessName": "Data",
        "TaskID": "116BFAA07B3036E4",
        "ParentEventID": [
          "47DE42F33068AFC7"
        ],
        "Label": "Thread.setName: DataXceiver for client DFSClient_NONMAPREDUCE_310321604_1 at /139.19.171.63:53470 [Sending block BP-1633380353-139.19.171.63-1554193446451:blk_1073766670_25846]",
        "Title": "X-Trace Task",
        "Host": "pinky26.mpi-sws.org",
        "HRT": 47516418435248481,
        "Timestamp": "1557750401645.769775",
        "TenantClass": 0,
        "Source": "DataXceiver.java:168",
        "ThreadID": 9034,
        "ThreadName": "",
        "EventID": "10451704C9990BD0",
        "BaggageBytes": "[[248 5] [240 0] [0 17 107 250 160 123 48 54 228] [240 1] [0 71 222 66 243 48 104 175 199] [240 3] [0 2]]",
        "ProcessID": 17069
      },
      {
        "Cycles": 0,
        "Agent": "Execution-CPU",
        "ProcessName": "Data",
        "TaskID": "116BFAA07B3036E4",
        "ParentEventID": [
          "8A7D873129FC0177"
        ],
        "Label": "set",
        "Title": "X-Trace Task",
        "Host": "pinky26.mpi-sws.org",
        "HRT": 47516418435200060,
        "Operation": "set",
        "Timestamp": "1557750401645.721436",
        "TenantClass": 0,
        "Source": "Receiver.java:117",
        "ThreadID": 9034,
        "ThreadName": "",
        "EventID": "47DE42F33068AFC7",
        "BaggageBytes": "[[248 5] [240 0] [0 17 107 250 160 123 48 54 228] [240 1] [0 138 125 135 49 41 252 1 119] [240 3] [0 2]]",
        "ProcessID": 17069
      },
      {
        "Cycles": 0,
        "Agent": "edu.brown.cs.systems.xtrace.logging.BaggageWrappers",
        "ProcessName": "Data",
        "TaskID": "116BFAA07B3036E4",
        "ParentEventID": [
          "10451704C9990BD0"
        ],
        "Label": "Forking current baggage with Baggage.fork()",
        "Title": "X-Trace Task",
        "Host": "pinky26.mpi-sws.org",
        "HRT": 47516418435402076,
        "Operation": "fork",
        "Timestamp": "1557750401645.923340",
        "TenantClass": 0,
        "Source": "DataXceiver.java:1257",
        "ThreadID": 9034,
        "ThreadName": "",
        "EventID": "3BA14A6F64F24BFB",
        "BaggageBytes": "[[248 5] [240 0] [0 17 107 250 160 123 48 54 228] [240 1] [0 16 69 23 4 201 153 11 208] [240 3] [0 2]]",
        "ProcessID": 17069
      },
      {
        "Cycles": 0,
        "Agent": "Execution-Sleep",
        "ProcessName": "Read",
        "TaskID": "116BFAA07B3036E4",
        "ParentEventID": [
          "8A7D873129FC0177"
        ],
        "Label": "waited",
        "Title": "X-Trace Task",
        "Host": "pinky19.mpi-sws.org",
        "Duration": "567712",
        "HRT": 26966761706102812,
        "Operation": "waited",
        "Timestamp": "1557750401646.075439",
        "TenantClass": 0,
        "Source": "SocketIOWithTimeout.java:335",
        "ThreadID": 1,
        "ThreadName": "",
        "EventID": "88A682A4D59DC16C",
        "ProcessID": 2801
      },
      {
        "Cycles": 0,
        "Agent": "Execution-Sleep",
        "ProcessName": "Data",
        "TaskID": "116BFAA07B3036E4",
        "ParentEventID": [
          "BA6482DE6305B531"
        ],
        "Label": "waited",
        "Title": "X-Trace Task",
        "Host": "pinky26.mpi-sws.org",
        "Duration": "4394",
        "HRT": 47516418435559656,
        "Operation": "waited",
        "Timestamp": "1557750401646.081055",
        "TenantClass": 0,
        "Source": "SocketIOWithTimeout.java:335",
        "ThreadID": 9034,
        "ThreadName": "",
        "EventID": "161864C09916CAF2",
        "BaggageBytes": "[[248 5] [240 0] [0 17 107 250 160 123 48 54 228] [240 1] [0 186 100 130 222 99 5 181 49] [240 3] [0 2]]",
        "ProcessID": 17069
      },
      {
        "Cycles": 0,
        "Agent": "edu.brown.cs.systems.xtrace.logging.BaggageWrappers",
        "ProcessName": "Data",
        "TaskID": "116BFAA07B3036E4",
        "ParentEventID": [
          "3BA14A6F64F24BFB"
        ],
        "Label": "Forking current baggage with Baggage.fork()",
        "Title": "X-Trace Task",
        "Host": "pinky26.mpi-sws.org",
        "HRT": 47516418435502973,
        "Operation": "fork",
        "Timestamp": "1557750401646.024170",
        "TenantClass": 0,
        "Source": "PacketHeader.java:95",
        "ThreadID": 9034,
        "ThreadName": "",
        "EventID": "BA6482DE6305B531",
        "BaggageBytes": "[[248 5] [240 0] [0 17 107 250 160 123 48 54 228] [240 1] [0 59 161 74 111 100 242 75 251] [240 3] [0 2]]",
        "ProcessID": 17069
      },
      {
        "Cycles": 0,
        "Agent": "edu.brown.cs.systems.xtrace.logging.BaggageWrappers",
        "ProcessName": "Read",
        "TaskID": "116BFAA07B3036E4",
        "ParentEventID": [
          "3BA14A6F64F24BFB",
          "88A682A4D59DC16C"
        ],
        "Label": "Merged current baggage with other baggage",
        "Title": "X-Trace Task",
        "Host": "pinky19.mpi-sws.org",
        "HRT": 26966761706186645,
        "Operation": "join",
        "Timestamp": "1557750401646.159180",
        "TenantClass": 0,
        "Source": "RemoteBlockReader2.java:429",
        "ThreadID": 1,
        "ThreadName": "",
        "EventID": "DEFAEC0FA270E894",
        "ProcessID": 2801
      },
      {
        "Cycles": 0,
        "Agent": "edu.brown.cs.systems.xtrace.logging.BaggageWrappers",
        "ProcessName": "Data",
        "TaskID": "116BFAA07B3036E4",
        "ParentEventID": [
          "161864C09916CAF2"
        ],
        "Label": "Forking current baggage with Baggage.fork()",
        "Title": "X-Trace Task",
        "Host": "pinky26.mpi-sws.org",
        "HRT": 47516418435636371,
        "Operation": "fork",
        "Timestamp": "1557750401646.157715",
        "TenantClass": 0,
        "Source": "PacketHeader.java:95",
        "ThreadID": 9034,
        "ThreadName": "",
        "EventID": "D98B23A6DAB231CE",
        "BaggageBytes": "[[248 5] [240 0] [0 17 107 250 160 123 48 54 228] [240 1] [0 22 24 100 192 153 22 202 242] [240 3] [0 2]]",
        "ProcessID": 17069
      },
      {
        "Cycles": 0,
        "Agent": "Execution-Sleep",
        "ProcessName": "Read",
        "TaskID": "116BFAA07B3036E4",
        "ParentEventID": [
          "DEFAEC0FA270E894"
        ],
        "Label": "waited",
        "Title": "X-Trace Task",
        "Host": "pinky19.mpi-sws.org",
        "Duration": "179005",
        "HRT": 26966761706453059,
        "Operation": "waited",
        "Timestamp": "1557750401646.425781",
        "TenantClass": 0,
        "Source": "SocketIOWithTimeout.java:335",
        "ThreadID": 1,
        "ThreadName": "",
        "EventID": "85B024A90756E78C",
        "ProcessID": 2801
      },
      {
        "Cycles": 0,
        "Agent": "Execution-Sleep",
        "ProcessName": "Data",
        "TaskID": "116BFAA07B3036E4",
        "ParentEventID": [
          "D98B23A6DAB231CE"
        ],
        "Label": "waited",
        "Title": "X-Trace Task",
        "Host": "pinky26.mpi-sws.org",
        "Duration": "199058",
        "HRT": 47516418435898982,
        "Operation": "waited",
        "Timestamp": "1557750401646.420410",
        "TenantClass": 0,
        "Source": "SocketIOWithTimeout.java:335",
        "ThreadID": 9034,
        "ThreadName": "",
        "EventID": "691675BBFC953981",
        "BaggageBytes": "[[248 5] [240 0] [0 17 107 250 160 123 48 54 228] [240 1] [0 217 139 35 166 218 178 49 206] [240 3] [0 2]]",
        "ProcessID": 17069
      },
      {
        "Cycles": 0,
        "Agent": "Execution-Sleep",
        "ProcessName": "Data",
        "TaskID": "116BFAA07B3036E4",
        "ParentEventID": [
          "691675BBFC953981"
        ],
        "Label": "waited",
        "Title": "X-Trace Task",
        "Host": "pinky26.mpi-sws.org",
        "Duration": "144549",
        "HRT": 47516418436113379,
        "Operation": "waited",
        "Timestamp": "1557750401646.634766",
        "TenantClass": 0,
        "Source": "SocketIOWithTimeout.java:335",
        "ThreadID": 9034,
        "ThreadName": "",
        "EventID": "9AF8267BA2169BBB",
        "BaggageBytes": "[[248 5] [240 0] [0 17 107 250 160 123 48 54 228] [240 1] [0 105 22 117 187 252 149 57 129] [240 3] [0 2]]",
        "ProcessID": 17069
      },
      {
        "Cycles": 0,
        "Agent": "Execution-Sleep",
        "ProcessName": "Read",
        "TaskID": "116BFAA07B3036E4",
        "ParentEventID": [
          "85B024A90756E78C"
        ],
        "Label": "waited",
        "Title": "X-Trace Task",
        "Host": "pinky19.mpi-sws.org",
        "Duration": "152228",
        "HRT": 26966761706673503,
        "Operation": "waited",
        "Timestamp": "1557750401646.646240",
        "TenantClass": 0,
        "Source": "SocketIOWithTimeout.java:335",
        "ThreadID": 1,
        "ThreadName": "",
        "EventID": "8EBD8F61D1CAD7B0",
        "ProcessID": 2801
      },
      {
        "Cycles": 0,
        "Agent": "edu.brown.cs.systems.xtrace.logging.BaggageWrappers",
        "ProcessName": "Data",
        "TaskID": "116BFAA07B3036E4",
        "ParentEventID": [
          "9AF8267BA2169BBB"
        ],
        "Label": "Forking current baggage with Baggage.fork()",
        "Title": "X-Trace Task",
        "Host": "pinky26.mpi-sws.org",
        "HRT": 47516418436153520,
        "Operation": "fork",
        "Timestamp": "1557750401646.674805",
        "TenantClass": 0,
        "Source": "PacketHeader.java:95",
        "ThreadID": 9034,
        "ThreadName": "",
        "EventID": "337D851B8A7C97E1",
        "BaggageBytes": "[[248 5] [240 0] [0 17 107 250 160 123 48 54 228] [240 1] [0 154 248 38 123 162 22 155 187] [240 3] [0 2]]",
        "ProcessID": 17069
      },
      {
        "Cycles": 0,
        "Agent": "Execution-Sleep",
        "ProcessName": "Data",
        "TaskID": "116BFAA07B3036E4",
        "ParentEventID": [
          "337D851B8A7C97E1"
        ],
        "Label": "waited",
        "Title": "X-Trace Task",
        "Host": "pinky26.mpi-sws.org",
        "Duration": "2550",
        "HRT": 47516418436187924,
        "Operation": "waited",
        "Timestamp": "1557750401646.709229",
        "TenantClass": 0,
        "Source": "SocketIOWithTimeout.java:335",
        "ThreadID": 9034,
        "ThreadName": "",
        "EventID": "429F8538BC2FC143",
        "BaggageBytes": "[[248 5] [240 0] [0 17 107 250 160 123 48 54 228] [240 1] [0 51 125 133 27 138 124 151 225] [240 3] [0 2]]",
        "ProcessID": 17069
      },
      {
        "Cycles": 0,
        "Agent": "edu.brown.cs.systems.xtrace.logging.BaggageWrappers",
        "ProcessName": "Data",
        "TaskID": "116BFAA07B3036E4",
        "ParentEventID": [
          "429F8538BC2FC143"
        ],
        "Label": "Forking current baggage with Baggage.fork()",
        "Title": "X-Trace Task",
        "Host": "pinky26.mpi-sws.org",
        "HRT": 47516418436238465,
        "Operation": "fork",
        "Timestamp": "1557750401646.759766",
        "TenantClass": 0,
        "Source": "PacketHeader.java:95",
        "ThreadID": 9034,
        "ThreadName": "",
        "EventID": "322F2CC8214BE4A1",
        "BaggageBytes": "[[248 5] [240 0] [0 17 107 250 160 123 48 54 228] [240 1] [0 66 159 133 56 188 47 193 67] [240 3] [0 2]]",
        "ProcessID": 17069
      },
      {
        "Cycles": 0,
        "Agent": "Execution-Sleep",
        "ProcessName": "Read",
        "TaskID": "116BFAA07B3036E4",
        "ParentEventID": [
          "8EBD8F61D1CAD7B0"
        ],
        "Label": "waited",
        "Title": "X-Trace Task",
        "Host": "pinky19.mpi-sws.org",
        "Duration": "144409",
        "HRT": 26966761706920586,
        "Operation": "waited",
        "Timestamp": "1557750401646.893311",
        "TenantClass": 0,
        "Source": "SocketIOWithTimeout.java:335",
        "ThreadID": 1,
        "ThreadName": "",
        "EventID": "BDBC3E001DD4CE0D",
        "ProcessID": 2801
      },
      {
        "Cycles": 0,
        "Agent": "edu.brown.cs.systems.xtrace.logging.BaggageWrappers",
        "ProcessName": "Read",
        "TaskID": "116BFAA07B3036E4",
        "ParentEventID": [
          "BDBC3E001DD4CE0D",
          "BA6482DE6305B531"
        ],
        "Label": "Merged current baggage with other baggage",
        "Title": "X-Trace Task",
        "Host": "pinky19.mpi-sws.org",
        "HRT": 26966761706971760,
        "Operation": "join",
        "Timestamp": "1557750401646.944336",
        "TenantClass": 0,
        "Source": "PacketHeader.java:168",
        "ThreadID": 1,
        "ThreadName": "",
        "EventID": "BD637E4F8660A93C",
        "ProcessID": 2801
      },
      {
        "Cycles": 0,
        "Agent": "Execution-Sleep",
        "ProcessName": "Data",
        "TaskID": "116BFAA07B3036E4",
        "ParentEventID": [
          "322F2CC8214BE4A1"
        ],
        "Label": "waited",
        "Title": "X-Trace Task",
        "Host": "pinky26.mpi-sws.org",
        "Duration": "235646",
        "HRT": 47516418436522299,
        "Operation": "waited",
        "Timestamp": "1557750401647.043701",
        "TenantClass": 0,
        "Source": "SocketIOWithTimeout.java:335",
        "ThreadID": 9034,
        "ThreadName": "",
        "EventID": "EB95E85F8E912AF7",
        "BaggageBytes": "[[248 5] [240 0] [0 17 107 250 160 123 48 54 228] [240 1] [0 50 47 44 200 33 75 228 161] [240 3] [0 2]]",
        "ProcessID": 17069
      },
      {
        "Cycles": 0,
        "Agent": "edu.brown.cs.systems.xtrace.logging.BaggageWrappers",
        "ProcessName": "Data",
        "TaskID": "116BFAA07B3036E4",
        "ParentEventID": [
          "EB95E85F8E912AF7"
        ],
        "Label": "Forking current baggage with Baggage.fork()",
        "Title": "X-Trace Task",
        "Host": "pinky26.mpi-sws.org",
        "HRT": 47516418436579290,
        "Operation": "fork",
        "Timestamp": "1557750401647.100586",
        "TenantClass": 0,
        "Source": "PacketHeader.java:95",
        "ThreadID": 9034,
        "ThreadName": "",
        "EventID": "089F27564F1362DD",
        "BaggageBytes": "[[248 5] [240 0] [0 17 107 250 160 123 48 54 228] [240 1] [0 235 149 232 95 142 145 42 247] [240 3] [0 2]]",
        "ProcessID": 17069
      },
      {
        "Cycles": 0,
        "Agent": "Execution-CPU",
        "ProcessName": "Data",
        "TaskID": "116BFAA07B3036E4",
        "ParentEventID": [
          "273E433FCB48EF09"
        ],
        "Label": "unset",
        "Title": "X-Trace Task",
        "Host": "pinky26.mpi-sws.org",
        "Duration": "1646980",
        "HRT": 47516418436867987,
        "Operation": "unset",
        "Timestamp": "1557750401647.389404",
        "TenantClass": 0,
        "Source": "DataXceiver.java:261",
        "ThreadID": 9034,
        "ThreadName": "",
        "EventID": "3021C2D475A78FB0",
        "BaggageBytes": "[[248 5] [240 0] [0 17 107 250 160 123 48 54 228] [240 1] [0 39 62 67 63 203 72 239 9] [240 3] [0 2]]",
        "ProcessID": 17069
      },
      {
        "Cycles": 0,
        "Agent": "Execution-Sleep",
        "ProcessName": "Data",
        "TaskID": "116BFAA07B3036E4",
        "ParentEventID": [
          "089F27564F1362DD"
        ],
        "Label": "waited",
        "Title": "X-Trace Task",
        "Host": "pinky26.mpi-sws.org",
        "Duration": "2498",
        "HRT": 47516418436624844,
        "Operation": "waited",
        "Timestamp": "1557750401647.146240",
        "TenantClass": 0,
        "Source": "SocketIOWithTimeout.java:335",
        "ThreadID": 9034,
        "ThreadName": "",
        "EventID": "273E433FCB48EF09",
        "BaggageBytes": "[[248 5] [240 0] [0 17 107 250 160 123 48 54 228] [240 1] [0 8 159 39 86 79 19 98 221] [240 3] [0 2]]",
        "ProcessID": 17069
      },
      {
        "Cycles": 0,
        "Agent": "edu.brown.cs.systems.retro.benchmarks.hdfs_client.Reader",
        "ProcessName": "Read",
        "TaskID": "116BFAA07B3036E4",
        "ParentEventID": [
          "0"
        ],
        "Label": "Reading file",
        "Title": "X-Trace Task",
        "Host": "pinky19.mpi-sws.org",
        "HRT": 26966761700965129,
        "Timestamp": "1557750401640.937744",
        "TenantClass": 0,
        "ThreadID": 1,
        "ThreadName": "",
        "EventID": "F4725802635181A6",
        "ProcessID": 2801,
        "Tag": [
          "reader_100kb",
          "Read Size: 102400"
        ]
      }
    ]
  }
]