[
  {
    "id": "8611C04E38C1FAD6",
    "reports": [
      {
        "Cycles": 0,
        "Agent": "org.apache.hadoop.ipc.ProtobufRpcEngine",
        "ProcessName": "Read",
        "TaskID": "8611C04E38C1FAD6",
        "ParentEventID": [
          "D4D4942E7B8F1259"
        ],
        "Label": "Invoking org.apache.hadoop.hdfs.protocol.ClientProtocol.getBlockLocations",
        "Title": "X-Trace Task",
        "Host": "pinky19.mpi-sws.org",
        "HRT": 25491787195655310,
        "Timestamp": "1556275427135.960693",
        "TenantClass": 0,
        "Source": "ProtobufRpcEngine.java:228",
        "ThreadID": 1,
        "ThreadName": "",
        "EventID": "95AF12381F182FAF",
        "ProcessID": 21035
      },
      {
        "Cycles": 0,
        "Agent": "Execution-CPU",
        "ProcessName": "Read",
        "TaskID": "8611C04E38C1FAD6",
        "ParentEventID": [
          "95AF12381F182FAF"
        ],
        "Label": "unset",
        "Title": "X-Trace Task",
        "Host": "pinky19.mpi-sws.org",
        "Duration": "22350162",
        "HRT": 25491787195712130,
        "Operation": "unset",
        "Timestamp": "1556275427136.017578",
        "TenantClass": 0,
        "Source": "Client.java:1027",
        "ThreadID": 1,
        "ThreadName": "",
        "EventID": "CB2AC1CD044825D7",
        "ProcessID": 21035
      },
      {
        "Cycles": 0,
        "Agent": "Execution-CPU",
        "ProcessName": "Read",
        "TaskID": "8611C04E38C1FAD6",
        "ParentEventID": [
          "CB2AC1CD044825D7"
        ],
        "Label": "set",
        "Title": "X-Trace Task",
        "Host": "pinky19.mpi-sws.org",
        "HRT": 25491787195777180,
        "Operation": "set",
        "Timestamp": "1556275427136.082520",
        "TenantClass": 0,
        "Source": "Client.java:1032",
        "ThreadID": 41,
        "ThreadName": "",
        "EventID": "EC87DF882E74BC44",
        "ProcessID": 21035
      },
      {
        "Cycles": 0,
        "Agent": "Execution-CPU",
        "ProcessName": "Read",
        "TaskID": "8611C04E38C1FAD6",
        "ParentEventID": [
          "F30345672D3E699E"
        ],
        "Label": "unset",
        "Title": "X-Trace Task",
        "Host": "pinky19.mpi-sws.org",
        "Duration": "86202",
        "HRT": 25491787195884907,
        "Operation": "unset",
        "Timestamp": "1556275427136.190430",
        "TenantClass": 0,
        "Source": "Client.java:1062",
        "ThreadID": 41,
        "ThreadName": "",
        "EventID": "C065D09E298B1D36",
        "ProcessID": 21035
      },
      {
        "Cycles": 0,
        "Agent": "edu.brown.cs.systems.retro.benchmarks.hdfs_client.Reader",
        "ProcessName": "Read",
        "TaskID": "8611C04E38C1FAD6",
        "ParentEventID": [
          "F26A30BD6D288F62"
        ],
        "Label": "Reading file",
        "Title": "X-Trace Task",
        "Host": "pinky19.mpi-sws.org",
        "HRT": 25491787195546181,
        "Timestamp": "1556275427135.851562",
        "TenantClass": 0,
        "ThreadID": 1,
        "ThreadName": "",
        "EventID": "D4D4942E7B8F1259",
        "ProcessID": 21035
      },
      {
        "Cycles": 0,
        "Agent": "Execution-CPU",
        "ProcessName": "Read",
        "TaskID": "8611C04E38C1FAD6",
        "ParentEventID": [
          "C065D09E298B1D36"
        ],
        "Label": "set",
        "Title": "X-Trace Task",
        "Host": "pinky19.mpi-sws.org",
        "HRT": 25491787195936611,
        "Operation": "set",
        "Timestamp": "1556275427136.241943",
        "TenantClass": 0,
        "Source": "Client.java:1104",
        "ThreadID": 1,
        "ThreadName": "",
        "EventID": "22AB165181ED5E7F",
        "ProcessID": 21035
      },
      {
        "Cycles": 0,
        "Agent": "edu.brown.cs.systems.xtrace.logging.BaggageWrappers",
        "ProcessName": "Read",
        "TaskID": "8611C04E38C1FAD6",
        "ParentEventID": [
          "EC87DF882E74BC44"
        ],
        "Label": "Forking current baggage with Baggage.fork()",
        "Title": "X-Trace Task",
        "Host": "pinky19.mpi-sws.org",
        "HRT": 25491787195799984,
        "Operation": "fork",
        "Timestamp": "1556275427136.105469",
        "TenantClass": 0,
        "Source": "Client.java:1043",
        "ThreadID": 41,
        "ThreadName": "",
        "EventID": "F30345672D3E699E",
        "ProcessID": 21035
      },
      {
        "Cycles": 0,
        "Agent": "edu.brown.cs.systems.xtrace.logging.BaggageWrappers",
        "ProcessName": "Name",
        "TaskID": "8611C04E38C1FAD6",
        "ParentEventID": [
          "18587BB6C5609A2D"
        ],
        "Label": "Forking current baggage with Baggage.fork()",
        "Title": "X-Trace Task",
        "Host": "pinky19.mpi-sws.org",
        "HRT": 25491787196008414,
        "Operation": "fork",
        "Timestamp": "1556275427136.355225",
        "TenantClass": 0,
        "Source": "Server.java:550",
        "ThreadID": 48,
        "ThreadName": "",
        "EventID": "E7726097A5A36024",
        "BaggageBytes": "[[248 5] [240 0] [0 134 17 192 78 56 193 250 214] [240 1] [0 24 88 123 182 197 96 154 45] [240 3] [0 2]]",
        "ProcessID": 2171
      },
      {
        "Cycles": 0,
        "Agent": "Execution-CPU",
        "ProcessName": "Name",
        "TaskID": "8611C04E38C1FAD6",
        "ParentEventID": [
          "F30345672D3E699E"
        ],
        "Label": "set",
        "Title": "X-Trace Task",
        "Host": "pinky19.mpi-sws.org",
        "HRT": 25491787195977890,
        "Operation": "set",
        "Timestamp": "1556275427136.324707",
        "TenantClass": 0,
        "Source": "Server.java:1840",
        "ThreadID": 48,
        "ThreadName": "",
        "EventID": "18587BB6C5609A2D",
        "BaggageBytes": "[[248 5] [240 0] [0 134 17 192 78 56 193 250 214] [240 1] [0 243 3 69 103 45 62 105 158] [240 3] [0 2]]",
        "ProcessID": 2171
      },
      {
        "Cycles": 0,
        "Agent": "Execution-CPU",
        "ProcessName": "Name",
        "TaskID": "8611C04E38C1FAD6",
        "ParentEventID": [
          "E7726097A5A36024"
        ],
        "Label": "unset",
        "Title": "X-Trace Task",
        "Host": "pinky19.mpi-sws.org",
        "Duration": "26134",
        "HRT": 25491787196030997,
        "Operation": "unset",
        "Timestamp": "1556275427136.377686",
        "TenantClass": 0,
        "Source": "Server.java:1828",
        "ThreadID": 48,
        "ThreadName": "",
        "EventID": "1AD2FABC84851940",
        "BaggageBytes": "[[248 5] [240 0] [0 134 17 192 78 56 193 250 214] [240 1] [0 231 114 96 151 165 163 96 36] [240 3] [0 2]]",
        "ProcessID": 2171
      },
      {
        "Cycles": 0,
        "Agent": "org.apache.hadoop.ipc.Server",
        "ProcessName": "Name",
        "TaskID": "8611C04E38C1FAD6",
        "ParentEventID": [
          "485DD5EC140ACD76"
        ],
        "Label": "getBlockLocations in org.apache.hadoop.hdfs.protocol.ClientProtocol",
        "Title": "X-Trace Task",
        "Host": "pinky19.mpi-sws.org",
        "HRT": 25491787196107754,
        "Timestamp": "1556275427136.454346",
        "TenantClass": 0,
        "Source": "ProtobufRpcEngine.java:601",
        "ThreadID": 60,
        "ThreadName": "",
        "EventID": "DB3D73EA2144065B",
        "BaggageBytes": "[[248 5] [240 0] [0 134 17 192 78 56 193 250 214] [240 1] [0 72 93 213 236 20 10 205 118] [240 3] [0 2]]",
        "ProcessID": 2171
      },
      {
        "Cycles": 0,
        "Agent": "Execution-CPU",
        "ProcessName": "Name",
        "TaskID": "8611C04E38C1FAD6",
        "ParentEventID": [
          "E7726097A5A36024"
        ],
        "Label": "set",
        "Title": "X-Trace Task",
        "Host": "pinky19.mpi-sws.org",
        "HRT": 25491787196066639,
        "Operation": "set",
        "Timestamp": "1556275427136.413330",
        "TenantClass": 0,
        "Source": "Server.java:2071",
        "ThreadID": 60,
        "ThreadName": "",
        "EventID": "485DD5EC140ACD76",
        "BaggageBytes": "[[248 5] [240 0] [0 134 17 192 78 56 193 250 214] [240 1] [0 231 114 96 151 165 163 96 36] [240 3] [0 2]]",
        "ProcessID": 2171
      },
      {
        "Cycles": 0,
        "Agent": "org.apache.hadoop.hdfs.server.namenode.FSNamesystem.audit",
        "ProcessName": "Name",
        "TaskID": "8611C04E38C1FAD6",
        "ParentEventID": [
          "DB3D73EA2144065B"
        ],
        "Label": "allowed=true\tugi=plascas (auth:SIMPLE)\tip=/139.19.171.63\tcmd=open\tsrc=/ds/foMeaJtNBnswguZG\tdst=null\tperm=null\tproto=rpc",
        "Title": "X-Trace Task",
        "Host": "pinky19.mpi-sws.org",
        "HRT": 25491787196170275,
        "Timestamp": "1556275427136.517090",
        "TenantClass": 0,
        "Source": "FSNamesystem.java:8313",
        "ThreadID": 60,
        "ThreadName": "",
        "EventID": "B1E0C32C0DDF2184",
        "BaggageBytes": "[[248 5] [240 0] [0 134 17 192 78 56 193 250 214] [240 1] [0 219 61 115 234 33 68 6 91] [240 3] [0 2]]",
        "ProcessID": 2171
      },
      {
        "Cycles": 0,
        "Agent": "Execution-CPU",
        "ProcessName": "Name",
        "TaskID": "8611C04E38C1FAD6",
        "ParentEventID": [
          "4A0F75082E0319B0"
        ],
        "Label": "unset",
        "Title": "X-Trace Task",
        "Host": "pinky19.mpi-sws.org",
        "Duration": "242047",
        "HRT": 25491787196337453,
        "Operation": "unset",
        "Timestamp": "1556275427136.684082",
        "TenantClass": 0,
        "Source": "Server.java:1058",
        "ThreadID": 60,
        "ThreadName": "",
        "EventID": "E37BB074E82A656D",
        "BaggageBytes": "[[248 5] [240 0] [0 134 17 192 78 56 193 250 214] [240 1] [0 74 15 117 8 46 3 25 176] [240 3] [0 2]]",
        "ProcessID": 2171
      },
      {
        "Cycles": 0,
        "Agent": "Execution-CPU",
        "ProcessName": "Read",
        "TaskID": "8611C04E38C1FAD6",
        "ParentEventID": [
          "4A0F75082E0319B0"
        ],
        "Label": "set",
        "Title": "X-Trace Task",
        "Host": "pinky19.mpi-sws.org",
        "HRT": 25491787196436666,
        "Operation": "set",
        "Timestamp": "1556275427136.742188",
        "TenantClass": 0,
        "Source": "Client.java:302",
        "ThreadID": 37,
        "ThreadName": "",
        "EventID": "E0AD36863BB6E693",
        "ProcessID": 21035
      },
      {
        "Cycles": 0,
        "Agent": "edu.brown.cs.systems.xtrace.logging.BaggageWrappers",
        "ProcessName": "Name",
        "TaskID": "8611C04E38C1FAD6",
        "ParentEventID": [
          "B1E0C32C0DDF2184"
        ],
        "Label": "Forking current baggage with Baggage.fork()",
        "Title": "X-Trace Task",
        "Host": "pinky19.mpi-sws.org",
        "HRT": 25491787196216354,
        "Operation": "fork",
        "Timestamp": "1556275427136.562988",
        "TenantClass": 0,
        "Source": "Server.java:2398",
        "ThreadID": 60,
        "ThreadName": "",
        "EventID": "4A0F75082E0319B0",
        "BaggageBytes": "[[248 5] [240 0] [0 134 17 192 78 56 193 250 214] [240 1] [0 177 224 195 44 13 223 33 132] [240 3] [0 2]]",
        "ProcessID": 2171
      },
      {
        "Cycles": 0,
        "Agent": "Execution-CPU",
        "ProcessName": "Read",
        "TaskID": "8611C04E38C1FAD6",
        "ParentEventID": [
          "E0AD36863BB6E693"
        ],
        "Label": "unset",
        "Title": "X-Trace Task",
        "Host": "pinky19.mpi-sws.org",
        "Duration": "12389",
        "HRT": 25491787196465809,
        "Operation": "unset",
        "Timestamp": "1556275427136.771240",
        "TenantClass": 0,
        "Source": "Client.java:1168",
        "ThreadID": 37,
        "ThreadName": "",
        "EventID": "2D7754844A04CB0A",
        "ProcessID": 21035
      },
      {
        "Cycles": 0,
        "Agent": "Execution-Sleep",
        "ProcessName": "Read",
        "TaskID": "8611C04E38C1FAD6",
        "ParentEventID": [
          "22AB165181ED5E7F"
        ],
        "Label": "waited",
        "Title": "X-Trace Task",
        "Host": "pinky19.mpi-sws.org",
        "Duration": "521182",
        "HRT": 25491787196493907,
        "Operation": "waited",
        "Timestamp": "1556275427136.799316",
        "TenantClass": 0,
        "Source": "Client.java:1537",
        "ThreadID": 1,
        "ThreadName": "",
        "EventID": "1FC94E829BB596B5",
        "ProcessID": 21035
      },
      {
        "Cycles": 0,
        "Agent": "edu.brown.cs.systems.xtrace.logging.BaggageWrappers",
        "ProcessName": "Read",
        "TaskID": "8611C04E38C1FAD6",
        "ParentEventID": [
          "1FC94E829BB596B5",
          "2D7754844A04CB0A"
        ],
        "Label": "Merged current baggage with other baggage",
        "Title": "X-Trace Task",
        "Host": "pinky19.mpi-sws.org",
        "HRT": 25491787196516421,
        "Operation": "join",
        "Timestamp": "1556275427136.821777",
        "TenantClass": 0,
        "Source": "Client.java:1545",
        "ThreadID": 1,
        "ThreadName": "",
        "EventID": "F4A64A58797C93FA",
        "ProcessID": 21035
      },
      {
        "Cycles": 0,
        "Agent": "edu.brown.cs.systems.xtrace.logging.BaggageWrappers",
        "ProcessName": "Read",
        "TaskID": "8611C04E38C1FAD6",
        "ParentEventID": [
          "8307A37685BEE5DB"
        ],
        "Label": "Forking current baggage with Baggage.fork()",
        "Title": "X-Trace Task",
        "Host": "pinky19.mpi-sws.org",
        "HRT": 25491787196658431,
        "Operation": "fork",
        "Timestamp": "1556275427136.963867",
        "TenantClass": 0,
        "Source": "DataTransferProtoUtil.java:94",
        "ThreadID": 1,
        "ThreadName": "",
        "EventID": "6FA846911F2927F3",
        "ProcessID": 21035
      },
      {
        "Cycles": 0,
        "Agent": "org.apache.hadoop.ipc.ProtobufRpcEngine",
        "ProcessName": "Read",
        "TaskID": "8611C04E38C1FAD6",
        "ParentEventID": [
          "F4A64A58797C93FA"
        ],
        "Label": "org.apache.hadoop.hdfs.protocol.ClientProtocol.getBlockLocations completed",
        "Title": "X-Trace Task",
        "Host": "pinky19.mpi-sws.org",
        "HRT": 25491787196565532,
        "Timestamp": "1556275427136.870850",
        "TenantClass": 0,
        "Source": "ProtobufRpcEngine.java:275",
        "ThreadID": 1,
        "ThreadName": "",
        "EventID": "8307A37685BEE5DB",
        "ProcessID": 21035
      },
      {
        "Cycles": 0,
        "Agent": "Execution-CPU",
        "ProcessName": "Data",
        "TaskID": "8611C04E38C1FAD6",
        "ParentEventID": [
          "6FA846911F2927F3"
        ],
        "Label": "set",
        "Title": "X-Trace Task",
        "Host": "pinky21.mpi-sws.org",
        "HRT": 9338096904033075,
        "Operation": "set",
        "Timestamp": "1556275427137.603516",
        "TenantClass": 0,
        "Source": "Receiver.java:117",
        "ThreadID": 5977,
        "ThreadName": "",
        "EventID": "F6DB8F74035B7507",
        "BaggageBytes": "[[248 5] [240 0] [0 134 17 192 78 56 193 250 214] [240 1] [0 111 168 70 145 31 41 39 243] [240 3] [0 2]]",
        "ProcessID": 20775
      },
      {
        "Cycles": 0,
        "Agent": "edu.brown.cs.systems.xtrace.logging.BaggageWrappers",
        "ProcessName": "Data",
        "TaskID": "8611C04E38C1FAD6",
        "ParentEventID": [
          "EE43B18E91048044"
        ],
        "Label": "Forking current baggage with Baggage.fork()",
        "Title": "X-Trace Task",
        "Host": "pinky21.mpi-sws.org",
        "HRT": 9338096904330515,
        "Operation": "fork",
        "Timestamp": "1556275427137.901123",
        "TenantClass": 0,
        "Source": "DataXceiver.java:1257",
        "ThreadID": 5977,
        "ThreadName": "",
        "EventID": "CA42BACD73C19AFC",
        "BaggageBytes": "[[248 5] [240 0] [0 134 17 192 78 56 193 250 214] [240 1] [0 238 67 177 142 145 4 128 68] [240 3] [0 2]]",
        "ProcessID": 20775
      },
      {
        "Cycles": 0,
        "Agent": "Execution-Sleep",
        "ProcessName": "Read",
        "TaskID": "8611C04E38C1FAD6",
        "ParentEventID": [
          "6FA846911F2927F3"
        ],
        "Label": "waited",
        "Title": "X-Trace Task",
        "Host": "pinky19.mpi-sws.org",
        "Duration": "767671",
        "HRT": 25491787197557503,
        "Operation": "waited",
        "Timestamp": "1556275427137.863037",
        "TenantClass": 0,
        "Source": "SocketIOWithTimeout.java:335",
        "ThreadID": 1,
        "ThreadName": "",
        "EventID": "127DA1885619FAF5",
        "ProcessID": 21035
      },
      {
        "Cycles": 0,
        "Agent": "edu.brown.cs.systems.xtrace.logging.XTraceInit",
        "ProcessName": "Data",
        "TaskID": "8611C04E38C1FAD6",
        "ParentEventID": [
          "F6DB8F74035B7507"
        ],
        "Label": "Thread.setName: DataXceiver for client DFSClient_NONMAPREDUCE_1377588049_1 at /139.19.171.63:56492 [Sending block BP-1633380353-139.19.171.63-1554193446451:blk_1073763931_23107]",
        "Title": "X-Trace Task",
        "Host": "pinky21.mpi-sws.org",
        "HRT": 9338096904133265,
        "Timestamp": "1556275427137.703857",
        "TenantClass": 0,
        "Source": "DataXceiver.java:168",
        "ThreadID": 5977,
        "ThreadName": "",
        "EventID": "EE43B18E91048044",
        "BaggageBytes": "[[248 5] [240 0] [0 134 17 192 78 56 193 250 214] [240 1] [0 246 219 143 116 3 91 117 7] [240 3] [0 2]]",
        "ProcessID": 20775
      },
      {
        "Cycles": 0,
        "Agent": "edu.brown.cs.systems.xtrace.logging.BaggageWrappers",
        "ProcessName": "Data",
        "TaskID": "8611C04E38C1FAD6",
        "ParentEventID": [
          "CA42BACD73C19AFC"
        ],
        "Label": "Forking current baggage with Baggage.fork()",
        "Title": "X-Trace Task",
        "Host": "pinky21.mpi-sws.org",
        "HRT": 9338096904512455,
        "Operation": "fork",
        "Timestamp": "1556275427138.083008",
        "TenantClass": 0,
        "Source": "PacketHeader.java:95",
        "ThreadID": 5977,
        "ThreadName": "",
        "EventID": "802C1D647FE17B6F",
        "BaggageBytes": "[[248 5] [240 0] [0 134 17 192 78 56 193 250 214] [240 1] [0 202 66 186 205 115 193 154 252] [240 3] [0 2]]",
        "ProcessID": 20775
      },
      {
        "Cycles": 0,
        "Agent": "Execution-Sleep",
        "ProcessName": "Data",
        "TaskID": "8611C04E38C1FAD6",
        "ParentEventID": [
          "802C1D647FE17B6F"
        ],
        "Label": "waited",
        "Title": "X-Trace Task",
        "Host": "pinky21.mpi-sws.org",
        "Duration": "10920",
        "HRT": 9338096904698706,
        "Operation": "waited",
        "Timestamp": "1556275427138.269287",
        "TenantClass": 0,
        "Source": "SocketIOWithTimeout.java:335",
        "ThreadID": 5977,
        "ThreadName": "",
        "EventID": "D6BE7DFBD62C4065",
        "BaggageBytes": "[[248 5] [240 0] [0 134 17 192 78 56 193 250 214] [240 1] [0 128 44 29 100 127 225 123 111] [240 3] [0 2]]",
        "ProcessID": 20775
      },
      {
        "Cycles": 0,
        "Agent": "Execution-Sleep",
        "ProcessName": "Read",
        "TaskID": "8611C04E38C1FAD6",
        "ParentEventID": [
          "968D929DFF7E726A"
        ],
        "Label": "waited",
        "Title": "X-Trace Task",
        "Host": "pinky19.mpi-sws.org",
        "Duration": "70567",
        "HRT": 25491787197925161,
        "Operation": "waited",
        "Timestamp": "1556275427138.230469",
        "TenantClass": 0,
        "Source": "SocketIOWithTimeout.java:335",
        "ThreadID": 1,
        "ThreadName": "",
        "EventID": "754140004C1099BE",
        "ProcessID": 21035
      },
      {
        "Cycles": 0,
        "Agent": "edu.brown.cs.systems.xtrace.logging.BaggageWrappers",
        "ProcessName": "Read",
        "TaskID": "8611C04E38C1FAD6",
        "ParentEventID": [
          "127DA1885619FAF5",
          "CA42BACD73C19AFC"
        ],
        "Label": "Merged current baggage with other baggage",
        "Title": "X-Trace Task",
        "Host": "pinky19.mpi-sws.org",
        "HRT": 25491787197717887,
        "Operation": "join",
        "Timestamp": "1556275427138.023193",
        "TenantClass": 0,
        "Source": "RemoteBlockReader2.java:429",
        "ThreadID": 1,
        "ThreadName": "",
        "EventID": "968D929DFF7E726A",
        "ProcessID": 21035
      },
      {
        "Cycles": 0,
        "Agent": "edu.brown.cs.systems.xtrace.logging.BaggageWrappers",
        "ProcessName": "Data",
        "TaskID": "8611C04E38C1FAD6",
        "ParentEventID": [
          "D6BE7DFBD62C4065"
        ],
        "Label": "Forking current baggage with Baggage.fork()",
        "Title": "X-Trace Task",
        "Host": "pinky21.mpi-sws.org",
        "HRT": 9338096904891774,
        "Operation": "fork",
        "Timestamp": "1556275427138.462158",
        "TenantClass": 0,
        "Source": "PacketHeader.java:95",
        "ThreadID": 5977,
        "ThreadName": "",
        "EventID": "4A8026CFCC0CD29F",
        "BaggageBytes": "[[248 5] [240 0] [0 134 17 192 78 56 193 250 214] [240 1] [0 214 190 125 251 214 44 64 101] [240 3] [0 2]]",
        "ProcessID": 20775
      },
      {
        "Cycles": 0,
        "Agent": "edu.brown.cs.systems.xtrace.logging.BaggageWrappers",
        "ProcessName": "Read",
        "TaskID": "8611C04E38C1FAD6",
        "ParentEventID": [
          "4A8026CFCC0CD29F",
          "B167091F619A89E3"
        ],
        "Label": "Merged current baggage with other baggage",
        "Title": "X-Trace Task",
        "Host": "pinky19.mpi-sws.org",
        "HRT": 25491787198085049,
        "Operation": "join",
        "Timestamp": "1556275427138.390381",
        "TenantClass": 0,
        "Source": "PacketHeader.java:168",
        "ThreadID": 1,
        "ThreadName": "",
        "EventID": "8767E574F19E9E10",
        "ProcessID": 21035
      },
      {
        "Cycles": 0,
        "Agent": "edu.brown.cs.systems.xtrace.logging.BaggageWrappers",
        "ProcessName": "Read",
        "TaskID": "8611C04E38C1FAD6",
        "ParentEventID": [
          "802C1D647FE17B6F",
          "754140004C1099BE"
        ],
        "Label": "Merged current baggage with other baggage",
        "Title": "X-Trace Task",
        "Host": "pinky19.mpi-sws.org",
        "HRT": 25491787197993858,
        "Operation": "join",
        "Timestamp": "1556275427138.299316",
        "TenantClass": 0,
        "Source": "PacketHeader.java:168",
        "ThreadID": 1,
        "ThreadName": "",
        "EventID": "B167091F619A89E3",
        "ProcessID": 21035
      },
      {
        "Cycles": 0,
        "Agent": "edu.brown.cs.systems.xtrace.logging.BaggageWrappers",
        "ProcessName": "Read",
        "TaskID": "8611C04E38C1FAD6",
        "ParentEventID": [
          "8767E574F19E9E10"
        ],
        "Label": "Forking current baggage with Baggage.fork()",
        "Title": "X-Trace Task",
        "Host": "pinky19.mpi-sws.org",
        "HRT": 25491787198106404,
        "Operation": "fork",
        "Timestamp": "1556275427138.411865",
        "TenantClass": 0,
        "Source": "RemoteBlockReader2.java:361",
        "ThreadID": 1,
        "ThreadName": "",
        "EventID": "B03B10A7C0908D62",
        "ProcessID": 21035
      },
      {
        "Cycles": 0,
        "Agent": "edu.brown.cs.systems.xtrace.logging.BaggageWrappers",
        "ProcessName": "Data",
        "TaskID": "8611C04E38C1FAD6",
        "ParentEventID": [
          "16B581195FF4230C",
          "B03B10A7C0908D62"
        ],
        "Label": "Merged current baggage with other baggage",
        "Title": "X-Trace Task",
        "Host": "pinky21.mpi-sws.org",
        "HRT": 9338096905364397,
        "Operation": "join",
        "Timestamp": "1556275427138.934814",
        "TenantClass": 0,
        "Source": "DataXceiver.java:574",
        "ThreadID": 5977,
        "ThreadName": "",
        "EventID": "C6A326129377D173",
        "BaggageBytes": "[[248 5] [240 0] [0 134 17 192 78 56 193 250 214] [240 1] [0 176 59 16 167 192 144 141 98] [0 22 181 129 25 95 244 35 12] [240 3] [0 2]]",
        "ProcessID": 20775
      },
      {
        "Cycles": 0,
        "Agent": "Execution-Sleep",
        "ProcessName": "Data",
        "TaskID": "8611C04E38C1FAD6",
        "ParentEventID": [
          "4A8026CFCC0CD29F"
        ],
        "Label": "waited",
        "Title": "X-Trace Task",
        "Host": "pinky21.mpi-sws.org",
        "Duration": "99800",
        "HRT": 9338096905211547,
        "Operation": "waited",
        "Timestamp": "1556275427138.781982",
        "TenantClass": 0,
        "Source": "SocketIOWithTimeout.java:335",
        "ThreadID": 5977,
        "ThreadName": "",
        "EventID": "16B581195FF4230C",
        "BaggageBytes": "[[248 5] [240 0] [0 134 17 192 78 56 193 250 214] [240 1] [0 74 128 38 207 204 12 210 159] [240 3] [0 2]]",
        "ProcessID": 20775
      },
      {
        "Cycles": 0,
        "Agent": "Execution-CPU",
        "ProcessName": "Data",
        "TaskID": "8611C04E38C1FAD6",
        "ParentEventID": [
          "C6A326129377D173"
        ],
        "Label": "unset",
        "Title": "X-Trace Task",
        "Host": "pinky21.mpi-sws.org",
        "Duration": "1322072",
        "HRT": 9338096905427616,
        "Operation": "unset",
        "Timestamp": "1556275427138.998047",
        "TenantClass": 0,
        "Source": "DataXceiver.java:261",
        "ThreadID": 5977,
        "ThreadName": "",
        "EventID": "3D9CEE17EFC31372",
        "BaggageBytes": "[[248 5] [240 0] [0 134 17 192 78 56 193 250 214] [240 1] [0 198 163 38 18 147 119 209 115] [240 3] [0 2]]",
        "ProcessID": 20775
      },
      {
        "Cycles": 0,
        "Agent": "edu.brown.cs.systems.retro.benchmarks.hdfs_client.Reader",
        "ProcessName": "Read",
        "TaskID": "8611C04E38C1FAD6",
        "ParentEventID": [
          "0"
        ],
        "Label": "Reading file",
        "Title": "X-Trace Task",
        "Host": "pinky19.mpi-sws.org",
        "HRT": 25491787195484330,
        "Timestamp": "1556275427135.789795",
        "TenantClass": 0,
        "ThreadID": 1,
        "ThreadName": "",
        "EventID": "F26A30BD6D288F62",
        "ProcessID": 21035,
        "Tag": [
          "reader_1kb",
          "Read Size: 1024"
        ]
      }
    ]
  }
]