[
  {
    "id": "A3F57DC53ED990DE",
    "reports": [
      {
        "Cycles": 0,
        "Agent": "edu.brown.cs.systems.retro.benchmarks.hdfs_client.Reader",
        "ProcessName": "Read",
        "TaskID": "A3F57DC53ED990DE",
        "ParentEventID": [
          "E1BE7017A214ED9E"
        ],
        "Label": "Reading file",
        "Title": "X-Trace Task",
        "Host": "pinky19.mpi-sws.org",
        "HRT": 26962499239377796,
        "Timestamp": "1557746139179.682373",
        "TenantClass": 0,
        "ThreadID": 1,
        "ThreadName": "",
        "EventID": "EB5691325534E9D2",
        "ProcessID": 36430
      },
      {
        "Cycles": 0,
        "Agent": "Execution-CPU",
        "ProcessName": "Read",
        "TaskID": "A3F57DC53ED990DE",
        "ParentEventID": [
          "4D6BA39CEE0B024A"
        ],
        "Label": "unset",
        "Title": "X-Trace Task",
        "Host": "pinky19.mpi-sws.org",
        "Duration": "21320290",
        "HRT": 26962499239435764,
        "Operation": "unset",
        "Timestamp": "1557746139179.740479",
        "TenantClass": 0,
        "Source": "Client.java:1027",
        "ThreadID": 1,
        "ThreadName": "",
        "EventID": "21DF06F105DEF26C",
        "ProcessID": 36430
      },
      {
        "Cycles": 0,
        "Agent": "org.apache.hadoop.ipc.ProtobufRpcEngine",
        "ProcessName": "Read",
        "TaskID": "A3F57DC53ED990DE",
        "ParentEventID": [
          "EB5691325534E9D2"
        ],
        "Label": "Invoking org.apache.hadoop.hdfs.protocol.ClientProtocol.getBlockLocations",
        "Title": "X-Trace Task",
        "Host": "pinky19.mpi-sws.org",
        "HRT": 26962499239410845,
        "Timestamp": "1557746139179.715576",
        "TenantClass": 0,
        "Source": "ProtobufRpcEngine.java:228",
        "ThreadID": 1,
        "ThreadName": "",
        "EventID": "4D6BA39CEE0B024A",
        "ProcessID": 36430
      },
      {
        "Cycles": 0,
        "Agent": "Execution-CPU",
        "ProcessName": "Read",
        "TaskID": "A3F57DC53ED990DE",
        "ParentEventID": [
          "21DF06F105DEF26C"
        ],
        "Label": "set",
        "Title": "X-Trace Task",
        "Host": "pinky19.mpi-sws.org",
        "HRT": 26962499239481328,
        "Operation": "set",
        "Timestamp": "1557746139179.785889",
        "TenantClass": 0,
        "Source": "Client.java:1032",
        "ThreadID": 41,
        "ThreadName": "",
        "EventID": "5A0B9B729C6F7BFF",
        "ProcessID": 36430
      },
      {
        "Cycles": 0,
        "Agent": "edu.brown.cs.systems.xtrace.logging.BaggageWrappers",
        "ProcessName": "Read",
        "TaskID": "A3F57DC53ED990DE",
        "ParentEventID": [
          "5A0B9B729C6F7BFF"
        ],
        "Label": "Forking current baggage with Baggage.fork()",
        "Title": "X-Trace Task",
        "Host": "pinky19.mpi-sws.org",
        "HRT": 26962499239494948,
        "Operation": "fork",
        "Timestamp": "1557746139179.799561",
        "TenantClass": 0,
        "Source": "Client.java:1043",
        "ThreadID": 41,
        "ThreadName": "",
        "EventID": "5D002BEE884E585B",
        "ProcessID": 36430
      },
      {
        "Cycles": 0,
        "Agent": "Execution-CPU",
        "ProcessName": "Read",
        "TaskID": "A3F57DC53ED990DE",
        "ParentEventID": [
          "5D002BEE884E585B"
        ],
        "Label": "unset",
        "Title": "X-Trace Task",
        "Host": "pinky19.mpi-sws.org",
        "Duration": "64209",
        "HRT": 26962499239558942,
        "Operation": "unset",
        "Timestamp": "1557746139179.863525",
        "TenantClass": 0,
        "Source": "Client.java:1062",
        "ThreadID": 41,
        "ThreadName": "",
        "EventID": "80239BE9A99DEC60",
        "ProcessID": 36430
      },
      {
        "Cycles": 0,
        "Agent": "Execution-CPU",
        "ProcessName": "Name",
        "TaskID": "A3F57DC53ED990DE",
        "ParentEventID": [
          "5D002BEE884E585B"
        ],
        "Label": "set",
        "Title": "X-Trace Task",
        "Host": "pinky19.mpi-sws.org",
        "HRT": 26962499239611847,
        "Operation": "set",
        "Timestamp": "1557746139179.955811",
        "TenantClass": 0,
        "Source": "Server.java:1840",
        "ThreadID": 48,
        "ThreadName": "",
        "EventID": "DF4CA3B6F3A7B097",
        "BaggageBytes": "[[248 5] [240 0] [0 163 245 125 197 62 217 144 222] [240 1] [0 93 0 43 238 136 78 88 91] [240 3] [0 2]]",
        "ProcessID": 2171
      },
      {
        "Cycles": 0,
        "Agent": "edu.brown.cs.systems.xtrace.logging.BaggageWrappers",
        "ProcessName": "Name",
        "TaskID": "A3F57DC53ED990DE",
        "ParentEventID": [
          "DF4CA3B6F3A7B097"
        ],
        "Label": "Forking current baggage with Baggage.fork()",
        "Title": "X-Trace Task",
        "Host": "pinky19.mpi-sws.org",
        "HRT": 26962499239642159,
        "Operation": "fork",
        "Timestamp": "1557746139179.986084",
        "TenantClass": 0,
        "Source": "Server.java:550",
        "ThreadID": 48,
        "ThreadName": "",
        "EventID": "E36CA07E0598B755",
        "BaggageBytes": "[[248 5] [240 0] [0 163 245 125 197 62 217 144 222] [240 1] [0 223 76 163 182 243 167 176 151] [240 3] [0 2]]",
        "ProcessID": 2171
      },
      {
        "Cycles": 0,
        "Agent": "Execution-CPU",
        "ProcessName": "Read",
        "TaskID": "A3F57DC53ED990DE",
        "ParentEventID": [
          "80239BE9A99DEC60"
        ],
        "Label": "set",
        "Title": "X-Trace Task",
        "Host": "pinky19.mpi-sws.org",
        "HRT": 26962499239589029,
        "Operation": "set",
        "Timestamp": "1557746139179.893799",
        "TenantClass": 0,
        "Source": "Client.java:1104",
        "ThreadID": 1,
        "ThreadName": "",
        "EventID": "F7C59B6207E3BADA",
        "ProcessID": 36430
      },
      {
        "Cycles": 0,
        "Agent": "Execution-CPU",
        "ProcessName": "Name",
        "TaskID": "A3F57DC53ED990DE",
        "ParentEventID": [
          "E36CA07E0598B755"
        ],
        "Label": "unset",
        "Title": "X-Trace Task",
        "Host": "pinky19.mpi-sws.org",
        "Duration": "24386",
        "HRT": 26962499239662643,
        "Operation": "unset",
        "Timestamp": "1557746139180.006592",
        "TenantClass": 0,
        "Source": "Server.java:1828",
        "ThreadID": 48,
        "ThreadName": "",
        "EventID": "2218BE4595C56778",
        "BaggageBytes": "[[248 5] [240 0] [0 163 245 125 197 62 217 144 222] [240 1] [0 227 108 160 126 5 152 183 85] [240 3] [0 2]]",
        "ProcessID": 2171
      },
      {
        "Cycles": 0,
        "Agent": "Execution-CPU",
        "ProcessName": "Name",
        "TaskID": "A3F57DC53ED990DE",
        "ParentEventID": [
          "E36CA07E0598B755"
        ],
        "Label": "set",
        "Title": "X-Trace Task",
        "Host": "pinky19.mpi-sws.org",
        "HRT": 26962499239675093,
        "Operation": "set",
        "Timestamp": "1557746139180.019043",
        "TenantClass": 0,
        "Source": "Server.java:2071",
        "ThreadID": 57,
        "ThreadName": "",
        "EventID": "5CE089ACE54DDC84",
        "BaggageBytes": "[[248 5] [240 0] [0 163 245 125 197 62 217 144 222] [240 1] [0 227 108 160 126 5 152 183 85] [240 3] [0 2]]",
        "ProcessID": 2171
      },
      {
        "Cycles": 0,
        "Agent": "org.apache.hadoop.ipc.Server",
        "ProcessName": "Name",
        "TaskID": "A3F57DC53ED990DE",
        "ParentEventID": [
          "5CE089ACE54DDC84"
        ],
        "Label": "getBlockLocations in org.apache.hadoop.hdfs.protocol.ClientProtocol",
        "Title": "X-Trace Task",
        "Host": "pinky19.mpi-sws.org",
        "HRT": 26962499239723098,
        "Timestamp": "1557746139180.066895",
        "TenantClass": 0,
        "Source": "ProtobufRpcEngine.java:601",
        "ThreadID": 57,
        "ThreadName": "",
        "EventID": "FFC7C8599D4AB7A1",
        "BaggageBytes": "[[248 5] [240 0] [0 163 245 125 197 62 217 144 222] [240 1] [0 92 224 137 172 229 77 220 132] [240 3] [0 2]]",
        "ProcessID": 2171
      },
      {
        "Cycles": 0,
        "Agent": "edu.brown.cs.systems.xtrace.logging.BaggageWrappers",
        "ProcessName": "Name",
        "TaskID": "A3F57DC53ED990DE",
        "ParentEventID": [
          "7F198403877F5EC3"
        ],
        "Label": "Forking current baggage with Baggage.fork()",
        "Title": "X-Trace Task",
        "Host": "pinky19.mpi-sws.org",
        "HRT": 26962499239834698,
        "Operation": "fork",
        "Timestamp": "1557746139180.178467",
        "TenantClass": 0,
        "Source": "Server.java:2398",
        "ThreadID": 57,
        "ThreadName": "",
        "EventID": "2801C7FF0E595623",
        "BaggageBytes": "[[248 5] [240 0] [0 163 245 125 197 62 217 144 222] [240 1] [0 127 25 132 3 135 127 94 195] [240 3] [0 2]]",
        "ProcessID": 2171
      },
      {
        "Cycles": 0,
        "Agent": "Execution-CPU",
        "ProcessName": "Name",
        "TaskID": "A3F57DC53ED990DE",
        "ParentEventID": [
          "2801C7FF0E595623"
        ],
        "Label": "unset",
        "Title": "X-Trace Task",
        "Host": "pinky19.mpi-sws.org",
        "Duration": "244139",
        "HRT": 26962499239952456,
        "Operation": "unset",
        "Timestamp": "1557746139180.296387",
        "TenantClass": 0,
        "Source": "Server.java:1058",
        "ThreadID": 57,
        "ThreadName": "",
        "EventID": "0EFFF2FD2276B893",
        "BaggageBytes": "[[248 5] [240 0] [0 163 245 125 197 62 217 144 222] [240 1] [0 40 1 199 255 14 89 86 35] [240 3] [0 2]]",
        "ProcessID": 2171
      },
      {
        "Cycles": 0,
        "Agent": "org.apache.hadoop.hdfs.server.namenode.FSNamesystem.audit",
        "ProcessName": "Name",
        "TaskID": "A3F57DC53ED990DE",
        "ParentEventID": [
          "FFC7C8599D4AB7A1"
        ],
        "Label": "allowed=true\tugi=plascas (auth:SIMPLE)\tip=/139.19.171.63\tcmd=open\tsrc=/ds/gJlV1NjdZCBoqWmq\tdst=null\tperm=null\tproto=rpc",
        "Title": "X-Trace Task",
        "Host": "pinky19.mpi-sws.org",
        "HRT": 26962499239781760,
        "Timestamp": "1557746139180.125732",
        "TenantClass": 0,
        "Source": "FSNamesystem.java:8313",
        "ThreadID": 57,
        "ThreadName": "",
        "EventID": "7F198403877F5EC3",
        "BaggageBytes": "[[248 5] [240 0] [0 163 245 125 197 62 217 144 222] [240 1] [0 255 199 200 89 157 74 183 161] [240 3] [0 2]]",
        "ProcessID": 2171
      },
      {
        "Cycles": 0,
        "Agent": "Execution-CPU",
        "ProcessName": "Read",
        "TaskID": "A3F57DC53ED990DE",
        "ParentEventID": [
          "10C9F6AE092D5D45"
        ],
        "Label": "unset",
        "Title": "X-Trace Task",
        "Host": "pinky19.mpi-sws.org",
        "Duration": "11865",
        "HRT": 26962499240059683,
        "Operation": "unset",
        "Timestamp": "1557746139180.364258",
        "TenantClass": 0,
        "Source": "Client.java:1168",
        "ThreadID": 37,
        "ThreadName": "",
        "EventID": "5F3710413AAE110E",
        "ProcessID": 36430
      },
      {
        "Cycles": 0,
        "Agent": "Execution-CPU",
        "ProcessName": "Read",
        "TaskID": "A3F57DC53ED990DE",
        "ParentEventID": [
          "2801C7FF0E595623"
        ],
        "Label": "set",
        "Title": "X-Trace Task",
        "Host": "pinky19.mpi-sws.org",
        "HRT": 26962499240030328,
        "Operation": "set",
        "Timestamp": "1557746139180.334961",
        "TenantClass": 0,
        "Source": "Client.java:302",
        "ThreadID": 37,
        "ThreadName": "",
        "EventID": "10C9F6AE092D5D45",
        "ProcessID": 36430
      },
      {
        "Cycles": 0,
        "Agent": "Execution-Sleep",
        "ProcessName": "Read",
        "TaskID": "A3F57DC53ED990DE",
        "ParentEventID": [
          "F7C59B6207E3BADA"
        ],
        "Label": "waited",
        "Title": "X-Trace Task",
        "Host": "pinky19.mpi-sws.org",
        "Duration": "481697",
        "HRT": 26962499240079920,
        "Operation": "waited",
        "Timestamp": "1557746139180.384521",
        "TenantClass": 0,
        "Source": "Client.java:1537",
        "ThreadID": 1,
        "ThreadName": "",
        "EventID": "F7737B5CDDFE37BD",
        "ProcessID": 36430
      },
      {
        "Cycles": 0,
        "Agent": "edu.brown.cs.systems.xtrace.logging.BaggageWrappers",
        "ProcessName": "Read",
        "TaskID": "A3F57DC53ED990DE",
        "ParentEventID": [
          "F7737B5CDDFE37BD",
          "5F3710413AAE110E"
        ],
        "Label": "Merged current baggage with other baggage",
        "Title": "X-Trace Task",
        "Host": "pinky19.mpi-sws.org",
        "HRT": 26962499240095486,
        "Operation": "join",
        "Timestamp": "1557746139180.400146",
        "TenantClass": 0,
        "Source": "Client.java:1545",
        "ThreadID": 1,
        "ThreadName": "",
        "EventID": "DD8159F75BA492B2",
        "ProcessID": 36430
      },
      {
        "Cycles": 0,
        "Agent": "org.apache.hadoop.ipc.ProtobufRpcEngine",
        "ProcessName": "Read",
        "TaskID": "A3F57DC53ED990DE",
        "ParentEventID": [
          "DD8159F75BA492B2"
        ],
        "Label": "org.apache.hadoop.hdfs.protocol.ClientProtocol.getBlockLocations completed",
        "Title": "X-Trace Task",
        "Host": "pinky19.mpi-sws.org",
        "HRT": 26962499240135397,
        "Timestamp": "1557746139180.439941",
        "TenantClass": 0,
        "Source": "ProtobufRpcEngine.java:275",
        "ThreadID": 1,
        "ThreadName": "",
        "EventID": "FACEDD59EC911756",
        "ProcessID": 36430
      },
      {
        "Cycles": 0,
        "Agent": "edu.brown.cs.systems.xtrace.logging.BaggageWrappers",
        "ProcessName": "Read",
        "TaskID": "A3F57DC53ED990DE",
        "ParentEventID": [
          "FACEDD59EC911756"
        ],
        "Label": "Forking current baggage with Baggage.fork()",
        "Title": "X-Trace Task",
        "Host": "pinky19.mpi-sws.org",
        "HRT": 26962499240197644,
        "Operation": "fork",
        "Timestamp": "1557746139180.502197",
        "TenantClass": 0,
        "Source": "DataTransferProtoUtil.java:94",
        "ThreadID": 1,
        "ThreadName": "",
        "EventID": "056D68527E0406F5",
        "ProcessID": 36430
      },
      {
        "Cycles": 0,
        "Agent": "edu.brown.cs.systems.xtrace.logging.XTraceInit",
        "ProcessName": "Data",
        "TaskID": "A3F57DC53ED990DE",
        "ParentEventID": [
          "9DB10C433AA5372F"
        ],
        "Label": "Thread.setName: DataXceiver for client DFSClient_NONMAPREDUCE_778905418_1 at /139.19.171.63:58814 [Sending block BP-1633380353-139.19.171.63-1554193446451:blk_1073764324_23500]",
        "Title": "X-Trace Task",
        "Host": "pinky24.mpi-sws.org",
        "HRT": 6573751964959227,
        "Timestamp": "1557746139181.017334",
        "TenantClass": 0,
        "Source": "DataXceiver.java:168",
        "ThreadID": 14307,
        "ThreadName": "",
        "EventID": "DBBFA5DFC4EE3387",
        "BaggageBytes": "[[248 5] [240 0] [0 163 245 125 197 62 217 144 222] [240 1] [0 157 177 12 67 58 165 55 47] [240 3] [0 2]]",
        "ProcessID": 28692
      },
      {
        "Cycles": 0,
        "Agent": "Execution-CPU",
        "ProcessName": "Data",
        "TaskID": "A3F57DC53ED990DE",
        "ParentEventID": [
          "056D68527E0406F5"
        ],
        "Label": "set",
        "Title": "X-Trace Task",
        "Host": "pinky24.mpi-sws.org",
        "HRT": 6573751964861250,
        "Operation": "set",
        "Timestamp": "1557746139180.919434",
        "TenantClass": 0,
        "Source": "Receiver.java:117",
        "ThreadID": 14307,
        "ThreadName": "",
        "EventID": "9DB10C433AA5372F",
        "BaggageBytes": "[[248 5] [240 0] [0 163 245 125 197 62 217 144 222] [240 1] [0 5 109 104 82 126 4 6 245] [240 3] [0 2]]",
        "ProcessID": 28692
      },
      {
        "Cycles": 0,
        "Agent": "edu.brown.cs.systems.retro.benchmarks.hdfs_client.Reader",
        "ProcessName": "Read",
        "TaskID": "A3F57DC53ED990DE",
        "ParentEventID": [
          "0"
        ],
        "Label": "Reading file",
        "Title": "X-Trace Task",
        "Host": "pinky19.mpi-sws.org",
        "HRT": 26962499239361687,
        "Timestamp": "1557746139179.666260",
        "TenantClass": 0,
        "ThreadID": 1,
        "ThreadName": "",
        "EventID": "E1BE7017A214ED9E",
        "ProcessID": 36430,
        "Tag": [
          "reader_10kb",
          "Read Size: 10240"
        ]
      },
      {
        "Cycles": 0,
        "Agent": "edu.brown.cs.systems.xtrace.logging.BaggageWrappers",
        "ProcessName": "Data",
        "TaskID": "A3F57DC53ED990DE",
        "ParentEventID": [
          "7C38DC715F659E03"
        ],
        "Label": "Forking current baggage with Baggage.fork()",
        "Title": "X-Trace Task",
        "Host": "pinky24.mpi-sws.org",
        "HRT": 6573751972799304,
        "Operation": "fork",
        "Timestamp": "1557746139188.857422",
        "TenantClass": 0,
        "Source": "PacketHeader.java:95",
        "ThreadID": 14307,
        "ThreadName": "",
        "EventID": "47B12057181D6126",
        "BaggageBytes": "[[248 5] [240 0] [0 163 245 125 197 62 217 144 222] [240 1] [0 124 56 220 113 95 101 158 3] [240 3] [0 2]]",
        "ProcessID": 28692
      },
      {
        "Cycles": 0,
        "Agent": "edu.brown.cs.systems.xtrace.logging.BaggageWrappers",
        "ProcessName": "Data",
        "TaskID": "A3F57DC53ED990DE",
        "ParentEventID": [
          "DBBFA5DFC4EE3387"
        ],
        "Label": "Forking current baggage with Baggage.fork()",
        "Title": "X-Trace Task",
        "Host": "pinky24.mpi-sws.org",
        "HRT": 6573751972726618,
        "Operation": "fork",
        "Timestamp": "1557746139188.784668",
        "TenantClass": 0,
        "Source": "DataXceiver.java:1257",
        "ThreadID": 14307,
        "ThreadName": "",
        "EventID": "7C38DC715F659E03",
        "BaggageBytes": "[[248 5] [240 0] [0 163 245 125 197 62 217 144 222] [240 1] [0 219 191 165 223 196 238 51 135] [240 3] [0 2]]",
        "ProcessID": 28692
      },
      {
        "Cycles": 0,
        "Agent": "Execution-Sleep",
        "ProcessName": "Data",
        "TaskID": "A3F57DC53ED990DE",
        "ParentEventID": [
          "47B12057181D6126"
        ],
        "Label": "waited",
        "Title": "X-Trace Task",
        "Host": "pinky24.mpi-sws.org",
        "Duration": "16969",
        "HRT": 6573751972873327,
        "Operation": "waited",
        "Timestamp": "1557746139188.931396",
        "TenantClass": 0,
        "Source": "SocketIOWithTimeout.java:335",
        "ThreadID": 14307,
        "ThreadName": "",
        "EventID": "34DE7469237C4023",
        "BaggageBytes": "[[248 5] [240 0] [0 163 245 125 197 62 217 144 222] [240 1] [0 71 177 32 87 24 29 97 38] [240 3] [0 2]]",
        "ProcessID": 28692
      },
      {
        "Cycles": 0,
        "Agent": "Execution-Sleep",
        "ProcessName": "Read",
        "TaskID": "A3F57DC53ED990DE",
        "ParentEventID": [
          "056D68527E0406F5"
        ],
        "Label": "waited",
        "Title": "X-Trace Task",
        "Host": "pinky19.mpi-sws.org",
        "Duration": "8271821",
        "HRT": 26962499248563844,
        "Operation": "waited",
        "Timestamp": "1557746139188.868408",
        "TenantClass": 0,
        "Source": "SocketIOWithTimeout.java:335",
        "ThreadID": 1,
        "ThreadName": "",
        "EventID": "829022E056E10D9B",
        "ProcessID": 36430
      },
      {
        "Cycles": 0,
        "Agent": "edu.brown.cs.systems.xtrace.logging.BaggageWrappers",
        "ProcessName": "Read",
        "TaskID": "A3F57DC53ED990DE",
        "ParentEventID": [
          "7C38DC715F659E03",
          "829022E056E10D9B"
        ],
        "Label": "Merged current baggage with other baggage",
        "Title": "X-Trace Task",
        "Host": "pinky19.mpi-sws.org",
        "HRT": 26962499248657956,
        "Operation": "join",
        "Timestamp": "1557746139188.962646",
        "TenantClass": 0,
        "Source": "RemoteBlockReader2.java:429",
        "ThreadID": 1,
        "ThreadName": "",
        "EventID": "7CA7A2C141F79DA2",
        "ProcessID": 36430
      },
      {
        "Cycles": 0,
        "Agent": "edu.brown.cs.systems.xtrace.logging.BaggageWrappers",
        "ProcessName": "Data",
        "TaskID": "A3F57DC53ED990DE",
        "ParentEventID": [
          "34DE7469237C4023"
        ],
        "Label": "Forking current baggage with Baggage.fork()",
        "Title": "X-Trace Task",
        "Host": "pinky24.mpi-sws.org",
        "HRT": 6573751977601886,
        "Operation": "fork",
        "Timestamp": "1557746139193.660156",
        "TenantClass": 0,
        "Source": "PacketHeader.java:95",
        "ThreadID": 14307,
        "ThreadName": "",
        "EventID": "0D681B9E005A3AA1",
        "BaggageBytes": "[[248 5] [240 0] [0 163 245 125 197 62 217 144 222] [240 1] [0 52 222 116 105 35 124 64 35] [240 3] [0 2]]",
        "ProcessID": 28692
      },
      {
        "Cycles": 0,
        "Agent": "Execution-Sleep",
        "ProcessName": "Read",
        "TaskID": "A3F57DC53ED990DE",
        "ParentEventID": [
          "7CA7A2C141F79DA2"
        ],
        "Label": "waited",
        "Title": "X-Trace Task",
        "Host": "pinky19.mpi-sws.org",
        "Duration": "4705075",
        "HRT": 26962499253456999,
        "Operation": "waited",
        "Timestamp": "1557746139193.761719",
        "TenantClass": 0,
        "Source": "SocketIOWithTimeout.java:335",
        "ThreadID": 1,
        "ThreadName": "",
        "EventID": "9B9B71590BA019DD",
        "ProcessID": 36430
      },
      {
        "Cycles": 0,
        "Agent": "edu.brown.cs.systems.xtrace.logging.BaggageWrappers",
        "ProcessName": "Read",
        "TaskID": "A3F57DC53ED990DE",
        "ParentEventID": [
          "47B12057181D6126",
          "9B9B71590BA019DD"
        ],
        "Label": "Merged current baggage with other baggage",
        "Title": "X-Trace Task",
        "Host": "pinky19.mpi-sws.org",
        "HRT": 26962499253523998,
        "Operation": "join",
        "Timestamp": "1557746139193.828613",
        "TenantClass": 0,
        "Source": "PacketHeader.java:168",
        "ThreadID": 1,
        "ThreadName": "",
        "EventID": "0CC8FEBD8A93B681",
        "ProcessID": 36430
      },
      {
        "Cycles": 0,
        "Agent": "edu.brown.cs.systems.xtrace.logging.BaggageWrappers",
        "ProcessName": "Read",
        "TaskID": "A3F57DC53ED990DE",
        "ParentEventID": [
          "0D681B9E005A3AA1",
          "0CC8FEBD8A93B681"
        ],
        "Label": "Merged current baggage with other baggage",
        "Title": "X-Trace Task",
        "Host": "pinky19.mpi-sws.org",
        "HRT": 26962499253589323,
        "Operation": "join",
        "Timestamp": "1557746139193.894043",
        "TenantClass": 0,
        "Source": "PacketHeader.java:168",
        "ThreadID": 1,
        "ThreadName": "",
        "EventID": "4B1FCAF04B5CD936",
        "ProcessID": 36430
      },
      {
        "Cycles": 0,
        "Agent": "edu.brown.cs.systems.xtrace.logging.BaggageWrappers",
        "ProcessName": "Read",
        "TaskID": "A3F57DC53ED990DE",
        "ParentEventID": [
          "4B1FCAF04B5CD936"
        ],
        "Label": "Forking current baggage with Baggage.fork()",
        "Title": "X-Trace Task",
        "Host": "pinky19.mpi-sws.org",
        "HRT": 26962499253604733,
        "Operation": "fork",
        "Timestamp": "1557746139193.909424",
        "TenantClass": 0,
        "Source": "RemoteBlockReader2.java:361",
        "ThreadID": 1,
        "ThreadName": "",
        "EventID": "EC36898964AB3AFD",
        "ProcessID": 36430
      },
      {
        "Cycles": 0,
        "Agent": "Execution-Sleep",
        "ProcessName": "Data",
        "TaskID": "A3F57DC53ED990DE",
        "ParentEventID": [
          "0D681B9E005A3AA1"
        ],
        "Label": "waited",
        "Title": "X-Trace Task",
        "Host": "pinky24.mpi-sws.org",
        "Duration": "274111",
        "HRT": 6573751977977370,
        "Operation": "waited",
        "Timestamp": "1557746139194.035400",
        "TenantClass": 0,
        "Source": "SocketIOWithTimeout.java:335",
        "ThreadID": 14307,
        "ThreadName": "",
        "EventID": "2DC96EADA50711CA",
        "BaggageBytes": "[[248 5] [240 0] [0 163 245 125 197 62 217 144 222] [240 1] [0 13 104 27 158 0 90 58 161] [240 3] [0 2]]",
        "ProcessID": 28692
      },
      {
        "Cycles": 0,
        "Agent": "edu.brown.cs.systems.xtrace.logging.BaggageWrappers",
        "ProcessName": "Data",
        "TaskID": "A3F57DC53ED990DE",
        "ParentEventID": [
          "2DC96EADA50711CA",
          "EC36898964AB3AFD"
        ],
        "Label": "Merged current baggage with other baggage",
        "Title": "X-Trace Task",
        "Host": "pinky24.mpi-sws.org",
        "HRT": 6573751978029242,
        "Operation": "join",
        "Timestamp": "1557746139194.087402",
        "TenantClass": 0,
        "Source": "DataXceiver.java:574",
        "ThreadID": 14307,
        "ThreadName": "",
        "EventID": "5F7FA729EC05A19B",
        "BaggageBytes": "[[248 5] [240 0] [0 163 245 125 197 62 217 144 222] [240 1] [0 236 54 137 137 100 171 58 253] [0 45 201 110 173 165 7 17 202] [240 3] [0 2]]",
        "ProcessID": 28692
      },
      {
        "Cycles": 0,
        "Agent": "Execution-CPU",
        "ProcessName": "Data",
        "TaskID": "A3F57DC53ED990DE",
        "ParentEventID": [
          "5F7FA729EC05A19B"
        ],
        "Label": "unset",
        "Title": "X-Trace Task",
        "Host": "pinky24.mpi-sws.org",
        "Duration": "13116758",
        "HRT": 6573751978045375,
        "Operation": "unset",
        "Timestamp": "1557746139194.103516",
        "TenantClass": 0,
        "Source": "DataXceiver.java:261",
        "ThreadID": 14307,
        "ThreadName": "",
        "EventID": "5C6D3CDBDB9C7F94",
        "BaggageBytes": "[[248 5] [240 0] [0 163 245 125 197 62 217 144 222] [240 1] [0 95 127 167 41 236 5 161 155] [240 3] [0 2]]",
        "ProcessID": 28692
      }
    ]
  }
]