[
  {
    "id": "A979BAC88077E081",
    "reports": [
      {
        "Cycles": 0,
        "Agent": "edu.brown.cs.systems.retro.benchmarks.hdfs_client.Reader",
        "ProcessName": "Read",
        "TaskID": "A979BAC88077E081",
        "ParentEventID": [
          "5FD40AAF6253DE68"
        ],
        "Label": "Reading file",
        "Title": "X-Trace Task",
        "Host": "pinky19.mpi-sws.org",
        "HRT": 26962613768696252,
        "Timestamp": "1557746253708.877197",
        "TenantClass": 0,
        "ThreadID": 1,
        "ThreadName": "",
        "EventID": "6AED28868FEC2F2B",
        "ProcessID": 36430
      },
      {
        "Cycles": 0,
        "Agent": "org.apache.hadoop.ipc.ProtobufRpcEngine",
        "ProcessName": "Read",
        "TaskID": "A979BAC88077E081",
        "ParentEventID": [
          "6AED28868FEC2F2B"
        ],
        "Label": "Invoking org.apache.hadoop.hdfs.protocol.ClientProtocol.getBlockLocations",
        "Title": "X-Trace Task",
        "Host": "pinky19.mpi-sws.org",
        "HRT": 26962613768722665,
        "Timestamp": "1557746253708.903564",
        "TenantClass": 0,
        "Source": "ProtobufRpcEngine.java:228",
        "ThreadID": 1,
        "ThreadName": "",
        "EventID": "2F1C8B6F84C3150B",
        "ProcessID": 36430
      },
      {
        "Cycles": 0,
        "Agent": "Execution-CPU",
        "ProcessName": "Read",
        "TaskID": "A979BAC88077E081",
        "ParentEventID": [
          "2F1C8B6F84C3150B"
        ],
        "Label": "unset",
        "Title": "X-Trace Task",
        "Host": "pinky19.mpi-sws.org",
        "Duration": "21199636",
        "HRT": 26962613768738337,
        "Operation": "unset",
        "Timestamp": "1557746253708.919189",
        "TenantClass": 0,
        "Source": "Client.java:1027",
        "ThreadID": 1,
        "ThreadName": "",
        "EventID": "73FB77BF2FBABB82",
        "ProcessID": 36430
      },
      {
        "Cycles": 0,
        "Agent": "Execution-CPU",
        "ProcessName": "Read",
        "TaskID": "A979BAC88077E081",
        "ParentEventID": [
          "73FB77BF2FBABB82"
        ],
        "Label": "set",
        "Title": "X-Trace Task",
        "Host": "pinky19.mpi-sws.org",
        "HRT": 26962613768779516,
        "Operation": "set",
        "Timestamp": "1557746253708.960449",
        "TenantClass": 0,
        "Source": "Client.java:1032",
        "ThreadID": 41,
        "ThreadName": "",
        "EventID": "8E680578B3E5B1E4",
        "ProcessID": 36430
      },
      {
        "Cycles": 0,
        "Agent": "edu.brown.cs.systems.xtrace.logging.BaggageWrappers",
        "ProcessName": "Read",
        "TaskID": "A979BAC88077E081",
        "ParentEventID": [
          "8E680578B3E5B1E4"
        ],
        "Label": "Forking current baggage with Baggage.fork()",
        "Title": "X-Trace Task",
        "Host": "pinky19.mpi-sws.org",
        "HRT": 26962613768799572,
        "Operation": "fork",
        "Timestamp": "1557746253708.980469",
        "TenantClass": 0,
        "Source": "Client.java:1043",
        "ThreadID": 41,
        "ThreadName": "",
        "EventID": "806F599626CF68A9",
        "ProcessID": 36430
      },
      {
        "Cycles": 0,
        "Agent": "Execution-CPU",
        "ProcessName": "Read",
        "TaskID": "A979BAC88077E081",
        "ParentEventID": [
          "D0E80AAD6B78B35B"
        ],
        "Label": "set",
        "Title": "X-Trace Task",
        "Host": "pinky19.mpi-sws.org",
        "HRT": 26962613768898663,
        "Operation": "set",
        "Timestamp": "1557746253709.079590",
        "TenantClass": 0,
        "Source": "Client.java:1104",
        "ThreadID": 1,
        "ThreadName": "",
        "EventID": "42DFF0BE28B8273F",
        "ProcessID": 36430
      },
      {
        "Cycles": 0,
        "Agent": "Execution-CPU",
        "ProcessName": "Name",
        "TaskID": "A979BAC88077E081",
        "ParentEventID": [
          "806F599626CF68A9"
        ],
        "Label": "set",
        "Title": "X-Trace Task",
        "Host": "pinky19.mpi-sws.org",
        "HRT": 26962613768923319,
        "Operation": "set",
        "Timestamp": "1557746253709.133057",
        "TenantClass": 0,
        "Source": "Server.java:1840",
        "ThreadID": 48,
        "ThreadName": "",
        "EventID": "36CF6BB899CA2349",
        "BaggageBytes": "[[248 5] [240 0] [0 169 121 186 200 128 119 224 129] [240 1] [0 128 111 89 150 38 207 104 169] [240 3] [0 2]]",
        "ProcessID": 2171
      },
      {
        "Cycles": 0,
        "Agent": "edu.brown.cs.systems.xtrace.logging.BaggageWrappers",
        "ProcessName": "Name",
        "TaskID": "A979BAC88077E081",
        "ParentEventID": [
          "36CF6BB899CA2349"
        ],
        "Label": "Forking current baggage with Baggage.fork()",
        "Title": "X-Trace Task",
        "Host": "pinky19.mpi-sws.org",
        "HRT": 26962613768954234,
        "Operation": "fork",
        "Timestamp": "1557746253709.164062",
        "TenantClass": 0,
        "Source": "Server.java:550",
        "ThreadID": 48,
        "ThreadName": "",
        "EventID": "F6EEAB2364C3E8A3",
        "BaggageBytes": "[[248 5] [240 0] [0 169 121 186 200 128 119 224 129] [240 1] [0 54 207 107 184 153 202 35 73] [240 3] [0 2]]",
        "ProcessID": 2171
      },
      {
        "Cycles": 0,
        "Agent": "Execution-CPU",
        "ProcessName": "Name",
        "TaskID": "A979BAC88077E081",
        "ParentEventID": [
          "F6EEAB2364C3E8A3"
        ],
        "Label": "unset",
        "Title": "X-Trace Task",
        "Host": "pinky19.mpi-sws.org",
        "Duration": "25622",
        "HRT": 26962613768976040,
        "Operation": "unset",
        "Timestamp": "1557746253709.185791",
        "TenantClass": 0,
        "Source": "Server.java:1828",
        "ThreadID": 48,
        "ThreadName": "",
        "EventID": "92F0FE89D3045E46",
        "BaggageBytes": "[[248 5] [240 0] [0 169 121 186 200 128 119 224 129] [240 1] [0 246 238 171 35 100 195 232 163] [240 3] [0 2]]",
        "ProcessID": 2171
      },
      {
        "Cycles": 0,
        "Agent": "Execution-CPU",
        "ProcessName": "Read",
        "TaskID": "A979BAC88077E081",
        "ParentEventID": [
          "806F599626CF68A9"
        ],
        "Label": "unset",
        "Title": "X-Trace Task",
        "Host": "pinky19.mpi-sws.org",
        "Duration": "74490",
        "HRT": 26962613768874233,
        "Operation": "unset",
        "Timestamp": "1557746253709.055176",
        "TenantClass": 0,
        "Source": "Client.java:1062",
        "ThreadID": 41,
        "ThreadName": "",
        "EventID": "D0E80AAD6B78B35B",
        "ProcessID": 36430
      },
      {
        "Cycles": 0,
        "Agent": "Execution-CPU",
        "ProcessName": "Name",
        "TaskID": "A979BAC88077E081",
        "ParentEventID": [
          "F6EEAB2364C3E8A3"
        ],
        "Label": "set",
        "Title": "X-Trace Task",
        "Host": "pinky19.mpi-sws.org",
        "HRT": 26962613768984596,
        "Operation": "set",
        "Timestamp": "1557746253709.194336",
        "TenantClass": 0,
        "Source": "Server.java:2071",
        "ThreadID": 55,
        "ThreadName": "",
        "EventID": "C8127D03E8174B38",
        "BaggageBytes": "[[248 5] [240 0] [0 169 121 186 200 128 119 224 129] [240 1] [0 246 238 171 35 100 195 232 163] [240 3] [0 2]]",
        "ProcessID": 2171
      },
      {
        "Cycles": 0,
        "Agent": "org.apache.hadoop.hdfs.server.namenode.FSNamesystem.audit",
        "ProcessName": "Name",
        "TaskID": "A979BAC88077E081",
        "ParentEventID": [
          "FAE471DB15D1DC32"
        ],
        "Label": "allowed=true\tugi=plascas (auth:SIMPLE)\tip=/139.19.171.63\tcmd=open\tsrc=/ds/lmHHlWAm6GC9Z0QA\tdst=null\tperm=null\tproto=rpc",
        "Title": "X-Trace Task",
        "Host": "pinky19.mpi-sws.org",
        "HRT": 26962613769064967,
        "Timestamp": "1557746253709.274658",
        "TenantClass": 0,
        "Source": "FSNamesystem.java:8313",
        "ThreadID": 55,
        "ThreadName": "",
        "EventID": "6955FFCD51A035FB",
        "BaggageBytes": "[[248 5] [240 0] [0 169 121 186 200 128 119 224 129] [240 1] [0 250 228 113 219 21 209 220 50] [240 3] [0 2]]",
        "ProcessID": 2171
      },
      {
        "Cycles": 0,
        "Agent": "edu.brown.cs.systems.xtrace.logging.BaggageWrappers",
        "ProcessName": "Name",
        "TaskID": "A979BAC88077E081",
        "ParentEventID": [
          "6955FFCD51A035FB"
        ],
        "Label": "Forking current baggage with Baggage.fork()",
        "Title": "X-Trace Task",
        "Host": "pinky19.mpi-sws.org",
        "HRT": 26962613769106528,
        "Operation": "fork",
        "Timestamp": "1557746253709.316406",
        "TenantClass": 0,
        "Source": "Server.java:2398",
        "ThreadID": 55,
        "ThreadName": "",
        "EventID": "353BD0DED97A7428",
        "BaggageBytes": "[[248 5] [240 0] [0 169 121 186 200 128 119 224 129] [240 1] [0 105 85 255 205 81 160 53 251] [240 3] [0 2]]",
        "ProcessID": 2171
      },
      {
        "Cycles": 0,
        "Agent": "org.apache.hadoop.ipc.Server",
        "ProcessName": "Name",
        "TaskID": "A979BAC88077E081",
        "ParentEventID": [
          "C8127D03E8174B38"
        ],
        "Label": "getBlockLocations in org.apache.hadoop.hdfs.protocol.ClientProtocol",
        "Title": "X-Trace Task",
        "Host": "pinky19.mpi-sws.org",
        "HRT": 26962613769017573,
        "Timestamp": "1557746253709.227295",
        "TenantClass": 0,
        "Source": "ProtobufRpcEngine.java:601",
        "ThreadID": 55,
        "ThreadName": "",
        "EventID": "FAE471DB15D1DC32",
        "BaggageBytes": "[[248 5] [240 0] [0 169 121 186 200 128 119 224 129] [240 1] [0 200 18 125 3 232 23 75 56] [240 3] [0 2]]",
        "ProcessID": 2171
      },
      {
        "Cycles": 0,
        "Agent": "Execution-CPU",
        "ProcessName": "Name",
        "TaskID": "A979BAC88077E081",
        "ParentEventID": [
          "353BD0DED97A7428"
        ],
        "Label": "unset",
        "Title": "X-Trace Task",
        "Host": "pinky19.mpi-sws.org",
        "Duration": "203820",
        "HRT": 26962613769210579,
        "Operation": "unset",
        "Timestamp": "1557746253709.420410",
        "TenantClass": 0,
        "Source": "Server.java:1058",
        "ThreadID": 55,
        "ThreadName": "",
        "EventID": "38D1445BF2A068B2",
        "BaggageBytes": "[[248 5] [240 0] [0 169 121 186 200 128 119 224 129] [240 1] [0 53 59 208 222 217 122 116 40] [240 3] [0 2]]",
        "ProcessID": 2171
      },
      {
        "Cycles": 0,
        "Agent": "Execution-CPU",
        "ProcessName": "Read",
        "TaskID": "A979BAC88077E081",
        "ParentEventID": [
          "CED0592D5E8F8F22"
        ],
        "Label": "unset",
        "Title": "X-Trace Task",
        "Host": "pinky19.mpi-sws.org",
        "Duration": "5502",
        "HRT": 26962613769309411,
        "Operation": "unset",
        "Timestamp": "1557746253709.490234",
        "TenantClass": 0,
        "Source": "Client.java:1168",
        "ThreadID": 37,
        "ThreadName": "",
        "EventID": "8AFB132E843AA707",
        "ProcessID": 36430
      },
      {
        "Cycles": 0,
        "Agent": "Execution-CPU",
        "ProcessName": "Read",
        "TaskID": "A979BAC88077E081",
        "ParentEventID": [
          "353BD0DED97A7428"
        ],
        "Label": "set",
        "Title": "X-Trace Task",
        "Host": "pinky19.mpi-sws.org",
        "HRT": 26962613769287810,
        "Operation": "set",
        "Timestamp": "1557746253709.468750",
        "TenantClass": 0,
        "Source": "Client.java:302",
        "ThreadID": 37,
        "ThreadName": "",
        "EventID": "CED0592D5E8F8F22",
        "ProcessID": 36430
      },
      {
        "Cycles": 0,
        "Agent": "Execution-Sleep",
        "ProcessName": "Read",
        "TaskID": "A979BAC88077E081",
        "ParentEventID": [
          "42DFF0BE28B8273F"
        ],
        "Label": "waited",
        "Title": "X-Trace Task",
        "Host": "pinky19.mpi-sws.org",
        "Duration": "419549",
        "HRT": 26962613769326210,
        "Operation": "waited",
        "Timestamp": "1557746253709.507080",
        "TenantClass": 0,
        "Source": "Client.java:1537",
        "ThreadID": 1,
        "ThreadName": "",
        "EventID": "B3DCD632D96A7677",
        "ProcessID": 36430
      },
      {
        "Cycles": 0,
        "Agent": "edu.brown.cs.systems.xtrace.logging.BaggageWrappers",
        "ProcessName": "Read",
        "TaskID": "A979BAC88077E081",
        "ParentEventID": [
          "8AFB132E843AA707",
          "B3DCD632D96A7677"
        ],
        "Label": "Merged current baggage with other baggage",
        "Title": "X-Trace Task",
        "Host": "pinky19.mpi-sws.org",
        "HRT": 26962613769337101,
        "Operation": "join",
        "Timestamp": "1557746253709.518066",
        "TenantClass": 0,
        "Source": "Client.java:1545",
        "ThreadID": 1,
        "ThreadName": "",
        "EventID": "55C573160C60FECA",
        "ProcessID": 36430
      },
      {
        "Cycles": 0,
        "Agent": "org.apache.hadoop.ipc.ProtobufRpcEngine",
        "ProcessName": "Read",
        "TaskID": "A979BAC88077E081",
        "ParentEventID": [
          "55C573160C60FECA"
        ],
        "Label": "org.apache.hadoop.hdfs.protocol.ClientProtocol.getBlockLocations completed",
        "Title": "X-Trace Task",
        "Host": "pinky19.mpi-sws.org",
        "HRT": 26962613769374936,
        "Timestamp": "1557746253709.555908",
        "TenantClass": 0,
        "Source": "ProtobufRpcEngine.java:275",
        "ThreadID": 1,
        "ThreadName": "",
        "EventID": "16BBE21F1BB61AA6",
        "ProcessID": 36430
      },
      {
        "Cycles": 0,
        "Agent": "edu.brown.cs.systems.xtrace.logging.BaggageWrappers",
        "ProcessName": "Read",
        "TaskID": "A979BAC88077E081",
        "ParentEventID": [
          "16BBE21F1BB61AA6"
        ],
        "Label": "Forking current baggage with Baggage.fork()",
        "Title": "X-Trace Task",
        "Host": "pinky19.mpi-sws.org",
        "HRT": 26962613769449476,
        "Operation": "fork",
        "Timestamp": "1557746253709.630371",
        "TenantClass": 0,
        "Source": "DataTransferProtoUtil.java:94",
        "ThreadID": 1,
        "ThreadName": "",
        "EventID": "26FFE30E1BCE6E7B",
        "ProcessID": 36430
      },
      {
        "Cycles": 0,
        "Agent": "edu.brown.cs.systems.xtrace.logging.XTraceInit",
        "ProcessName": "Data",
        "TaskID": "A979BAC88077E081",
        "ParentEventID": [
          "23A09729D4727FA7"
        ],
        "Label": "Thread.setName: DataXceiver for client DFSClient_NONMAPREDUCE_778905418_1 at /139.19.171.63:35320 [Sending block BP-1633380353-139.19.171.63-1554193446451:blk_1073763643_22819]",
        "Title": "X-Trace Task",
        "Host": "pinky21.mpi-sws.org",
        "HRT": 10808923476152525,
        "Timestamp": "1557746253710.055908",
        "TenantClass": 0,
        "Source": "DataXceiver.java:168",
        "ThreadID": 14875,
        "ThreadName": "",
        "EventID": "4517D4310A38D1B6",
        "BaggageBytes": "[[248 5] [240 0] [0 169 121 186 200 128 119 224 129] [240 1] [0 35 160 151 41 212 114 127 167] [240 3] [0 2]]",
        "ProcessID": 20775
      },
      {
        "Cycles": 0,
        "Agent": "edu.brown.cs.systems.xtrace.logging.BaggageWrappers",
        "ProcessName": "Data",
        "TaskID": "A979BAC88077E081",
        "ParentEventID": [
          "4517D4310A38D1B6"
        ],
        "Label": "Forking current baggage with Baggage.fork()",
        "Title": "X-Trace Task",
        "Host": "pinky21.mpi-sws.org",
        "HRT": 10808923476391516,
        "Operation": "fork",
        "Timestamp": "1557746253710.294922",
        "TenantClass": 0,
        "Source": "DataXceiver.java:1257",
        "ThreadID": 14875,
        "ThreadName": "",
        "EventID": "96FBA7EE8433F434",
        "BaggageBytes": "[[248 5] [240 0] [0 169 121 186 200 128 119 224 129] [240 1] [0 69 23 212 49 10 56 209 182] [240 3] [0 2]]",
        "ProcessID": 20775
      },
      {
        "Cycles": 0,
        "Agent": "Execution-CPU",
        "ProcessName": "Data",
        "TaskID": "A979BAC88077E081",
        "ParentEventID": [
          "26FFE30E1BCE6E7B"
        ],
        "Label": "set",
        "Title": "X-Trace Task",
        "Host": "pinky21.mpi-sws.org",
        "HRT": 10808923476048711,
        "Operation": "set",
        "Timestamp": "1557746253709.952148",
        "TenantClass": 0,
        "Source": "Receiver.java:117",
        "ThreadID": 14875,
        "ThreadName": "",
        "EventID": "23A09729D4727FA7",
        "BaggageBytes": "[[248 5] [240 0] [0 169 121 186 200 128 119 224 129] [240 1] [0 38 255 227 14 27 206 110 123] [240 3] [0 2]]",
        "ProcessID": 20775
      },
      {
        "Cycles": 0,
        "Agent": "Execution-Sleep",
        "ProcessName": "Read",
        "TaskID": "A979BAC88077E081",
        "ParentEventID": [
          "26FFE30E1BCE6E7B"
        ],
        "Label": "waited",
        "Title": "X-Trace Task",
        "Host": "pinky19.mpi-sws.org",
        "Duration": "718039",
        "HRT": 26962613770261917,
        "Operation": "waited",
        "Timestamp": "1557746253710.442871",
        "TenantClass": 0,
        "Source": "SocketIOWithTimeout.java:335",
        "ThreadID": 1,
        "ThreadName": "",
        "EventID": "BBC159CF2364B5D2",
        "ProcessID": 36430
      },
      {
        "Cycles": 0,
        "Agent": "edu.brown.cs.systems.xtrace.logging.BaggageWrappers",
        "ProcessName": "Data",
        "TaskID": "A979BAC88077E081",
        "ParentEventID": [
          "96FBA7EE8433F434"
        ],
        "Label": "Forking current baggage with Baggage.fork()",
        "Title": "X-Trace Task",
        "Host": "pinky21.mpi-sws.org",
        "HRT": 10808923476553593,
        "Operation": "fork",
        "Timestamp": "1557746253710.457031",
        "TenantClass": 0,
        "Source": "PacketHeader.java:95",
        "ThreadID": 14875,
        "ThreadName": "",
        "EventID": "E0EEAA7151C5505A",
        "BaggageBytes": "[[248 5] [240 0] [0 169 121 186 200 128 119 224 129] [240 1] [0 150 251 167 238 132 51 244 52] [240 3] [0 2]]",
        "ProcessID": 20775
      },
      {
        "Cycles": 0,
        "Agent": "edu.brown.cs.systems.xtrace.logging.BaggageWrappers",
        "ProcessName": "Read",
        "TaskID": "A979BAC88077E081",
        "ParentEventID": [
          "96FBA7EE8433F434",
          "BBC159CF2364B5D2"
        ],
        "Label": "Merged current baggage with other baggage",
        "Title": "X-Trace Task",
        "Host": "pinky19.mpi-sws.org",
        "HRT": 26962613770348591,
        "Operation": "join",
        "Timestamp": "1557746253710.529541",
        "TenantClass": 0,
        "Source": "RemoteBlockReader2.java:429",
        "ThreadID": 1,
        "ThreadName": "",
        "EventID": "7220298D5B9B9F9C",
        "ProcessID": 36430
      },
      {
        "Cycles": 0,
        "Agent": "Execution-Sleep",
        "ProcessName": "Read",
        "TaskID": "A979BAC88077E081",
        "ParentEventID": [
          "7220298D5B9B9F9C"
        ],
        "Label": "waited",
        "Title": "X-Trace Task",
        "Host": "pinky19.mpi-sws.org",
        "Duration": "38888",
        "HRT": 26962613770438502,
        "Operation": "waited",
        "Timestamp": "1557746253710.619385",
        "TenantClass": 0,
        "Source": "SocketIOWithTimeout.java:335",
        "ThreadID": 1,
        "ThreadName": "",
        "EventID": "36B7D9334D085BF3",
        "ProcessID": 36430
      },
      {
        "Cycles": 0,
        "Agent": "Execution-Sleep",
        "ProcessName": "Data",
        "TaskID": "A979BAC88077E081",
        "ParentEventID": [
          "E0EEAA7151C5505A"
        ],
        "Label": "waited",
        "Title": "X-Trace Task",
        "Host": "pinky21.mpi-sws.org",
        "Duration": "27393",
        "HRT": 10808923476749637,
        "Operation": "waited",
        "Timestamp": "1557746253710.653076",
        "TenantClass": 0,
        "Source": "SocketIOWithTimeout.java:335",
        "ThreadID": 14875,
        "ThreadName": "",
        "EventID": "FEE6F8679D62ACC1",
        "BaggageBytes": "[[248 5] [240 0] [0 169 121 186 200 128 119 224 129] [240 1] [0 224 238 170 113 81 197 80 90] [240 3] [0 2]]",
        "ProcessID": 20775
      },
      {
        "Cycles": 0,
        "Agent": "edu.brown.cs.systems.xtrace.logging.BaggageWrappers",
        "ProcessName": "Data",
        "TaskID": "A979BAC88077E081",
        "ParentEventID": [
          "FEE6F8679D62ACC1"
        ],
        "Label": "Forking current baggage with Baggage.fork()",
        "Title": "X-Trace Task",
        "Host": "pinky21.mpi-sws.org",
        "HRT": 10808923476943947,
        "Operation": "fork",
        "Timestamp": "1557746253710.847168",
        "TenantClass": 0,
        "Source": "PacketHeader.java:95",
        "ThreadID": 14875,
        "ThreadName": "",
        "EventID": "DCC5EDAEE0177FB2",
        "BaggageBytes": "[[248 5] [240 0] [0 169 121 186 200 128 119 224 129] [240 1] [0 254 230 248 103 157 98 172 193] [240 3] [0 2]]",
        "ProcessID": 20775
      },
      {
        "Cycles": 0,
        "Agent": "edu.brown.cs.systems.xtrace.logging.BaggageWrappers",
        "ProcessName": "Read",
        "TaskID": "A979BAC88077E081",
        "ParentEventID": [
          "2D3F17A0410C07E0",
          "E0EEAA7151C5505A"
        ],
        "Label": "Merged current baggage with other baggage",
        "Title": "X-Trace Task",
        "Host": "pinky19.mpi-sws.org",
        "HRT": 26962613770840568,
        "Operation": "join",
        "Timestamp": "1557746253711.021484",
        "TenantClass": 0,
        "Source": "PacketHeader.java:168",
        "ThreadID": 1,
        "ThreadName": "",
        "EventID": "8EEB131F4692D822",
        "ProcessID": 36430
      },
      {
        "Cycles": 0,
        "Agent": "Execution-Sleep",
        "ProcessName": "Read",
        "TaskID": "A979BAC88077E081",
        "ParentEventID": [
          "36B7D9334D085BF3"
        ],
        "Label": "waited",
        "Title": "X-Trace Task",
        "Host": "pinky19.mpi-sws.org",
        "Duration": "230769",
        "HRT": 26962613770761557,
        "Operation": "waited",
        "Timestamp": "1557746253710.942383",
        "TenantClass": 0,
        "Source": "SocketIOWithTimeout.java:335",
        "ThreadID": 1,
        "ThreadName": "",
        "EventID": "2D3F17A0410C07E0",
        "ProcessID": 36430
      },
      {
        "Cycles": 0,
        "Agent": "edu.brown.cs.systems.xtrace.logging.BaggageWrappers",
        "ProcessName": "Read",
        "TaskID": "A979BAC88077E081",
        "ParentEventID": [
          "DCC5EDAEE0177FB2",
          "8EEB131F4692D822"
        ],
        "Label": "Merged current baggage with other baggage",
        "Title": "X-Trace Task",
        "Host": "pinky19.mpi-sws.org",
        "HRT": 26962613770896543,
        "Operation": "join",
        "Timestamp": "1557746253711.077393",
        "TenantClass": 0,
        "Source": "PacketHeader.java:168",
        "ThreadID": 1,
        "ThreadName": "",
        "EventID": "8044D6D9E6645212",
        "ProcessID": 36430
      },
      {
        "Cycles": 0,
        "Agent": "Execution-Sleep",
        "ProcessName": "Data",
        "TaskID": "A979BAC88077E081",
        "ParentEventID": [
          "DCC5EDAEE0177FB2"
        ],
        "Label": "waited",
        "Title": "X-Trace Task",
        "Host": "pinky21.mpi-sws.org",
        "Duration": "103597",
        "HRT": 10808923477289695,
        "Operation": "waited",
        "Timestamp": "1557746253711.193115",
        "TenantClass": 0,
        "Source": "SocketIOWithTimeout.java:335",
        "ThreadID": 14875,
        "ThreadName": "",
        "EventID": "8A08EDF5FA828529",
        "BaggageBytes": "[[248 5] [240 0] [0 169 121 186 200 128 119 224 129] [240 1] [0 220 197 237 174 224 23 127 178] [240 3] [0 2]]",
        "ProcessID": 20775
      },
      {
        "Cycles": 0,
        "Agent": "edu.brown.cs.systems.xtrace.logging.BaggageWrappers",
        "ProcessName": "Read",
        "TaskID": "A979BAC88077E081",
        "ParentEventID": [
          "8044D6D9E6645212"
        ],
        "Label": "Forking current baggage with Baggage.fork()",
        "Title": "X-Trace Task",
        "Host": "pinky19.mpi-sws.org",
        "HRT": 26962613770908807,
        "Operation": "fork",
        "Timestamp": "1557746253711.089600",
        "TenantClass": 0,
        "Source": "RemoteBlockReader2.java:361",
        "ThreadID": 1,
        "ThreadName": "",
        "EventID": "9EDF526204DF9A14",
        "ProcessID": 36430
      },
      {
        "Cycles": 0,
        "Agent": "edu.brown.cs.systems.xtrace.logging.BaggageWrappers",
        "ProcessName": "Data",
        "TaskID": "A979BAC88077E081",
        "ParentEventID": [
          "9EDF526204DF9A14",
          "8A08EDF5FA828529"
        ],
        "Label": "Merged current baggage with other baggage",
        "Title": "X-Trace Task",
        "Host": "pinky21.mpi-sws.org",
        "HRT": 10808923477416625,
        "Operation": "join",
        "Timestamp": "1557746253711.320068",
        "TenantClass": 0,
        "Source": "DataXceiver.java:574",
        "ThreadID": 14875,
        "ThreadName": "",
        "EventID": "7C2E6C9B64D0A90C",
        "BaggageBytes": "[[248 5] [240 0] [0 169 121 186 200 128 119 224 129] [240 1] [0 138 8 237 245 250 130 133 41] [0 158 223 82 98 4 223 154 20] [240 3] [0 2]]",
        "ProcessID": 20775
      },
      {
        "Cycles": 0,
        "Agent": "Execution-CPU",
        "ProcessName": "Data",
        "TaskID": "A979BAC88077E081",
        "ParentEventID": [
          "7C2E6C9B64D0A90C"
        ],
        "Label": "unset",
        "Title": "X-Trace Task",
        "Host": "pinky21.mpi-sws.org",
        "Duration": "1364807",
        "HRT": 10808923477487169,
        "Operation": "unset",
        "Timestamp": "1557746253711.390381",
        "TenantClass": 0,
        "Source": "DataXceiver.java:261",
        "ThreadID": 14875,
        "ThreadName": "",
        "EventID": "58609FFB1549102B",
        "BaggageBytes": "[[248 5] [240 0] [0 169 121 186 200 128 119 224 129] [240 1] [0 124 46 108 155 100 208 169 12] [240 3] [0 2]]",
        "ProcessID": 20775
      },
      {
        "Cycles": 0,
        "Agent": "edu.brown.cs.systems.retro.benchmarks.hdfs_client.Reader",
        "ProcessName": "Read",
        "TaskID": "A979BAC88077E081",
        "ParentEventID": [
          "0"
        ],
        "Label": "Reading file",
        "Title": "X-Trace Task",
        "Host": "pinky19.mpi-sws.org",
        "HRT": 26962613768680507,
        "Timestamp": "1557746253708.861328",
        "TenantClass": 0,
        "ThreadID": 1,
        "ThreadName": "",
        "EventID": "5FD40AAF6253DE68",
        "ProcessID": 36430,
        "Tag": [
          "reader_10kb",
          "Read Size: 10240"
        ]
      }
    ]
  }
]