[
  {
    "id": "3E594DAB35795C28",
    "reports": [
      {
        "Cycles": 0,
        "Agent": "Execution-CPU",
        "ProcessName": "Read",
        "TaskID": "3E594DAB35795C28",
        "ParentEventID": [
          "428BFCF272AFD365"
        ],
        "Label": "unset",
        "Title": "X-Trace Task",
        "Host": "pinky19.mpi-sws.org",
        "Duration": "22374808",
        "HRT": 25491847388559290,
        "Operation": "unset",
        "Timestamp": "1556275487328.962402",
        "TenantClass": 0,
        "Source": "Client.java:1027",
        "ThreadID": 1,
        "ThreadName": "",
        "EventID": "97C256B685164A27",
        "ProcessID": 21035
      },
      {
        "Cycles": 0,
        "Agent": "edu.brown.cs.systems.retro.benchmarks.hdfs_client.Reader",
        "ProcessName": "Read",
        "TaskID": "3E594DAB35795C28",
        "ParentEventID": [
          "7F4713176AC7AC12"
        ],
        "Label": "Reading file",
        "Title": "X-Trace Task",
        "Host": "pinky19.mpi-sws.org",
        "HRT": 25491847388496615,
        "Timestamp": "1556275487328.899902",
        "TenantClass": 0,
        "ThreadID": 1,
        "ThreadName": "",
        "EventID": "A650DCDEC2B29403",
        "ProcessID": 21035
      },
      {
        "Cycles": 0,
        "Agent": "org.apache.hadoop.ipc.ProtobufRpcEngine",
        "ProcessName": "Read",
        "TaskID": "3E594DAB35795C28",
        "ParentEventID": [
          "A650DCDEC2B29403"
        ],
        "Label": "Invoking org.apache.hadoop.hdfs.protocol.ClientProtocol.getBlockLocations",
        "Title": "X-Trace Task",
        "Host": "pinky19.mpi-sws.org",
        "HRT": 25491847388529382,
        "Timestamp": "1556275487328.932617",
        "TenantClass": 0,
        "Source": "ProtobufRpcEngine.java:228",
        "ThreadID": 1,
        "ThreadName": "",
        "EventID": "428BFCF272AFD365",
        "ProcessID": 21035
      },
      {
        "Cycles": 0,
        "Agent": "Execution-CPU",
        "ProcessName": "Read",
        "TaskID": "3E594DAB35795C28",
        "ParentEventID": [
          "97C256B685164A27"
        ],
        "Label": "set",
        "Title": "X-Trace Task",
        "Host": "pinky19.mpi-sws.org",
        "HRT": 25491847388610771,
        "Operation": "set",
        "Timestamp": "1556275487329.013916",
        "TenantClass": 0,
        "Source": "Client.java:1032",
        "ThreadID": 41,
        "ThreadName": "",
        "EventID": "0C95AFC93EB3D0A9",
        "ProcessID": 21035
      },
      {
        "Cycles": 0,
        "Agent": "Execution-CPU",
        "ProcessName": "Read",
        "TaskID": "3E594DAB35795C28",
        "ParentEventID": [
          "197EF77EBFDE2013"
        ],
        "Label": "unset",
        "Title": "X-Trace Task",
        "Host": "pinky19.mpi-sws.org",
        "Duration": "72715",
        "HRT": 25491847388701595,
        "Operation": "unset",
        "Timestamp": "1556275487329.104736",
        "TenantClass": 0,
        "Source": "Client.java:1062",
        "ThreadID": 41,
        "ThreadName": "",
        "EventID": "CF0A478603816615",
        "ProcessID": 21035
      },
      {
        "Cycles": 0,
        "Agent": "Execution-CPU",
        "ProcessName": "Read",
        "TaskID": "3E594DAB35795C28",
        "ParentEventID": [
          "CF0A478603816615"
        ],
        "Label": "set",
        "Title": "X-Trace Task",
        "Host": "pinky19.mpi-sws.org",
        "HRT": 25491847388722861,
        "Operation": "set",
        "Timestamp": "1556275487329.125977",
        "TenantClass": 0,
        "Source": "Client.java:1104",
        "ThreadID": 1,
        "ThreadName": "",
        "EventID": "D794CFD840CC6A5C",
        "ProcessID": 21035
      },
      {
        "Cycles": 0,
        "Agent": "Execution-CPU",
        "ProcessName": "Name",
        "TaskID": "3E594DAB35795C28",
        "ParentEventID": [
          "197EF77EBFDE2013"
        ],
        "Label": "set",
        "Title": "X-Trace Task",
        "Host": "pinky19.mpi-sws.org",
        "HRT": 25491847388749033,
        "Operation": "set",
        "Timestamp": "1556275487329.183105",
        "TenantClass": 0,
        "Source": "Server.java:1840",
        "ThreadID": 48,
        "ThreadName": "",
        "EventID": "AAFAEC8BC764E466",
        "BaggageBytes": "[[248 5] [240 0] [0 62 89 77 171 53 121 92 40] [240 1] [0 25 126 247 126 191 222 32 19] [240 3] [0 2]]",
        "ProcessID": 2171
      },
      {
        "Cycles": 0,
        "Agent": "edu.brown.cs.systems.xtrace.logging.BaggageWrappers",
        "ProcessName": "Name",
        "TaskID": "3E594DAB35795C28",
        "ParentEventID": [
          "AAFAEC8BC764E466"
        ],
        "Label": "Forking current baggage with Baggage.fork()",
        "Title": "X-Trace Task",
        "Host": "pinky19.mpi-sws.org",
        "HRT": 25491847388776509,
        "Operation": "fork",
        "Timestamp": "1556275487329.210449",
        "TenantClass": 0,
        "Source": "Server.java:550",
        "ThreadID": 48,
        "ThreadName": "",
        "EventID": "FD7277372E27366A",
        "BaggageBytes": "[[248 5] [240 0] [0 62 89 77 171 53 121 92 40] [240 1] [0 170 250 236 139 199 100 228 102] [240 3] [0 2]]",
        "ProcessID": 2171
      },
      {
        "Cycles": 0,
        "Agent": "edu.brown.cs.systems.xtrace.logging.BaggageWrappers",
        "ProcessName": "Read",
        "TaskID": "3E594DAB35795C28",
        "ParentEventID": [
          "0C95AFC93EB3D0A9"
        ],
        "Label": "Forking current baggage with Baggage.fork()",
        "Title": "X-Trace Task",
        "Host": "pinky19.mpi-sws.org",
        "HRT": 25491847388629670,
        "Operation": "fork",
        "Timestamp": "1556275487329.032959",
        "TenantClass": 0,
        "Source": "Client.java:1043",
        "ThreadID": 41,
        "ThreadName": "",
        "EventID": "197EF77EBFDE2013",
        "ProcessID": 21035
      },
      {
        "Cycles": 0,
        "Agent": "Execution-CPU",
        "ProcessName": "Name",
        "TaskID": "3E594DAB35795C28",
        "ParentEventID": [
          "FD7277372E27366A"
        ],
        "Label": "unset",
        "Title": "X-Trace Task",
        "Host": "pinky19.mpi-sws.org",
        "Duration": "25854",
        "HRT": 25491847388797522,
        "Operation": "unset",
        "Timestamp": "1556275487329.231445",
        "TenantClass": 0,
        "Source": "Server.java:1828",
        "ThreadID": 48,
        "ThreadName": "",
        "EventID": "925E99532B9131F8",
        "BaggageBytes": "[[248 5] [240 0] [0 62 89 77 171 53 121 92 40] [240 1] [0 253 114 119 55 46 39 54 106] [240 3] [0 2]]",
        "ProcessID": 2171
      },
      {
        "Cycles": 0,
        "Agent": "org.apache.hadoop.ipc.Server",
        "ProcessName": "Name",
        "TaskID": "3E594DAB35795C28",
        "ParentEventID": [
          "7FC8AA7D52C24C00"
        ],
        "Label": "getBlockLocations in org.apache.hadoop.hdfs.protocol.ClientProtocol",
        "Title": "X-Trace Task",
        "Host": "pinky19.mpi-sws.org",
        "HRT": 25491847388850074,
        "Timestamp": "1556275487329.284180",
        "TenantClass": 0,
        "Source": "ProtobufRpcEngine.java:601",
        "ThreadID": 55,
        "ThreadName": "",
        "EventID": "8A25BF65CEF0201E",
        "BaggageBytes": "[[248 5] [240 0] [0 62 89 77 171 53 121 92 40] [240 1] [0 127 200 170 125 82 194 76 0] [240 3] [0 2]]",
        "ProcessID": 2171
      },
      {
        "Cycles": 0,
        "Agent": "org.apache.hadoop.hdfs.server.namenode.FSNamesystem.audit",
        "ProcessName": "Name",
        "TaskID": "3E594DAB35795C28",
        "ParentEventID": [
          "8A25BF65CEF0201E"
        ],
        "Label": "allowed=true\tugi=plascas (auth:SIMPLE)\tip=/139.19.171.63\tcmd=open\tsrc=/ds/ohOqDeQF7ROEFibp\tdst=null\tperm=null\tproto=rpc",
        "Title": "X-Trace Task",
        "Host": "pinky19.mpi-sws.org",
        "HRT": 25491847388911523,
        "Timestamp": "1556275487329.345459",
        "TenantClass": 0,
        "Source": "FSNamesystem.java:8313",
        "ThreadID": 55,
        "ThreadName": "",
        "EventID": "19F7AAB17AA4398B",
        "BaggageBytes": "[[248 5] [240 0] [0 62 89 77 171 53 121 92 40] [240 1] [0 138 37 191 101 206 240 32 30] [240 3] [0 2]]",
        "ProcessID": 2171
      },
      {
        "Cycles": 0,
        "Agent": "edu.brown.cs.systems.xtrace.logging.BaggageWrappers",
        "ProcessName": "Name",
        "TaskID": "3E594DAB35795C28",
        "ParentEventID": [
          "19F7AAB17AA4398B"
        ],
        "Label": "Forking current baggage with Baggage.fork()",
        "Title": "X-Trace Task",
        "Host": "pinky19.mpi-sws.org",
        "HRT": 25491847388962976,
        "Operation": "fork",
        "Timestamp": "1556275487329.396973",
        "TenantClass": 0,
        "Source": "Server.java:2398",
        "ThreadID": 55,
        "ThreadName": "",
        "EventID": "D53B14E7F11927BD",
        "BaggageBytes": "[[248 5] [240 0] [0 62 89 77 171 53 121 92 40] [240 1] [0 25 247 170 177 122 164 57 139] [240 3] [0 2]]",
        "ProcessID": 2171
      },
      {
        "Cycles": 0,
        "Agent": "Execution-CPU",
        "ProcessName": "Name",
        "TaskID": "3E594DAB35795C28",
        "ParentEventID": [
          "FD7277372E27366A"
        ],
        "Label": "set",
        "Title": "X-Trace Task",
        "Host": "pinky19.mpi-sws.org",
        "HRT": 25491847388805903,
        "Operation": "set",
        "Timestamp": "1556275487329.239990",
        "TenantClass": 0,
        "Source": "Server.java:2071",
        "ThreadID": 55,
        "ThreadName": "",
        "EventID": "7FC8AA7D52C24C00",
        "BaggageBytes": "[[248 5] [240 0] [0 62 89 77 171 53 121 92 40] [240 1] [0 253 114 119 55 46 39 54 106] [240 3] [0 2]]",
        "ProcessID": 2171
      },
      {
        "Cycles": 0,
        "Agent": "Execution-CPU",
        "ProcessName": "Name",
        "TaskID": "3E594DAB35795C28",
        "ParentEventID": [
          "D53B14E7F11927BD"
        ],
        "Label": "unset",
        "Title": "X-Trace Task",
        "Host": "pinky19.mpi-sws.org",
        "Duration": "259245",
        "HRT": 25491847389092318,
        "Operation": "unset",
        "Timestamp": "1556275487329.526367",
        "TenantClass": 0,
        "Source": "Server.java:1058",
        "ThreadID": 55,
        "ThreadName": "",
        "EventID": "A83B07BBD1420BAF",
        "BaggageBytes": "[[248 5] [240 0] [0 62 89 77 171 53 121 92 40] [240 1] [0 213 59 20 231 241 25 39 189] [240 3] [0 2]]",
        "ProcessID": 2171
      },
      {
        "Cycles": 0,
        "Agent": "Execution-CPU",
        "ProcessName": "Read",
        "TaskID": "3E594DAB35795C28",
        "ParentEventID": [
          "4FE66AC4CF0E8946"
        ],
        "Label": "unset",
        "Title": "X-Trace Task",
        "Host": "pinky19.mpi-sws.org",
        "Duration": "9245",
        "HRT": 25491847389166249,
        "Operation": "unset",
        "Timestamp": "1556275487329.569580",
        "TenantClass": 0,
        "Source": "Client.java:1168",
        "ThreadID": 37,
        "ThreadName": "",
        "EventID": "4ED3C9FF3D3A869C",
        "ProcessID": 21035
      },
      {
        "Cycles": 0,
        "Agent": "Execution-CPU",
        "ProcessName": "Read",
        "TaskID": "3E594DAB35795C28",
        "ParentEventID": [
          "D53B14E7F11927BD"
        ],
        "Label": "set",
        "Title": "X-Trace Task",
        "Host": "pinky19.mpi-sws.org",
        "HRT": 25491847389143954,
        "Operation": "set",
        "Timestamp": "1556275487329.547119",
        "TenantClass": 0,
        "Source": "Client.java:302",
        "ThreadID": 37,
        "ThreadName": "",
        "EventID": "4FE66AC4CF0E8946",
        "ProcessID": 21035
      },
      {
        "Cycles": 0,
        "Agent": "edu.brown.cs.systems.xtrace.logging.BaggageWrappers",
        "ProcessName": "Read",
        "TaskID": "3E594DAB35795C28",
        "ParentEventID": [
          "FEC11BB78E562C53",
          "4ED3C9FF3D3A869C"
        ],
        "Label": "Merged current baggage with other baggage",
        "Title": "X-Trace Task",
        "Host": "pinky19.mpi-sws.org",
        "HRT": 25491847389195941,
        "Operation": "join",
        "Timestamp": "1556275487329.599121",
        "TenantClass": 0,
        "Source": "Client.java:1545",
        "ThreadID": 1,
        "ThreadName": "",
        "EventID": "91473F5483E21CAA",
        "ProcessID": 21035
      },
      {
        "Cycles": 0,
        "Agent": "Execution-Sleep",
        "ProcessName": "Read",
        "TaskID": "3E594DAB35795C28",
        "ParentEventID": [
          "D794CFD840CC6A5C"
        ],
        "Label": "waited",
        "Title": "X-Trace Task",
        "Host": "pinky19.mpi-sws.org",
        "Duration": "452388",
        "HRT": 25491847389184354,
        "Operation": "waited",
        "Timestamp": "1556275487329.587646",
        "TenantClass": 0,
        "Source": "Client.java:1537",
        "ThreadID": 1,
        "ThreadName": "",
        "EventID": "FEC11BB78E562C53",
        "ProcessID": 21035
      },
      {
        "Cycles": 0,
        "Agent": "org.apache.hadoop.ipc.ProtobufRpcEngine",
        "ProcessName": "Read",
        "TaskID": "3E594DAB35795C28",
        "ParentEventID": [
          "91473F5483E21CAA"
        ],
        "Label": "org.apache.hadoop.hdfs.protocol.ClientProtocol.getBlockLocations completed",
        "Title": "X-Trace Task",
        "Host": "pinky19.mpi-sws.org",
        "HRT": 25491847389232786,
        "Timestamp": "1556275487329.635986",
        "TenantClass": 0,
        "Source": "ProtobufRpcEngine.java:275",
        "ThreadID": 1,
        "ThreadName": "",
        "EventID": "2C01334B58F0041E",
        "ProcessID": 21035
      },
      {
        "Cycles": 0,
        "Agent": "Execution-CPU",
        "ProcessName": "Data",
        "TaskID": "3E594DAB35795C28",
        "ParentEventID": [
          "7F74E21ADB5CBF0B"
        ],
        "Label": "set",
        "Title": "X-Trace Task",
        "Host": "pinky19.mpi-sws.org",
        "HRT": 25491847389419445,
        "Operation": "set",
        "Timestamp": "1556275487329.822998",
        "TenantClass": 0,
        "Source": "Receiver.java:117",
        "ThreadID": 9602,
        "ThreadName": "",
        "EventID": "A4DB82B1DB6D40FF",
        "BaggageBytes": "[[248 5] [240 0] [0 62 89 77 171 53 121 92 40] [240 1] [0 127 116 226 26 219 92 191 11] [240 3] [0 2]]",
        "ProcessID": 2319
      },
      {
        "Cycles": 0,
        "Agent": "edu.brown.cs.systems.xtrace.logging.BaggageWrappers",
        "ProcessName": "Read",
        "TaskID": "3E594DAB35795C28",
        "ParentEventID": [
          "2C01334B58F0041E"
        ],
        "Label": "Forking current baggage with Baggage.fork()",
        "Title": "X-Trace Task",
        "Host": "pinky19.mpi-sws.org",
        "HRT": 25491847389293508,
        "Operation": "fork",
        "Timestamp": "1556275487329.696777",
        "TenantClass": 0,
        "Source": "DataTransferProtoUtil.java:94",
        "ThreadID": 1,
        "ThreadName": "",
        "EventID": "7F74E21ADB5CBF0B",
        "ProcessID": 21035
      },
      {
        "Cycles": 0,
        "Agent": "edu.brown.cs.systems.xtrace.logging.XTraceInit",
        "ProcessName": "Data",
        "TaskID": "3E594DAB35795C28",
        "ParentEventID": [
          "A4DB82B1DB6D40FF"
        ],
        "Label": "Thread.setName: DataXceiver for client DFSClient_NONMAPREDUCE_1377588049_1 at /139.19.171.63:36074 [Sending block BP-1633380353-139.19.171.63-1554193446451:blk_1073760083_19259]",
        "Title": "X-Trace Task",
        "Host": "pinky19.mpi-sws.org",
        "HRT": 25491847389453656,
        "Timestamp": "1556275487329.857178",
        "TenantClass": 0,
        "Source": "DataXceiver.java:168",
        "ThreadID": 9602,
        "ThreadName": "",
        "EventID": "650C455F2E5DC942",
        "BaggageBytes": "[[248 5] [240 0] [0 62 89 77 171 53 121 92 40] [240 1] [0 164 219 130 177 219 109 64 255] [240 3] [0 2]]",
        "ProcessID": 2319
      },
      {
        "Cycles": 0,
        "Agent": "Execution-Sleep",
        "ProcessName": "Read",
        "TaskID": "3E594DAB35795C28",
        "ParentEventID": [
          "7F74E21ADB5CBF0B"
        ],
        "Label": "waited",
        "Title": "X-Trace Task",
        "Host": "pinky19.mpi-sws.org",
        "Duration": "196618",
        "HRT": 25491847389591302,
        "Operation": "waited",
        "Timestamp": "1556275487329.994629",
        "TenantClass": 0,
        "Source": "SocketIOWithTimeout.java:335",
        "ThreadID": 1,
        "ThreadName": "",
        "EventID": "724CEA87EB2DDFED",
        "ProcessID": 21035
      },
      {
        "Cycles": 0,
        "Agent": "edu.brown.cs.systems.xtrace.logging.BaggageWrappers",
        "ProcessName": "Data",
        "TaskID": "3E594DAB35795C28",
        "ParentEventID": [
          "650C455F2E5DC942"
        ],
        "Label": "Forking current baggage with Baggage.fork()",
        "Title": "X-Trace Task",
        "Host": "pinky19.mpi-sws.org",
        "HRT": 25491847389530309,
        "Operation": "fork",
        "Timestamp": "1556275487329.933838",
        "TenantClass": 0,
        "Source": "DataXceiver.java:1257",
        "ThreadID": 9602,
        "ThreadName": "",
        "EventID": "52948319843F3E37",
        "BaggageBytes": "[[248 5] [240 0] [0 62 89 77 171 53 121 92 40] [240 1] [0 101 12 69 95 46 93 201 66] [240 3] [0 2]]",
        "ProcessID": 2319
      },
      {
        "Cycles": 0,
        "Agent": "edu.brown.cs.systems.xtrace.logging.BaggageWrappers",
        "ProcessName": "Data",
        "TaskID": "3E594DAB35795C28",
        "ParentEventID": [
          "52948319843F3E37"
        ],
        "Label": "Forking current baggage with Baggage.fork()",
        "Title": "X-Trace Task",
        "Host": "pinky19.mpi-sws.org",
        "HRT": 25491847389593275,
        "Operation": "fork",
        "Timestamp": "1556275487329.996826",
        "TenantClass": 0,
        "Source": "PacketHeader.java:95",
        "ThreadID": 9602,
        "ThreadName": "",
        "EventID": "BCE675611B405FEC",
        "BaggageBytes": "[[248 5] [240 0] [0 62 89 77 171 53 121 92 40] [240 1] [0 82 148 131 25 132 63 62 55] [240 3] [0 2]]",
        "ProcessID": 2319
      },
      {
        "Cycles": 0,
        "Agent": "Execution-Sleep",
        "ProcessName": "Data",
        "TaskID": "3E594DAB35795C28",
        "ParentEventID": [
          "BCE675611B405FEC"
        ],
        "Label": "waited",
        "Title": "X-Trace Task",
        "Host": "pinky19.mpi-sws.org",
        "Duration": "5142",
        "HRT": 25491847389670837,
        "Operation": "waited",
        "Timestamp": "1556275487330.074463",
        "TenantClass": 0,
        "Source": "SocketIOWithTimeout.java:335",
        "ThreadID": 9602,
        "ThreadName": "",
        "EventID": "2301FDDB6339418D",
        "BaggageBytes": "[[248 5] [240 0] [0 62 89 77 171 53 121 92 40] [240 1] [0 188 230 117 97 27 64 95 236] [240 3] [0 2]]",
        "ProcessID": 2319
      },
      {
        "Cycles": 0,
        "Agent": "edu.brown.cs.systems.xtrace.logging.BaggageWrappers",
        "ProcessName": "Read",
        "TaskID": "3E594DAB35795C28",
        "ParentEventID": [
          "724CEA87EB2DDFED",
          "52948319843F3E37"
        ],
        "Label": "Merged current baggage with other baggage",
        "Title": "X-Trace Task",
        "Host": "pinky19.mpi-sws.org",
        "HRT": 25491847389691334,
        "Operation": "join",
        "Timestamp": "1556275487330.094482",
        "TenantClass": 0,
        "Source": "RemoteBlockReader2.java:429",
        "ThreadID": 1,
        "ThreadName": "",
        "EventID": "37F9FF7C25189EA7",
        "ProcessID": 21035
      },
      {
        "Cycles": 0,
        "Agent": "edu.brown.cs.systems.xtrace.logging.BaggageWrappers",
        "ProcessName": "Read",
        "TaskID": "3E594DAB35795C28",
        "ParentEventID": [
          "BCE675611B405FEC",
          "37F9FF7C25189EA7"
        ],
        "Label": "Merged current baggage with other baggage",
        "Title": "X-Trace Task",
        "Host": "pinky19.mpi-sws.org",
        "HRT": 25491847389795151,
        "Operation": "join",
        "Timestamp": "1556275487330.198486",
        "TenantClass": 0,
        "Source": "PacketHeader.java:168",
        "ThreadID": 1,
        "ThreadName": "",
        "EventID": "341E163B7EFE6638",
        "ProcessID": 21035
      },
      {
        "Cycles": 0,
        "Agent": "edu.brown.cs.systems.xtrace.logging.BaggageWrappers",
        "ProcessName": "Data",
        "TaskID": "3E594DAB35795C28",
        "ParentEventID": [
          "2301FDDB6339418D"
        ],
        "Label": "Forking current baggage with Baggage.fork()",
        "Title": "X-Trace Task",
        "Host": "pinky19.mpi-sws.org",
        "HRT": 25491847389755990,
        "Operation": "fork",
        "Timestamp": "1556275487330.159668",
        "TenantClass": 0,
        "Source": "PacketHeader.java:95",
        "ThreadID": 9602,
        "ThreadName": "",
        "EventID": "C5F824AF7BEB9B27",
        "BaggageBytes": "[[248 5] [240 0] [0 62 89 77 171 53 121 92 40] [240 1] [0 35 1 253 219 99 57 65 141] [240 3] [0 2]]",
        "ProcessID": 2319
      },
      {
        "Cycles": 0,
        "Agent": "edu.brown.cs.systems.xtrace.logging.BaggageWrappers",
        "ProcessName": "Read",
        "TaskID": "3E594DAB35795C28",
        "ParentEventID": [
          "C5F824AF7BEB9B27",
          "341E163B7EFE6638"
        ],
        "Label": "Merged current baggage with other baggage",
        "Title": "X-Trace Task",
        "Host": "pinky19.mpi-sws.org",
        "HRT": 25491847389876444,
        "Operation": "join",
        "Timestamp": "1556275487330.279785",
        "TenantClass": 0,
        "Source": "PacketHeader.java:168",
        "ThreadID": 1,
        "ThreadName": "",
        "EventID": "112C5DD00D3845BF",
        "ProcessID": 21035
      },
      {
        "Cycles": 0,
        "Agent": "Execution-Sleep",
        "ProcessName": "Data",
        "TaskID": "3E594DAB35795C28",
        "ParentEventID": [
          "C5F824AF7BEB9B27"
        ],
        "Label": "waited",
        "Title": "X-Trace Task",
        "Host": "pinky19.mpi-sws.org",
        "Duration": "67990",
        "HRT": 25491847389940323,
        "Operation": "waited",
        "Timestamp": "1556275487330.343994",
        "TenantClass": 0,
        "Source": "SocketIOWithTimeout.java:335",
        "ThreadID": 9602,
        "ThreadName": "",
        "EventID": "C4053778E2222601",
        "BaggageBytes": "[[248 5] [240 0] [0 62 89 77 171 53 121 92 40] [240 1] [0 197 248 36 175 123 235 155 39] [240 3] [0 2]]",
        "ProcessID": 2319
      },
      {
        "Cycles": 0,
        "Agent": "edu.brown.cs.systems.xtrace.logging.BaggageWrappers",
        "ProcessName": "Read",
        "TaskID": "3E594DAB35795C28",
        "ParentEventID": [
          "112C5DD00D3845BF"
        ],
        "Label": "Forking current baggage with Baggage.fork()",
        "Title": "X-Trace Task",
        "Host": "pinky19.mpi-sws.org",
        "HRT": 25491847389888005,
        "Operation": "fork",
        "Timestamp": "1556275487330.291260",
        "TenantClass": 0,
        "Source": "RemoteBlockReader2.java:361",
        "ThreadID": 1,
        "ThreadName": "",
        "EventID": "70EBF8D9577E4AC4",
        "ProcessID": 21035
      },
      {
        "Cycles": 0,
        "Agent": "edu.brown.cs.systems.xtrace.logging.BaggageWrappers",
        "ProcessName": "Data",
        "TaskID": "3E594DAB35795C28",
        "ParentEventID": [
          "70EBF8D9577E4AC4",
          "C4053778E2222601"
        ],
        "Label": "Merged current baggage with other baggage",
        "Title": "X-Trace Task",
        "Host": "pinky19.mpi-sws.org",
        "HRT": 25491847390007795,
        "Operation": "join",
        "Timestamp": "1556275487330.411377",
        "TenantClass": 0,
        "Source": "DataXceiver.java:574",
        "ThreadID": 9602,
        "ThreadName": "",
        "EventID": "8C1914492594CEC4",
        "BaggageBytes": "[[248 5] [240 0] [0 62 89 77 171 53 121 92 40] [240 1] [0 196 5 55 120 226 34 38 1] [0 112 235 248 217 87 126 74 196] [240 3] [0 2]]",
        "ProcessID": 2319
      },
      {
        "Cycles": 0,
        "Agent": "Execution-CPU",
        "ProcessName": "Data",
        "TaskID": "3E594DAB35795C28",
        "ParentEventID": [
          "8C1914492594CEC4"
        ],
        "Label": "unset",
        "Title": "X-Trace Task",
        "Host": "pinky19.mpi-sws.org",
        "Duration": "585374",
        "HRT": 25491847390028931,
        "Operation": "unset",
        "Timestamp": "1556275487330.432617",
        "TenantClass": 0,
        "Source": "DataXceiver.java:261",
        "ThreadID": 9602,
        "ThreadName": "",
        "EventID": "BBA7DE51DBC2EE01",
        "BaggageBytes": "[[248 5] [240 0] [0 62 89 77 171 53 121 92 40] [240 1] [0 140 25 20 73 37 148 206 196] [240 3] [0 2]]",
        "ProcessID": 2319
      },
      {
        "Cycles": 0,
        "Agent": "edu.brown.cs.systems.retro.benchmarks.hdfs_client.Reader",
        "ProcessName": "Read",
        "TaskID": "3E594DAB35795C28",
        "ParentEventID": [
          "0"
        ],
        "Label": "Reading file",
        "Title": "X-Trace Task",
        "Host": "pinky19.mpi-sws.org",
        "HRT": 25491847388473745,
        "Timestamp": "1556275487328.876953",
        "TenantClass": 0,
        "ThreadID": 1,
        "ThreadName": "",
        "EventID": "7F4713176AC7AC12",
        "ProcessID": 21035,
        "Tag": [
          "reader_1kb",
          "Read Size: 1024"
        ]
      }
    ]
  }
]