[
  {
    "id": "235E67F8D91DE8DE",
    "reports": [
      {
        "Cycles": 0,
        "Agent": "edu.brown.cs.systems.xtrace.logging.XTraceInit",
        "ProcessName": "Data",
        "TaskID": "235E67F8D91DE8DE",
        "ParentEventID": [
          "3890D3FFD5E0092C"
        ],
        "Label": "Thread.setName: DataXceiver for client DFSClient_NONMAPREDUCE_1377588049_1 at /139.19.171.63:51766 [Sending block BP-1633380353-139.19.171.63-1554193446451:blk_1073761171_20347]",
        "Title": "X-Trace Task",
        "Host": "pinky24.mpi-sws.org",
        "HRT": 5103010717054739,
        "Timestamp": "1556275397931.689697",
        "TenantClass": 0,
        "Source": "DataXceiver.java:168",
        "ThreadID": 5164,
        "ThreadName": "",
        "EventID": "D407C9E67577E88A",
        "BaggageBytes": "[[248 5] [240 0] [0 35 94 103 248 217 29 232 222] [240 1] [0 56 144 211 255 213 224 9 44] [240 3] [0 2]]",
        "ProcessID": 28692
      },
      {
        "Cycles": 0,
        "Agent": "edu.brown.cs.systems.xtrace.logging.BaggageWrappers",
        "ProcessName": "Data",
        "TaskID": "235E67F8D91DE8DE",
        "ParentEventID": [
          "8A873EB5B13876BA"
        ],
        "Label": "Forking current baggage with Baggage.fork()",
        "Title": "X-Trace Task",
        "Host": "pinky24.mpi-sws.org",
        "HRT": 5103010717427833,
        "Operation": "fork",
        "Timestamp": "1556275397932.062744",
        "TenantClass": 0,
        "Source": "PacketHeader.java:95",
        "ThreadID": 5164,
        "ThreadName": "",
        "EventID": "C6FF1477B75F78C8",
        "BaggageBytes": "[[248 5] [240 0] [0 35 94 103 248 217 29 232 222] [240 1] [0 138 135 62 181 177 56 118 186] [240 3] [0 2]]",
        "ProcessID": 28692
      },
      {
        "Cycles": 0,
        "Agent": "edu.brown.cs.systems.xtrace.logging.BaggageWrappers",
        "ProcessName": "Data",
        "TaskID": "235E67F8D91DE8DE",
        "ParentEventID": [
          "D407C9E67577E88A"
        ],
        "Label": "Forking current baggage with Baggage.fork()",
        "Title": "X-Trace Task",
        "Host": "pinky24.mpi-sws.org",
        "HRT": 5103010717261749,
        "Operation": "fork",
        "Timestamp": "1556275397931.896729",
        "TenantClass": 0,
        "Source": "DataXceiver.java:1257",
        "ThreadID": 5164,
        "ThreadName": "",
        "EventID": "8A873EB5B13876BA",
        "BaggageBytes": "[[248 5] [240 0] [0 35 94 103 248 217 29 232 222] [240 1] [0 212 7 201 230 117 119 232 138] [240 3] [0 2]]",
        "ProcessID": 28692
      },
      {
        "Cycles": 0,
        "Agent": "edu.brown.cs.systems.retro.benchmarks.hdfs_client.Reader",
        "ProcessName": "Read",
        "TaskID": "235E67F8D91DE8DE",
        "ParentEventID": [
          "0"
        ],
        "Label": "Reading file",
        "Title": "X-Trace Task",
        "Host": "pinky19.mpi-sws.org",
        "HRT": 25491757981618025,
        "Timestamp": "1556275397921.164795",
        "TenantClass": 0,
        "ThreadID": 1,
        "ThreadName": "",
        "EventID": "AC42982A9EC854B9",
        "ProcessID": 21035,
        "Tag": [
          "reader_1kb",
          "Read Size: 1024"
        ]
      },
      {
        "Cycles": 0,
        "Agent": "edu.brown.cs.systems.retro.benchmarks.hdfs_client.Reader",
        "ProcessName": "Read",
        "TaskID": "235E67F8D91DE8DE",
        "ParentEventID": [
          "AC42982A9EC854B9"
        ],
        "Label": "Reading file",
        "Title": "X-Trace Task",
        "Host": "pinky19.mpi-sws.org",
        "HRT": 25491757981663164,
        "Timestamp": "1556275397921.209961",
        "TenantClass": 0,
        "ThreadID": 1,
        "ThreadName": "",
        "EventID": "383341300555FE65",
        "ProcessID": 21035
      },
      {
        "Cycles": 0,
        "Agent": "org.apache.hadoop.ipc.ProtobufRpcEngine",
        "ProcessName": "Read",
        "TaskID": "235E67F8D91DE8DE",
        "ParentEventID": [
          "383341300555FE65"
        ],
        "Label": "Invoking org.apache.hadoop.hdfs.protocol.ClientProtocol.getBlockLocations",
        "Title": "X-Trace Task",
        "Host": "pinky19.mpi-sws.org",
        "HRT": 25491757981780883,
        "Timestamp": "1556275397921.327637",
        "TenantClass": 0,
        "Source": "ProtobufRpcEngine.java:228",
        "ThreadID": 1,
        "ThreadName": "",
        "EventID": "1E7EF1AFA02500ED",
        "ProcessID": 21035
      },
      {
        "Cycles": 0,
        "Agent": "Execution-CPU",
        "ProcessName": "Read",
        "TaskID": "235E67F8D91DE8DE",
        "ParentEventID": [
          "1E7EF1AFA02500ED"
        ],
        "Label": "unset",
        "Title": "X-Trace Task",
        "Host": "pinky19.mpi-sws.org",
        "Duration": "29868213",
        "HRT": 25491757981849558,
        "Operation": "unset",
        "Timestamp": "1556275397921.396240",
        "TenantClass": 0,
        "Source": "Client.java:1027",
        "ThreadID": 1,
        "ThreadName": "",
        "EventID": "B2D142F75C0C8116",
        "ProcessID": 21035
      },
      {
        "Cycles": 0,
        "Agent": "edu.brown.cs.systems.xtrace.logging.BaggageWrappers",
        "ProcessName": "Read",
        "TaskID": "235E67F8D91DE8DE",
        "ParentEventID": [
          "DCF6F09C33298CCD"
        ],
        "Label": "Forking current baggage with Baggage.fork()",
        "Title": "X-Trace Task",
        "Host": "pinky19.mpi-sws.org",
        "HRT": 25491757982017187,
        "Operation": "fork",
        "Timestamp": "1556275397921.563965",
        "TenantClass": 0,
        "Source": "Client.java:1043",
        "ThreadID": 41,
        "ThreadName": "",
        "EventID": "D9B437B9816CB944",
        "ProcessID": 21035
      },
      {
        "Cycles": 0,
        "Agent": "Execution-CPU",
        "ProcessName": "Read",
        "TaskID": "235E67F8D91DE8DE",
        "ParentEventID": [
          "B2D142F75C0C8116"
        ],
        "Label": "set",
        "Title": "X-Trace Task",
        "Host": "pinky19.mpi-sws.org",
        "HRT": 25491757981987556,
        "Operation": "set",
        "Timestamp": "1556275397921.534424",
        "TenantClass": 0,
        "Source": "Client.java:1032",
        "ThreadID": 41,
        "ThreadName": "",
        "EventID": "DCF6F09C33298CCD",
        "ProcessID": 21035
      },
      {
        "Cycles": 0,
        "Agent": "Execution-CPU",
        "ProcessName": "Read",
        "TaskID": "235E67F8D91DE8DE",
        "ParentEventID": [
          "D9B437B9816CB944"
        ],
        "Label": "unset",
        "Title": "X-Trace Task",
        "Host": "pinky19.mpi-sws.org",
        "Duration": "149885",
        "HRT": 25491757982163467,
        "Operation": "unset",
        "Timestamp": "1556275397921.710205",
        "TenantClass": 0,
        "Source": "Client.java:1062",
        "ThreadID": 41,
        "ThreadName": "",
        "EventID": "55463AAA3A895E9B",
        "ProcessID": 21035
      },
      {
        "Cycles": 0,
        "Agent": "Execution-CPU",
        "ProcessName": "Read",
        "TaskID": "235E67F8D91DE8DE",
        "ParentEventID": [
          "55463AAA3A895E9B"
        ],
        "Label": "set",
        "Title": "X-Trace Task",
        "Host": "pinky19.mpi-sws.org",
        "HRT": 25491757982276677,
        "Operation": "set",
        "Timestamp": "1556275397921.823486",
        "TenantClass": 0,
        "Source": "Client.java:1104",
        "ThreadID": 1,
        "ThreadName": "",
        "EventID": "BC95F456F6F5A11A",
        "ProcessID": 21035
      },
      {
        "Cycles": 0,
        "Agent": "Execution-CPU",
        "ProcessName": "Read",
        "TaskID": "235E67F8D91DE8DE",
        "ParentEventID": [
          "2F75FE60704F565F"
        ],
        "Label": "set",
        "Title": "X-Trace Task",
        "Host": "pinky19.mpi-sws.org",
        "HRT": 25491757982793094,
        "Operation": "set",
        "Timestamp": "1556275397922.339844",
        "TenantClass": 0,
        "Source": "Client.java:302",
        "ThreadID": 37,
        "ThreadName": "",
        "EventID": "FD3B5E9917B64B34",
        "ProcessID": 21035
      },
      {
        "Cycles": 0,
        "Agent": "Execution-Sleep",
        "ProcessName": "Read",
        "TaskID": "235E67F8D91DE8DE",
        "ParentEventID": [
          "BC95F456F6F5A11A"
        ],
        "Label": "waited",
        "Title": "X-Trace Task",
        "Host": "pinky19.mpi-sws.org",
        "Duration": "570862",
        "HRT": 25491757982867387,
        "Operation": "waited",
        "Timestamp": "1556275397922.414062",
        "TenantClass": 0,
        "Source": "Client.java:1537",
        "ThreadID": 1,
        "ThreadName": "",
        "EventID": "A4487BE72F421C81",
        "ProcessID": 21035
      },
      {
        "Cycles": 0,
        "Agent": "Execution-CPU",
        "ProcessName": "Read",
        "TaskID": "235E67F8D91DE8DE",
        "ParentEventID": [
          "FD3B5E9917B64B34"
        ],
        "Label": "unset",
        "Title": "X-Trace Task",
        "Host": "pinky19.mpi-sws.org",
        "Duration": "24410",
        "HRT": 25491757982837147,
        "Operation": "unset",
        "Timestamp": "1556275397922.384033",
        "TenantClass": 0,
        "Source": "Client.java:1168",
        "ThreadID": 37,
        "ThreadName": "",
        "EventID": "5243E1494DCBA0F2",
        "ProcessID": 21035
      },
      {
        "Cycles": 0,
        "Agent": "edu.brown.cs.systems.xtrace.logging.BaggageWrappers",
        "ProcessName": "Read",
        "TaskID": "235E67F8D91DE8DE",
        "ParentEventID": [
          "5243E1494DCBA0F2",
          "A4487BE72F421C81"
        ],
        "Label": "Merged current baggage with other baggage",
        "Title": "X-Trace Task",
        "Host": "pinky19.mpi-sws.org",
        "HRT": 25491757982901578,
        "Operation": "join",
        "Timestamp": "1556275397922.448242",
        "TenantClass": 0,
        "Source": "Client.java:1545",
        "ThreadID": 1,
        "ThreadName": "",
        "EventID": "FFE172073D793CE7",
        "ProcessID": 21035
      },
      {
        "Cycles": 0,
        "Agent": "Execution-Sleep",
        "ProcessName": "Data",
        "TaskID": "235E67F8D91DE8DE",
        "ParentEventID": [
          "C6FF1477B75F78C8"
        ],
        "Label": "waited",
        "Title": "X-Trace Task",
        "Host": "pinky24.mpi-sws.org",
        "Duration": "11270",
        "HRT": 5103010717602700,
        "Operation": "waited",
        "Timestamp": "1556275397932.237549",
        "TenantClass": 0,
        "Source": "SocketIOWithTimeout.java:335",
        "ThreadID": 5164,
        "ThreadName": "",
        "EventID": "135DFE5BCEDE33C9",
        "BaggageBytes": "[[248 5] [240 0] [0 35 94 103 248 217 29 232 222] [240 1] [0 198 255 20 119 183 95 120 200] [240 3] [0 2]]",
        "ProcessID": 28692
      },
      {
        "Cycles": 0,
        "Agent": "Execution-Sleep",
        "ProcessName": "Data",
        "TaskID": "235E67F8D91DE8DE",
        "ParentEventID": [
          "C15989C8E347457A"
        ],
        "Label": "waited",
        "Title": "X-Trace Task",
        "Host": "pinky24.mpi-sws.org",
        "Duration": "101547",
        "HRT": 5103010718090658,
        "Operation": "waited",
        "Timestamp": "1556275397932.725586",
        "TenantClass": 0,
        "Source": "SocketIOWithTimeout.java:335",
        "ThreadID": 5164,
        "ThreadName": "",
        "EventID": "B160773E436EA523",
        "BaggageBytes": "[[248 5] [240 0] [0 35 94 103 248 217 29 232 222] [240 1] [0 193 89 137 200 227 71 69 122] [240 3] [0 2]]",
        "ProcessID": 28692
      },
      {
        "Cycles": 0,
        "Agent": "edu.brown.cs.systems.xtrace.logging.BaggageWrappers",
        "ProcessName": "Data",
        "TaskID": "235E67F8D91DE8DE",
        "ParentEventID": [
          "6DC96652371D8E9A",
          "B160773E436EA523"
        ],
        "Label": "Merged current baggage with other baggage",
        "Title": "X-Trace Task",
        "Host": "pinky24.mpi-sws.org",
        "HRT": 5103010718212848,
        "Operation": "join",
        "Timestamp": "1556275397932.847656",
        "TenantClass": 0,
        "Source": "DataXceiver.java:574",
        "ThreadID": 5164,
        "ThreadName": "",
        "EventID": "30E5D03E900F0470",
        "BaggageBytes": "[[248 5] [240 0] [0 35 94 103 248 217 29 232 222] [240 1] [0 177 96 119 62 67 110 165 35] [0 109 201 102 82 55 29 142 154] [240 3] [0 2]]",
        "ProcessID": 28692
      },
      {
        "Cycles": 0,
        "Agent": "edu.brown.cs.systems.xtrace.logging.BaggageWrappers",
        "ProcessName": "Data",
        "TaskID": "235E67F8D91DE8DE",
        "ParentEventID": [
          "135DFE5BCEDE33C9"
        ],
        "Label": "Forking current baggage with Baggage.fork()",
        "Title": "X-Trace Task",
        "Host": "pinky24.mpi-sws.org",
        "HRT": 5103010717774224,
        "Operation": "fork",
        "Timestamp": "1556275397932.409180",
        "TenantClass": 0,
        "Source": "PacketHeader.java:95",
        "ThreadID": 5164,
        "ThreadName": "",
        "EventID": "C15989C8E347457A",
        "BaggageBytes": "[[248 5] [240 0] [0 35 94 103 248 217 29 232 222] [240 1] [0 19 93 254 91 206 222 51 201] [240 3] [0 2]]",
        "ProcessID": 28692
      },
      {
        "Cycles": 0,
        "Agent": "Execution-CPU",
        "ProcessName": "Data",
        "TaskID": "235E67F8D91DE8DE",
        "ParentEventID": [
          "30E5D03E900F0470"
        ],
        "Label": "unset",
        "Title": "X-Trace Task",
        "Host": "pinky24.mpi-sws.org",
        "Duration": "1251746",
        "HRT": 5103010718278238,
        "Operation": "unset",
        "Timestamp": "1556275397932.913086",
        "TenantClass": 0,
        "Source": "DataXceiver.java:261",
        "ThreadID": 5164,
        "ThreadName": "",
        "EventID": "8F545CE800C2F425",
        "BaggageBytes": "[[248 5] [240 0] [0 35 94 103 248 217 29 232 222] [240 1] [0 48 229 208 62 144 15 4 112] [240 3] [0 2]]",
        "ProcessID": 28692
      },
      {
        "Cycles": 0,
        "Agent": "edu.brown.cs.systems.xtrace.logging.BaggageWrappers",
        "ProcessName": "Read",
        "TaskID": "235E67F8D91DE8DE",
        "ParentEventID": [
          "9BF022DEEC2D8B33"
        ],
        "Label": "Forking current baggage with Baggage.fork()",
        "Title": "X-Trace Task",
        "Host": "pinky19.mpi-sws.org",
        "HRT": 25491757991678223,
        "Operation": "fork",
        "Timestamp": "1556275397931.225098",
        "TenantClass": 0,
        "Source": "DataTransferProtoUtil.java:94",
        "ThreadID": 1,
        "ThreadName": "",
        "EventID": "3FD02EAE489487A8",
        "ProcessID": 21035
      },
      {
        "Cycles": 0,
        "Agent": "org.apache.hadoop.ipc.ProtobufRpcEngine",
        "ProcessName": "Read",
        "TaskID": "235E67F8D91DE8DE",
        "ParentEventID": [
          "FFE172073D793CE7"
        ],
        "Label": "org.apache.hadoop.hdfs.protocol.ClientProtocol.getBlockLocations completed",
        "Title": "X-Trace Task",
        "Host": "pinky19.mpi-sws.org",
        "HRT": 25491757982965148,
        "Timestamp": "1556275397922.511963",
        "TenantClass": 0,
        "Source": "ProtobufRpcEngine.java:275",
        "ThreadID": 1,
        "ThreadName": "",
        "EventID": "9BF022DEEC2D8B33",
        "ProcessID": 21035
      },
      {
        "Cycles": 0,
        "Agent": "edu.brown.cs.systems.xtrace.logging.BaggageWrappers",
        "ProcessName": "Read",
        "TaskID": "235E67F8D91DE8DE",
        "ParentEventID": [
          "2AD1B0D5DDC09FAF",
          "8A873EB5B13876BA"
        ],
        "Label": "Merged current baggage with other baggage",
        "Title": "X-Trace Task",
        "Host": "pinky19.mpi-sws.org",
        "HRT": 25491757992669164,
        "Operation": "join",
        "Timestamp": "1556275397932.215820",
        "TenantClass": 0,
        "Source": "RemoteBlockReader2.java:429",
        "ThreadID": 1,
        "ThreadName": "",
        "EventID": "B6DC33DD59C86E8F",
        "ProcessID": 21035
      },
      {
        "Cycles": 0,
        "Agent": "Execution-Sleep",
        "ProcessName": "Read",
        "TaskID": "235E67F8D91DE8DE",
        "ParentEventID": [
          "B6DC33DD59C86E8F"
        ],
        "Label": "waited",
        "Title": "X-Trace Task",
        "Host": "pinky19.mpi-sws.org",
        "Duration": "88632",
        "HRT": 25491757992900290,
        "Operation": "waited",
        "Timestamp": "1556275397932.447021",
        "TenantClass": 0,
        "Source": "SocketIOWithTimeout.java:335",
        "ThreadID": 1,
        "ThreadName": "",
        "EventID": "3E68ACB014D3AE45",
        "ProcessID": 21035
      },
      {
        "Cycles": 0,
        "Agent": "Execution-Sleep",
        "ProcessName": "Read",
        "TaskID": "235E67F8D91DE8DE",
        "ParentEventID": [
          "3FD02EAE489487A8"
        ],
        "Label": "waited",
        "Title": "X-Trace Task",
        "Host": "pinky19.mpi-sws.org",
        "Duration": "701400",
        "HRT": 25491757992536308,
        "Operation": "waited",
        "Timestamp": "1556275397932.083008",
        "TenantClass": 0,
        "Source": "SocketIOWithTimeout.java:335",
        "ThreadID": 1,
        "ThreadName": "",
        "EventID": "2AD1B0D5DDC09FAF",
        "ProcessID": 21035
      },
      {
        "Cycles": 0,
        "Agent": "edu.brown.cs.systems.xtrace.logging.BaggageWrappers",
        "ProcessName": "Read",
        "TaskID": "235E67F8D91DE8DE",
        "ParentEventID": [
          "C6FF1477B75F78C8",
          "3E68ACB014D3AE45"
        ],
        "Label": "Merged current baggage with other baggage",
        "Title": "X-Trace Task",
        "Host": "pinky19.mpi-sws.org",
        "HRT": 25491757992959119,
        "Operation": "join",
        "Timestamp": "1556275397932.505859",
        "TenantClass": 0,
        "Source": "PacketHeader.java:168",
        "ThreadID": 1,
        "ThreadName": "",
        "EventID": "16D64CDF041E32F1",
        "ProcessID": 21035
      },
      {
        "Cycles": 0,
        "Agent": "Execution-Sleep",
        "ProcessName": "Read",
        "TaskID": "235E67F8D91DE8DE",
        "ParentEventID": [
          "16D64CDF041E32F1"
        ],
        "Label": "waited",
        "Title": "X-Trace Task",
        "Host": "pinky19.mpi-sws.org",
        "Duration": "15403",
        "HRT": 25491757993014599,
        "Operation": "waited",
        "Timestamp": "1556275397932.561279",
        "TenantClass": 0,
        "Source": "SocketIOWithTimeout.java:335",
        "ThreadID": 1,
        "ThreadName": "",
        "EventID": "7EC6E7A8F02F62A8",
        "ProcessID": 21035
      },
      {
        "Cycles": 0,
        "Agent": "edu.brown.cs.systems.xtrace.logging.BaggageWrappers",
        "ProcessName": "Read",
        "TaskID": "235E67F8D91DE8DE",
        "ParentEventID": [
          "C15989C8E347457A",
          "7EC6E7A8F02F62A8"
        ],
        "Label": "Merged current baggage with other baggage",
        "Title": "X-Trace Task",
        "Host": "pinky19.mpi-sws.org",
        "HRT": 25491757993074705,
        "Operation": "join",
        "Timestamp": "1556275397932.621582",
        "TenantClass": 0,
        "Source": "PacketHeader.java:168",
        "ThreadID": 1,
        "ThreadName": "",
        "EventID": "94B30C0EF254A4B7",
        "ProcessID": 21035
      },
      {
        "Cycles": 0,
        "Agent": "Execution-CPU",
        "ProcessName": "Name",
        "TaskID": "235E67F8D91DE8DE",
        "ParentEventID": [
          "D9B437B9816CB944"
        ],
        "Label": "set",
        "Title": "X-Trace Task",
        "Host": "pinky19.mpi-sws.org",
        "HRT": 25491757982273197,
        "Operation": "set",
        "Timestamp": "1556275397921.785889",
        "TenantClass": 0,
        "Source": "Server.java:1840",
        "ThreadID": 48,
        "ThreadName": "",
        "EventID": "BACA96D4AB94DFCC",
        "BaggageBytes": "[[248 5] [240 0] [0 35 94 103 248 217 29 232 222] [240 1] [0 217 180 55 185 129 108 185 68] [240 3] [0 2]]",
        "ProcessID": 2171
      },
      {
        "Cycles": 0,
        "Agent": "edu.brown.cs.systems.xtrace.logging.BaggageWrappers",
        "ProcessName": "Read",
        "TaskID": "235E67F8D91DE8DE",
        "ParentEventID": [
          "94B30C0EF254A4B7"
        ],
        "Label": "Forking current baggage with Baggage.fork()",
        "Title": "X-Trace Task",
        "Host": "pinky19.mpi-sws.org",
        "HRT": 25491757993088583,
        "Operation": "fork",
        "Timestamp": "1556275397932.635254",
        "TenantClass": 0,
        "Source": "RemoteBlockReader2.java:361",
        "ThreadID": 1,
        "ThreadName": "",
        "EventID": "6DC96652371D8E9A",
        "ProcessID": 21035
      },
      {
        "Cycles": 0,
        "Agent": "edu.brown.cs.systems.xtrace.logging.BaggageWrappers",
        "ProcessName": "Name",
        "TaskID": "235E67F8D91DE8DE",
        "ParentEventID": [
          "BACA96D4AB94DFCC"
        ],
        "Label": "Forking current baggage with Baggage.fork()",
        "Title": "X-Trace Task",
        "Host": "pinky19.mpi-sws.org",
        "HRT": 25491757982343669,
        "Operation": "fork",
        "Timestamp": "1556275397921.856445",
        "TenantClass": 0,
        "Source": "Server.java:550",
        "ThreadID": 48,
        "ThreadName": "",
        "EventID": "57CD5035D8367BE0",
        "BaggageBytes": "[[248 5] [240 0] [0 35 94 103 248 217 29 232 222] [240 1] [0 186 202 150 212 171 148 223 204] [240 3] [0 2]]",
        "ProcessID": 2171
      },
      {
        "Cycles": 0,
        "Agent": "Execution-CPU",
        "ProcessName": "Name",
        "TaskID": "235E67F8D91DE8DE",
        "ParentEventID": [
          "57CD5035D8367BE0"
        ],
        "Label": "set",
        "Title": "X-Trace Task",
        "Host": "pinky19.mpi-sws.org",
        "HRT": 25491757982411706,
        "Operation": "set",
        "Timestamp": "1556275397921.924316",
        "TenantClass": 0,
        "Source": "Server.java:2071",
        "ThreadID": 61,
        "ThreadName": "",
        "EventID": "DCF503D89CF7B060",
        "BaggageBytes": "[[248 5] [240 0] [0 35 94 103 248 217 29 232 222] [240 1] [0 87 205 80 53 216 54 123 224] [240 3] [0 2]]",
        "ProcessID": 2171
      },
      {
        "Cycles": 0,
        "Agent": "Execution-CPU",
        "ProcessName": "Name",
        "TaskID": "235E67F8D91DE8DE",
        "ParentEventID": [
          "57CD5035D8367BE0"
        ],
        "Label": "unset",
        "Title": "X-Trace Task",
        "Host": "pinky19.mpi-sws.org",
        "Duration": "42038",
        "HRT": 25491757982374670,
        "Operation": "unset",
        "Timestamp": "1556275397921.887451",
        "TenantClass": 0,
        "Source": "Server.java:1828",
        "ThreadID": 48,
        "ThreadName": "",
        "EventID": "9DF91E0C00BB3D76",
        "BaggageBytes": "[[248 5] [240 0] [0 35 94 103 248 217 29 232 222] [240 1] [0 87 205 80 53 216 54 123 224] [240 3] [0 2]]",
        "ProcessID": 2171
      },
      {
        "Cycles": 0,
        "Agent": "org.apache.hadoop.ipc.Server",
        "ProcessName": "Name",
        "TaskID": "235E67F8D91DE8DE",
        "ParentEventID": [
          "DCF503D89CF7B060"
        ],
        "Label": "getBlockLocations in org.apache.hadoop.hdfs.protocol.ClientProtocol",
        "Title": "X-Trace Task",
        "Host": "pinky19.mpi-sws.org",
        "HRT": 25491757982457094,
        "Timestamp": "1556275397921.969727",
        "TenantClass": 0,
        "Source": "ProtobufRpcEngine.java:601",
        "ThreadID": 61,
        "ThreadName": "",
        "EventID": "9CFFFA6CE75DFD6F",
        "BaggageBytes": "[[248 5] [240 0] [0 35 94 103 248 217 29 232 222] [240 1] [0 220 245 3 216 156 247 176 96] [240 3] [0 2]]",
        "ProcessID": 2171
      },
      {
        "Cycles": 0,
        "Agent": "edu.brown.cs.systems.xtrace.logging.BaggageWrappers",
        "ProcessName": "Name",
        "TaskID": "235E67F8D91DE8DE",
        "ParentEventID": [
          "CDC72273EBFF4818"
        ],
        "Label": "Forking current baggage with Baggage.fork()",
        "Title": "X-Trace Task",
        "Host": "pinky19.mpi-sws.org",
        "HRT": 25491757982604869,
        "Operation": "fork",
        "Timestamp": "1556275397922.117676",
        "TenantClass": 0,
        "Source": "Server.java:2398",
        "ThreadID": 61,
        "ThreadName": "",
        "EventID": "2F75FE60704F565F",
        "BaggageBytes": "[[248 5] [240 0] [0 35 94 103 248 217 29 232 222] [240 1] [0 205 199 34 115 235 255 72 24] [240 3] [0 2]]",
        "ProcessID": 2171
      },
      {
        "Cycles": 0,
        "Agent": "org.apache.hadoop.hdfs.server.namenode.FSNamesystem.audit",
        "ProcessName": "Name",
        "TaskID": "235E67F8D91DE8DE",
        "ParentEventID": [
          "9CFFFA6CE75DFD6F"
        ],
        "Label": "allowed=true\tugi=plascas (auth:SIMPLE)\tip=/139.19.171.63\tcmd=open\tsrc=/ds/zp1Mrv8xW4urgClR\tdst=null\tperm=null\tproto=rpc",
        "Title": "X-Trace Task",
        "Host": "pinky19.mpi-sws.org",
        "HRT": 25491757982521446,
        "Timestamp": "1556275397922.034180",
        "TenantClass": 0,
        "Source": "FSNamesystem.java:8313",
        "ThreadID": 61,
        "ThreadName": "",
        "EventID": "CDC72273EBFF4818",
        "BaggageBytes": "[[248 5] [240 0] [0 35 94 103 248 217 29 232 222] [240 1] [0 156 255 250 108 231 93 253 111] [240 3] [0 2]]",
        "ProcessID": 2171
      },
      {
        "Cycles": 0,
        "Agent": "Execution-CPU",
        "ProcessName": "Name",
        "TaskID": "235E67F8D91DE8DE",
        "ParentEventID": [
          "2F75FE60704F565F"
        ],
        "Label": "unset",
        "Title": "X-Trace Task",
        "Host": "pinky19.mpi-sws.org",
        "Duration": "270036",
        "HRT": 25491757982710363,
        "Operation": "unset",
        "Timestamp": "1556275397922.223145",
        "TenantClass": 0,
        "Source": "Server.java:1058",
        "ThreadID": 61,
        "ThreadName": "",
        "EventID": "DA3D7D225A5FB458",
        "BaggageBytes": "[[248 5] [240 0] [0 35 94 103 248 217 29 232 222] [240 1] [0 47 117 254 96 112 79 86 95] [240 3] [0 2]]",
        "ProcessID": 2171
      },
      {
        "Cycles": 0,
        "Agent": "Execution-CPU",
        "ProcessName": "Data",
        "TaskID": "235E67F8D91DE8DE",
        "ParentEventID": [
          "3FD02EAE489487A8"
        ],
        "Label": "set",
        "Title": "X-Trace Task",
        "Host": "pinky24.mpi-sws.org",
        "HRT": 5103010716958012,
        "Operation": "set",
        "Timestamp": "1556275397931.593018",
        "TenantClass": 0,
        "Source": "Receiver.java:117",
        "ThreadID": 5164,
        "ThreadName": "",
        "EventID": "3890D3FFD5E0092C",
        "BaggageBytes": "[[248 5] [240 0] [0 35 94 103 248 217 29 232 222] [240 1] [0 63 208 46 174 72 148 135 168] [240 3] [0 2]]",
        "ProcessID": 28692
      }
    ]
  }
]