[
  {
    "id": "31996EBB88F05F69",
    "reports": [
      {
        "Cycles": 0,
        "Agent": "Execution-CPU",
        "ProcessName": "Read",
        "TaskID": "31996EBB88F05F69",
        "ParentEventID": [
          "8B87460EAF292792"
        ],
        "Label": "unset",
        "Title": "X-Trace Task",
        "Host": "pinky19.mpi-sws.org",
        "Duration": "21309139",
        "HRT": 26962658789411086,
        "Operation": "unset",
        "Timestamp": "1557746298729.793701",
        "TenantClass": 0,
        "Source": "Client.java:1027",
        "ThreadID": 1,
        "ThreadName": "",
        "EventID": "C2BB687D0A0292CB",
        "ProcessID": 36430
      },
      {
        "Cycles": 0,
        "Agent": "Execution-CPU",
        "ProcessName": "Read",
        "TaskID": "31996EBB88F05F69",
        "ParentEventID": [
          "C2BB687D0A0292CB"
        ],
        "Label": "set",
        "Title": "X-Trace Task",
        "Host": "pinky19.mpi-sws.org",
        "HRT": 26962658789454602,
        "Operation": "set",
        "Timestamp": "1557746298729.837158",
        "TenantClass": 0,
        "Source": "Client.java:1032",
        "ThreadID": 41,
        "ThreadName": "",
        "EventID": "D52C753CE5282A87",
        "ProcessID": 36430
      },
      {
        "Cycles": 0,
        "Agent": "edu.brown.cs.systems.retro.benchmarks.hdfs_client.Reader",
        "ProcessName": "Read",
        "TaskID": "31996EBB88F05F69",
        "ParentEventID": [
          "0"
        ],
        "Label": "Reading file",
        "Title": "X-Trace Task",
        "Host": "pinky19.mpi-sws.org",
        "HRT": 26962658789349830,
        "Timestamp": "1557746298729.732422",
        "TenantClass": 0,
        "ThreadID": 1,
        "ThreadName": "",
        "EventID": "3B41DDBCE17FFA36",
        "ProcessID": 36430,
        "Tag": [
          "reader_10kb",
          "Read Size: 10240"
        ]
      },
      {
        "Cycles": 0,
        "Agent": "org.apache.hadoop.ipc.ProtobufRpcEngine",
        "ProcessName": "Read",
        "TaskID": "31996EBB88F05F69",
        "ParentEventID": [
          "AF530F60CB646AB4"
        ],
        "Label": "Invoking org.apache.hadoop.hdfs.protocol.ClientProtocol.getBlockLocations",
        "Title": "X-Trace Task",
        "Host": "pinky19.mpi-sws.org",
        "HRT": 26962658789393023,
        "Timestamp": "1557746298729.775635",
        "TenantClass": 0,
        "Source": "ProtobufRpcEngine.java:228",
        "ThreadID": 1,
        "ThreadName": "",
        "EventID": "8B87460EAF292792",
        "ProcessID": 36430
      },
      {
        "Cycles": 0,
        "Agent": "Execution-CPU",
        "ProcessName": "Read",
        "TaskID": "31996EBB88F05F69",
        "ParentEventID": [
          "48FB21F70E97276C"
        ],
        "Label": "unset",
        "Title": "X-Trace Task",
        "Host": "pinky19.mpi-sws.org",
        "Duration": "66568",
        "HRT": 26962658789539370,
        "Operation": "unset",
        "Timestamp": "1557746298729.922119",
        "TenantClass": 0,
        "Source": "Client.java:1062",
        "ThreadID": 41,
        "ThreadName": "",
        "EventID": "280CCD3BDB50BB98",
        "ProcessID": 36430
      },
      {
        "Cycles": 0,
        "Agent": "edu.brown.cs.systems.xtrace.logging.BaggageWrappers",
        "ProcessName": "Read",
        "TaskID": "31996EBB88F05F69",
        "ParentEventID": [
          "D52C753CE5282A87"
        ],
        "Label": "Forking current baggage with Baggage.fork()",
        "Title": "X-Trace Task",
        "Host": "pinky19.mpi-sws.org",
        "HRT": 26962658789473571,
        "Operation": "fork",
        "Timestamp": "1557746298729.856201",
        "TenantClass": 0,
        "Source": "Client.java:1043",
        "ThreadID": 41,
        "ThreadName": "",
        "EventID": "48FB21F70E97276C",
        "ProcessID": 36430
      },
      {
        "Cycles": 0,
        "Agent": "Execution-CPU",
        "ProcessName": "Name",
        "TaskID": "31996EBB88F05F69",
        "ParentEventID": [
          "48FB21F70E97276C"
        ],
        "Label": "set",
        "Title": "X-Trace Task",
        "Host": "pinky19.mpi-sws.org",
        "HRT": 26962658789598923,
        "Operation": "set",
        "Timestamp": "1557746298730.012207",
        "TenantClass": 0,
        "Source": "Server.java:1840",
        "ThreadID": 48,
        "ThreadName": "",
        "EventID": "222671AF52825CEA",
        "BaggageBytes": "[[248 5] [240 0] [0 49 153 110 187 136 240 95 105] [240 1] [0 72 251 33 247 14 151 39 108] [240 3] [0 2]]",
        "ProcessID": 2171
      },
      {
        "Cycles": 0,
        "Agent": "Execution-CPU",
        "ProcessName": "Read",
        "TaskID": "31996EBB88F05F69",
        "ParentEventID": [
          "280CCD3BDB50BB98"
        ],
        "Label": "set",
        "Title": "X-Trace Task",
        "Host": "pinky19.mpi-sws.org",
        "HRT": 26962658789559177,
        "Operation": "set",
        "Timestamp": "1557746298729.941895",
        "TenantClass": 0,
        "Source": "Client.java:1104",
        "ThreadID": 1,
        "ThreadName": "",
        "EventID": "CC4C7ACF91F37D9A",
        "ProcessID": 36430
      },
      {
        "Cycles": 0,
        "Agent": "edu.brown.cs.systems.xtrace.logging.BaggageWrappers",
        "ProcessName": "Name",
        "TaskID": "31996EBB88F05F69",
        "ParentEventID": [
          "222671AF52825CEA"
        ],
        "Label": "Forking current baggage with Baggage.fork()",
        "Title": "X-Trace Task",
        "Host": "pinky19.mpi-sws.org",
        "HRT": 26962658789628872,
        "Operation": "fork",
        "Timestamp": "1557746298730.041992",
        "TenantClass": 0,
        "Source": "Server.java:550",
        "ThreadID": 48,
        "ThreadName": "",
        "EventID": "EFABA007B86FC53D",
        "BaggageBytes": "[[248 5] [240 0] [0 49 153 110 187 136 240 95 105] [240 1] [0 34 38 113 175 82 130 92 234] [240 3] [0 2]]",
        "ProcessID": 2171
      },
      {
        "Cycles": 0,
        "Agent": "Execution-CPU",
        "ProcessName": "Name",
        "TaskID": "31996EBB88F05F69",
        "ParentEventID": [
          "EFABA007B86FC53D"
        ],
        "Label": "set",
        "Title": "X-Trace Task",
        "Host": "pinky19.mpi-sws.org",
        "HRT": 26962658789657190,
        "Operation": "set",
        "Timestamp": "1557746298730.070312",
        "TenantClass": 0,
        "Source": "Server.java:2071",
        "ThreadID": 64,
        "ThreadName": "",
        "EventID": "9D51703B6BC24A2D",
        "BaggageBytes": "[[248 5] [240 0] [0 49 153 110 187 136 240 95 105] [240 1] [0 239 171 160 7 184 111 197 61] [240 3] [0 2]]",
        "ProcessID": 2171
      },
      {
        "Cycles": 0,
        "Agent": "org.apache.hadoop.ipc.Server",
        "ProcessName": "Name",
        "TaskID": "31996EBB88F05F69",
        "ParentEventID": [
          "9D51703B6BC24A2D"
        ],
        "Label": "getBlockLocations in org.apache.hadoop.hdfs.protocol.ClientProtocol",
        "Title": "X-Trace Task",
        "Host": "pinky19.mpi-sws.org",
        "HRT": 26962658789694955,
        "Timestamp": "1557746298730.108154",
        "TenantClass": 0,
        "Source": "ProtobufRpcEngine.java:601",
        "ThreadID": 64,
        "ThreadName": "",
        "EventID": "95DF3F16D65E5719",
        "BaggageBytes": "[[248 5] [240 0] [0 49 153 110 187 136 240 95 105] [240 1] [0 157 81 112 59 107 194 74 45] [240 3] [0 2]]",
        "ProcessID": 2171
      },
      {
        "Cycles": 0,
        "Agent": "Execution-CPU",
        "ProcessName": "Name",
        "TaskID": "31996EBB88F05F69",
        "ParentEventID": [
          "EFABA007B86FC53D"
        ],
        "Label": "unset",
        "Title": "X-Trace Task",
        "Host": "pinky19.mpi-sws.org",
        "Duration": "24888",
        "HRT": 26962658789649787,
        "Operation": "unset",
        "Timestamp": "1557746298730.062988",
        "TenantClass": 0,
        "Source": "Server.java:1828",
        "ThreadID": 48,
        "ThreadName": "",
        "EventID": "90FADBC711D484F8",
        "BaggageBytes": "[[248 5] [240 0] [0 49 153 110 187 136 240 95 105] [240 1] [0 239 171 160 7 184 111 197 61] [240 3] [0 2]]",
        "ProcessID": 2171
      },
      {
        "Cycles": 0,
        "Agent": "edu.brown.cs.systems.xtrace.logging.BaggageWrappers",
        "ProcessName": "Name",
        "TaskID": "31996EBB88F05F69",
        "ParentEventID": [
          "A28541389C52FDC4"
        ],
        "Label": "Forking current baggage with Baggage.fork()",
        "Title": "X-Trace Task",
        "Host": "pinky19.mpi-sws.org",
        "HRT": 26962658789783989,
        "Operation": "fork",
        "Timestamp": "1557746298730.197266",
        "TenantClass": 0,
        "Source": "Server.java:2398",
        "ThreadID": 64,
        "ThreadName": "",
        "EventID": "7D1C39A3731B4D07",
        "BaggageBytes": "[[248 5] [240 0] [0 49 153 110 187 136 240 95 105] [240 1] [0 162 133 65 56 156 82 253 196] [240 3] [0 2]]",
        "ProcessID": 2171
      },
      {
        "Cycles": 0,
        "Agent": "Execution-CPU",
        "ProcessName": "Name",
        "TaskID": "31996EBB88F05F69",
        "ParentEventID": [
          "7D1C39A3731B4D07"
        ],
        "Label": "unset",
        "Title": "X-Trace Task",
        "Host": "pinky19.mpi-sws.org",
        "Duration": "209576",
        "HRT": 26962658789892117,
        "Operation": "unset",
        "Timestamp": "1557746298730.305176",
        "TenantClass": 0,
        "Source": "Server.java:1058",
        "ThreadID": 64,
        "ThreadName": "",
        "EventID": "67ED9539129B989E",
        "BaggageBytes": "[[248 5] [240 0] [0 49 153 110 187 136 240 95 105] [240 1] [0 125 28 57 163 115 27 77 7] [240 3] [0 2]]",
        "ProcessID": 2171
      },
      {
        "Cycles": 0,
        "Agent": "Execution-CPU",
        "ProcessName": "Read",
        "TaskID": "31996EBB88F05F69",
        "ParentEventID": [
          "7D1C39A3731B4D07"
        ],
        "Label": "set",
        "Title": "X-Trace Task",
        "Host": "pinky19.mpi-sws.org",
        "HRT": 26962658789970609,
        "Operation": "set",
        "Timestamp": "1557746298730.353271",
        "TenantClass": 0,
        "Source": "Client.java:302",
        "ThreadID": 37,
        "ThreadName": "",
        "EventID": "AA99A5DC49D23D25",
        "ProcessID": 36430
      },
      {
        "Cycles": 0,
        "Agent": "Execution-CPU",
        "ProcessName": "Read",
        "TaskID": "31996EBB88F05F69",
        "ParentEventID": [
          "AA99A5DC49D23D25"
        ],
        "Label": "unset",
        "Title": "X-Trace Task",
        "Host": "pinky19.mpi-sws.org",
        "Duration": "5196",
        "HRT": 26962658789991912,
        "Operation": "unset",
        "Timestamp": "1557746298730.374512",
        "TenantClass": 0,
        "Source": "Client.java:1168",
        "ThreadID": 37,
        "ThreadName": "",
        "EventID": "513E19728DFC1B58",
        "ProcessID": 36430
      },
      {
        "Cycles": 0,
        "Agent": "org.apache.hadoop.hdfs.server.namenode.FSNamesystem.audit",
        "ProcessName": "Name",
        "TaskID": "31996EBB88F05F69",
        "ParentEventID": [
          "95DF3F16D65E5719"
        ],
        "Label": "allowed=true\tugi=plascas (auth:SIMPLE)\tip=/139.19.171.63\tcmd=open\tsrc=/ds/fUSqSpt5gXxrKmjC\tdst=null\tperm=null\tproto=rpc",
        "Title": "X-Trace Task",
        "Host": "pinky19.mpi-sws.org",
        "HRT": 26962658789741914,
        "Timestamp": "1557746298730.155029",
        "TenantClass": 0,
        "Source": "FSNamesystem.java:8313",
        "ThreadID": 64,
        "ThreadName": "",
        "EventID": "A28541389C52FDC4",
        "BaggageBytes": "[[248 5] [240 0] [0 49 153 110 187 136 240 95 105] [240 1] [0 149 223 63 22 214 94 87 25] [240 3] [0 2]]",
        "ProcessID": 2171
      },
      {
        "Cycles": 0,
        "Agent": "Execution-Sleep",
        "ProcessName": "Read",
        "TaskID": "31996EBB88F05F69",
        "ParentEventID": [
          "CC4C7ACF91F37D9A"
        ],
        "Label": "waited",
        "Title": "X-Trace Task",
        "Host": "pinky19.mpi-sws.org",
        "Duration": "459734",
        "HRT": 26962658790031353,
        "Operation": "waited",
        "Timestamp": "1557746298730.414062",
        "TenantClass": 0,
        "Source": "Client.java:1537",
        "ThreadID": 1,
        "ThreadName": "",
        "EventID": "95E5073CB83D56C9",
        "ProcessID": 36430
      },
      {
        "Cycles": 0,
        "Agent": "edu.brown.cs.systems.xtrace.logging.BaggageWrappers",
        "ProcessName": "Read",
        "TaskID": "31996EBB88F05F69",
        "ParentEventID": [
          "95E5073CB83D56C9",
          "513E19728DFC1B58"
        ],
        "Label": "Merged current baggage with other baggage",
        "Title": "X-Trace Task",
        "Host": "pinky19.mpi-sws.org",
        "HRT": 26962658790053464,
        "Operation": "join",
        "Timestamp": "1557746298730.436035",
        "TenantClass": 0,
        "Source": "Client.java:1545",
        "ThreadID": 1,
        "ThreadName": "",
        "EventID": "9DE20D4F94875BB4",
        "ProcessID": 36430
      },
      {
        "Cycles": 0,
        "Agent": "org.apache.hadoop.ipc.ProtobufRpcEngine",
        "ProcessName": "Read",
        "TaskID": "31996EBB88F05F69",
        "ParentEventID": [
          "9DE20D4F94875BB4"
        ],
        "Label": "org.apache.hadoop.hdfs.protocol.ClientProtocol.getBlockLocations completed",
        "Title": "X-Trace Task",
        "Host": "pinky19.mpi-sws.org",
        "HRT": 26962658790088688,
        "Timestamp": "1557746298730.471436",
        "TenantClass": 0,
        "Source": "ProtobufRpcEngine.java:275",
        "ThreadID": 1,
        "ThreadName": "",
        "EventID": "E579178122BD6302",
        "ProcessID": 36430
      },
      {
        "Cycles": 0,
        "Agent": "edu.brown.cs.systems.xtrace.logging.BaggageWrappers",
        "ProcessName": "Read",
        "TaskID": "31996EBB88F05F69",
        "ParentEventID": [
          "E579178122BD6302"
        ],
        "Label": "Forking current baggage with Baggage.fork()",
        "Title": "X-Trace Task",
        "Host": "pinky19.mpi-sws.org",
        "HRT": 26962658790143070,
        "Operation": "fork",
        "Timestamp": "1557746298730.525635",
        "TenantClass": 0,
        "Source": "DataTransferProtoUtil.java:94",
        "ThreadID": 1,
        "ThreadName": "",
        "EventID": "76F2D5AB3FB3CF06",
        "ProcessID": 36430
      },
      {
        "Cycles": 0,
        "Agent": "edu.brown.cs.systems.xtrace.logging.XTraceInit",
        "ProcessName": "Data",
        "TaskID": "31996EBB88F05F69",
        "ParentEventID": [
          "6156D723B29A95E3"
        ],
        "Label": "Thread.setName: DataXceiver for client DFSClient_NONMAPREDUCE_778905418_1 at /139.19.171.63:35320 [Sending block BP-1633380353-139.19.171.63-1554193446451:blk_1073763019_22195]",
        "Title": "X-Trace Task",
        "Host": "pinky21.mpi-sws.org",
        "HRT": 10808968496842626,
        "Timestamp": "1557746298730.937256",
        "TenantClass": 0,
        "Source": "DataXceiver.java:168",
        "ThreadID": 14875,
        "ThreadName": "",
        "EventID": "12063ACC304106C0",
        "BaggageBytes": "[[248 5] [240 0] [0 49 153 110 187 136 240 95 105] [240 1] [0 97 86 215 35 178 154 149 227] [240 3] [0 2]]",
        "ProcessID": 20775
      },
      {
        "Cycles": 0,
        "Agent": "Execution-CPU",
        "ProcessName": "Data",
        "TaskID": "31996EBB88F05F69",
        "ParentEventID": [
          "76F2D5AB3FB3CF06"
        ],
        "Label": "set",
        "Title": "X-Trace Task",
        "Host": "pinky21.mpi-sws.org",
        "HRT": 10808968496741936,
        "Operation": "set",
        "Timestamp": "1557746298730.836426",
        "TenantClass": 0,
        "Source": "Receiver.java:117",
        "ThreadID": 14875,
        "ThreadName": "",
        "EventID": "6156D723B29A95E3",
        "BaggageBytes": "[[248 5] [240 0] [0 49 153 110 187 136 240 95 105] [240 1] [0 118 242 213 171 63 179 207 6] [240 3] [0 2]]",
        "ProcessID": 20775
      },
      {
        "Cycles": 0,
        "Agent": "edu.brown.cs.systems.xtrace.logging.BaggageWrappers",
        "ProcessName": "Data",
        "TaskID": "31996EBB88F05F69",
        "ParentEventID": [
          "12063ACC304106C0"
        ],
        "Label": "Forking current baggage with Baggage.fork()",
        "Title": "X-Trace Task",
        "Host": "pinky21.mpi-sws.org",
        "HRT": 10808968497048870,
        "Operation": "fork",
        "Timestamp": "1557746298731.143311",
        "TenantClass": 0,
        "Source": "DataXceiver.java:1257",
        "ThreadID": 14875,
        "ThreadName": "",
        "EventID": "7275DF3A50CE3D63",
        "BaggageBytes": "[[248 5] [240 0] [0 49 153 110 187 136 240 95 105] [240 1] [0 18 6 58 204 48 65 6 192] [240 3] [0 2]]",
        "ProcessID": 20775
      },
      {
        "Cycles": 0,
        "Agent": "edu.brown.cs.systems.xtrace.logging.BaggageWrappers",
        "ProcessName": "Read",
        "TaskID": "31996EBB88F05F69",
        "ParentEventID": [
          "7D4C2FC256C89317",
          "7275DF3A50CE3D63"
        ],
        "Label": "Merged current baggage with other baggage",
        "Title": "X-Trace Task",
        "Host": "pinky19.mpi-sws.org",
        "HRT": 26962658791006976,
        "Operation": "join",
        "Timestamp": "1557746298731.389648",
        "TenantClass": 0,
        "Source": "RemoteBlockReader2.java:429",
        "ThreadID": 1,
        "ThreadName": "",
        "EventID": "254181AFDD0DDB79",
        "ProcessID": 36430
      },
      {
        "Cycles": 0,
        "Agent": "Execution-Sleep",
        "ProcessName": "Read",
        "TaskID": "31996EBB88F05F69",
        "ParentEventID": [
          "76F2D5AB3FB3CF06"
        ],
        "Label": "waited",
        "Title": "X-Trace Task",
        "Host": "pinky19.mpi-sws.org",
        "Duration": "718520",
        "HRT": 26962658790936558,
        "Operation": "waited",
        "Timestamp": "1557746298731.319092",
        "TenantClass": 0,
        "Source": "SocketIOWithTimeout.java:335",
        "ThreadID": 1,
        "ThreadName": "",
        "EventID": "7D4C2FC256C89317",
        "ProcessID": 36430
      },
      {
        "Cycles": 0,
        "Agent": "edu.brown.cs.systems.xtrace.logging.BaggageWrappers",
        "ProcessName": "Data",
        "TaskID": "31996EBB88F05F69",
        "ParentEventID": [
          "7275DF3A50CE3D63"
        ],
        "Label": "Forking current baggage with Baggage.fork()",
        "Title": "X-Trace Task",
        "Host": "pinky21.mpi-sws.org",
        "HRT": 10808968497237024,
        "Operation": "fork",
        "Timestamp": "1557746298731.331543",
        "TenantClass": 0,
        "Source": "PacketHeader.java:95",
        "ThreadID": 14875,
        "ThreadName": "",
        "EventID": "B23B172BFB6872C4",
        "BaggageBytes": "[[248 5] [240 0] [0 49 153 110 187 136 240 95 105] [240 1] [0 114 117 223 58 80 206 61 99] [240 3] [0 2]]",
        "ProcessID": 20775
      },
      {
        "Cycles": 0,
        "Agent": "Execution-Sleep",
        "ProcessName": "Data",
        "TaskID": "31996EBB88F05F69",
        "ParentEventID": [
          "B23B172BFB6872C4"
        ],
        "Label": "waited",
        "Title": "X-Trace Task",
        "Host": "pinky21.mpi-sws.org",
        "Duration": "11694",
        "HRT": 10808968497411901,
        "Operation": "waited",
        "Timestamp": "1557746298731.506348",
        "TenantClass": 0,
        "Source": "SocketIOWithTimeout.java:335",
        "ThreadID": 14875,
        "ThreadName": "",
        "EventID": "BEB3FBC34508C593",
        "BaggageBytes": "[[248 5] [240 0] [0 49 153 110 187 136 240 95 105] [240 1] [0 178 59 23 43 251 104 114 196] [240 3] [0 2]]",
        "ProcessID": 20775
      },
      {
        "Cycles": 0,
        "Agent": "Execution-Sleep",
        "ProcessName": "Read",
        "TaskID": "31996EBB88F05F69",
        "ParentEventID": [
          "254181AFDD0DDB79"
        ],
        "Label": "waited",
        "Title": "X-Trace Task",
        "Host": "pinky19.mpi-sws.org",
        "Duration": "53088",
        "HRT": 26962658791101812,
        "Operation": "waited",
        "Timestamp": "1557746298731.484375",
        "TenantClass": 0,
        "Source": "SocketIOWithTimeout.java:335",
        "ThreadID": 1,
        "ThreadName": "",
        "EventID": "48ACCC459F53ED36",
        "ProcessID": 36430
      },
      {
        "Cycles": 0,
        "Agent": "edu.brown.cs.systems.xtrace.logging.BaggageWrappers",
        "ProcessName": "Data",
        "TaskID": "31996EBB88F05F69",
        "ParentEventID": [
          "BEB3FBC34508C593"
        ],
        "Label": "Forking current baggage with Baggage.fork()",
        "Title": "X-Trace Task",
        "Host": "pinky21.mpi-sws.org",
        "HRT": 10808968497600872,
        "Operation": "fork",
        "Timestamp": "1557746298731.695312",
        "TenantClass": 0,
        "Source": "PacketHeader.java:95",
        "ThreadID": 14875,
        "ThreadName": "",
        "EventID": "2DB74C1D45CB0141",
        "BaggageBytes": "[[248 5] [240 0] [0 49 153 110 187 136 240 95 105] [240 1] [0 190 179 251 195 69 8 197 147] [240 3] [0 2]]",
        "ProcessID": 20775
      },
      {
        "Cycles": 0,
        "Agent": "Execution-Sleep",
        "ProcessName": "Read",
        "TaskID": "31996EBB88F05F69",
        "ParentEventID": [
          "48ACCC459F53ED36"
        ],
        "Label": "waited",
        "Title": "X-Trace Task",
        "Host": "pinky19.mpi-sws.org",
        "Duration": "246221",
        "HRT": 26962658791412447,
        "Operation": "waited",
        "Timestamp": "1557746298731.795166",
        "TenantClass": 0,
        "Source": "SocketIOWithTimeout.java:335",
        "ThreadID": 1,
        "ThreadName": "",
        "EventID": "FF5D3DCAB45061CA",
        "ProcessID": 36430
      },
      {
        "Cycles": 0,
        "Agent": "edu.brown.cs.systems.xtrace.logging.BaggageWrappers",
        "ProcessName": "Read",
        "TaskID": "31996EBB88F05F69",
        "ParentEventID": [
          "4AFFCBF0E9C688DC",
          "2DB74C1D45CB0141"
        ],
        "Label": "Merged current baggage with other baggage",
        "Title": "X-Trace Task",
        "Host": "pinky19.mpi-sws.org",
        "HRT": 26962658791522069,
        "Operation": "join",
        "Timestamp": "1557746298731.904785",
        "TenantClass": 0,
        "Source": "PacketHeader.java:168",
        "ThreadID": 1,
        "ThreadName": "",
        "EventID": "1195E235A5046A50",
        "ProcessID": 36430
      },
      {
        "Cycles": 0,
        "Agent": "edu.brown.cs.systems.xtrace.logging.BaggageWrappers",
        "ProcessName": "Read",
        "TaskID": "31996EBB88F05F69",
        "ParentEventID": [
          "B23B172BFB6872C4",
          "FF5D3DCAB45061CA"
        ],
        "Label": "Merged current baggage with other baggage",
        "Title": "X-Trace Task",
        "Host": "pinky19.mpi-sws.org",
        "HRT": 26962658791471424,
        "Operation": "join",
        "Timestamp": "1557746298731.854004",
        "TenantClass": 0,
        "Source": "PacketHeader.java:168",
        "ThreadID": 1,
        "ThreadName": "",
        "EventID": "4AFFCBF0E9C688DC",
        "ProcessID": 36430
      },
      {
        "Cycles": 0,
        "Agent": "edu.brown.cs.systems.xtrace.logging.BaggageWrappers",
        "ProcessName": "Read",
        "TaskID": "31996EBB88F05F69",
        "ParentEventID": [
          "1195E235A5046A50"
        ],
        "Label": "Forking current baggage with Baggage.fork()",
        "Title": "X-Trace Task",
        "Host": "pinky19.mpi-sws.org",
        "HRT": 26962658791530972,
        "Operation": "fork",
        "Timestamp": "1557746298731.913574",
        "TenantClass": 0,
        "Source": "RemoteBlockReader2.java:361",
        "ThreadID": 1,
        "ThreadName": "",
        "EventID": "29DEB2FA5AB9AD79",
        "ProcessID": 36430
      },
      {
        "Cycles": 0,
        "Agent": "Execution-Sleep",
        "ProcessName": "Data",
        "TaskID": "31996EBB88F05F69",
        "ParentEventID": [
          "2DB74C1D45CB0141"
        ],
        "Label": "waited",
        "Title": "X-Trace Task",
        "Host": "pinky21.mpi-sws.org",
        "Duration": "60457",
        "HRT": 10808968497896743,
        "Operation": "waited",
        "Timestamp": "1557746298731.991211",
        "TenantClass": 0,
        "Source": "SocketIOWithTimeout.java:335",
        "ThreadID": 14875,
        "ThreadName": "",
        "EventID": "683F527428490956",
        "BaggageBytes": "[[248 5] [240 0] [0 49 153 110 187 136 240 95 105] [240 1] [0 45 183 76 29 69 203 1 65] [240 3] [0 2]]",
        "ProcessID": 20775
      },
      {
        "Cycles": 0,
        "Agent": "edu.brown.cs.systems.xtrace.logging.BaggageWrappers",
        "ProcessName": "Data",
        "TaskID": "31996EBB88F05F69",
        "ParentEventID": [
          "29DEB2FA5AB9AD79",
          "683F527428490956"
        ],
        "Label": "Merged current baggage with other baggage",
        "Title": "X-Trace Task",
        "Host": "pinky21.mpi-sws.org",
        "HRT": 10808968498028440,
        "Operation": "join",
        "Timestamp": "1557746298732.123047",
        "TenantClass": 0,
        "Source": "DataXceiver.java:574",
        "ThreadID": 14875,
        "ThreadName": "",
        "EventID": "D420EB7C2586DA17",
        "BaggageBytes": "[[248 5] [240 0] [0 49 153 110 187 136 240 95 105] [240 1] [0 41 222 178 250 90 185 173 121] [0 104 63 82 116 40 73 9 86] [240 3] [0 2]]",
        "ProcessID": 20775
      },
      {
        "Cycles": 0,
        "Agent": "Execution-CPU",
        "ProcessName": "Data",
        "TaskID": "31996EBB88F05F69",
        "ParentEventID": [
          "D420EB7C2586DA17"
        ],
        "Label": "unset",
        "Title": "X-Trace Task",
        "Host": "pinky21.mpi-sws.org",
        "Duration": "1272050",
        "HRT": 10808968498087010,
        "Operation": "unset",
        "Timestamp": "1557746298732.181641",
        "TenantClass": 0,
        "Source": "DataXceiver.java:261",
        "ThreadID": 14875,
        "ThreadName": "",
        "EventID": "70F34E0E66619801",
        "BaggageBytes": "[[248 5] [240 0] [0 49 153 110 187 136 240 95 105] [240 1] [0 212 32 235 124 37 134 218 23] [240 3] [0 2]]",
        "ProcessID": 20775
      },
      {
        "Cycles": 0,
        "Agent": "edu.brown.cs.systems.retro.benchmarks.hdfs_client.Reader",
        "ProcessName": "Read",
        "TaskID": "31996EBB88F05F69",
        "ParentEventID": [
          "3B41DDBCE17FFA36"
        ],
        "Label": "Reading file",
        "Title": "X-Trace Task",
        "Host": "pinky19.mpi-sws.org",
        "HRT": 26962658789365410,
        "Timestamp": "1557746298729.748047",
        "TenantClass": 0,
        "ThreadID": 1,
        "ThreadName": "",
        "EventID": "AF530F60CB646AB4",
        "ProcessID": 36430
      }
    ]
  }
]