[
  {
    "id": "86570B5B075ED878",
    "reports": [
      {
        "Cycles": 0,
        "Agent": "org.apache.hadoop.ipc.ProtobufRpcEngine",
        "ProcessName": "Read",
        "TaskID": "86570B5B075ED878",
        "ParentEventID": [
          "A9D28ADFD5AB98A3"
        ],
        "Label": "Invoking org.apache.hadoop.hdfs.protocol.ClientProtocol.getBlockLocations",
        "Title": "X-Trace Task",
        "Host": "pinky19.mpi-sws.org",
        "HRT": 26966769907745751,
        "Timestamp": "1557750409848.025635",
        "TenantClass": 0,
        "Source": "ProtobufRpcEngine.java:228",
        "ThreadID": 1,
        "ThreadName": "",
        "EventID": "E9C79E4EF6A21E80",
        "ProcessID": 2801
      },
      {
        "Cycles": 0,
        "Agent": "Execution-CPU",
        "ProcessName": "Read",
        "TaskID": "86570B5B075ED878",
        "ParentEventID": [
          "2B79838A90E5E6C9"
        ],
        "Label": "set",
        "Title": "X-Trace Task",
        "Host": "pinky19.mpi-sws.org",
        "HRT": 26966769907805428,
        "Operation": "set",
        "Timestamp": "1557750409848.085449",
        "TenantClass": 0,
        "Source": "Client.java:1032",
        "ThreadID": 41,
        "ThreadName": "",
        "EventID": "B8F5C69A4B08C787",
        "ProcessID": 2801
      },
      {
        "Cycles": 0,
        "Agent": "edu.brown.cs.systems.xtrace.logging.BaggageWrappers",
        "ProcessName": "Read",
        "TaskID": "86570B5B075ED878",
        "ParentEventID": [
          "B8F5C69A4B08C787"
        ],
        "Label": "Forking current baggage with Baggage.fork()",
        "Title": "X-Trace Task",
        "Host": "pinky19.mpi-sws.org",
        "HRT": 26966769907826878,
        "Operation": "fork",
        "Timestamp": "1557750409848.106934",
        "TenantClass": 0,
        "Source": "Client.java:1043",
        "ThreadID": 41,
        "ThreadName": "",
        "EventID": "D0320DC218941130",
        "ProcessID": 2801
      },
      {
        "Cycles": 0,
        "Agent": "Execution-CPU",
        "ProcessName": "Read",
        "TaskID": "86570B5B075ED878",
        "ParentEventID": [
          "D0320DC218941130"
        ],
        "Label": "unset",
        "Title": "X-Trace Task",
        "Host": "pinky19.mpi-sws.org",
        "Duration": "69913",
        "HRT": 26966769907896033,
        "Operation": "unset",
        "Timestamp": "1557750409848.176025",
        "TenantClass": 0,
        "Source": "Client.java:1062",
        "ThreadID": 41,
        "ThreadName": "",
        "EventID": "70CEB94B00AE09D6",
        "ProcessID": 2801
      },
      {
        "Cycles": 0,
        "Agent": "edu.brown.cs.systems.retro.benchmarks.hdfs_client.Reader",
        "ProcessName": "Read",
        "TaskID": "86570B5B075ED878",
        "ParentEventID": [
          "A736B034B259B353"
        ],
        "Label": "Reading file",
        "Title": "X-Trace Task",
        "Host": "pinky19.mpi-sws.org",
        "HRT": 26966769907702463,
        "Timestamp": "1557750409847.982422",
        "TenantClass": 0,
        "ThreadID": 1,
        "ThreadName": "",
        "EventID": "A9D28ADFD5AB98A3",
        "ProcessID": 2801
      },
      {
        "Cycles": 0,
        "Agent": "Execution-CPU",
        "ProcessName": "Read",
        "TaskID": "86570B5B075ED878",
        "ParentEventID": [
          "E9C79E4EF6A21E80"
        ],
        "Label": "unset",
        "Title": "X-Trace Task",
        "Host": "pinky19.mpi-sws.org",
        "Duration": "24994498",
        "HRT": 26966769907762664,
        "Operation": "unset",
        "Timestamp": "1557750409848.042725",
        "TenantClass": 0,
        "Source": "Client.java:1027",
        "ThreadID": 1,
        "ThreadName": "",
        "EventID": "2B79838A90E5E6C9",
        "ProcessID": 2801
      },
      {
        "Cycles": 0,
        "Agent": "Execution-CPU",
        "ProcessName": "Read",
        "TaskID": "86570B5B075ED878",
        "ParentEventID": [
          "70CEB94B00AE09D6"
        ],
        "Label": "set",
        "Title": "X-Trace Task",
        "Host": "pinky19.mpi-sws.org",
        "HRT": 26966769907919313,
        "Operation": "set",
        "Timestamp": "1557750409848.199219",
        "TenantClass": 0,
        "Source": "Client.java:1104",
        "ThreadID": 1,
        "ThreadName": "",
        "EventID": "6843FA25CBB55F91",
        "ProcessID": 2801
      },
      {
        "Cycles": 0,
        "Agent": "Execution-CPU",
        "ProcessName": "Name",
        "TaskID": "86570B5B075ED878",
        "ParentEventID": [
          "D0320DC218941130"
        ],
        "Label": "set",
        "Title": "X-Trace Task",
        "Host": "pinky19.mpi-sws.org",
        "HRT": 26966769907957852,
        "Operation": "set",
        "Timestamp": "1557750409848.260254",
        "TenantClass": 0,
        "Source": "Server.java:1840",
        "ThreadID": 48,
        "ThreadName": "",
        "EventID": "215D8B666A4B78E6",
        "BaggageBytes": "[[248 5] [240 0] [0 134 87 11 91 7 94 216 120] [240 1] [0 208 50 13 194 24 148 17 48] [240 3] [0 2]]",
        "ProcessID": 2171
      },
      {
        "Cycles": 0,
        "Agent": "Execution-CPU",
        "ProcessName": "Name",
        "TaskID": "86570B5B075ED878",
        "ParentEventID": [
          "9A4712ABDEE93848"
        ],
        "Label": "unset",
        "Title": "X-Trace Task",
        "Host": "pinky19.mpi-sws.org",
        "Duration": "27865",
        "HRT": 26966769908018793,
        "Operation": "unset",
        "Timestamp": "1557750409848.321289",
        "TenantClass": 0,
        "Source": "Server.java:1828",
        "ThreadID": 48,
        "ThreadName": "",
        "EventID": "F34C4DB2025AA36F",
        "BaggageBytes": "[[248 5] [240 0] [0 134 87 11 91 7 94 216 120] [240 1] [0 154 71 18 171 222 233 56 72] [240 3] [0 2]]",
        "ProcessID": 2171
      },
      {
        "Cycles": 0,
        "Agent": "Execution-CPU",
        "ProcessName": "Name",
        "TaskID": "86570B5B075ED878",
        "ParentEventID": [
          "9A4712ABDEE93848"
        ],
        "Label": "set",
        "Title": "X-Trace Task",
        "Host": "pinky19.mpi-sws.org",
        "HRT": 26966769908028697,
        "Operation": "set",
        "Timestamp": "1557750409848.331055",
        "TenantClass": 0,
        "Source": "Server.java:2071",
        "ThreadID": 57,
        "ThreadName": "",
        "EventID": "07FACE1633F4C40C",
        "BaggageBytes": "[[248 5] [240 0] [0 134 87 11 91 7 94 216 120] [240 1] [0 154 71 18 171 222 233 56 72] [240 3] [0 2]]",
        "ProcessID": 2171
      },
      {
        "Cycles": 0,
        "Agent": "org.apache.hadoop.ipc.Server",
        "ProcessName": "Name",
        "TaskID": "86570B5B075ED878",
        "ParentEventID": [
          "07FACE1633F4C40C"
        ],
        "Label": "getBlockLocations in org.apache.hadoop.hdfs.protocol.ClientProtocol",
        "Title": "X-Trace Task",
        "Host": "pinky19.mpi-sws.org",
        "HRT": 26966769908062585,
        "Timestamp": "1557750409848.364990",
        "TenantClass": 0,
        "Source": "ProtobufRpcEngine.java:601",
        "ThreadID": 57,
        "ThreadName": "",
        "EventID": "8829DC3ED1272AA6",
        "BaggageBytes": "[[248 5] [240 0] [0 134 87 11 91 7 94 216 120] [240 1] [0 7 250 206 22 51 244 196 12] [240 3] [0 2]]",
        "ProcessID": 2171
      },
      {
        "Cycles": 0,
        "Agent": "org.apache.hadoop.hdfs.server.namenode.FSNamesystem.audit",
        "ProcessName": "Name",
        "TaskID": "86570B5B075ED878",
        "ParentEventID": [
          "8829DC3ED1272AA6"
        ],
        "Label": "allowed=true\tugi=plascas (auth:SIMPLE)\tip=/139.19.171.63\tcmd=open\tsrc=/ds/0Jgg2ru7Wz2XaiPe\tdst=null\tperm=null\tproto=rpc",
        "Title": "X-Trace Task",
        "Host": "pinky19.mpi-sws.org",
        "HRT": 26966769908108263,
        "Timestamp": "1557750409848.410645",
        "TenantClass": 0,
        "Source": "FSNamesystem.java:8313",
        "ThreadID": 57,
        "ThreadName": "",
        "EventID": "F88E294F3CF694F4",
        "BaggageBytes": "[[248 5] [240 0] [0 134 87 11 91 7 94 216 120] [240 1] [0 136 41 220 62 209 39 42 166] [240 3] [0 2]]",
        "ProcessID": 2171
      },
      {
        "Cycles": 0,
        "Agent": "edu.brown.cs.systems.xtrace.logging.BaggageWrappers",
        "ProcessName": "Name",
        "TaskID": "86570B5B075ED878",
        "ParentEventID": [
          "215D8B666A4B78E6"
        ],
        "Label": "Forking current baggage with Baggage.fork()",
        "Title": "X-Trace Task",
        "Host": "pinky19.mpi-sws.org",
        "HRT": 26966769907995601,
        "Operation": "fork",
        "Timestamp": "1557750409848.298096",
        "TenantClass": 0,
        "Source": "Server.java:550",
        "ThreadID": 48,
        "ThreadName": "",
        "EventID": "9A4712ABDEE93848",
        "BaggageBytes": "[[248 5] [240 0] [0 134 87 11 91 7 94 216 120] [240 1] [0 33 93 139 102 106 75 120 230] [240 3] [0 2]]",
        "ProcessID": 2171
      },
      {
        "Cycles": 0,
        "Agent": "edu.brown.cs.systems.xtrace.logging.BaggageWrappers",
        "ProcessName": "Name",
        "TaskID": "86570B5B075ED878",
        "ParentEventID": [
          "F88E294F3CF694F4"
        ],
        "Label": "Forking current baggage with Baggage.fork()",
        "Title": "X-Trace Task",
        "Host": "pinky19.mpi-sws.org",
        "HRT": 26966769908151995,
        "Operation": "fork",
        "Timestamp": "1557750409848.454346",
        "TenantClass": 0,
        "Source": "Server.java:2398",
        "ThreadID": 57,
        "ThreadName": "",
        "EventID": "363D1C407C16AE15",
        "BaggageBytes": "[[248 5] [240 0] [0 134 87 11 91 7 94 216 120] [240 1] [0 248 142 41 79 60 246 148 244] [240 3] [0 2]]",
        "ProcessID": 2171
      },
      {
        "Cycles": 0,
        "Agent": "Execution-CPU",
        "ProcessName": "Read",
        "TaskID": "86570B5B075ED878",
        "ParentEventID": [
          "363D1C407C16AE15"
        ],
        "Label": "set",
        "Title": "X-Trace Task",
        "Host": "pinky19.mpi-sws.org",
        "HRT": 26966769908328035,
        "Operation": "set",
        "Timestamp": "1557750409848.607910",
        "TenantClass": 0,
        "Source": "Client.java:302",
        "ThreadID": 40,
        "ThreadName": "",
        "EventID": "8BBEC82CFF47119F",
        "ProcessID": 2801
      },
      {
        "Cycles": 0,
        "Agent": "Execution-CPU",
        "ProcessName": "Read",
        "TaskID": "86570B5B075ED878",
        "ParentEventID": [
          "8BBEC82CFF47119F"
        ],
        "Label": "unset",
        "Title": "X-Trace Task",
        "Host": "pinky19.mpi-sws.org",
        "Duration": "7673",
        "HRT": 26966769908353251,
        "Operation": "unset",
        "Timestamp": "1557750409848.633301",
        "TenantClass": 0,
        "Source": "Client.java:1168",
        "ThreadID": 40,
        "ThreadName": "",
        "EventID": "583C34D297726F0E",
        "ProcessID": 2801
      },
      {
        "Cycles": 0,
        "Agent": "Execution-CPU",
        "ProcessName": "Name",
        "TaskID": "86570B5B075ED878",
        "ParentEventID": [
          "363D1C407C16AE15"
        ],
        "Label": "unset",
        "Title": "X-Trace Task",
        "Host": "pinky19.mpi-sws.org",
        "Duration": "204268",
        "HRT": 26966769908254772,
        "Operation": "unset",
        "Timestamp": "1557750409848.557129",
        "TenantClass": 0,
        "Source": "Server.java:1058",
        "ThreadID": 57,
        "ThreadName": "",
        "EventID": "B0E6B02014280C6D",
        "BaggageBytes": "[[248 5] [240 0] [0 134 87 11 91 7 94 216 120] [240 1] [0 54 61 28 64 124 22 174 21] [240 3] [0 2]]",
        "ProcessID": 2171
      },
      {
        "Cycles": 0,
        "Agent": "Execution-Sleep",
        "ProcessName": "Read",
        "TaskID": "86570B5B075ED878",
        "ParentEventID": [
          "6843FA25CBB55F91"
        ],
        "Label": "waited",
        "Title": "X-Trace Task",
        "Host": "pinky19.mpi-sws.org",
        "Duration": "445485",
        "HRT": 26966769908375093,
        "Operation": "waited",
        "Timestamp": "1557750409848.655029",
        "TenantClass": 0,
        "Source": "Client.java:1537",
        "ThreadID": 1,
        "ThreadName": "",
        "EventID": "B335657EBA8B1AEF",
        "ProcessID": 2801
      },
      {
        "Cycles": 0,
        "Agent": "edu.brown.cs.systems.xtrace.logging.BaggageWrappers",
        "ProcessName": "Read",
        "TaskID": "86570B5B075ED878",
        "ParentEventID": [
          "583C34D297726F0E",
          "B335657EBA8B1AEF"
        ],
        "Label": "Merged current baggage with other baggage",
        "Title": "X-Trace Task",
        "Host": "pinky19.mpi-sws.org",
        "HRT": 26966769908390209,
        "Operation": "join",
        "Timestamp": "1557750409848.670166",
        "TenantClass": 0,
        "Source": "Client.java:1545",
        "ThreadID": 1,
        "ThreadName": "",
        "EventID": "BD8C98E59CE2D963",
        "ProcessID": 2801
      },
      {
        "Cycles": 0,
        "Agent": "org.apache.hadoop.ipc.ProtobufRpcEngine",
        "ProcessName": "Read",
        "TaskID": "86570B5B075ED878",
        "ParentEventID": [
          "BD8C98E59CE2D963"
        ],
        "Label": "org.apache.hadoop.hdfs.protocol.ClientProtocol.getBlockLocations completed",
        "Title": "X-Trace Task",
        "Host": "pinky19.mpi-sws.org",
        "HRT": 26966769908466676,
        "Timestamp": "1557750409848.746582",
        "TenantClass": 0,
        "Source": "ProtobufRpcEngine.java:275",
        "ThreadID": 1,
        "ThreadName": "",
        "EventID": "24F60D1C2C4D0DFF",
        "ProcessID": 2801
      },
      {
        "Cycles": 0,
        "Agent": "Execution-Sleep",
        "ProcessName": "Read",
        "TaskID": "86570B5B075ED878",
        "ParentEventID": [
          "24F60D1C2C4D0DFF"
        ],
        "Label": "waited",
        "Title": "X-Trace Task",
        "Host": "pinky19.mpi-sws.org",
        "Duration": "123271",
        "HRT": 26966769908692020,
        "Operation": "waited",
        "Timestamp": "1557750409848.971924",
        "TenantClass": 0,
        "Source": "SocketIOWithTimeout.java:335",
        "ThreadID": 1,
        "ThreadName": "",
        "EventID": "E356F83F75299B5C",
        "ProcessID": 2801
      },
      {
        "Cycles": 0,
        "Agent": "Execution-CPU",
        "ProcessName": "Data",
        "TaskID": "86570B5B075ED878",
        "ParentEventID": [
          "422C1BDBDBA20CCA"
        ],
        "Label": "set",
        "Title": "X-Trace Task",
        "Host": "pinky20.mpi-sws.org",
        "HRT": 6569974268206890,
        "Operation": "set",
        "Timestamp": "1557750409849.353271",
        "TenantClass": 0,
        "Source": "Receiver.java:117",
        "ThreadID": 15309,
        "ThreadName": "",
        "EventID": "CAD5913C5CC35C66",
        "BaggageBytes": "[[248 5] [240 0] [0 134 87 11 91 7 94 216 120] [240 1] [0 66 44 27 219 219 162 12 202] [240 3] [0 2]]",
        "ProcessID": 13111
      },
      {
        "Cycles": 0,
        "Agent": "edu.brown.cs.systems.xtrace.logging.BaggageWrappers",
        "ProcessName": "Read",
        "TaskID": "86570B5B075ED878",
        "ParentEventID": [
          "E356F83F75299B5C"
        ],
        "Label": "Forking current baggage with Baggage.fork()",
        "Title": "X-Trace Task",
        "Host": "pinky19.mpi-sws.org",
        "HRT": 26966769908733522,
        "Operation": "fork",
        "Timestamp": "1557750409849.013428",
        "TenantClass": 0,
        "Source": "DataTransferProtoUtil.java:94",
        "ThreadID": 1,
        "ThreadName": "",
        "EventID": "422C1BDBDBA20CCA",
        "ProcessID": 2801
      },
      {
        "Cycles": 0,
        "Agent": "edu.brown.cs.systems.xtrace.logging.XTraceInit",
        "ProcessName": "Data",
        "TaskID": "86570B5B075ED878",
        "ParentEventID": [
          "CAD5913C5CC35C66"
        ],
        "Label": "Thread.setName: DataXceiver for client DFSClient_NONMAPREDUCE_310321604_1 at /139.19.171.63:57134 [Sending block BP-1633380353-139.19.171.63-1554193446451:blk_1073769710_28886]",
        "Title": "X-Trace Task",
        "Host": "pinky20.mpi-sws.org",
        "HRT": 6569974268322480,
        "Timestamp": "1557750409849.468750",
        "TenantClass": 0,
        "Source": "DataXceiver.java:168",
        "ThreadID": 15309,
        "ThreadName": "",
        "EventID": "8BFD8CEB9D30C0BB",
        "BaggageBytes": "[[248 5] [240 0] [0 134 87 11 91 7 94 216 120] [240 1] [0 202 213 145 60 92 195 92 102] [240 3] [0 2]]",
        "ProcessID": 13111
      },
      {
        "Cycles": 0,
        "Agent": "Execution-Sleep",
        "ProcessName": "Read",
        "TaskID": "86570B5B075ED878",
        "ParentEventID": [
          "422C1BDBDBA20CCA"
        ],
        "Label": "waited",
        "Title": "X-Trace Task",
        "Host": "pinky19.mpi-sws.org",
        "Duration": "765691",
        "HRT": 26966769909584026,
        "Operation": "waited",
        "Timestamp": "1557750409849.864014",
        "TenantClass": 0,
        "Source": "SocketIOWithTimeout.java:335",
        "ThreadID": 1,
        "ThreadName": "",
        "EventID": "CD7A5B86C94CEE86",
        "ProcessID": 2801
      },
      {
        "Cycles": 0,
        "Agent": "edu.brown.cs.systems.xtrace.logging.BaggageWrappers",
        "ProcessName": "Data",
        "TaskID": "86570B5B075ED878",
        "ParentEventID": [
          "8BFD8CEB9D30C0BB"
        ],
        "Label": "Forking current baggage with Baggage.fork()",
        "Title": "X-Trace Task",
        "Host": "pinky20.mpi-sws.org",
        "HRT": 6569974268555994,
        "Operation": "fork",
        "Timestamp": "1557750409849.702148",
        "TenantClass": 0,
        "Source": "DataXceiver.java:1257",
        "ThreadID": 15309,
        "ThreadName": "",
        "EventID": "73313CDBF65C7E17",
        "BaggageBytes": "[[248 5] [240 0] [0 134 87 11 91 7 94 216 120] [240 1] [0 139 253 140 235 157 48 192 187] [240 3] [0 2]]",
        "ProcessID": 13111
      },
      {
        "Cycles": 0,
        "Agent": "edu.brown.cs.systems.xtrace.logging.BaggageWrappers",
        "ProcessName": "Read",
        "TaskID": "86570B5B075ED878",
        "ParentEventID": [
          "73313CDBF65C7E17",
          "CD7A5B86C94CEE86"
        ],
        "Label": "Merged current baggage with other baggage",
        "Title": "X-Trace Task",
        "Host": "pinky19.mpi-sws.org",
        "HRT": 26966769909645857,
        "Operation": "join",
        "Timestamp": "1557750409849.925781",
        "TenantClass": 0,
        "Source": "RemoteBlockReader2.java:429",
        "ThreadID": 1,
        "ThreadName": "",
        "EventID": "EDDA3939C66AC5DF",
        "ProcessID": 2801
      },
      {
        "Cycles": 0,
        "Agent": "edu.brown.cs.systems.xtrace.logging.BaggageWrappers",
        "ProcessName": "Data",
        "TaskID": "86570B5B075ED878",
        "ParentEventID": [
          "73313CDBF65C7E17"
        ],
        "Label": "Forking current baggage with Baggage.fork()",
        "Title": "X-Trace Task",
        "Host": "pinky20.mpi-sws.org",
        "HRT": 6569974268717797,
        "Operation": "fork",
        "Timestamp": "1557750409849.864014",
        "TenantClass": 0,
        "Source": "PacketHeader.java:95",
        "ThreadID": 15309,
        "ThreadName": "",
        "EventID": "7512B9695B9BA247",
        "BaggageBytes": "[[248 5] [240 0] [0 134 87 11 91 7 94 216 120] [240 1] [0 115 49 60 219 246 92 126 23] [240 3] [0 2]]",
        "ProcessID": 13111
      },
      {
        "Cycles": 0,
        "Agent": "Execution-Sleep",
        "ProcessName": "Read",
        "TaskID": "86570B5B075ED878",
        "ParentEventID": [
          "EDDA3939C66AC5DF"
        ],
        "Label": "waited",
        "Title": "X-Trace Task",
        "Host": "pinky19.mpi-sws.org",
        "Duration": "41725",
        "HRT": 26966769909739577,
        "Operation": "waited",
        "Timestamp": "1557750409850.019531",
        "TenantClass": 0,
        "Source": "SocketIOWithTimeout.java:335",
        "ThreadID": 1,
        "ThreadName": "",
        "EventID": "3BE5BE7398458A29",
        "ProcessID": 2801
      },
      {
        "Cycles": 0,
        "Agent": "edu.brown.cs.systems.xtrace.logging.BaggageWrappers",
        "ProcessName": "Data",
        "TaskID": "86570B5B075ED878",
        "ParentEventID": [
          "43807F4B96370523"
        ],
        "Label": "Forking current baggage with Baggage.fork()",
        "Title": "X-Trace Task",
        "Host": "pinky20.mpi-sws.org",
        "HRT": 6569974269051051,
        "Operation": "fork",
        "Timestamp": "1557750409850.197266",
        "TenantClass": 0,
        "Source": "PacketHeader.java:95",
        "ThreadID": 15309,
        "ThreadName": "",
        "EventID": "7C7B6C5EE9AD5CC4",
        "BaggageBytes": "[[248 5] [240 0] [0 134 87 11 91 7 94 216 120] [240 1] [0 67 128 127 75 150 55 5 35] [240 3] [0 2]]",
        "ProcessID": 13111
      },
      {
        "Cycles": 0,
        "Agent": "Execution-Sleep",
        "ProcessName": "Data",
        "TaskID": "86570B5B075ED878",
        "ParentEventID": [
          "7512B9695B9BA247"
        ],
        "Label": "waited",
        "Title": "X-Trace Task",
        "Host": "pinky20.mpi-sws.org",
        "Duration": "14023",
        "HRT": 6569974268870628,
        "Operation": "waited",
        "Timestamp": "1557750409850.016846",
        "TenantClass": 0,
        "Source": "SocketIOWithTimeout.java:335",
        "ThreadID": 15309,
        "ThreadName": "",
        "EventID": "43807F4B96370523",
        "BaggageBytes": "[[248 5] [240 0] [0 134 87 11 91 7 94 216 120] [240 1] [0 117 18 185 105 91 155 162 71] [240 3] [0 2]]",
        "ProcessID": 13111
      },
      {
        "Cycles": 0,
        "Agent": "Execution-Sleep",
        "ProcessName": "Read",
        "TaskID": "86570B5B075ED878",
        "ParentEventID": [
          "3BE5BE7398458A29"
        ],
        "Label": "waited",
        "Title": "X-Trace Task",
        "Host": "pinky19.mpi-sws.org",
        "Duration": "339678",
        "HRT": 26966769910133229,
        "Operation": "waited",
        "Timestamp": "1557750409850.413330",
        "TenantClass": 0,
        "Source": "SocketIOWithTimeout.java:335",
        "ThreadID": 1,
        "ThreadName": "",
        "EventID": "8EA43735A19EA078",
        "ProcessID": 2801
      },
      {
        "Cycles": 0,
        "Agent": "Execution-Sleep",
        "ProcessName": "Read",
        "TaskID": "86570B5B075ED878",
        "ParentEventID": [
          "8EA3CC4B1D0C7F74"
        ],
        "Label": "waited",
        "Title": "X-Trace Task",
        "Host": "pinky19.mpi-sws.org",
        "Duration": "140149",
        "HRT": 26966769910617496,
        "Operation": "waited",
        "Timestamp": "1557750409850.897461",
        "TenantClass": 0,
        "Source": "SocketIOWithTimeout.java:335",
        "ThreadID": 1,
        "ThreadName": "",
        "EventID": "8E7C8C7BE31515CA",
        "ProcessID": 2801
      },
      {
        "Cycles": 0,
        "Agent": "Execution-Sleep",
        "ProcessName": "Read",
        "TaskID": "86570B5B075ED878",
        "ParentEventID": [
          "8EA43735A19EA078"
        ],
        "Label": "waited",
        "Title": "X-Trace Task",
        "Host": "pinky19.mpi-sws.org",
        "Duration": "228969",
        "HRT": 26966769910409994,
        "Operation": "waited",
        "Timestamp": "1557750409850.689941",
        "TenantClass": 0,
        "Source": "SocketIOWithTimeout.java:335",
        "ThreadID": 1,
        "ThreadName": "",
        "EventID": "8EA3CC4B1D0C7F74",
        "ProcessID": 2801
      },
      {
        "Cycles": 0,
        "Agent": "edu.brown.cs.systems.xtrace.logging.BaggageWrappers",
        "ProcessName": "Read",
        "TaskID": "86570B5B075ED878",
        "ParentEventID": [
          "7512B9695B9BA247",
          "8E7C8C7BE31515CA"
        ],
        "Label": "Merged current baggage with other baggage",
        "Title": "X-Trace Task",
        "Host": "pinky19.mpi-sws.org",
        "HRT": 26966769910672511,
        "Operation": "join",
        "Timestamp": "1557750409850.952393",
        "TenantClass": 0,
        "Source": "PacketHeader.java:168",
        "ThreadID": 1,
        "ThreadName": "",
        "EventID": "084760A63F2E24FA",
        "ProcessID": 2801
      },
      {
        "Cycles": 0,
        "Agent": "edu.brown.cs.systems.xtrace.logging.BaggageWrappers",
        "ProcessName": "Read",
        "TaskID": "86570B5B075ED878",
        "ParentEventID": [
          "084760A63F2E24FA",
          "7C7B6C5EE9AD5CC4"
        ],
        "Label": "Merged current baggage with other baggage",
        "Title": "X-Trace Task",
        "Host": "pinky19.mpi-sws.org",
        "HRT": 26966769910771486,
        "Operation": "join",
        "Timestamp": "1557750409851.051514",
        "TenantClass": 0,
        "Source": "PacketHeader.java:168",
        "ThreadID": 1,
        "ThreadName": "",
        "EventID": "EFACCCC5867ACB9E",
        "ProcessID": 2801
      },
      {
        "Cycles": 0,
        "Agent": "edu.brown.cs.systems.xtrace.logging.BaggageWrappers",
        "ProcessName": "Read",
        "TaskID": "86570B5B075ED878",
        "ParentEventID": [
          "EFACCCC5867ACB9E"
        ],
        "Label": "Forking current baggage with Baggage.fork()",
        "Title": "X-Trace Task",
        "Host": "pinky19.mpi-sws.org",
        "HRT": 26966769910781207,
        "Operation": "fork",
        "Timestamp": "1557750409851.061279",
        "TenantClass": 0,
        "Source": "RemoteBlockReader2.java:361",
        "ThreadID": 1,
        "ThreadName": "",
        "EventID": "B898D076F5DBC55D",
        "ProcessID": 2801
      },
      {
        "Cycles": 0,
        "Agent": "Execution-Sleep",
        "ProcessName": "Data",
        "TaskID": "86570B5B075ED878",
        "ParentEventID": [
          "7C7B6C5EE9AD5CC4"
        ],
        "Label": "waited",
        "Title": "X-Trace Task",
        "Host": "pinky20.mpi-sws.org",
        "Duration": "754545",
        "HRT": 6569974269987202,
        "Operation": "waited",
        "Timestamp": "1557750409851.133545",
        "TenantClass": 0,
        "Source": "SocketIOWithTimeout.java:335",
        "ThreadID": 15309,
        "ThreadName": "",
        "EventID": "CF76FB4A248370E4",
        "BaggageBytes": "[[248 5] [240 0] [0 134 87 11 91 7 94 216 120] [240 1] [0 124 123 108 94 233 173 92 196] [240 3] [0 2]]",
        "ProcessID": 13111
      },
      {
        "Cycles": 0,
        "Agent": "edu.brown.cs.systems.xtrace.logging.BaggageWrappers",
        "ProcessName": "Read",
        "TaskID": "86570B5B075ED878",
        "ParentEventID": [
          "B898D076F5DBC55D"
        ],
        "Label": "Forking current baggage with Baggage.fork()",
        "Title": "X-Trace Task",
        "Host": "pinky19.mpi-sws.org",
        "HRT": 26966769910836495,
        "Operation": "fork",
        "Timestamp": "1557750409851.116455",
        "TenantClass": 0,
        "Source": "DataTransferProtoUtil.java:94",
        "ThreadID": 1,
        "ThreadName": "",
        "EventID": "8442C37E73E54420",
        "ProcessID": 2801
      },
      {
        "Cycles": 0,
        "Agent": "edu.brown.cs.systems.xtrace.logging.BaggageWrappers",
        "ProcessName": "Data",
        "TaskID": "86570B5B075ED878",
        "ParentEventID": [
          "CF76FB4A248370E4",
          "B898D076F5DBC55D"
        ],
        "Label": "Merged current baggage with other baggage",
        "Title": "X-Trace Task",
        "Host": "pinky20.mpi-sws.org",
        "HRT": 6569974270078016,
        "Operation": "join",
        "Timestamp": "1557750409851.224365",
        "TenantClass": 0,
        "Source": "DataXceiver.java:574",
        "ThreadID": 15309,
        "ThreadName": "",
        "EventID": "C61266B7BC772D06",
        "BaggageBytes": "[[248 5] [240 0] [0 134 87 11 91 7 94 216 120] [240 1] [0 184 152 208 118 245 219 197 93] [0 207 118 251 74 36 131 112 228] [240 3] [0 2]]",
        "ProcessID": 13111
      },
      {
        "Cycles": 0,
        "Agent": "Execution-CPU",
        "ProcessName": "Data",
        "TaskID": "86570B5B075ED878",
        "ParentEventID": [
          "8442C37E73E54420"
        ],
        "Label": "set",
        "Title": "X-Trace Task",
        "Host": "pinky20.mpi-sws.org",
        "HRT": 6569974270143073,
        "Operation": "set",
        "Timestamp": "1557750409851.289307",
        "TenantClass": 0,
        "Source": "Receiver.java:117",
        "ThreadID": 15309,
        "ThreadName": "",
        "EventID": "30595BD41078C9B9",
        "BaggageBytes": "[[248 5] [240 0] [0 134 87 11 91 7 94 216 120] [240 1] [0 132 66 195 126 115 229 68 32] [240 3] [0 2]]",
        "ProcessID": 13111
      },
      {
        "Cycles": 0,
        "Agent": "Execution-CPU",
        "ProcessName": "Data",
        "TaskID": "86570B5B075ED878",
        "ParentEventID": [
          "C61266B7BC772D06"
        ],
        "Label": "unset",
        "Title": "X-Trace Task",
        "Host": "pinky20.mpi-sws.org",
        "Duration": "1813574",
        "HRT": 6569974270103421,
        "Operation": "unset",
        "Timestamp": "1557750409851.249756",
        "TenantClass": 0,
        "Source": "DataXceiver.java:261",
        "ThreadID": 15309,
        "ThreadName": "",
        "EventID": "76447112DDD3701B",
        "BaggageBytes": "[[248 5] [240 0] [0 134 87 11 91 7 94 216 120] [240 1] [0 198 18 102 183 188 119 45 6] [240 3] [0 2]]",
        "ProcessID": 13111
      },
      {
        "Cycles": 0,
        "Agent": "edu.brown.cs.systems.xtrace.logging.XTraceInit",
        "ProcessName": "Data",
        "TaskID": "86570B5B075ED878",
        "ParentEventID": [
          "30595BD41078C9B9"
        ],
        "Label": "Thread.setName: DataXceiver for client DFSClient_NONMAPREDUCE_310321604_1 at /139.19.171.63:57134 [Sending block BP-1633380353-139.19.171.63-1554193446451:blk_1073769710_28886]",
        "Title": "X-Trace Task",
        "Host": "pinky20.mpi-sws.org",
        "HRT": 6569974270183413,
        "Timestamp": "1557750409851.329590",
        "TenantClass": 0,
        "Source": "DataXceiver.java:168",
        "ThreadID": 15309,
        "ThreadName": "",
        "EventID": "BC62B1E38E432824",
        "BaggageBytes": "[[248 5] [240 0] [0 134 87 11 91 7 94 216 120] [240 1] [0 48 89 91 212 16 120 201 185] [240 3] [0 2]]",
        "ProcessID": 13111
      },
      {
        "Cycles": 0,
        "Agent": "edu.brown.cs.systems.xtrace.logging.BaggageWrappers",
        "ProcessName": "Data",
        "TaskID": "86570B5B075ED878",
        "ParentEventID": [
          "56F4FAAC0DD69FB6"
        ],
        "Label": "Forking current baggage with Baggage.fork()",
        "Title": "X-Trace Task",
        "Host": "pinky20.mpi-sws.org",
        "HRT": 6569974270366833,
        "Operation": "fork",
        "Timestamp": "1557750409851.513184",
        "TenantClass": 0,
        "Source": "PacketHeader.java:95",
        "ThreadID": 15309,
        "ThreadName": "",
        "EventID": "E650C7BD39933B6A",
        "BaggageBytes": "[[248 5] [240 0] [0 134 87 11 91 7 94 216 120] [240 1] [0 86 244 250 172 13 214 159 182] [240 3] [0 2]]",
        "ProcessID": 13111
      },
      {
        "Cycles": 0,
        "Agent": "edu.brown.cs.systems.xtrace.logging.BaggageWrappers",
        "ProcessName": "Data",
        "TaskID": "86570B5B075ED878",
        "ParentEventID": [
          "BC62B1E38E432824"
        ],
        "Label": "Forking current baggage with Baggage.fork()",
        "Title": "X-Trace Task",
        "Host": "pinky20.mpi-sws.org",
        "HRT": 6569974270283583,
        "Operation": "fork",
        "Timestamp": "1557750409851.429932",
        "TenantClass": 0,
        "Source": "DataXceiver.java:1257",
        "ThreadID": 15309,
        "ThreadName": "",
        "EventID": "56F4FAAC0DD69FB6",
        "BaggageBytes": "[[248 5] [240 0] [0 134 87 11 91 7 94 216 120] [240 1] [0 188 98 177 227 142 67 40 36] [240 3] [0 2]]",
        "ProcessID": 13111
      },
      {
        "Cycles": 0,
        "Agent": "Execution-Sleep",
        "ProcessName": "Read",
        "TaskID": "86570B5B075ED878",
        "ParentEventID": [
          "8442C37E73E54420"
        ],
        "Label": "waited",
        "Title": "X-Trace Task",
        "Host": "pinky19.mpi-sws.org",
        "Duration": "335588",
        "HRT": 26966769911236470,
        "Operation": "waited",
        "Timestamp": "1557750409851.516357",
        "TenantClass": 0,
        "Source": "SocketIOWithTimeout.java:335",
        "ThreadID": 1,
        "ThreadName": "",
        "EventID": "C8E03F4C1EDD0548",
        "ProcessID": 2801
      },
      {
        "Cycles": 0,
        "Agent": "Execution-Sleep",
        "ProcessName": "Data",
        "TaskID": "86570B5B075ED878",
        "ParentEventID": [
          "E650C7BD39933B6A"
        ],
        "Label": "waited",
        "Title": "X-Trace Task",
        "Host": "pinky20.mpi-sws.org",
        "Duration": "5954",
        "HRT": 6569974270425445,
        "Operation": "waited",
        "Timestamp": "1557750409851.571777",
        "TenantClass": 0,
        "Source": "SocketIOWithTimeout.java:335",
        "ThreadID": 15309,
        "ThreadName": "",
        "EventID": "127DE538BAC6FF97",
        "BaggageBytes": "[[248 5] [240 0] [0 134 87 11 91 7 94 216 120] [240 1] [0 230 80 199 189 57 147 59 106] [240 3] [0 2]]",
        "ProcessID": 13111
      },
      {
        "Cycles": 0,
        "Agent": "edu.brown.cs.systems.xtrace.logging.BaggageWrappers",
        "ProcessName": "Read",
        "TaskID": "86570B5B075ED878",
        "ParentEventID": [
          "C8E03F4C1EDD0548",
          "56F4FAAC0DD69FB6"
        ],
        "Label": "Merged current baggage with other baggage",
        "Title": "X-Trace Task",
        "Host": "pinky19.mpi-sws.org",
        "HRT": 26966769911313086,
        "Operation": "join",
        "Timestamp": "1557750409851.593018",
        "TenantClass": 0,
        "Source": "RemoteBlockReader2.java:429",
        "ThreadID": 1,
        "ThreadName": "",
        "EventID": "E96214A5E25136F6",
        "ProcessID": 2801
      },
      {
        "Cycles": 0,
        "Agent": "edu.brown.cs.systems.xtrace.logging.BaggageWrappers",
        "ProcessName": "Data",
        "TaskID": "86570B5B075ED878",
        "ParentEventID": [
          "127DE538BAC6FF97"
        ],
        "Label": "Forking current baggage with Baggage.fork()",
        "Title": "X-Trace Task",
        "Host": "pinky20.mpi-sws.org",
        "HRT": 6569974270488587,
        "Operation": "fork",
        "Timestamp": "1557750409851.634766",
        "TenantClass": 0,
        "Source": "PacketHeader.java:95",
        "ThreadID": 15309,
        "ThreadName": "",
        "EventID": "A4725566F538431C",
        "BaggageBytes": "[[248 5] [240 0] [0 134 87 11 91 7 94 216 120] [240 1] [0 18 125 229 56 186 198 255 151] [240 3] [0 2]]",
        "ProcessID": 13111
      },
      {
        "Cycles": 0,
        "Agent": "Execution-Sleep",
        "ProcessName": "Read",
        "TaskID": "86570B5B075ED878",
        "ParentEventID": [
          "E96214A5E25136F6"
        ],
        "Label": "waited",
        "Title": "X-Trace Task",
        "Host": "pinky19.mpi-sws.org",
        "Duration": "206152",
        "HRT": 26966769911597295,
        "Operation": "waited",
        "Timestamp": "1557750409851.877197",
        "TenantClass": 0,
        "Source": "SocketIOWithTimeout.java:335",
        "ThreadID": 1,
        "ThreadName": "",
        "EventID": "662984D44B5D34A2",
        "ProcessID": 2801
      },
      {
        "Cycles": 0,
        "Agent": "Execution-Sleep",
        "ProcessName": "Read",
        "TaskID": "86570B5B075ED878",
        "ParentEventID": [
          "662984D44B5D34A2"
        ],
        "Label": "waited",
        "Title": "X-Trace Task",
        "Host": "pinky19.mpi-sws.org",
        "Duration": "159480",
        "HRT": 26966769911805512,
        "Operation": "waited",
        "Timestamp": "1557750409852.085449",
        "TenantClass": 0,
        "Source": "SocketIOWithTimeout.java:335",
        "ThreadID": 1,
        "ThreadName": "",
        "EventID": "259487FC6084E794",
        "ProcessID": 2801
      },
      {
        "Cycles": 0,
        "Agent": "Execution-Sleep",
        "ProcessName": "Read",
        "TaskID": "86570B5B075ED878",
        "ParentEventID": [
          "259487FC6084E794"
        ],
        "Label": "waited",
        "Title": "X-Trace Task",
        "Host": "pinky19.mpi-sws.org",
        "Duration": "107576",
        "HRT": 26966769911962927,
        "Operation": "waited",
        "Timestamp": "1557750409852.242920",
        "TenantClass": 0,
        "Source": "SocketIOWithTimeout.java:335",
        "ThreadID": 1,
        "ThreadName": "",
        "EventID": "50A266A0AB9FFEFF",
        "ProcessID": 2801
      },
      {
        "Cycles": 0,
        "Agent": "Execution-Sleep",
        "ProcessName": "Data",
        "TaskID": "86570B5B075ED878",
        "ParentEventID": [
          "A4725566F538431C"
        ],
        "Label": "waited",
        "Title": "X-Trace Task",
        "Host": "pinky20.mpi-sws.org",
        "Duration": "212118",
        "HRT": 6569974270764289,
        "Operation": "waited",
        "Timestamp": "1557750409851.910645",
        "TenantClass": 0,
        "Source": "SocketIOWithTimeout.java:335",
        "ThreadID": 15309,
        "ThreadName": "",
        "EventID": "825F3A163A2C108C",
        "BaggageBytes": "[[248 5] [240 0] [0 134 87 11 91 7 94 216 120] [240 1] [0 164 114 85 102 245 56 67 28] [240 3] [0 2]]",
        "ProcessID": 13111
      },
      {
        "Cycles": 0,
        "Agent": "edu.brown.cs.systems.xtrace.logging.BaggageWrappers",
        "ProcessName": "Data",
        "TaskID": "86570B5B075ED878",
        "ParentEventID": [
          "825F3A163A2C108C"
        ],
        "Label": "Forking current baggage with Baggage.fork()",
        "Title": "X-Trace Task",
        "Host": "pinky20.mpi-sws.org",
        "HRT": 6569974270829511,
        "Operation": "fork",
        "Timestamp": "1557750409851.975830",
        "TenantClass": 0,
        "Source": "PacketHeader.java:95",
        "ThreadID": 15309,
        "ThreadName": "",
        "EventID": "BE3672B7B87BB020",
        "BaggageBytes": "[[248 5] [240 0] [0 134 87 11 91 7 94 216 120] [240 1] [0 130 95 58 22 58 44 16 140] [240 3] [0 2]]",
        "ProcessID": 13111
      },
      {
        "Cycles": 0,
        "Agent": "edu.brown.cs.systems.xtrace.logging.BaggageWrappers",
        "ProcessName": "Read",
        "TaskID": "86570B5B075ED878",
        "ParentEventID": [
          "E650C7BD39933B6A",
          "50A266A0AB9FFEFF"
        ],
        "Label": "Merged current baggage with other baggage",
        "Title": "X-Trace Task",
        "Host": "pinky19.mpi-sws.org",
        "HRT": 26966769912002996,
        "Operation": "join",
        "Timestamp": "1557750409852.282959",
        "TenantClass": 0,
        "Source": "PacketHeader.java:168",
        "ThreadID": 1,
        "ThreadName": "",
        "EventID": "9E3162584C910CCE",
        "ProcessID": 2801
      },
      {
        "Cycles": 0,
        "Agent": "Execution-Sleep",
        "ProcessName": "Data",
        "TaskID": "86570B5B075ED878",
        "ParentEventID": [
          "BE3672B7B87BB020"
        ],
        "Label": "waited",
        "Title": "X-Trace Task",
        "Host": "pinky20.mpi-sws.org",
        "Duration": "3521",
        "HRT": 6569974270877954,
        "Operation": "waited",
        "Timestamp": "1557750409852.024170",
        "TenantClass": 0,
        "Source": "SocketIOWithTimeout.java:335",
        "ThreadID": 15309,
        "ThreadName": "",
        "EventID": "2DE194645D599C70",
        "BaggageBytes": "[[248 5] [240 0] [0 134 87 11 91 7 94 216 120] [240 1] [0 190 54 114 183 184 123 176 32] [240 3] [0 2]]",
        "ProcessID": 13111
      },
      {
        "Cycles": 0,
        "Agent": "Execution-Sleep",
        "ProcessName": "Data",
        "TaskID": "86570B5B075ED878",
        "ParentEventID": [
          "5319891678154747"
        ],
        "Label": "waited",
        "Title": "X-Trace Task",
        "Host": "pinky20.mpi-sws.org",
        "Duration": "3408",
        "HRT": 6569974270998373,
        "Operation": "waited",
        "Timestamp": "1557750409852.144531",
        "TenantClass": 0,
        "Source": "SocketIOWithTimeout.java:335",
        "ThreadID": 15309,
        "ThreadName": "",
        "EventID": "420BA5ED18630917",
        "BaggageBytes": "[[248 5] [240 0] [0 134 87 11 91 7 94 216 120] [240 1] [0 83 25 137 22 120 21 71 71] [240 3] [0 2]]",
        "ProcessID": 13111
      },
      {
        "Cycles": 0,
        "Agent": "edu.brown.cs.systems.xtrace.logging.BaggageWrappers",
        "ProcessName": "Data",
        "TaskID": "86570B5B075ED878",
        "ParentEventID": [
          "2DE194645D599C70"
        ],
        "Label": "Forking current baggage with Baggage.fork()",
        "Title": "X-Trace Task",
        "Host": "pinky20.mpi-sws.org",
        "HRT": 6569974270928347,
        "Operation": "fork",
        "Timestamp": "1557750409852.074707",
        "TenantClass": 0,
        "Source": "PacketHeader.java:95",
        "ThreadID": 15309,
        "ThreadName": "",
        "EventID": "5319891678154747",
        "BaggageBytes": "[[248 5] [240 0] [0 134 87 11 91 7 94 216 120] [240 1] [0 45 225 148 100 93 89 156 112] [240 3] [0 2]]",
        "ProcessID": 13111
      },
      {
        "Cycles": 0,
        "Agent": "edu.brown.cs.systems.xtrace.logging.BaggageWrappers",
        "ProcessName": "Data",
        "TaskID": "86570B5B075ED878",
        "ParentEventID": [
          "420BA5ED18630917"
        ],
        "Label": "Forking current baggage with Baggage.fork()",
        "Title": "X-Trace Task",
        "Host": "pinky20.mpi-sws.org",
        "HRT": 6569974271051378,
        "Operation": "fork",
        "Timestamp": "1557750409852.197754",
        "TenantClass": 0,
        "Source": "PacketHeader.java:95",
        "ThreadID": 15309,
        "ThreadName": "",
        "EventID": "1F49F4397563ACC3",
        "BaggageBytes": "[[248 5] [240 0] [0 134 87 11 91 7 94 216 120] [240 1] [0 66 11 165 237 24 99 9 23] [240 3] [0 2]]",
        "ProcessID": 13111
      },
      {
        "Cycles": 0,
        "Agent": "edu.brown.cs.systems.xtrace.logging.BaggageWrappers",
        "ProcessName": "Data",
        "TaskID": "86570B5B075ED878",
        "ParentEventID": [
          "40EFCF8B113F12E9"
        ],
        "Label": "Forking current baggage with Baggage.fork()",
        "Title": "X-Trace Task",
        "Host": "pinky20.mpi-sws.org",
        "HRT": 6569974271218719,
        "Operation": "fork",
        "Timestamp": "1557750409852.364990",
        "TenantClass": 0,
        "Source": "PacketHeader.java:95",
        "ThreadID": 15309,
        "ThreadName": "",
        "EventID": "DFEF6B3460DDB2D5",
        "BaggageBytes": "[[248 5] [240 0] [0 134 87 11 91 7 94 216 120] [240 1] [0 64 239 207 139 17 63 18 233] [240 3] [0 2]]",
        "ProcessID": 13111
      },
      {
        "Cycles": 0,
        "Agent": "Execution-Sleep",
        "ProcessName": "Data",
        "TaskID": "86570B5B075ED878",
        "ParentEventID": [
          "1F49F4397563ACC3"
        ],
        "Label": "waited",
        "Title": "X-Trace Task",
        "Host": "pinky20.mpi-sws.org",
        "Duration": "20605",
        "HRT": 6569974271120590,
        "Operation": "waited",
        "Timestamp": "1557750409852.266846",
        "TenantClass": 0,
        "Source": "SocketIOWithTimeout.java:335",
        "ThreadID": 15309,
        "ThreadName": "",
        "EventID": "40EFCF8B113F12E9",
        "BaggageBytes": "[[248 5] [240 0] [0 134 87 11 91 7 94 216 120] [240 1] [0 31 73 244 57 117 99 172 195] [240 3] [0 2]]",
        "ProcessID": 13111
      },
      {
        "Cycles": 0,
        "Agent": "Execution-Sleep",
        "ProcessName": "Data",
        "TaskID": "86570B5B075ED878",
        "ParentEventID": [
          "DFEF6B3460DDB2D5"
        ],
        "Label": "waited",
        "Title": "X-Trace Task",
        "Host": "pinky20.mpi-sws.org",
        "Duration": "3686",
        "HRT": 6569974271282006,
        "Operation": "waited",
        "Timestamp": "1557750409852.428223",
        "TenantClass": 0,
        "Source": "SocketIOWithTimeout.java:335",
        "ThreadID": 15309,
        "ThreadName": "",
        "EventID": "1E905BCA40D41CB3",
        "BaggageBytes": "[[248 5] [240 0] [0 134 87 11 91 7 94 216 120] [240 1] [0 223 239 107 52 96 221 178 213] [240 3] [0 2]]",
        "ProcessID": 13111
      },
      {
        "Cycles": 0,
        "Agent": "Execution-CPU",
        "ProcessName": "Data",
        "TaskID": "86570B5B075ED878",
        "ParentEventID": [
          "1E905BCA40D41CB3"
        ],
        "Label": "unset",
        "Title": "X-Trace Task",
        "Host": "pinky20.mpi-sws.org",
        "Duration": "1256943",
        "HRT": 6569974271415991,
        "Operation": "unset",
        "Timestamp": "1557750409852.562256",
        "TenantClass": 0,
        "Source": "DataXceiver.java:261",
        "ThreadID": 15309,
        "ThreadName": "",
        "EventID": "649175B4E2BD5FCA",
        "BaggageBytes": "[[248 5] [240 0] [0 134 87 11 91 7 94 216 120] [240 1] [0 30 144 91 202 64 212 28 179] [240 3] [0 2]]",
        "ProcessID": 13111
      },
      {
        "Cycles": 0,
        "Agent": "edu.brown.cs.systems.retro.benchmarks.hdfs_client.Reader",
        "ProcessName": "Read",
        "TaskID": "86570B5B075ED878",
        "ParentEventID": [
          "0"
        ],
        "Label": "Reading file",
        "Title": "X-Trace Task",
        "Host": "pinky19.mpi-sws.org",
        "HRT": 26966769907688832,
        "Timestamp": "1557750409847.968750",
        "TenantClass": 0,
        "ThreadID": 1,
        "ThreadName": "",
        "EventID": "A736B034B259B353",
        "ProcessID": 2801,
        "Tag": [
          "reader_100kb",
          "Read Size: 102400"
        ]
      }
    ]
  }
]