[
  {
    "id": "086C85E7575726F7",
    "reports": [
      {
        "Cycles": 0,
        "Agent": "Execution-CPU",
        "ProcessName": "Read",
        "TaskID": "086C85E7575726F7",
        "ParentEventID": [
          "CF48AB314722FEEC"
        ],
        "Label": "unset",
        "Title": "X-Trace Task",
        "Host": "pinky19.mpi-sws.org",
        "Duration": "21923320",
        "HRT": 25491741316726378,
        "Operation": "unset",
        "Timestamp": "1556275381256.794678",
        "TenantClass": 0,
        "Source": "Client.java:1027",
        "ThreadID": 1,
        "ThreadName": "",
        "EventID": "BD15038C64C4E002",
        "ProcessID": 21035
      },
      {
        "Cycles": 0,
        "Agent": "edu.brown.cs.systems.retro.benchmarks.hdfs_client.Reader",
        "ProcessName": "Read",
        "TaskID": "086C85E7575726F7",
        "ParentEventID": [
          "0"
        ],
        "Label": "Reading file",
        "Title": "X-Trace Task",
        "Host": "pinky19.mpi-sws.org",
        "HRT": 25491741316637529,
        "Timestamp": "1556275381256.705811",
        "TenantClass": 0,
        "ThreadID": 1,
        "ThreadName": "",
        "EventID": "67F35D119B167514",
        "ProcessID": 21035,
        "Tag": [
          "reader_1kb",
          "Read Size: 1024"
        ]
      },
      {
        "Cycles": 0,
        "Agent": "org.apache.hadoop.ipc.ProtobufRpcEngine",
        "ProcessName": "Read",
        "TaskID": "086C85E7575726F7",
        "ParentEventID": [
          "931DEB52CD96003C"
        ],
        "Label": "Invoking org.apache.hadoop.hdfs.protocol.ClientProtocol.getBlockLocations",
        "Title": "X-Trace Task",
        "Host": "pinky19.mpi-sws.org",
        "HRT": 25491741316692830,
        "Timestamp": "1556275381256.760986",
        "TenantClass": 0,
        "Source": "ProtobufRpcEngine.java:228",
        "ThreadID": 1,
        "ThreadName": "",
        "EventID": "CF48AB314722FEEC",
        "ProcessID": 21035
      },
      {
        "Cycles": 0,
        "Agent": "edu.brown.cs.systems.retro.benchmarks.hdfs_client.Reader",
        "ProcessName": "Read",
        "TaskID": "086C85E7575726F7",
        "ParentEventID": [
          "67F35D119B167514"
        ],
        "Label": "Reading file",
        "Title": "X-Trace Task",
        "Host": "pinky19.mpi-sws.org",
        "HRT": 25491741316651417,
        "Timestamp": "1556275381256.719727",
        "TenantClass": 0,
        "ThreadID": 1,
        "ThreadName": "",
        "EventID": "931DEB52CD96003C",
        "ProcessID": 21035
      },
      {
        "Cycles": 0,
        "Agent": "Execution-CPU",
        "ProcessName": "Read",
        "TaskID": "086C85E7575726F7",
        "ParentEventID": [
          "BD15038C64C4E002"
        ],
        "Label": "set",
        "Title": "X-Trace Task",
        "Host": "pinky19.mpi-sws.org",
        "HRT": 25491741316758388,
        "Operation": "set",
        "Timestamp": "1556275381256.826660",
        "TenantClass": 0,
        "Source": "Client.java:1032",
        "ThreadID": 41,
        "ThreadName": "",
        "EventID": "200E67C68A037BAA",
        "ProcessID": 21035
      },
      {
        "Cycles": 0,
        "Agent": "Execution-CPU",
        "ProcessName": "Read",
        "TaskID": "086C85E7575726F7",
        "ParentEventID": [
          "AFE218EE06EE90BE"
        ],
        "Label": "set",
        "Title": "X-Trace Task",
        "Host": "pinky19.mpi-sws.org",
        "HRT": 25491741316889072,
        "Operation": "set",
        "Timestamp": "1556275381256.957275",
        "TenantClass": 0,
        "Source": "Client.java:1104",
        "ThreadID": 1,
        "ThreadName": "",
        "EventID": "D5E319A98AF21F77",
        "ProcessID": 21035
      },
      {
        "Cycles": 0,
        "Agent": "Execution-CPU",
        "ProcessName": "Name",
        "TaskID": "086C85E7575726F7",
        "ParentEventID": [
          "4E81EAA043C65308"
        ],
        "Label": "set",
        "Title": "X-Trace Task",
        "Host": "pinky19.mpi-sws.org",
        "HRT": 25491741316916902,
        "Operation": "set",
        "Timestamp": "1556275381257.009033",
        "TenantClass": 0,
        "Source": "Server.java:1840",
        "ThreadID": 48,
        "ThreadName": "",
        "EventID": "09FE4E556FC793B1",
        "BaggageBytes": "[[248 5] [240 0] [0 8 108 133 231 87 87 38 247] [240 1] [0 78 129 234 160 67 198 83 8] [240 3] [0 2]]",
        "ProcessID": 2171
      },
      {
        "Cycles": 0,
        "Agent": "edu.brown.cs.systems.xtrace.logging.BaggageWrappers",
        "ProcessName": "Name",
        "TaskID": "086C85E7575726F7",
        "ParentEventID": [
          "09FE4E556FC793B1"
        ],
        "Label": "Forking current baggage with Baggage.fork()",
        "Title": "X-Trace Task",
        "Host": "pinky19.mpi-sws.org",
        "HRT": 25491741316946347,
        "Operation": "fork",
        "Timestamp": "1556275381257.038574",
        "TenantClass": 0,
        "Source": "Server.java:550",
        "ThreadID": 48,
        "ThreadName": "",
        "EventID": "03A3BEBDD9BB3181",
        "BaggageBytes": "[[248 5] [240 0] [0 8 108 133 231 87 87 38 247] [240 1] [0 9 254 78 85 111 199 147 177] [240 3] [0 2]]",
        "ProcessID": 2171
      },
      {
        "Cycles": 0,
        "Agent": "Execution-CPU",
        "ProcessName": "Read",
        "TaskID": "086C85E7575726F7",
        "ParentEventID": [
          "4E81EAA043C65308"
        ],
        "Label": "unset",
        "Title": "X-Trace Task",
        "Host": "pinky19.mpi-sws.org",
        "Duration": "92751",
        "HRT": 25491741316863649,
        "Operation": "unset",
        "Timestamp": "1556275381256.931885",
        "TenantClass": 0,
        "Source": "Client.java:1062",
        "ThreadID": 41,
        "ThreadName": "",
        "EventID": "AFE218EE06EE90BE",
        "ProcessID": 21035
      },
      {
        "Cycles": 0,
        "Agent": "Execution-CPU",
        "ProcessName": "Name",
        "TaskID": "086C85E7575726F7",
        "ParentEventID": [
          "03A3BEBDD9BB3181"
        ],
        "Label": "unset",
        "Title": "X-Trace Task",
        "Host": "pinky19.mpi-sws.org",
        "Duration": "23822",
        "HRT": 25491741316966585,
        "Operation": "unset",
        "Timestamp": "1556275381257.058838",
        "TenantClass": 0,
        "Source": "Server.java:1828",
        "ThreadID": 48,
        "ThreadName": "",
        "EventID": "FECE2CBFC9416ECF",
        "BaggageBytes": "[[248 5] [240 0] [0 8 108 133 231 87 87 38 247] [240 1] [0 3 163 190 189 217 187 49 129] [240 3] [0 2]]",
        "ProcessID": 2171
      },
      {
        "Cycles": 0,
        "Agent": "Execution-CPU",
        "ProcessName": "Name",
        "TaskID": "086C85E7575726F7",
        "ParentEventID": [
          "03A3BEBDD9BB3181"
        ],
        "Label": "set",
        "Title": "X-Trace Task",
        "Host": "pinky19.mpi-sws.org",
        "HRT": 25491741316975392,
        "Operation": "set",
        "Timestamp": "1556275381257.067627",
        "TenantClass": 0,
        "Source": "Server.java:2071",
        "ThreadID": 59,
        "ThreadName": "",
        "EventID": "1B13EAD5C5A99F6C",
        "BaggageBytes": "[[248 5] [240 0] [0 8 108 133 231 87 87 38 247] [240 1] [0 3 163 190 189 217 187 49 129] [240 3] [0 2]]",
        "ProcessID": 2171
      },
      {
        "Cycles": 0,
        "Agent": "org.apache.hadoop.hdfs.server.namenode.FSNamesystem.audit",
        "ProcessName": "Name",
        "TaskID": "086C85E7575726F7",
        "ParentEventID": [
          "51AC8A3EA96782A5"
        ],
        "Label": "allowed=true\tugi=plascas (auth:SIMPLE)\tip=/139.19.171.63\tcmd=open\tsrc=/ds/3RkHhFfwmYir0Q13\tdst=null\tperm=null\tproto=rpc",
        "Title": "X-Trace Task",
        "Host": "pinky19.mpi-sws.org",
        "HRT": 25491741317047992,
        "Timestamp": "1556275381257.140137",
        "TenantClass": 0,
        "Source": "FSNamesystem.java:8313",
        "ThreadID": 59,
        "ThreadName": "",
        "EventID": "BC178D31E9A53821",
        "BaggageBytes": "[[248 5] [240 0] [0 8 108 133 231 87 87 38 247] [240 1] [0 81 172 138 62 169 103 130 165] [240 3] [0 2]]",
        "ProcessID": 2171
      },
      {
        "Cycles": 0,
        "Agent": "edu.brown.cs.systems.xtrace.logging.BaggageWrappers",
        "ProcessName": "Read",
        "TaskID": "086C85E7575726F7",
        "ParentEventID": [
          "200E67C68A037BAA"
        ],
        "Label": "Forking current baggage with Baggage.fork()",
        "Title": "X-Trace Task",
        "Host": "pinky19.mpi-sws.org",
        "HRT": 25491741316773412,
        "Operation": "fork",
        "Timestamp": "1556275381256.841553",
        "TenantClass": 0,
        "Source": "Client.java:1043",
        "ThreadID": 41,
        "ThreadName": "",
        "EventID": "4E81EAA043C65308",
        "ProcessID": 21035
      },
      {
        "Cycles": 0,
        "Agent": "edu.brown.cs.systems.xtrace.logging.BaggageWrappers",
        "ProcessName": "Name",
        "TaskID": "086C85E7575726F7",
        "ParentEventID": [
          "BC178D31E9A53821"
        ],
        "Label": "Forking current baggage with Baggage.fork()",
        "Title": "X-Trace Task",
        "Host": "pinky19.mpi-sws.org",
        "HRT": 25491741317096904,
        "Operation": "fork",
        "Timestamp": "1556275381257.188965",
        "TenantClass": 0,
        "Source": "Server.java:2398",
        "ThreadID": 59,
        "ThreadName": "",
        "EventID": "C88D6D75C39D7B7A",
        "BaggageBytes": "[[248 5] [240 0] [0 8 108 133 231 87 87 38 247] [240 1] [0 188 23 141 49 233 165 56 33] [240 3] [0 2]]",
        "ProcessID": 2171
      },
      {
        "Cycles": 0,
        "Agent": "Execution-CPU",
        "ProcessName": "Read",
        "TaskID": "086C85E7575726F7",
        "ParentEventID": [
          "C88D6D75C39D7B7A"
        ],
        "Label": "set",
        "Title": "X-Trace Task",
        "Host": "pinky19.mpi-sws.org",
        "HRT": 25491741317256525,
        "Operation": "set",
        "Timestamp": "1556275381257.324707",
        "TenantClass": 0,
        "Source": "Client.java:302",
        "ThreadID": 37,
        "ThreadName": "",
        "EventID": "8D4012E737A5A118",
        "ProcessID": 21035
      },
      {
        "Cycles": 0,
        "Agent": "Execution-CPU",
        "ProcessName": "Read",
        "TaskID": "086C85E7575726F7",
        "ParentEventID": [
          "8D4012E737A5A118"
        ],
        "Label": "unset",
        "Title": "X-Trace Task",
        "Host": "pinky19.mpi-sws.org",
        "Duration": "20708",
        "HRT": 25491741317292312,
        "Operation": "unset",
        "Timestamp": "1556275381257.360596",
        "TenantClass": 0,
        "Source": "Client.java:1168",
        "ThreadID": 37,
        "ThreadName": "",
        "EventID": "6DFF3F9EE4E6A857",
        "ProcessID": 21035
      },
      {
        "Cycles": 0,
        "Agent": "Execution-CPU",
        "ProcessName": "Name",
        "TaskID": "086C85E7575726F7",
        "ParentEventID": [
          "C88D6D75C39D7B7A"
        ],
        "Label": "unset",
        "Title": "X-Trace Task",
        "Host": "pinky19.mpi-sws.org",
        "Duration": "204144",
        "HRT": 25491741317196919,
        "Operation": "unset",
        "Timestamp": "1556275381257.289062",
        "TenantClass": 0,
        "Source": "Server.java:1058",
        "ThreadID": 59,
        "ThreadName": "",
        "EventID": "59195C1243BDF210",
        "BaggageBytes": "[[248 5] [240 0] [0 8 108 133 231 87 87 38 247] [240 1] [0 200 141 109 117 195 157 123 122] [240 3] [0 2]]",
        "ProcessID": 2171
      },
      {
        "Cycles": 0,
        "Agent": "Execution-Sleep",
        "ProcessName": "Read",
        "TaskID": "086C85E7575726F7",
        "ParentEventID": [
          "D5E319A98AF21F77"
        ],
        "Label": "waited",
        "Title": "X-Trace Task",
        "Host": "pinky19.mpi-sws.org",
        "Duration": "418215",
        "HRT": 25491741317316031,
        "Operation": "waited",
        "Timestamp": "1556275381257.384277",
        "TenantClass": 0,
        "Source": "Client.java:1537",
        "ThreadID": 1,
        "ThreadName": "",
        "EventID": "8EF50885DBB91FB7",
        "ProcessID": 21035
      },
      {
        "Cycles": 0,
        "Agent": "edu.brown.cs.systems.xtrace.logging.BaggageWrappers",
        "ProcessName": "Read",
        "TaskID": "086C85E7575726F7",
        "ParentEventID": [
          "8EF50885DBB91FB7",
          "6DFF3F9EE4E6A857"
        ],
        "Label": "Merged current baggage with other baggage",
        "Title": "X-Trace Task",
        "Host": "pinky19.mpi-sws.org",
        "HRT": 25491741317337346,
        "Operation": "join",
        "Timestamp": "1556275381257.405518",
        "TenantClass": 0,
        "Source": "Client.java:1545",
        "ThreadID": 1,
        "ThreadName": "",
        "EventID": "F89D6245DC489444",
        "ProcessID": 21035
      },
      {
        "Cycles": 0,
        "Agent": "edu.brown.cs.systems.xtrace.logging.BaggageWrappers",
        "ProcessName": "Read",
        "TaskID": "086C85E7575726F7",
        "ParentEventID": [
          "CC6DBDCBB426F780"
        ],
        "Label": "Forking current baggage with Baggage.fork()",
        "Title": "X-Trace Task",
        "Host": "pinky19.mpi-sws.org",
        "HRT": 25491741317475480,
        "Operation": "fork",
        "Timestamp": "1556275381257.543701",
        "TenantClass": 0,
        "Source": "DataTransferProtoUtil.java:94",
        "ThreadID": 1,
        "ThreadName": "",
        "EventID": "E1AF8B87FF49AB61",
        "ProcessID": 21035
      },
      {
        "Cycles": 0,
        "Agent": "org.apache.hadoop.ipc.Server",
        "ProcessName": "Name",
        "TaskID": "086C85E7575726F7",
        "ParentEventID": [
          "1B13EAD5C5A99F6C"
        ],
        "Label": "getBlockLocations in org.apache.hadoop.hdfs.protocol.ClientProtocol",
        "Title": "X-Trace Task",
        "Host": "pinky19.mpi-sws.org",
        "HRT": 25491741317004303,
        "Timestamp": "1556275381257.096436",
        "TenantClass": 0,
        "Source": "ProtobufRpcEngine.java:601",
        "ThreadID": 59,
        "ThreadName": "",
        "EventID": "51AC8A3EA96782A5",
        "BaggageBytes": "[[248 5] [240 0] [0 8 108 133 231 87 87 38 247] [240 1] [0 27 19 234 213 197 169 159 108] [240 3] [0 2]]",
        "ProcessID": 2171
      },
      {
        "Cycles": 0,
        "Agent": "Execution-CPU",
        "ProcessName": "Data",
        "TaskID": "086C85E7575726F7",
        "ParentEventID": [
          "E1AF8B87FF49AB61"
        ],
        "Label": "set",
        "Title": "X-Trace Task",
        "Host": "pinky24.mpi-sws.org",
        "HRT": 5102994042717992,
        "Operation": "set",
        "Timestamp": "1556275381258.108643",
        "TenantClass": 0,
        "Source": "Receiver.java:117",
        "ThreadID": 5164,
        "ThreadName": "",
        "EventID": "24506041931B7481",
        "BaggageBytes": "[[248 5] [240 0] [0 8 108 133 231 87 87 38 247] [240 1] [0 225 175 139 135 255 73 171 97] [240 3] [0 2]]",
        "ProcessID": 28692
      },
      {
        "Cycles": 0,
        "Agent": "org.apache.hadoop.ipc.ProtobufRpcEngine",
        "ProcessName": "Read",
        "TaskID": "086C85E7575726F7",
        "ParentEventID": [
          "F89D6245DC489444"
        ],
        "Label": "org.apache.hadoop.hdfs.protocol.ClientProtocol.getBlockLocations completed",
        "Title": "X-Trace Task",
        "Host": "pinky19.mpi-sws.org",
        "HRT": 25491741317379797,
        "Timestamp": "1556275381257.447998",
        "TenantClass": 0,
        "Source": "ProtobufRpcEngine.java:275",
        "ThreadID": 1,
        "ThreadName": "",
        "EventID": "CC6DBDCBB426F780",
        "ProcessID": 21035
      },
      {
        "Cycles": 0,
        "Agent": "edu.brown.cs.systems.xtrace.logging.BaggageWrappers",
        "ProcessName": "Data",
        "TaskID": "086C85E7575726F7",
        "ParentEventID": [
          "38502D512EC302D5"
        ],
        "Label": "Forking current baggage with Baggage.fork()",
        "Title": "X-Trace Task",
        "Host": "pinky24.mpi-sws.org",
        "HRT": 5102994043066352,
        "Operation": "fork",
        "Timestamp": "1556275381258.457031",
        "TenantClass": 0,
        "Source": "DataXceiver.java:1257",
        "ThreadID": 5164,
        "ThreadName": "",
        "EventID": "DCDDE24BB90BDD8C",
        "BaggageBytes": "[[248 5] [240 0] [0 8 108 133 231 87 87 38 247] [240 1] [0 56 80 45 81 46 195 2 213] [240 3] [0 2]]",
        "ProcessID": 28692
      },
      {
        "Cycles": 0,
        "Agent": "Execution-Sleep",
        "ProcessName": "Read",
        "TaskID": "086C85E7575726F7",
        "ParentEventID": [
          "E1AF8B87FF49AB61"
        ],
        "Label": "waited",
        "Title": "X-Trace Task",
        "Host": "pinky19.mpi-sws.org",
        "Duration": "736674",
        "HRT": 25491741318334455,
        "Operation": "waited",
        "Timestamp": "1556275381258.402588",
        "TenantClass": 0,
        "Source": "SocketIOWithTimeout.java:335",
        "ThreadID": 1,
        "ThreadName": "",
        "EventID": "1E7CC0D525D71C50",
        "ProcessID": 21035
      },
      {
        "Cycles": 0,
        "Agent": "edu.brown.cs.systems.xtrace.logging.XTraceInit",
        "ProcessName": "Data",
        "TaskID": "086C85E7575726F7",
        "ParentEventID": [
          "24506041931B7481"
        ],
        "Label": "Thread.setName: DataXceiver for client DFSClient_NONMAPREDUCE_1377588049_1 at /139.19.171.63:51766 [Sending block BP-1633380353-139.19.171.63-1554193446451:blk_1073767446_26622]",
        "Title": "X-Trace Task",
        "Host": "pinky24.mpi-sws.org",
        "HRT": 5102994042820498,
        "Timestamp": "1556275381258.211182",
        "TenantClass": 0,
        "Source": "DataXceiver.java:168",
        "ThreadID": 5164,
        "ThreadName": "",
        "EventID": "38502D512EC302D5",
        "BaggageBytes": "[[248 5] [240 0] [0 8 108 133 231 87 87 38 247] [240 1] [0 36 80 96 65 147 27 116 129] [240 3] [0 2]]",
        "ProcessID": 28692
      },
      {
        "Cycles": 0,
        "Agent": "edu.brown.cs.systems.xtrace.logging.BaggageWrappers",
        "ProcessName": "Read",
        "TaskID": "086C85E7575726F7",
        "ParentEventID": [
          "DCDDE24BB90BDD8C",
          "1E7CC0D525D71C50"
        ],
        "Label": "Merged current baggage with other baggage",
        "Title": "X-Trace Task",
        "Host": "pinky19.mpi-sws.org",
        "HRT": 25491741318423533,
        "Operation": "join",
        "Timestamp": "1556275381258.491699",
        "TenantClass": 0,
        "Source": "RemoteBlockReader2.java:429",
        "ThreadID": 1,
        "ThreadName": "",
        "EventID": "4F2486E8D9EB208B",
        "ProcessID": 21035
      },
      {
        "Cycles": 0,
        "Agent": "Execution-Sleep",
        "ProcessName": "Data",
        "TaskID": "086C85E7575726F7",
        "ParentEventID": [
          "700A06B4F2D1E835"
        ],
        "Label": "waited",
        "Title": "X-Trace Task",
        "Host": "pinky24.mpi-sws.org",
        "Duration": "11013",
        "HRT": 5102994043434823,
        "Operation": "waited",
        "Timestamp": "1556275381258.825439",
        "TenantClass": 0,
        "Source": "SocketIOWithTimeout.java:335",
        "ThreadID": 5164,
        "ThreadName": "",
        "EventID": "4770E17A3AE8FE3F",
        "BaggageBytes": "[[248 5] [240 0] [0 8 108 133 231 87 87 38 247] [240 1] [0 112 10 6 180 242 209 232 53] [240 3] [0 2]]",
        "ProcessID": 28692
      },
      {
        "Cycles": 0,
        "Agent": "Execution-Sleep",
        "ProcessName": "Read",
        "TaskID": "086C85E7575726F7",
        "ParentEventID": [
          "4F2486E8D9EB208B"
        ],
        "Label": "waited",
        "Title": "X-Trace Task",
        "Host": "pinky19.mpi-sws.org",
        "Duration": "23748",
        "HRT": 25491741318524029,
        "Operation": "waited",
        "Timestamp": "1556275381258.592285",
        "TenantClass": 0,
        "Source": "SocketIOWithTimeout.java:335",
        "ThreadID": 1,
        "ThreadName": "",
        "EventID": "CF484CF479279954",
        "ProcessID": 21035
      },
      {
        "Cycles": 0,
        "Agent": "Execution-Sleep",
        "ProcessName": "Read",
        "TaskID": "086C85E7575726F7",
        "ParentEventID": [
          "CF484CF479279954"
        ],
        "Label": "waited",
        "Title": "X-Trace Task",
        "Host": "pinky19.mpi-sws.org",
        "Duration": "120266",
        "HRT": 25491741318726765,
        "Operation": "waited",
        "Timestamp": "1556275381258.794922",
        "TenantClass": 0,
        "Source": "SocketIOWithTimeout.java:335",
        "ThreadID": 1,
        "ThreadName": "",
        "EventID": "11D97355EE7EB9D1",
        "ProcessID": 21035
      },
      {
        "Cycles": 0,
        "Agent": "edu.brown.cs.systems.xtrace.logging.BaggageWrappers",
        "ProcessName": "Data",
        "TaskID": "086C85E7575726F7",
        "ParentEventID": [
          "DCDDE24BB90BDD8C"
        ],
        "Label": "Forking current baggage with Baggage.fork()",
        "Title": "X-Trace Task",
        "Host": "pinky24.mpi-sws.org",
        "HRT": 5102994043257543,
        "Operation": "fork",
        "Timestamp": "1556275381258.648193",
        "TenantClass": 0,
        "Source": "PacketHeader.java:95",
        "ThreadID": 5164,
        "ThreadName": "",
        "EventID": "700A06B4F2D1E835",
        "BaggageBytes": "[[248 5] [240 0] [0 8 108 133 231 87 87 38 247] [240 1] [0 220 221 226 75 185 11 221 140] [240 3] [0 2]]",
        "ProcessID": 28692
      },
      {
        "Cycles": 0,
        "Agent": "edu.brown.cs.systems.xtrace.logging.BaggageWrappers",
        "ProcessName": "Data",
        "TaskID": "086C85E7575726F7",
        "ParentEventID": [
          "4770E17A3AE8FE3F"
        ],
        "Label": "Forking current baggage with Baggage.fork()",
        "Title": "X-Trace Task",
        "Host": "pinky24.mpi-sws.org",
        "HRT": 5102994043610317,
        "Operation": "fork",
        "Timestamp": "1556275381259.000977",
        "TenantClass": 0,
        "Source": "PacketHeader.java:95",
        "ThreadID": 5164,
        "ThreadName": "",
        "EventID": "474A177E7FE1D91E",
        "BaggageBytes": "[[248 5] [240 0] [0 8 108 133 231 87 87 38 247] [240 1] [0 71 112 225 122 58 232 254 63] [240 3] [0 2]]",
        "ProcessID": 28692
      },
      {
        "Cycles": 0,
        "Agent": "edu.brown.cs.systems.xtrace.logging.BaggageWrappers",
        "ProcessName": "Read",
        "TaskID": "086C85E7575726F7",
        "ParentEventID": [
          "474A177E7FE1D91E",
          "746C2D20042D8C24"
        ],
        "Label": "Merged current baggage with other baggage",
        "Title": "X-Trace Task",
        "Host": "pinky19.mpi-sws.org",
        "HRT": 25491741318930942,
        "Operation": "join",
        "Timestamp": "1556275381258.999268",
        "TenantClass": 0,
        "Source": "PacketHeader.java:168",
        "ThreadID": 1,
        "ThreadName": "",
        "EventID": "F7A22A8147CEDFDC",
        "ProcessID": 21035
      },
      {
        "Cycles": 0,
        "Agent": "Execution-Sleep",
        "ProcessName": "Read",
        "TaskID": "086C85E7575726F7",
        "ParentEventID": [
          "5690BC1B8DFAB097"
        ],
        "Label": "waited",
        "Title": "X-Trace Task",
        "Host": "pinky19.mpi-sws.org",
        "Duration": "4512",
        "HRT": 25491741318862018,
        "Operation": "waited",
        "Timestamp": "1556275381258.930176",
        "TenantClass": 0,
        "Source": "SocketIOWithTimeout.java:335",
        "ThreadID": 1,
        "ThreadName": "",
        "EventID": "746C2D20042D8C24",
        "ProcessID": 21035
      },
      {
        "Cycles": 0,
        "Agent": "edu.brown.cs.systems.xtrace.logging.BaggageWrappers",
        "ProcessName": "Read",
        "TaskID": "086C85E7575726F7",
        "ParentEventID": [
          "F7A22A8147CEDFDC"
        ],
        "Label": "Forking current baggage with Baggage.fork()",
        "Title": "X-Trace Task",
        "Host": "pinky19.mpi-sws.org",
        "HRT": 25491741318947389,
        "Operation": "fork",
        "Timestamp": "1556275381259.015625",
        "TenantClass": 0,
        "Source": "RemoteBlockReader2.java:361",
        "ThreadID": 1,
        "ThreadName": "",
        "EventID": "213BD4484C823E4A",
        "ProcessID": 21035
      },
      {
        "Cycles": 0,
        "Agent": "edu.brown.cs.systems.xtrace.logging.BaggageWrappers",
        "ProcessName": "Read",
        "TaskID": "086C85E7575726F7",
        "ParentEventID": [
          "11D97355EE7EB9D1",
          "700A06B4F2D1E835"
        ],
        "Label": "Merged current baggage with other baggage",
        "Title": "X-Trace Task",
        "Host": "pinky19.mpi-sws.org",
        "HRT": 25491741318803286,
        "Operation": "join",
        "Timestamp": "1556275381258.871582",
        "TenantClass": 0,
        "Source": "PacketHeader.java:168",
        "ThreadID": 1,
        "ThreadName": "",
        "EventID": "5690BC1B8DFAB097",
        "ProcessID": 21035
      },
      {
        "Cycles": 0,
        "Agent": "Execution-CPU",
        "ProcessName": "Data",
        "TaskID": "086C85E7575726F7",
        "ParentEventID": [
          "8DCDCA1AA1A352CE"
        ],
        "Label": "unset",
        "Title": "X-Trace Task",
        "Host": "pinky24.mpi-sws.org",
        "Duration": "1349417",
        "HRT": 5102994044141455,
        "Operation": "unset",
        "Timestamp": "1556275381259.531982",
        "TenantClass": 0,
        "Source": "DataXceiver.java:261",
        "ThreadID": 5164,
        "ThreadName": "",
        "EventID": "DE4902475520441B",
        "BaggageBytes": "[[248 5] [240 0] [0 8 108 133 231 87 87 38 247] [240 1] [0 141 205 202 26 161 163 82 206] [240 3] [0 2]]",
        "ProcessID": 28692
      },
      {
        "Cycles": 0,
        "Agent": "edu.brown.cs.systems.xtrace.logging.BaggageWrappers",
        "ProcessName": "Data",
        "TaskID": "086C85E7575726F7",
        "ParentEventID": [
          "634DC431462602CC",
          "213BD4484C823E4A"
        ],
        "Label": "Merged current baggage with other baggage",
        "Title": "X-Trace Task",
        "Host": "pinky24.mpi-sws.org",
        "HRT": 5102994044094398,
        "Operation": "join",
        "Timestamp": "1556275381259.484863",
        "TenantClass": 0,
        "Source": "DataXceiver.java:574",
        "ThreadID": 5164,
        "ThreadName": "",
        "EventID": "8DCDCA1AA1A352CE",
        "BaggageBytes": "[[248 5] [240 0] [0 8 108 133 231 87 87 38 247] [240 1] [0 33 59 212 72 76 130 62 74] [0 99 77 196 49 70 38 2 204] [240 3] [0 2]]",
        "ProcessID": 28692
      },
      {
        "Cycles": 0,
        "Agent": "Execution-Sleep",
        "ProcessName": "Data",
        "TaskID": "086C85E7575726F7",
        "ParentEventID": [
          "474A177E7FE1D91E"
        ],
        "Label": "waited",
        "Title": "X-Trace Task",
        "Host": "pinky24.mpi-sws.org",
        "Duration": "105467",
        "HRT": 5102994043957221,
        "Operation": "waited",
        "Timestamp": "1556275381259.347900",
        "TenantClass": 0,
        "Source": "SocketIOWithTimeout.java:335",
        "ThreadID": 5164,
        "ThreadName": "",
        "EventID": "634DC431462602CC",
        "BaggageBytes": "[[248 5] [240 0] [0 8 108 133 231 87 87 38 247] [240 1] [0 71 74 23 126 127 225 217 30] [240 3] [0 2]]",
        "ProcessID": 28692
      }
    ]
  }
]