[
  {
    "id": "0A526A8468F35D2B",
    "reports": [
      {
        "Cycles": 0,
        "Agent": "edu.brown.cs.systems.retro.benchmarks.hdfs_client.Reader",
        "ProcessName": "Read",
        "TaskID": "0A526A8468F35D2B",
        "ParentEventID": [
          "2B1537E79FC832B2"
        ],
        "Label": "Reading file",
        "Title": "X-Trace Task",
        "Host": "pinky19.mpi-sws.org",
        "HRT": 26966666146359470,
        "Timestamp": "1557750306086.302734",
        "TenantClass": 0,
        "ThreadID": 1,
        "ThreadName": "",
        "EventID": "8796BD5228A4C39B",
        "ProcessID": 2801
      },
      {
        "Cycles": 0,
        "Agent": "Execution-CPU",
        "ProcessName": "Read",
        "TaskID": "0A526A8468F35D2B",
        "ParentEventID": [
          "12AFE3FE7C94C2BE"
        ],
        "Label": "unset",
        "Title": "X-Trace Task",
        "Host": "pinky19.mpi-sws.org",
        "Duration": "33534818",
        "HRT": 26966666146422496,
        "Operation": "unset",
        "Timestamp": "1557750306086.365723",
        "TenantClass": 0,
        "Source": "Client.java:1027",
        "ThreadID": 1,
        "ThreadName": "",
        "EventID": "8EBCAF86CCA22489",
        "ProcessID": 2801
      },
      {
        "Cycles": 0,
        "Agent": "Execution-CPU",
        "ProcessName": "Read",
        "TaskID": "0A526A8468F35D2B",
        "ParentEventID": [
          "8EBCAF86CCA22489"
        ],
        "Label": "set",
        "Title": "X-Trace Task",
        "Host": "pinky19.mpi-sws.org",
        "HRT": 26966666146472981,
        "Operation": "set",
        "Timestamp": "1557750306086.416260",
        "TenantClass": 0,
        "Source": "Client.java:1032",
        "ThreadID": 41,
        "ThreadName": "",
        "EventID": "9680133D460B2F12",
        "ProcessID": 2801
      },
      {
        "Cycles": 0,
        "Agent": "org.apache.hadoop.ipc.ProtobufRpcEngine",
        "ProcessName": "Read",
        "TaskID": "0A526A8468F35D2B",
        "ParentEventID": [
          "8796BD5228A4C39B"
        ],
        "Label": "Invoking org.apache.hadoop.hdfs.protocol.ClientProtocol.getBlockLocations",
        "Title": "X-Trace Task",
        "Host": "pinky19.mpi-sws.org",
        "HRT": 26966666146401310,
        "Timestamp": "1557750306086.344482",
        "TenantClass": 0,
        "Source": "ProtobufRpcEngine.java:228",
        "ThreadID": 1,
        "ThreadName": "",
        "EventID": "12AFE3FE7C94C2BE",
        "ProcessID": 2801
      },
      {
        "Cycles": 0,
        "Agent": "Execution-CPU",
        "ProcessName": "Read",
        "TaskID": "0A526A8468F35D2B",
        "ParentEventID": [
          "C647DF51D13BA788"
        ],
        "Label": "unset",
        "Title": "X-Trace Task",
        "Host": "pinky19.mpi-sws.org",
        "Duration": "81952",
        "HRT": 26966666146579665,
        "Operation": "unset",
        "Timestamp": "1557750306086.522949",
        "TenantClass": 0,
        "Source": "Client.java:1062",
        "ThreadID": 41,
        "ThreadName": "",
        "EventID": "25A8F011D3D30019",
        "ProcessID": 2801
      },
      {
        "Cycles": 0,
        "Agent": "edu.brown.cs.systems.xtrace.logging.BaggageWrappers",
        "ProcessName": "Read",
        "TaskID": "0A526A8468F35D2B",
        "ParentEventID": [
          "9680133D460B2F12"
        ],
        "Label": "Forking current baggage with Baggage.fork()",
        "Title": "X-Trace Task",
        "Host": "pinky19.mpi-sws.org",
        "HRT": 26966666146499026,
        "Operation": "fork",
        "Timestamp": "1557750306086.442383",
        "TenantClass": 0,
        "Source": "Client.java:1043",
        "ThreadID": 41,
        "ThreadName": "",
        "EventID": "C647DF51D13BA788",
        "ProcessID": 2801
      },
      {
        "Cycles": 0,
        "Agent": "Execution-CPU",
        "ProcessName": "Read",
        "TaskID": "0A526A8468F35D2B",
        "ParentEventID": [
          "25A8F011D3D30019"
        ],
        "Label": "set",
        "Title": "X-Trace Task",
        "Host": "pinky19.mpi-sws.org",
        "HRT": 26966666146610620,
        "Operation": "set",
        "Timestamp": "1557750306086.553955",
        "TenantClass": 0,
        "Source": "Client.java:1104",
        "ThreadID": 1,
        "ThreadName": "",
        "EventID": "76A2797681E3F481",
        "ProcessID": 2801
      },
      {
        "Cycles": 0,
        "Agent": "edu.brown.cs.systems.xtrace.logging.BaggageWrappers",
        "ProcessName": "Name",
        "TaskID": "0A526A8468F35D2B",
        "ParentEventID": [
          "4F10DB5946766914"
        ],
        "Label": "Forking current baggage with Baggage.fork()",
        "Title": "X-Trace Task",
        "Host": "pinky19.mpi-sws.org",
        "HRT": 26966666146649533,
        "Operation": "fork",
        "Timestamp": "1557750306086.621582",
        "TenantClass": 0,
        "Source": "Server.java:550",
        "ThreadID": 48,
        "ThreadName": "",
        "EventID": "2F4E6EE7E3B3F7A3",
        "BaggageBytes": "[[248 5] [240 0] [0 10 82 106 132 104 243 93 43] [240 1] [0 79 16 219 89 70 118 105 20] [240 3] [0 2]]",
        "ProcessID": 2171
      },
      {
        "Cycles": 0,
        "Agent": "Execution-CPU",
        "ProcessName": "Name",
        "TaskID": "0A526A8468F35D2B",
        "ParentEventID": [
          "C647DF51D13BA788"
        ],
        "Label": "set",
        "Title": "X-Trace Task",
        "Host": "pinky19.mpi-sws.org",
        "HRT": 26966666146625011,
        "Operation": "set",
        "Timestamp": "1557750306086.597168",
        "TenantClass": 0,
        "Source": "Server.java:1840",
        "ThreadID": 48,
        "ThreadName": "",
        "EventID": "4F10DB5946766914",
        "BaggageBytes": "[[248 5] [240 0] [0 10 82 106 132 104 243 93 43] [240 1] [0 198 71 223 81 209 59 167 136] [240 3] [0 2]]",
        "ProcessID": 2171
      },
      {
        "Cycles": 0,
        "Agent": "Execution-CPU",
        "ProcessName": "Name",
        "TaskID": "0A526A8468F35D2B",
        "ParentEventID": [
          "2F4E6EE7E3B3F7A3"
        ],
        "Label": "unset",
        "Title": "X-Trace Task",
        "Host": "pinky19.mpi-sws.org",
        "Duration": "30930",
        "HRT": 26966666146677437,
        "Operation": "unset",
        "Timestamp": "1557750306086.649658",
        "TenantClass": 0,
        "Source": "Server.java:1828",
        "ThreadID": 48,
        "ThreadName": "",
        "EventID": "9050A7E91E053080",
        "BaggageBytes": "[[248 5] [240 0] [0 10 82 106 132 104 243 93 43] [240 1] [0 47 78 110 231 227 179 247 163] [240 3] [0 2]]",
        "ProcessID": 2171
      },
      {
        "Cycles": 0,
        "Agent": "Execution-CPU",
        "ProcessName": "Name",
        "TaskID": "0A526A8468F35D2B",
        "ParentEventID": [
          "2F4E6EE7E3B3F7A3"
        ],
        "Label": "set",
        "Title": "X-Trace Task",
        "Host": "pinky19.mpi-sws.org",
        "HRT": 26966666146686810,
        "Operation": "set",
        "Timestamp": "1557750306086.658936",
        "TenantClass": 0,
        "Source": "Server.java:2071",
        "ThreadID": 57,
        "ThreadName": "",
        "EventID": "7A6EC9BEE7CB28A6",
        "BaggageBytes": "[[248 5] [240 0] [0 10 82 106 132 104 243 93 43] [240 1] [0 47 78 110 231 227 179 247 163] [240 3] [0 2]]",
        "ProcessID": 2171
      },
      {
        "Cycles": 0,
        "Agent": "org.apache.hadoop.ipc.Server",
        "ProcessName": "Name",
        "TaskID": "0A526A8468F35D2B",
        "ParentEventID": [
          "7A6EC9BEE7CB28A6"
        ],
        "Label": "getBlockLocations in org.apache.hadoop.hdfs.protocol.ClientProtocol",
        "Title": "X-Trace Task",
        "Host": "pinky19.mpi-sws.org",
        "HRT": 26966666146736074,
        "Timestamp": "1557750306086.708252",
        "TenantClass": 0,
        "Source": "ProtobufRpcEngine.java:601",
        "ThreadID": 57,
        "ThreadName": "",
        "EventID": "F8F63EF72B0F84C4",
        "BaggageBytes": "[[248 5] [240 0] [0 10 82 106 132 104 243 93 43] [240 1] [0 122 110 201 190 231 203 40 166] [240 3] [0 2]]",
        "ProcessID": 2171
      },
      {
        "Cycles": 0,
        "Agent": "edu.brown.cs.systems.xtrace.logging.BaggageWrappers",
        "ProcessName": "Name",
        "TaskID": "0A526A8468F35D2B",
        "ParentEventID": [
          "0073ABB3AAFF4FA8"
        ],
        "Label": "Forking current baggage with Baggage.fork()",
        "Title": "X-Trace Task",
        "Host": "pinky19.mpi-sws.org",
        "HRT": 26966666146858789,
        "Operation": "fork",
        "Timestamp": "1557750306086.830811",
        "TenantClass": 0,
        "Source": "Server.java:2398",
        "ThreadID": 57,
        "ThreadName": "",
        "EventID": "BAFFC4EC6F193041",
        "BaggageBytes": "[[248 5] [240 0] [0 10 82 106 132 104 243 93 43] [240 1] [0 0 115 171 179 170 255 79 168] [240 3] [0 2]]",
        "ProcessID": 2171
      },
      {
        "Cycles": 0,
        "Agent": "Execution-CPU",
        "ProcessName": "Name",
        "TaskID": "0A526A8468F35D2B",
        "ParentEventID": [
          "BAFFC4EC6F193041"
        ],
        "Label": "unset",
        "Title": "X-Trace Task",
        "Host": "pinky19.mpi-sws.org",
        "Duration": "261925",
        "HRT": 26966666146982109,
        "Operation": "unset",
        "Timestamp": "1557750306086.954346",
        "TenantClass": 0,
        "Source": "Server.java:1058",
        "ThreadID": 57,
        "ThreadName": "",
        "EventID": "F127B8094689A5BE",
        "BaggageBytes": "[[248 5] [240 0] [0 10 82 106 132 104 243 93 43] [240 1] [0 186 255 196 236 111 25 48 65] [240 3] [0 2]]",
        "ProcessID": 2171
      },
      {
        "Cycles": 0,
        "Agent": "Execution-CPU",
        "ProcessName": "Read",
        "TaskID": "0A526A8468F35D2B",
        "ParentEventID": [
          "BAFFC4EC6F193041"
        ],
        "Label": "set",
        "Title": "X-Trace Task",
        "Host": "pinky19.mpi-sws.org",
        "HRT": 26966666147042590,
        "Operation": "set",
        "Timestamp": "1557750306086.985840",
        "TenantClass": 0,
        "Source": "Client.java:302",
        "ThreadID": 40,
        "ThreadName": "",
        "EventID": "1E8813DBF3F5A0E5",
        "ProcessID": 2801
      },
      {
        "Cycles": 0,
        "Agent": "Execution-CPU",
        "ProcessName": "Read",
        "TaskID": "0A526A8468F35D2B",
        "ParentEventID": [
          "1E8813DBF3F5A0E5"
        ],
        "Label": "unset",
        "Title": "X-Trace Task",
        "Host": "pinky19.mpi-sws.org",
        "Duration": "10071",
        "HRT": 26966666147069881,
        "Operation": "unset",
        "Timestamp": "1557750306087.013184",
        "TenantClass": 0,
        "Source": "Client.java:1168",
        "ThreadID": 40,
        "ThreadName": "",
        "EventID": "3F5BA29B3A061DA3",
        "ProcessID": 2801
      },
      {
        "Cycles": 0,
        "Agent": "Execution-Sleep",
        "ProcessName": "Read",
        "TaskID": "0A526A8468F35D2B",
        "ParentEventID": [
          "76A2797681E3F481"
        ],
        "Label": "waited",
        "Title": "X-Trace Task",
        "Host": "pinky19.mpi-sws.org",
        "Duration": "458851",
        "HRT": 26966666147091858,
        "Operation": "waited",
        "Timestamp": "1557750306087.035156",
        "TenantClass": 0,
        "Source": "Client.java:1537",
        "ThreadID": 1,
        "ThreadName": "",
        "EventID": "DEEB5BD2A93EDC3F",
        "ProcessID": 2801
      },
      {
        "Cycles": 0,
        "Agent": "edu.brown.cs.systems.xtrace.logging.BaggageWrappers",
        "ProcessName": "Read",
        "TaskID": "0A526A8468F35D2B",
        "ParentEventID": [
          "DEEB5BD2A93EDC3F",
          "3F5BA29B3A061DA3"
        ],
        "Label": "Merged current baggage with other baggage",
        "Title": "X-Trace Task",
        "Host": "pinky19.mpi-sws.org",
        "HRT": 26966666147113479,
        "Operation": "join",
        "Timestamp": "1557750306087.056885",
        "TenantClass": 0,
        "Source": "Client.java:1545",
        "ThreadID": 1,
        "ThreadName": "",
        "EventID": "FD0CB0BDB6FBB498",
        "ProcessID": 2801
      },
      {
        "Cycles": 0,
        "Agent": "org.apache.hadoop.hdfs.server.namenode.FSNamesystem.audit",
        "ProcessName": "Name",
        "TaskID": "0A526A8468F35D2B",
        "ParentEventID": [
          "F8F63EF72B0F84C4"
        ],
        "Label": "allowed=true\tugi=plascas (auth:SIMPLE)\tip=/139.19.171.63\tcmd=open\tsrc=/ds/JK1s20lKyWjmx25G\tdst=null\tperm=null\tproto=rpc",
        "Title": "X-Trace Task",
        "Host": "pinky19.mpi-sws.org",
        "HRT": 26966666146800282,
        "Timestamp": "1557750306086.772461",
        "TenantClass": 0,
        "Source": "FSNamesystem.java:8313",
        "ThreadID": 57,
        "ThreadName": "",
        "EventID": "0073ABB3AAFF4FA8",
        "BaggageBytes": "[[248 5] [240 0] [0 10 82 106 132 104 243 93 43] [240 1] [0 248 246 62 247 43 15 132 196] [240 3] [0 2]]",
        "ProcessID": 2171
      },
      {
        "Cycles": 0,
        "Agent": "org.apache.hadoop.ipc.ProtobufRpcEngine",
        "ProcessName": "Read",
        "TaskID": "0A526A8468F35D2B",
        "ParentEventID": [
          "FD0CB0BDB6FBB498"
        ],
        "Label": "org.apache.hadoop.hdfs.protocol.ClientProtocol.getBlockLocations completed",
        "Title": "X-Trace Task",
        "Host": "pinky19.mpi-sws.org",
        "HRT": 26966666147163270,
        "Timestamp": "1557750306087.106445",
        "TenantClass": 0,
        "Source": "ProtobufRpcEngine.java:275",
        "ThreadID": 1,
        "ThreadName": "",
        "EventID": "64D4A825E97F96FF",
        "ProcessID": 2801
      },
      {
        "Cycles": 0,
        "Agent": "edu.brown.cs.systems.xtrace.logging.BaggageWrappers",
        "ProcessName": "Read",
        "TaskID": "0A526A8468F35D2B",
        "ParentEventID": [
          "5C99F906AC327EF8"
        ],
        "Label": "Forking current baggage with Baggage.fork()",
        "Title": "X-Trace Task",
        "Host": "pinky19.mpi-sws.org",
        "HRT": 26966666147448438,
        "Operation": "fork",
        "Timestamp": "1557750306087.391846",
        "TenantClass": 0,
        "Source": "DataTransferProtoUtil.java:94",
        "ThreadID": 1,
        "ThreadName": "",
        "EventID": "3597E96315915B9E",
        "ProcessID": 2801
      },
      {
        "Cycles": 0,
        "Agent": "Execution-Sleep",
        "ProcessName": "Read",
        "TaskID": "0A526A8468F35D2B",
        "ParentEventID": [
          "64D4A825E97F96FF"
        ],
        "Label": "waited",
        "Title": "X-Trace Task",
        "Host": "pinky19.mpi-sws.org",
        "Duration": "138180",
        "HRT": 26966666147403773,
        "Operation": "waited",
        "Timestamp": "1557750306087.347168",
        "TenantClass": 0,
        "Source": "SocketIOWithTimeout.java:335",
        "ThreadID": 1,
        "ThreadName": "",
        "EventID": "5C99F906AC327EF8",
        "ProcessID": 2801
      },
      {
        "Cycles": 0,
        "Agent": "Execution-CPU",
        "ProcessName": "Data",
        "TaskID": "0A526A8468F35D2B",
        "ParentEventID": [
          "3597E96315915B9E"
        ],
        "Label": "set",
        "Title": "X-Trace Task",
        "Host": "pinky23.mpi-sws.org",
        "HRT": 12368162121506627,
        "Operation": "set",
        "Timestamp": "1557750306087.831055",
        "TenantClass": 0,
        "Source": "Receiver.java:117",
        "ThreadID": 15798,
        "ThreadName": "",
        "EventID": "E1F21066816D093C",
        "BaggageBytes": "[[248 5] [240 0] [0 10 82 106 132 104 243 93 43] [240 1] [0 53 151 233 99 21 145 91 158] [240 3] [0 2]]",
        "ProcessID": 24612
      },
      {
        "Cycles": 0,
        "Agent": "edu.brown.cs.systems.xtrace.logging.BaggageWrappers",
        "ProcessName": "Data",
        "TaskID": "0A526A8468F35D2B",
        "ParentEventID": [
          "AFFF862017AF17D7"
        ],
        "Label": "Forking current baggage with Baggage.fork()",
        "Title": "X-Trace Task",
        "Host": "pinky23.mpi-sws.org",
        "HRT": 12368162121832761,
        "Operation": "fork",
        "Timestamp": "1557750306088.157227",
        "TenantClass": 0,
        "Source": "DataXceiver.java:1257",
        "ThreadID": 15798,
        "ThreadName": "",
        "EventID": "3A0B06A1F80888C2",
        "BaggageBytes": "[[248 5] [240 0] [0 10 82 106 132 104 243 93 43] [240 1] [0 175 255 134 32 23 175 23 215] [240 3] [0 2]]",
        "ProcessID": 24612
      },
      {
        "Cycles": 0,
        "Agent": "edu.brown.cs.systems.xtrace.logging.XTraceInit",
        "ProcessName": "Data",
        "TaskID": "0A526A8468F35D2B",
        "ParentEventID": [
          "E1F21066816D093C"
        ],
        "Label": "Thread.setName: DataXceiver for client DFSClient_NONMAPREDUCE_310321604_1 at /139.19.171.63:46172 [Sending block BP-1633380353-139.19.171.63-1554193446451:blk_1073763723_22899]",
        "Title": "X-Trace Task",
        "Host": "pinky23.mpi-sws.org",
        "HRT": 12368162121610284,
        "Timestamp": "1557750306087.934814",
        "TenantClass": 0,
        "Source": "DataXceiver.java:168",
        "ThreadID": 15798,
        "ThreadName": "",
        "EventID": "AFFF862017AF17D7",
        "BaggageBytes": "[[248 5] [240 0] [0 10 82 106 132 104 243 93 43] [240 1] [0 225 242 16 102 129 109 9 60] [240 3] [0 2]]",
        "ProcessID": 24612
      },
      {
        "Cycles": 0,
        "Agent": "Execution-Sleep",
        "ProcessName": "Read",
        "TaskID": "0A526A8468F35D2B",
        "ParentEventID": [
          "3597E96315915B9E"
        ],
        "Label": "waited",
        "Title": "X-Trace Task",
        "Host": "pinky19.mpi-sws.org",
        "Duration": "920936",
        "HRT": 26966666148450680,
        "Operation": "waited",
        "Timestamp": "1557750306088.394043",
        "TenantClass": 0,
        "Source": "SocketIOWithTimeout.java:335",
        "ThreadID": 1,
        "ThreadName": "",
        "EventID": "288C35C687947E02",
        "ProcessID": 2801
      },
      {
        "Cycles": 0,
        "Agent": "edu.brown.cs.systems.xtrace.logging.BaggageWrappers",
        "ProcessName": "Read",
        "TaskID": "0A526A8468F35D2B",
        "ParentEventID": [
          "288C35C687947E02",
          "3A0B06A1F80888C2"
        ],
        "Label": "Merged current baggage with other baggage",
        "Title": "X-Trace Task",
        "Host": "pinky19.mpi-sws.org",
        "HRT": 26966666148507017,
        "Operation": "join",
        "Timestamp": "1557750306088.450195",
        "TenantClass": 0,
        "Source": "RemoteBlockReader2.java:429",
        "ThreadID": 1,
        "ThreadName": "",
        "EventID": "A702201C0BCE8B09",
        "ProcessID": 2801
      },
      {
        "Cycles": 0,
        "Agent": "Execution-Sleep",
        "ProcessName": "Read",
        "TaskID": "0A526A8468F35D2B",
        "ParentEventID": [
          "A702201C0BCE8B09"
        ],
        "Label": "waited",
        "Title": "X-Trace Task",
        "Host": "pinky19.mpi-sws.org",
        "Duration": "62110",
        "HRT": 26966666148617508,
        "Operation": "waited",
        "Timestamp": "1557750306088.560791",
        "TenantClass": 0,
        "Source": "SocketIOWithTimeout.java:335",
        "ThreadID": 1,
        "ThreadName": "",
        "EventID": "FD8BC8B7163C3D89",
        "ProcessID": 2801
      },
      {
        "Cycles": 0,
        "Agent": "Execution-Sleep",
        "ProcessName": "Data",
        "TaskID": "0A526A8468F35D2B",
        "ParentEventID": [
          "EDFA3DCC1F00DD54"
        ],
        "Label": "waited",
        "Title": "X-Trace Task",
        "Host": "pinky23.mpi-sws.org",
        "Duration": "13966",
        "HRT": 12368162122151048,
        "Operation": "waited",
        "Timestamp": "1557750306088.475586",
        "TenantClass": 0,
        "Source": "SocketIOWithTimeout.java:335",
        "ThreadID": 15798,
        "ThreadName": "",
        "EventID": "B9E4B749CB3232E3",
        "BaggageBytes": "[[248 5] [240 0] [0 10 82 106 132 104 243 93 43] [240 1] [0 237 250 61 204 31 0 221 84] [240 3] [0 2]]",
        "ProcessID": 24612
      },
      {
        "Cycles": 0,
        "Agent": "edu.brown.cs.systems.xtrace.logging.BaggageWrappers",
        "ProcessName": "Data",
        "TaskID": "0A526A8468F35D2B",
        "ParentEventID": [
          "3A0B06A1F80888C2"
        ],
        "Label": "Forking current baggage with Baggage.fork()",
        "Title": "X-Trace Task",
        "Host": "pinky23.mpi-sws.org",
        "HRT": 12368162121997244,
        "Operation": "fork",
        "Timestamp": "1557750306088.321777",
        "TenantClass": 0,
        "Source": "PacketHeader.java:95",
        "ThreadID": 15798,
        "ThreadName": "",
        "EventID": "EDFA3DCC1F00DD54",
        "BaggageBytes": "[[248 5] [240 0] [0 10 82 106 132 104 243 93 43] [240 1] [0 58 11 6 161 248 8 136 194] [240 3] [0 2]]",
        "ProcessID": 24612
      },
      {
        "Cycles": 0,
        "Agent": "edu.brown.cs.systems.retro.benchmarks.hdfs_client.Reader",
        "ProcessName": "Read",
        "TaskID": "0A526A8468F35D2B",
        "ParentEventID": [
          "0"
        ],
        "Label": "Reading file",
        "Title": "X-Trace Task",
        "Host": "pinky19.mpi-sws.org",
        "HRT": 26966666146344161,
        "Timestamp": "1557750306086.287354",
        "TenantClass": 0,
        "ThreadID": 1,
        "ThreadName": "",
        "EventID": "2B1537E79FC832B2",
        "ProcessID": 2801,
        "Tag": [
          "reader_100kb",
          "Read Size: 102400"
        ]
      },
      {
        "Cycles": 0,
        "Agent": "Execution-Sleep",
        "ProcessName": "Read",
        "TaskID": "0A526A8468F35D2B",
        "ParentEventID": [
          "FD8BC8B7163C3D89"
        ],
        "Label": "waited",
        "Title": "X-Trace Task",
        "Host": "pinky19.mpi-sws.org",
        "Duration": "14710465",
        "HRT": 26966666163387775,
        "Operation": "waited",
        "Timestamp": "1557750306103.331055",
        "TenantClass": 0,
        "Source": "SocketIOWithTimeout.java:335",
        "ThreadID": 1,
        "ThreadName": "",
        "EventID": "5FFE32C5EC9C46B7",
        "ProcessID": 2801
      },
      {
        "Cycles": 0,
        "Agent": "edu.brown.cs.systems.xtrace.logging.BaggageWrappers",
        "ProcessName": "Data",
        "TaskID": "0A526A8468F35D2B",
        "ParentEventID": [
          "B9E4B749CB3232E3"
        ],
        "Label": "Forking current baggage with Baggage.fork()",
        "Title": "X-Trace Task",
        "Host": "pinky23.mpi-sws.org",
        "HRT": 12368162136692414,
        "Operation": "fork",
        "Timestamp": "1557750306103.016846",
        "TenantClass": 0,
        "Source": "PacketHeader.java:95",
        "ThreadID": 15798,
        "ThreadName": "",
        "EventID": "BBEA7993C2D81E61",
        "BaggageBytes": "[[248 5] [240 0] [0 10 82 106 132 104 243 93 43] [240 1] [0 185 228 183 73 203 50 50 227] [240 3] [0 2]]",
        "ProcessID": 24612
      },
      {
        "Cycles": 0,
        "Agent": "Execution-Sleep",
        "ProcessName": "Read",
        "TaskID": "0A526A8468F35D2B",
        "ParentEventID": [
          "5FFE32C5EC9C46B7"
        ],
        "Label": "waited",
        "Title": "X-Trace Task",
        "Host": "pinky19.mpi-sws.org",
        "Duration": "232610",
        "HRT": 26966666163688246,
        "Operation": "waited",
        "Timestamp": "1557750306103.631592",
        "TenantClass": 0,
        "Source": "SocketIOWithTimeout.java:335",
        "ThreadID": 1,
        "ThreadName": "",
        "EventID": "03D75D845BAA9E2B",
        "ProcessID": 2801
      },
      {
        "Cycles": 0,
        "Agent": "Execution-Sleep",
        "ProcessName": "Read",
        "TaskID": "0A526A8468F35D2B",
        "ParentEventID": [
          "03D75D845BAA9E2B"
        ],
        "Label": "waited",
        "Title": "X-Trace Task",
        "Host": "pinky19.mpi-sws.org",
        "Duration": "137675",
        "HRT": 26966666163889015,
        "Operation": "waited",
        "Timestamp": "1557750306103.832275",
        "TenantClass": 0,
        "Source": "SocketIOWithTimeout.java:335",
        "ThreadID": 1,
        "ThreadName": "",
        "EventID": "CE16BDE3DCE067FD",
        "ProcessID": 2801
      },
      {
        "Cycles": 0,
        "Agent": "Execution-Sleep",
        "ProcessName": "Read",
        "TaskID": "0A526A8468F35D2B",
        "ParentEventID": [
          "CE16BDE3DCE067FD"
        ],
        "Label": "waited",
        "Title": "X-Trace Task",
        "Host": "pinky19.mpi-sws.org",
        "Duration": "5091",
        "HRT": 26966666163952633,
        "Operation": "waited",
        "Timestamp": "1557750306103.895996",
        "TenantClass": 0,
        "Source": "SocketIOWithTimeout.java:335",
        "ThreadID": 1,
        "ThreadName": "",
        "EventID": "9123B08CBF528EC9",
        "ProcessID": 2801
      },
      {
        "Cycles": 0,
        "Agent": "edu.brown.cs.systems.xtrace.logging.BaggageWrappers",
        "ProcessName": "Read",
        "TaskID": "0A526A8468F35D2B",
        "ParentEventID": [
          "9123B08CBF528EC9",
          "EDFA3DCC1F00DD54"
        ],
        "Label": "Merged current baggage with other baggage",
        "Title": "X-Trace Task",
        "Host": "pinky19.mpi-sws.org",
        "HRT": 26966666164006614,
        "Operation": "join",
        "Timestamp": "1557750306103.949951",
        "TenantClass": 0,
        "Source": "PacketHeader.java:168",
        "ThreadID": 1,
        "ThreadName": "",
        "EventID": "A1824264450F18A0",
        "ProcessID": 2801
      },
      {
        "Cycles": 0,
        "Agent": "edu.brown.cs.systems.xtrace.logging.BaggageWrappers",
        "ProcessName": "Read",
        "TaskID": "0A526A8468F35D2B",
        "ParentEventID": [
          "BBEA7993C2D81E61",
          "A1824264450F18A0"
        ],
        "Label": "Merged current baggage with other baggage",
        "Title": "X-Trace Task",
        "Host": "pinky19.mpi-sws.org",
        "HRT": 26966666164131022,
        "Operation": "join",
        "Timestamp": "1557750306104.074219",
        "TenantClass": 0,
        "Source": "PacketHeader.java:168",
        "ThreadID": 1,
        "ThreadName": "",
        "EventID": "38EA7DEAB8A26932",
        "ProcessID": 2801
      },
      {
        "Cycles": 0,
        "Agent": "edu.brown.cs.systems.xtrace.logging.BaggageWrappers",
        "ProcessName": "Read",
        "TaskID": "0A526A8468F35D2B",
        "ParentEventID": [
          "38EA7DEAB8A26932"
        ],
        "Label": "Forking current baggage with Baggage.fork()",
        "Title": "X-Trace Task",
        "Host": "pinky19.mpi-sws.org",
        "HRT": 26966666164141862,
        "Operation": "fork",
        "Timestamp": "1557750306104.085205",
        "TenantClass": 0,
        "Source": "RemoteBlockReader2.java:361",
        "ThreadID": 1,
        "ThreadName": "",
        "EventID": "045956481220E0AC",
        "ProcessID": 2801
      },
      {
        "Cycles": 0,
        "Agent": "edu.brown.cs.systems.xtrace.logging.BaggageWrappers",
        "ProcessName": "Read",
        "TaskID": "0A526A8468F35D2B",
        "ParentEventID": [
          "045956481220E0AC"
        ],
        "Label": "Forking current baggage with Baggage.fork()",
        "Title": "X-Trace Task",
        "Host": "pinky19.mpi-sws.org",
        "HRT": 26966666164208849,
        "Operation": "fork",
        "Timestamp": "1557750306104.152100",
        "TenantClass": 0,
        "Source": "DataTransferProtoUtil.java:94",
        "ThreadID": 1,
        "ThreadName": "",
        "EventID": "1D0ADCB14FF9E621",
        "ProcessID": 2801
      },
      {
        "Cycles": 0,
        "Agent": "Execution-Sleep",
        "ProcessName": "Data",
        "TaskID": "0A526A8468F35D2B",
        "ParentEventID": [
          "BBEA7993C2D81E61"
        ],
        "Label": "waited",
        "Title": "X-Trace Task",
        "Host": "pinky23.mpi-sws.org",
        "Duration": "1016420",
        "HRT": 12368162137807710,
        "Operation": "waited",
        "Timestamp": "1557750306104.132080",
        "TenantClass": 0,
        "Source": "SocketIOWithTimeout.java:335",
        "ThreadID": 15798,
        "ThreadName": "",
        "EventID": "B1034C269107D8A3",
        "BaggageBytes": "[[248 5] [240 0] [0 10 82 106 132 104 243 93 43] [240 1] [0 187 234 121 147 194 216 30 97] [240 3] [0 2]]",
        "ProcessID": 24612
      },
      {
        "Cycles": 0,
        "Agent": "Execution-CPU",
        "ProcessName": "Data",
        "TaskID": "0A526A8468F35D2B",
        "ParentEventID": [
          "5ADCC563D96143A5"
        ],
        "Label": "unset",
        "Title": "X-Trace Task",
        "Host": "pinky23.mpi-sws.org",
        "Duration": "16545839",
        "HRT": 12368162138124487,
        "Operation": "unset",
        "Timestamp": "1557750306104.448975",
        "TenantClass": 0,
        "Source": "DataXceiver.java:261",
        "ThreadID": 15798,
        "ThreadName": "",
        "EventID": "81F4D6C83BAA7E3D",
        "BaggageBytes": "[[248 5] [240 0] [0 10 82 106 132 104 243 93 43] [240 1] [0 90 220 197 99 217 97 67 165] [240 3] [0 2]]",
        "ProcessID": 24612
      },
      {
        "Cycles": 0,
        "Agent": "edu.brown.cs.systems.xtrace.logging.BaggageWrappers",
        "ProcessName": "Data",
        "TaskID": "0A526A8468F35D2B",
        "ParentEventID": [
          "045956481220E0AC",
          "B1034C269107D8A3"
        ],
        "Label": "Merged current baggage with other baggage",
        "Title": "X-Trace Task",
        "Host": "pinky23.mpi-sws.org",
        "HRT": 12368162138052897,
        "Operation": "join",
        "Timestamp": "1557750306104.377441",
        "TenantClass": 0,
        "Source": "DataXceiver.java:574",
        "ThreadID": 15798,
        "ThreadName": "",
        "EventID": "5ADCC563D96143A5",
        "BaggageBytes": "[[248 5] [240 0] [0 10 82 106 132 104 243 93 43] [240 1] [0 177 3 76 38 145 7 216 163] [0 4 89 86 72 18 32 224 172] [240 3] [0 2]]",
        "ProcessID": 24612
      },
      {
        "Cycles": 0,
        "Agent": "Execution-CPU",
        "ProcessName": "Data",
        "TaskID": "0A526A8468F35D2B",
        "ParentEventID": [
          "1D0ADCB14FF9E621"
        ],
        "Label": "set",
        "Title": "X-Trace Task",
        "Host": "pinky23.mpi-sws.org",
        "HRT": 12368162138249084,
        "Operation": "set",
        "Timestamp": "1557750306104.573486",
        "TenantClass": 0,
        "Source": "Receiver.java:117",
        "ThreadID": 15798,
        "ThreadName": "",
        "EventID": "BBD35252BB10CB21",
        "BaggageBytes": "[[248 5] [240 0] [0 10 82 106 132 104 243 93 43] [240 1] [0 29 10 220 177 79 249 230 33] [240 3] [0 2]]",
        "ProcessID": 24612
      },
      {
        "Cycles": 0,
        "Agent": "edu.brown.cs.systems.xtrace.logging.XTraceInit",
        "ProcessName": "Data",
        "TaskID": "0A526A8468F35D2B",
        "ParentEventID": [
          "BBD35252BB10CB21"
        ],
        "Label": "Thread.setName: DataXceiver for client DFSClient_NONMAPREDUCE_310321604_1 at /139.19.171.63:46172 [Sending block BP-1633380353-139.19.171.63-1554193446451:blk_1073763723_22899]",
        "Title": "X-Trace Task",
        "Host": "pinky23.mpi-sws.org",
        "HRT": 12368162138334227,
        "Timestamp": "1557750306104.658691",
        "TenantClass": 0,
        "Source": "DataXceiver.java:168",
        "ThreadID": 15798,
        "ThreadName": "",
        "EventID": "6113E25E57595132",
        "BaggageBytes": "[[248 5] [240 0] [0 10 82 106 132 104 243 93 43] [240 1] [0 187 211 82 82 187 16 203 33] [240 3] [0 2]]",
        "ProcessID": 24612
      },
      {
        "Cycles": 0,
        "Agent": "edu.brown.cs.systems.xtrace.logging.BaggageWrappers",
        "ProcessName": "Data",
        "TaskID": "0A526A8468F35D2B",
        "ParentEventID": [
          "6113E25E57595132"
        ],
        "Label": "Forking current baggage with Baggage.fork()",
        "Title": "X-Trace Task",
        "Host": "pinky23.mpi-sws.org",
        "HRT": 12368162138599231,
        "Operation": "fork",
        "Timestamp": "1557750306104.923828",
        "TenantClass": 0,
        "Source": "DataXceiver.java:1257",
        "ThreadID": 15798,
        "ThreadName": "",
        "EventID": "5CC6B52820CEFE5F",
        "BaggageBytes": "[[248 5] [240 0] [0 10 82 106 132 104 243 93 43] [240 1] [0 97 19 226 94 87 89 81 50] [240 3] [0 2]]",
        "ProcessID": 24612
      },
      {
        "Cycles": 0,
        "Agent": "Execution-Sleep",
        "ProcessName": "Read",
        "TaskID": "0A526A8468F35D2B",
        "ParentEventID": [
          "1D0ADCB14FF9E621"
        ],
        "Label": "waited",
        "Title": "X-Trace Task",
        "Host": "pinky19.mpi-sws.org",
        "Duration": "921654",
        "HRT": 26966666165216505,
        "Operation": "waited",
        "Timestamp": "1557750306105.159912",
        "TenantClass": 0,
        "Source": "SocketIOWithTimeout.java:335",
        "ThreadID": 1,
        "ThreadName": "",
        "EventID": "F96CBB88417B3D83",
        "ProcessID": 2801
      },
      {
        "Cycles": 0,
        "Agent": "edu.brown.cs.systems.xtrace.logging.BaggageWrappers",
        "ProcessName": "Read",
        "TaskID": "0A526A8468F35D2B",
        "ParentEventID": [
          "5CC6B52820CEFE5F",
          "F96CBB88417B3D83"
        ],
        "Label": "Merged current baggage with other baggage",
        "Title": "X-Trace Task",
        "Host": "pinky19.mpi-sws.org",
        "HRT": 26966666165272991,
        "Operation": "join",
        "Timestamp": "1557750306105.216309",
        "TenantClass": 0,
        "Source": "RemoteBlockReader2.java:429",
        "ThreadID": 1,
        "ThreadName": "",
        "EventID": "15FD8A744E76DC69",
        "ProcessID": 2801
      },
      {
        "Cycles": 0,
        "Agent": "edu.brown.cs.systems.xtrace.logging.BaggageWrappers",
        "ProcessName": "Data",
        "TaskID": "0A526A8468F35D2B",
        "ParentEventID": [
          "5CC6B52820CEFE5F"
        ],
        "Label": "Forking current baggage with Baggage.fork()",
        "Title": "X-Trace Task",
        "Host": "pinky23.mpi-sws.org",
        "HRT": 12368162138781201,
        "Operation": "fork",
        "Timestamp": "1557750306105.105713",
        "TenantClass": 0,
        "Source": "PacketHeader.java:95",
        "ThreadID": 15798,
        "ThreadName": "",
        "EventID": "42C6BFE6C2FD6BA4",
        "BaggageBytes": "[[248 5] [240 0] [0 10 82 106 132 104 243 93 43] [240 1] [0 92 198 181 40 32 206 254 95] [240 3] [0 2]]",
        "ProcessID": 24612
      },
      {
        "Cycles": 0,
        "Agent": "Execution-Sleep",
        "ProcessName": "Read",
        "TaskID": "0A526A8468F35D2B",
        "ParentEventID": [
          "15FD8A744E76DC69"
        ],
        "Label": "waited",
        "Title": "X-Trace Task",
        "Host": "pinky19.mpi-sws.org",
        "Duration": "72684",
        "HRT": 26966666165392488,
        "Operation": "waited",
        "Timestamp": "1557750306105.335693",
        "TenantClass": 0,
        "Source": "SocketIOWithTimeout.java:335",
        "ThreadID": 1,
        "ThreadName": "",
        "EventID": "062B8135BEE31638",
        "ProcessID": 2801
      },
      {
        "Cycles": 0,
        "Agent": "Execution-Sleep",
        "ProcessName": "Data",
        "TaskID": "0A526A8468F35D2B",
        "ParentEventID": [
          "42C6BFE6C2FD6BA4"
        ],
        "Label": "waited",
        "Title": "X-Trace Task",
        "Host": "pinky23.mpi-sws.org",
        "Duration": "11377",
        "HRT": 12368162138938788,
        "Operation": "waited",
        "Timestamp": "1557750306105.263184",
        "TenantClass": 0,
        "Source": "SocketIOWithTimeout.java:335",
        "ThreadID": 15798,
        "ThreadName": "",
        "EventID": "5715891E9A6C57EB",
        "BaggageBytes": "[[248 5] [240 0] [0 10 82 106 132 104 243 93 43] [240 1] [0 66 198 191 230 194 253 107 164] [240 3] [0 2]]",
        "ProcessID": 24612
      },
      {
        "Cycles": 0,
        "Agent": "edu.brown.cs.systems.xtrace.logging.BaggageWrappers",
        "ProcessName": "Data",
        "TaskID": "0A526A8468F35D2B",
        "ParentEventID": [
          "5715891E9A6C57EB"
        ],
        "Label": "Forking current baggage with Baggage.fork()",
        "Title": "X-Trace Task",
        "Host": "pinky23.mpi-sws.org",
        "HRT": 12368162139158835,
        "Operation": "fork",
        "Timestamp": "1557750306105.483398",
        "TenantClass": 0,
        "Source": "PacketHeader.java:95",
        "ThreadID": 15798,
        "ThreadName": "",
        "EventID": "FD24F08E6D5DF8E3",
        "BaggageBytes": "[[248 5] [240 0] [0 10 82 106 132 104 243 93 43] [240 1] [0 87 21 137 30 154 108 87 235] [240 3] [0 2]]",
        "ProcessID": 24612
      },
      {
        "Cycles": 0,
        "Agent": "Execution-Sleep",
        "ProcessName": "Read",
        "TaskID": "0A526A8468F35D2B",
        "ParentEventID": [
          "062B8135BEE31638"
        ],
        "Label": "waited",
        "Title": "X-Trace Task",
        "Host": "pinky19.mpi-sws.org",
        "Duration": "372329",
        "HRT": 26966666165828867,
        "Operation": "waited",
        "Timestamp": "1557750306105.772217",
        "TenantClass": 0,
        "Source": "SocketIOWithTimeout.java:335",
        "ThreadID": 1,
        "ThreadName": "",
        "EventID": "1D03EB0D6E723F6E",
        "ProcessID": 2801
      },
      {
        "Cycles": 0,
        "Agent": "Execution-Sleep",
        "ProcessName": "Data",
        "TaskID": "0A526A8468F35D2B",
        "ParentEventID": [
          "FD24F08E6D5DF8E3"
        ],
        "Label": "waited",
        "Title": "X-Trace Task",
        "Host": "pinky23.mpi-sws.org",
        "Duration": "168990",
        "HRT": 12368162139452352,
        "Operation": "waited",
        "Timestamp": "1557750306105.776855",
        "TenantClass": 0,
        "Source": "SocketIOWithTimeout.java:335",
        "ThreadID": 15798,
        "ThreadName": "",
        "EventID": "D804FAEBF9F24C02",
        "BaggageBytes": "[[248 5] [240 0] [0 10 82 106 132 104 243 93 43] [240 1] [0 253 36 240 142 109 93 248 227] [240 3] [0 2]]",
        "ProcessID": 24612
      },
      {
        "Cycles": 0,
        "Agent": "Execution-Sleep",
        "ProcessName": "Read",
        "TaskID": "0A526A8468F35D2B",
        "ParentEventID": [
          "1D03EB0D6E723F6E"
        ],
        "Label": "waited",
        "Title": "X-Trace Task",
        "Host": "pinky19.mpi-sws.org",
        "Duration": "150567",
        "HRT": 26966666166037165,
        "Operation": "waited",
        "Timestamp": "1557750306105.980469",
        "TenantClass": 0,
        "Source": "SocketIOWithTimeout.java:335",
        "ThreadID": 1,
        "ThreadName": "",
        "EventID": "4F6792E32531A11D",
        "ProcessID": 2801
      },
      {
        "Cycles": 0,
        "Agent": "Execution-Sleep",
        "ProcessName": "Read",
        "TaskID": "0A526A8468F35D2B",
        "ParentEventID": [
          "4F6792E32531A11D"
        ],
        "Label": "waited",
        "Title": "X-Trace Task",
        "Host": "pinky19.mpi-sws.org",
        "Duration": "155806",
        "HRT": 26966666166247900,
        "Operation": "waited",
        "Timestamp": "1557750306106.191162",
        "TenantClass": 0,
        "Source": "SocketIOWithTimeout.java:335",
        "ThreadID": 1,
        "ThreadName": "",
        "EventID": "DBE0C09C9E2A10D7",
        "ProcessID": 2801
      },
      {
        "Cycles": 0,
        "Agent": "edu.brown.cs.systems.xtrace.logging.BaggageWrappers",
        "ProcessName": "Data",
        "TaskID": "0A526A8468F35D2B",
        "ParentEventID": [
          "D804FAEBF9F24C02"
        ],
        "Label": "Forking current baggage with Baggage.fork()",
        "Title": "X-Trace Task",
        "Host": "pinky23.mpi-sws.org",
        "HRT": 12368162139664693,
        "Operation": "fork",
        "Timestamp": "1557750306105.989258",
        "TenantClass": 0,
        "Source": "PacketHeader.java:95",
        "ThreadID": 15798,
        "ThreadName": "",
        "EventID": "AB9E525154998F48",
        "BaggageBytes": "[[248 5] [240 0] [0 10 82 106 132 104 243 93 43] [240 1] [0 216 4 250 235 249 242 76 2] [240 3] [0 2]]",
        "ProcessID": 24612
      },
      {
        "Cycles": 0,
        "Agent": "Execution-Sleep",
        "ProcessName": "Read",
        "TaskID": "0A526A8468F35D2B",
        "ParentEventID": [
          "DBE0C09C9E2A10D7"
        ],
        "Label": "waited",
        "Title": "X-Trace Task",
        "Host": "pinky19.mpi-sws.org",
        "Duration": "170627",
        "HRT": 26966666166465809,
        "Operation": "waited",
        "Timestamp": "1557750306106.409180",
        "TenantClass": 0,
        "Source": "SocketIOWithTimeout.java:335",
        "ThreadID": 1,
        "ThreadName": "",
        "EventID": "94C95A40ECF98E9A",
        "ProcessID": 2801
      },
      {
        "Cycles": 0,
        "Agent": "Execution-Sleep",
        "ProcessName": "Data",
        "TaskID": "0A526A8468F35D2B",
        "ParentEventID": [
          "AB9E525154998F48"
        ],
        "Label": "waited",
        "Title": "X-Trace Task",
        "Host": "pinky23.mpi-sws.org",
        "Duration": "10133",
        "HRT": 12368162139797893,
        "Operation": "waited",
        "Timestamp": "1557750306106.122314",
        "TenantClass": 0,
        "Source": "SocketIOWithTimeout.java:335",
        "ThreadID": 15798,
        "ThreadName": "",
        "EventID": "95907FFF996B6889",
        "BaggageBytes": "[[248 5] [240 0] [0 10 82 106 132 104 243 93 43] [240 1] [0 171 158 82 81 84 153 143 72] [240 3] [0 2]]",
        "ProcessID": 24612
      },
      {
        "Cycles": 0,
        "Agent": "edu.brown.cs.systems.xtrace.logging.BaggageWrappers",
        "ProcessName": "Read",
        "TaskID": "0A526A8468F35D2B",
        "ParentEventID": [
          "42C6BFE6C2FD6BA4",
          "94C95A40ECF98E9A"
        ],
        "Label": "Merged current baggage with other baggage",
        "Title": "X-Trace Task",
        "Host": "pinky19.mpi-sws.org",
        "HRT": 26966666166531956,
        "Operation": "join",
        "Timestamp": "1557750306106.475342",
        "TenantClass": 0,
        "Source": "PacketHeader.java:168",
        "ThreadID": 1,
        "ThreadName": "",
        "EventID": "4115DFD0B4AC3981",
        "ProcessID": 2801
      },
      {
        "Cycles": 0,
        "Agent": "edu.brown.cs.systems.xtrace.logging.BaggageWrappers",
        "ProcessName": "Data",
        "TaskID": "0A526A8468F35D2B",
        "ParentEventID": [
          "95907FFF996B6889"
        ],
        "Label": "Forking current baggage with Baggage.fork()",
        "Title": "X-Trace Task",
        "Host": "pinky23.mpi-sws.org",
        "HRT": 12368162140247523,
        "Operation": "fork",
        "Timestamp": "1557750306106.572021",
        "TenantClass": 0,
        "Source": "PacketHeader.java:95",
        "ThreadID": 15798,
        "ThreadName": "",
        "EventID": "3ED5F2E381FAD342",
        "BaggageBytes": "[[248 5] [240 0] [0 10 82 106 132 104 243 93 43] [240 1] [0 149 144 127 255 153 107 104 137] [240 3] [0 2]]",
        "ProcessID": 24612
      },
      {
        "Cycles": 0,
        "Agent": "Execution-CPU",
        "ProcessName": "Data",
        "TaskID": "0A526A8468F35D2B",
        "ParentEventID": [
          "3ED5F2E381FAD342"
        ],
        "Label": "unset",
        "Title": "X-Trace Task",
        "Host": "pinky23.mpi-sws.org",
        "Duration": "2328910",
        "HRT": 12368162140636117,
        "Operation": "unset",
        "Timestamp": "1557750306106.960693",
        "TenantClass": 0,
        "Source": "DataXceiver.java:261",
        "ThreadID": 15798,
        "ThreadName": "",
        "EventID": "C0E73E0A2AF90040",
        "BaggageBytes": "[[248 5] [240 0] [0 10 82 106 132 104 243 93 43] [240 1] [0 62 213 242 227 129 250 211 66] [240 3] [0 2]]",
        "ProcessID": 24612
      }
    ]
  }
]