[
  {
    "id": "592DA16D4A62FC64",
    "reports": [
      {
        "Cycles": 0,
        "Agent": "org.apache.hadoop.ipc.ProtobufRpcEngine",
        "ProcessName": "Read",
        "TaskID": "592DA16D4A62FC64",
        "ParentEventID": [
          "C2134AA3D9F8F9F3"
        ],
        "Label": "Invoking org.apache.hadoop.hdfs.protocol.ClientProtocol.getBlockLocations",
        "Title": "X-Trace Task",
        "Host": "pinky19.mpi-sws.org",
        "HRT": 25491756041274673,
        "Timestamp": "1556275395981.553223",
        "TenantClass": 0,
        "Source": "ProtobufRpcEngine.java:228",
        "ThreadID": 1,
        "ThreadName": "",
        "EventID": "119FA042E54C9A04",
        "ProcessID": 21035
      },
      {
        "Cycles": 0,
        "Agent": "Execution-CPU",
        "ProcessName": "Read",
        "TaskID": "592DA16D4A62FC64",
        "ParentEventID": [
          "F8C27365C48F831C"
        ],
        "Label": "set",
        "Title": "X-Trace Task",
        "Host": "pinky19.mpi-sws.org",
        "HRT": 25491756041361130,
        "Operation": "set",
        "Timestamp": "1556275395981.639648",
        "TenantClass": 0,
        "Source": "Client.java:1032",
        "ThreadID": 41,
        "ThreadName": "",
        "EventID": "38D8F6971B8F31D4",
        "ProcessID": 21035
      },
      {
        "Cycles": 0,
        "Agent": "edu.brown.cs.systems.xtrace.logging.BaggageWrappers",
        "ProcessName": "Read",
        "TaskID": "592DA16D4A62FC64",
        "ParentEventID": [
          "38D8F6971B8F31D4"
        ],
        "Label": "Forking current baggage with Baggage.fork()",
        "Title": "X-Trace Task",
        "Host": "pinky19.mpi-sws.org",
        "HRT": 25491756041384217,
        "Operation": "fork",
        "Timestamp": "1556275395981.662598",
        "TenantClass": 0,
        "Source": "Client.java:1043",
        "ThreadID": 41,
        "ThreadName": "",
        "EventID": "DD0CB573FCFF7245",
        "ProcessID": 21035
      },
      {
        "Cycles": 0,
        "Agent": "Execution-CPU",
        "ProcessName": "Read",
        "TaskID": "592DA16D4A62FC64",
        "ParentEventID": [
          "119FA042E54C9A04"
        ],
        "Label": "unset",
        "Title": "X-Trace Task",
        "Host": "pinky19.mpi-sws.org",
        "Duration": "22156512",
        "HRT": 25491756041309397,
        "Operation": "unset",
        "Timestamp": "1556275395981.587891",
        "TenantClass": 0,
        "Source": "Client.java:1027",
        "ThreadID": 1,
        "ThreadName": "",
        "EventID": "F8C27365C48F831C",
        "ProcessID": 21035
      },
      {
        "Cycles": 0,
        "Agent": "Execution-CPU",
        "ProcessName": "Read",
        "TaskID": "592DA16D4A62FC64",
        "ParentEventID": [
          "DD0CB573FCFF7245"
        ],
        "Label": "unset",
        "Title": "X-Trace Task",
        "Host": "pinky19.mpi-sws.org",
        "Duration": "84389",
        "HRT": 25491756041467509,
        "Operation": "unset",
        "Timestamp": "1556275395981.745850",
        "TenantClass": 0,
        "Source": "Client.java:1062",
        "ThreadID": 41,
        "ThreadName": "",
        "EventID": "8D5003DB19951A9E",
        "ProcessID": 21035
      },
      {
        "Cycles": 0,
        "Agent": "edu.brown.cs.systems.retro.benchmarks.hdfs_client.Reader",
        "ProcessName": "Read",
        "TaskID": "592DA16D4A62FC64",
        "ParentEventID": [
          "9DA4DD6E36FC4288"
        ],
        "Label": "Reading file",
        "Title": "X-Trace Task",
        "Host": "pinky19.mpi-sws.org",
        "HRT": 25491756041216533,
        "Timestamp": "1556275395981.494873",
        "TenantClass": 0,
        "ThreadID": 1,
        "ThreadName": "",
        "EventID": "C2134AA3D9F8F9F3",
        "ProcessID": 21035
      },
      {
        "Cycles": 0,
        "Agent": "Execution-CPU",
        "ProcessName": "Read",
        "TaskID": "592DA16D4A62FC64",
        "ParentEventID": [
          "8D5003DB19951A9E"
        ],
        "Label": "set",
        "Title": "X-Trace Task",
        "Host": "pinky19.mpi-sws.org",
        "HRT": 25491756041495002,
        "Operation": "set",
        "Timestamp": "1556275395981.773438",
        "TenantClass": 0,
        "Source": "Client.java:1104",
        "ThreadID": 1,
        "ThreadName": "",
        "EventID": "EE3B6A4B759299A1",
        "ProcessID": 21035
      },
      {
        "Cycles": 0,
        "Agent": "Execution-CPU",
        "ProcessName": "Name",
        "TaskID": "592DA16D4A62FC64",
        "ParentEventID": [
          "DD0CB573FCFF7245"
        ],
        "Label": "set",
        "Title": "X-Trace Task",
        "Host": "pinky19.mpi-sws.org",
        "HRT": 25491756041543091,
        "Operation": "set",
        "Timestamp": "1556275395981.832031",
        "TenantClass": 0,
        "Source": "Server.java:1840",
        "ThreadID": 48,
        "ThreadName": "",
        "EventID": "7C731E95EF08D900",
        "BaggageBytes": "[[248 5] [240 0] [0 89 45 161 109 74 98 252 100] [240 1] [0 221 12 181 115 252 255 114 69] [240 3] [0 2]]",
        "ProcessID": 2171
      },
      {
        "Cycles": 0,
        "Agent": "edu.brown.cs.systems.xtrace.logging.BaggageWrappers",
        "ProcessName": "Name",
        "TaskID": "592DA16D4A62FC64",
        "ParentEventID": [
          "7C731E95EF08D900"
        ],
        "Label": "Forking current baggage with Baggage.fork()",
        "Title": "X-Trace Task",
        "Host": "pinky19.mpi-sws.org",
        "HRT": 25491756041573668,
        "Operation": "fork",
        "Timestamp": "1556275395981.862549",
        "TenantClass": 0,
        "Source": "Server.java:550",
        "ThreadID": 48,
        "ThreadName": "",
        "EventID": "0641A9BFAC59045E",
        "BaggageBytes": "[[248 5] [240 0] [0 89 45 161 109 74 98 252 100] [240 1] [0 124 115 30 149 239 8 217 0] [240 3] [0 2]]",
        "ProcessID": 2171
      },
      {
        "Cycles": 0,
        "Agent": "Execution-CPU",
        "ProcessName": "Name",
        "TaskID": "592DA16D4A62FC64",
        "ParentEventID": [
          "0641A9BFAC59045E"
        ],
        "Label": "set",
        "Title": "X-Trace Task",
        "Host": "pinky19.mpi-sws.org",
        "HRT": 25491756041627042,
        "Operation": "set",
        "Timestamp": "1556275395981.916016",
        "TenantClass": 0,
        "Source": "Server.java:2071",
        "ThreadID": 61,
        "ThreadName": "",
        "EventID": "0E82A1841F347A1A",
        "BaggageBytes": "[[248 5] [240 0] [0 89 45 161 109 74 98 252 100] [240 1] [0 6 65 169 191 172 89 4 94] [240 3] [0 2]]",
        "ProcessID": 2171
      },
      {
        "Cycles": 0,
        "Agent": "org.apache.hadoop.ipc.Server",
        "ProcessName": "Name",
        "TaskID": "592DA16D4A62FC64",
        "ParentEventID": [
          "0E82A1841F347A1A"
        ],
        "Label": "getBlockLocations in org.apache.hadoop.hdfs.protocol.ClientProtocol",
        "Title": "X-Trace Task",
        "Host": "pinky19.mpi-sws.org",
        "HRT": 25491756041671003,
        "Timestamp": "1556275395981.959961",
        "TenantClass": 0,
        "Source": "ProtobufRpcEngine.java:601",
        "ThreadID": 61,
        "ThreadName": "",
        "EventID": "82F09778696D00AF",
        "BaggageBytes": "[[248 5] [240 0] [0 89 45 161 109 74 98 252 100] [240 1] [0 14 130 161 132 31 52 122 26] [240 3] [0 2]]",
        "ProcessID": 2171
      },
      {
        "Cycles": 0,
        "Agent": "Execution-CPU",
        "ProcessName": "Name",
        "TaskID": "592DA16D4A62FC64",
        "ParentEventID": [
          "0641A9BFAC59045E"
        ],
        "Label": "unset",
        "Title": "X-Trace Task",
        "Host": "pinky19.mpi-sws.org",
        "Duration": "25836",
        "HRT": 25491756041595590,
        "Operation": "unset",
        "Timestamp": "1556275395981.884521",
        "TenantClass": 0,
        "Source": "Server.java:1828",
        "ThreadID": 48,
        "ThreadName": "",
        "EventID": "1424147A4189E1AC",
        "BaggageBytes": "[[248 5] [240 0] [0 89 45 161 109 74 98 252 100] [240 1] [0 6 65 169 191 172 89 4 94] [240 3] [0 2]]",
        "ProcessID": 2171
      },
      {
        "Cycles": 0,
        "Agent": "org.apache.hadoop.hdfs.server.namenode.FSNamesystem.audit",
        "ProcessName": "Name",
        "TaskID": "592DA16D4A62FC64",
        "ParentEventID": [
          "82F09778696D00AF"
        ],
        "Label": "allowed=true\tugi=plascas (auth:SIMPLE)\tip=/139.19.171.63\tcmd=open\tsrc=/ds/0UF7FJOdapIQVXeZ\tdst=null\tperm=null\tproto=rpc",
        "Title": "X-Trace Task",
        "Host": "pinky19.mpi-sws.org",
        "HRT": 25491756041715125,
        "Timestamp": "1556275395982.003906",
        "TenantClass": 0,
        "Source": "FSNamesystem.java:8313",
        "ThreadID": 61,
        "ThreadName": "",
        "EventID": "4D79E671294DF451",
        "BaggageBytes": "[[248 5] [240 0] [0 89 45 161 109 74 98 252 100] [240 1] [0 130 240 151 120 105 109 0 175] [240 3] [0 2]]",
        "ProcessID": 2171
      },
      {
        "Cycles": 0,
        "Agent": "Execution-CPU",
        "ProcessName": "Name",
        "TaskID": "592DA16D4A62FC64",
        "ParentEventID": [
          "077071F87C28FE3A"
        ],
        "Label": "unset",
        "Title": "X-Trace Task",
        "Host": "pinky19.mpi-sws.org",
        "Duration": "210277",
        "HRT": 25491756041865842,
        "Operation": "unset",
        "Timestamp": "1556275395982.154785",
        "TenantClass": 0,
        "Source": "Server.java:1058",
        "ThreadID": 61,
        "ThreadName": "",
        "EventID": "865EEA35D7EF01BB",
        "BaggageBytes": "[[248 5] [240 0] [0 89 45 161 109 74 98 252 100] [240 1] [0 7 112 113 248 124 40 254 58] [240 3] [0 2]]",
        "ProcessID": 2171
      },
      {
        "Cycles": 0,
        "Agent": "Execution-CPU",
        "ProcessName": "Read",
        "TaskID": "592DA16D4A62FC64",
        "ParentEventID": [
          "077071F87C28FE3A"
        ],
        "Label": "set",
        "Title": "X-Trace Task",
        "Host": "pinky19.mpi-sws.org",
        "HRT": 25491756041939535,
        "Operation": "set",
        "Timestamp": "1556275395982.218018",
        "TenantClass": 0,
        "Source": "Client.java:302",
        "ThreadID": 37,
        "ThreadName": "",
        "EventID": "7976D55F8C2B0CB9",
        "ProcessID": 21035
      },
      {
        "Cycles": 0,
        "Agent": "edu.brown.cs.systems.xtrace.logging.BaggageWrappers",
        "ProcessName": "Name",
        "TaskID": "592DA16D4A62FC64",
        "ParentEventID": [
          "4D79E671294DF451"
        ],
        "Label": "Forking current baggage with Baggage.fork()",
        "Title": "X-Trace Task",
        "Host": "pinky19.mpi-sws.org",
        "HRT": 25491756041759581,
        "Operation": "fork",
        "Timestamp": "1556275395982.048584",
        "TenantClass": 0,
        "Source": "Server.java:2398",
        "ThreadID": 61,
        "ThreadName": "",
        "EventID": "077071F87C28FE3A",
        "BaggageBytes": "[[248 5] [240 0] [0 89 45 161 109 74 98 252 100] [240 1] [0 77 121 230 113 41 77 244 81] [240 3] [0 2]]",
        "ProcessID": 2171
      },
      {
        "Cycles": 0,
        "Agent": "Execution-CPU",
        "ProcessName": "Read",
        "TaskID": "592DA16D4A62FC64",
        "ParentEventID": [
          "7976D55F8C2B0CB9"
        ],
        "Label": "unset",
        "Title": "X-Trace Task",
        "Host": "pinky19.mpi-sws.org",
        "Duration": "14441",
        "HRT": 25491756041976894,
        "Operation": "unset",
        "Timestamp": "1556275395982.255371",
        "TenantClass": 0,
        "Source": "Client.java:1168",
        "ThreadID": 37,
        "ThreadName": "",
        "EventID": "FA74C485C30F6AC6",
        "ProcessID": 21035
      },
      {
        "Cycles": 0,
        "Agent": "Execution-Sleep",
        "ProcessName": "Read",
        "TaskID": "592DA16D4A62FC64",
        "ParentEventID": [
          "EE3B6A4B759299A1"
        ],
        "Label": "waited",
        "Title": "X-Trace Task",
        "Host": "pinky19.mpi-sws.org",
        "Duration": "521949",
        "HRT": 25491756042031695,
        "Operation": "waited",
        "Timestamp": "1556275395982.310059",
        "TenantClass": 0,
        "Source": "Client.java:1537",
        "ThreadID": 1,
        "ThreadName": "",
        "EventID": "1127B460C8ECEBDC",
        "ProcessID": 21035
      },
      {
        "Cycles": 0,
        "Agent": "org.apache.hadoop.ipc.ProtobufRpcEngine",
        "ProcessName": "Read",
        "TaskID": "592DA16D4A62FC64",
        "ParentEventID": [
          "220E9B7FDD1F037D"
        ],
        "Label": "org.apache.hadoop.hdfs.protocol.ClientProtocol.getBlockLocations completed",
        "Title": "X-Trace Task",
        "Host": "pinky19.mpi-sws.org",
        "HRT": 25491756042121065,
        "Timestamp": "1556275395982.399414",
        "TenantClass": 0,
        "Source": "ProtobufRpcEngine.java:275",
        "ThreadID": 1,
        "ThreadName": "",
        "EventID": "580F144594215218",
        "ProcessID": 21035
      },
      {
        "Cycles": 0,
        "Agent": "edu.brown.cs.systems.xtrace.logging.BaggageWrappers",
        "ProcessName": "Read",
        "TaskID": "592DA16D4A62FC64",
        "ParentEventID": [
          "1127B460C8ECEBDC",
          "FA74C485C30F6AC6"
        ],
        "Label": "Merged current baggage with other baggage",
        "Title": "X-Trace Task",
        "Host": "pinky19.mpi-sws.org",
        "HRT": 25491756042066673,
        "Operation": "join",
        "Timestamp": "1556275395982.345215",
        "TenantClass": 0,
        "Source": "Client.java:1545",
        "ThreadID": 1,
        "ThreadName": "",
        "EventID": "220E9B7FDD1F037D",
        "ProcessID": 21035
      },
      {
        "Cycles": 0,
        "Agent": "Execution-CPU",
        "ProcessName": "Data",
        "TaskID": "592DA16D4A62FC64",
        "ParentEventID": [
          "05CFCD3C8446B3D8"
        ],
        "Label": "set",
        "Title": "X-Trace Task",
        "Host": "pinky21.mpi-sws.org",
        "HRT": 9338065749606994,
        "Operation": "set",
        "Timestamp": "1556275395982.876221",
        "TenantClass": 0,
        "Source": "Receiver.java:117",
        "ThreadID": 5977,
        "ThreadName": "",
        "EventID": "CF5946446BC58B3A",
        "BaggageBytes": "[[248 5] [240 0] [0 89 45 161 109 74 98 252 100] [240 1] [0 5 207 205 60 132 70 179 216] [240 3] [0 2]]",
        "ProcessID": 20775
      },
      {
        "Cycles": 0,
        "Agent": "edu.brown.cs.systems.xtrace.logging.BaggageWrappers",
        "ProcessName": "Read",
        "TaskID": "592DA16D4A62FC64",
        "ParentEventID": [
          "580F144594215218"
        ],
        "Label": "Forking current baggage with Baggage.fork()",
        "Title": "X-Trace Task",
        "Host": "pinky19.mpi-sws.org",
        "HRT": 25491756042223149,
        "Operation": "fork",
        "Timestamp": "1556275395982.501465",
        "TenantClass": 0,
        "Source": "DataTransferProtoUtil.java:94",
        "ThreadID": 1,
        "ThreadName": "",
        "EventID": "05CFCD3C8446B3D8",
        "ProcessID": 21035
      },
      {
        "Cycles": 0,
        "Agent": "edu.brown.cs.systems.xtrace.logging.XTraceInit",
        "ProcessName": "Data",
        "TaskID": "592DA16D4A62FC64",
        "ParentEventID": [
          "CF5946446BC58B3A"
        ],
        "Label": "Thread.setName: DataXceiver for client DFSClient_NONMAPREDUCE_1377588049_1 at /139.19.171.63:56492 [Sending block BP-1633380353-139.19.171.63-1554193446451:blk_1073769438_28614]",
        "Title": "X-Trace Task",
        "Host": "pinky21.mpi-sws.org",
        "HRT": 9338065749708835,
        "Timestamp": "1556275395982.978027",
        "TenantClass": 0,
        "Source": "DataXceiver.java:168",
        "ThreadID": 5977,
        "ThreadName": "",
        "EventID": "FC9F5A04E28AAB7D",
        "BaggageBytes": "[[248 5] [240 0] [0 89 45 161 109 74 98 252 100] [240 1] [0 207 89 70 68 107 197 139 58] [240 3] [0 2]]",
        "ProcessID": 20775
      },
      {
        "Cycles": 0,
        "Agent": "Execution-Sleep",
        "ProcessName": "Read",
        "TaskID": "592DA16D4A62FC64",
        "ParentEventID": [
          "05CFCD3C8446B3D8"
        ],
        "Label": "waited",
        "Title": "X-Trace Task",
        "Host": "pinky19.mpi-sws.org",
        "Duration": "761657",
        "HRT": 25491756043094437,
        "Operation": "waited",
        "Timestamp": "1556275395983.372803",
        "TenantClass": 0,
        "Source": "SocketIOWithTimeout.java:335",
        "ThreadID": 1,
        "ThreadName": "",
        "EventID": "CDCFA1270ACE5607",
        "ProcessID": 21035
      },
      {
        "Cycles": 0,
        "Agent": "edu.brown.cs.systems.xtrace.logging.BaggageWrappers",
        "ProcessName": "Data",
        "TaskID": "592DA16D4A62FC64",
        "ParentEventID": [
          "EBB746139C5A21E9"
        ],
        "Label": "Forking current baggage with Baggage.fork()",
        "Title": "X-Trace Task",
        "Host": "pinky21.mpi-sws.org",
        "HRT": 9338065750106686,
        "Operation": "fork",
        "Timestamp": "1556275395983.375977",
        "TenantClass": 0,
        "Source": "PacketHeader.java:95",
        "ThreadID": 5977,
        "ThreadName": "",
        "EventID": "1B543B827F92EFEC",
        "BaggageBytes": "[[248 5] [240 0] [0 89 45 161 109 74 98 252 100] [240 1] [0 235 183 70 19 156 90 33 233] [240 3] [0 2]]",
        "ProcessID": 20775
      },
      {
        "Cycles": 0,
        "Agent": "edu.brown.cs.systems.xtrace.logging.BaggageWrappers",
        "ProcessName": "Data",
        "TaskID": "592DA16D4A62FC64",
        "ParentEventID": [
          "FC9F5A04E28AAB7D"
        ],
        "Label": "Forking current baggage with Baggage.fork()",
        "Title": "X-Trace Task",
        "Host": "pinky21.mpi-sws.org",
        "HRT": 9338065749916509,
        "Operation": "fork",
        "Timestamp": "1556275395983.185791",
        "TenantClass": 0,
        "Source": "DataXceiver.java:1257",
        "ThreadID": 5977,
        "ThreadName": "",
        "EventID": "EBB746139C5A21E9",
        "BaggageBytes": "[[248 5] [240 0] [0 89 45 161 109 74 98 252 100] [240 1] [0 252 159 90 4 226 138 171 125] [240 3] [0 2]]",
        "ProcessID": 20775
      },
      {
        "Cycles": 0,
        "Agent": "edu.brown.cs.systems.xtrace.logging.BaggageWrappers",
        "ProcessName": "Read",
        "TaskID": "592DA16D4A62FC64",
        "ParentEventID": [
          "EBB746139C5A21E9",
          "CDCFA1270ACE5607"
        ],
        "Label": "Merged current baggage with other baggage",
        "Title": "X-Trace Task",
        "Host": "pinky19.mpi-sws.org",
        "HRT": 25491756043191565,
        "Operation": "join",
        "Timestamp": "1556275395983.469971",
        "TenantClass": 0,
        "Source": "RemoteBlockReader2.java:429",
        "ThreadID": 1,
        "ThreadName": "",
        "EventID": "EBCB5A88F7AB518A",
        "ProcessID": 21035
      },
      {
        "Cycles": 0,
        "Agent": "Execution-Sleep",
        "ProcessName": "Data",
        "TaskID": "592DA16D4A62FC64",
        "ParentEventID": [
          "1B543B827F92EFEC"
        ],
        "Label": "waited",
        "Title": "X-Trace Task",
        "Host": "pinky21.mpi-sws.org",
        "Duration": "11933",
        "HRT": 9338065750289960,
        "Operation": "waited",
        "Timestamp": "1556275395983.559082",
        "TenantClass": 0,
        "Source": "SocketIOWithTimeout.java:335",
        "ThreadID": 5977,
        "ThreadName": "",
        "EventID": "DD651D3233106B7C",
        "BaggageBytes": "[[248 5] [240 0] [0 89 45 161 109 74 98 252 100] [240 1] [0 27 84 59 130 127 146 239 236] [240 3] [0 2]]",
        "ProcessID": 20775
      },
      {
        "Cycles": 0,
        "Agent": "Execution-Sleep",
        "ProcessName": "Read",
        "TaskID": "592DA16D4A62FC64",
        "ParentEventID": [
          "EBCB5A88F7AB518A"
        ],
        "Label": "waited",
        "Title": "X-Trace Task",
        "Host": "pinky19.mpi-sws.org",
        "Duration": "170441",
        "HRT": 25491756043488478,
        "Operation": "waited",
        "Timestamp": "1556275395983.766846",
        "TenantClass": 0,
        "Source": "SocketIOWithTimeout.java:335",
        "ThreadID": 1,
        "ThreadName": "",
        "EventID": "F87A328E20980045",
        "ProcessID": 21035
      },
      {
        "Cycles": 0,
        "Agent": "edu.brown.cs.systems.xtrace.logging.BaggageWrappers",
        "ProcessName": "Read",
        "TaskID": "592DA16D4A62FC64",
        "ParentEventID": [
          "F87A328E20980045",
          "1B543B827F92EFEC"
        ],
        "Label": "Merged current baggage with other baggage",
        "Title": "X-Trace Task",
        "Host": "pinky19.mpi-sws.org",
        "HRT": 25491756043561743,
        "Operation": "join",
        "Timestamp": "1556275395983.840088",
        "TenantClass": 0,
        "Source": "PacketHeader.java:168",
        "ThreadID": 1,
        "ThreadName": "",
        "EventID": "138EA160E165EC72",
        "ProcessID": 21035
      },
      {
        "Cycles": 0,
        "Agent": "edu.brown.cs.systems.xtrace.logging.BaggageWrappers",
        "ProcessName": "Data",
        "TaskID": "592DA16D4A62FC64",
        "ParentEventID": [
          "DD651D3233106B7C"
        ],
        "Label": "Forking current baggage with Baggage.fork()",
        "Title": "X-Trace Task",
        "Host": "pinky21.mpi-sws.org",
        "HRT": 9338065750477507,
        "Operation": "fork",
        "Timestamp": "1556275395983.746826",
        "TenantClass": 0,
        "Source": "PacketHeader.java:95",
        "ThreadID": 5977,
        "ThreadName": "",
        "EventID": "76429F86910F6000",
        "BaggageBytes": "[[248 5] [240 0] [0 89 45 161 109 74 98 252 100] [240 1] [0 221 101 29 50 51 16 107 124] [240 3] [0 2]]",
        "ProcessID": 20775
      },
      {
        "Cycles": 0,
        "Agent": "Execution-Sleep",
        "ProcessName": "Read",
        "TaskID": "592DA16D4A62FC64",
        "ParentEventID": [
          "138EA160E165EC72"
        ],
        "Label": "waited",
        "Title": "X-Trace Task",
        "Host": "pinky19.mpi-sws.org",
        "Duration": "22982",
        "HRT": 25491756043628606,
        "Operation": "waited",
        "Timestamp": "1556275395983.906982",
        "TenantClass": 0,
        "Source": "SocketIOWithTimeout.java:335",
        "ThreadID": 1,
        "ThreadName": "",
        "EventID": "EF4BA67FA50C241F",
        "ProcessID": 21035
      },
      {
        "Cycles": 0,
        "Agent": "edu.brown.cs.systems.xtrace.logging.BaggageWrappers",
        "ProcessName": "Read",
        "TaskID": "592DA16D4A62FC64",
        "ParentEventID": [
          "FA0E59924C96B878"
        ],
        "Label": "Forking current baggage with Baggage.fork()",
        "Title": "X-Trace Task",
        "Host": "pinky19.mpi-sws.org",
        "HRT": 25491756043707328,
        "Operation": "fork",
        "Timestamp": "1556275395983.985840",
        "TenantClass": 0,
        "Source": "RemoteBlockReader2.java:361",
        "ThreadID": 1,
        "ThreadName": "",
        "EventID": "863EE8BDAE068F8A",
        "ProcessID": 21035
      },
      {
        "Cycles": 0,
        "Agent": "edu.brown.cs.systems.xtrace.logging.BaggageWrappers",
        "ProcessName": "Read",
        "TaskID": "592DA16D4A62FC64",
        "ParentEventID": [
          "EF4BA67FA50C241F",
          "76429F86910F6000"
        ],
        "Label": "Merged current baggage with other baggage",
        "Title": "X-Trace Task",
        "Host": "pinky19.mpi-sws.org",
        "HRT": 25491756043693243,
        "Operation": "join",
        "Timestamp": "1556275395983.971680",
        "TenantClass": 0,
        "Source": "PacketHeader.java:168",
        "ThreadID": 1,
        "ThreadName": "",
        "EventID": "FA0E59924C96B878",
        "ProcessID": 21035
      },
      {
        "Cycles": 0,
        "Agent": "Execution-Sleep",
        "ProcessName": "Data",
        "TaskID": "592DA16D4A62FC64",
        "ParentEventID": [
          "76429F86910F6000"
        ],
        "Label": "waited",
        "Title": "X-Trace Task",
        "Host": "pinky21.mpi-sws.org",
        "Duration": "101910",
        "HRT": 9338065750813248,
        "Operation": "waited",
        "Timestamp": "1556275395984.082520",
        "TenantClass": 0,
        "Source": "SocketIOWithTimeout.java:335",
        "ThreadID": 5977,
        "ThreadName": "",
        "EventID": "1502CB2EA22DA3F5",
        "BaggageBytes": "[[248 5] [240 0] [0 89 45 161 109 74 98 252 100] [240 1] [0 118 66 159 134 145 15 96 0] [240 3] [0 2]]",
        "ProcessID": 20775
      },
      {
        "Cycles": 0,
        "Agent": "edu.brown.cs.systems.xtrace.logging.BaggageWrappers",
        "ProcessName": "Data",
        "TaskID": "592DA16D4A62FC64",
        "ParentEventID": [
          "863EE8BDAE068F8A",
          "1502CB2EA22DA3F5"
        ],
        "Label": "Merged current baggage with other baggage",
        "Title": "X-Trace Task",
        "Host": "pinky21.mpi-sws.org",
        "HRT": 9338065750941138,
        "Operation": "join",
        "Timestamp": "1556275395984.210449",
        "TenantClass": 0,
        "Source": "DataXceiver.java:574",
        "ThreadID": 5977,
        "ThreadName": "",
        "EventID": "83E19C17F0331BC9",
        "BaggageBytes": "[[248 5] [240 0] [0 89 45 161 109 74 98 252 100] [240 1] [0 134 62 232 189 174 6 143 138] [0 21 2 203 46 162 45 163 245] [240 3] [0 2]]",
        "ProcessID": 20775
      },
      {
        "Cycles": 0,
        "Agent": "Execution-CPU",
        "ProcessName": "Data",
        "TaskID": "592DA16D4A62FC64",
        "ParentEventID": [
          "83E19C17F0331BC9"
        ],
        "Label": "unset",
        "Title": "X-Trace Task",
        "Host": "pinky21.mpi-sws.org",
        "Duration": "1326608",
        "HRT": 9338065751007339,
        "Operation": "unset",
        "Timestamp": "1556275395984.276611",
        "TenantClass": 0,
        "Source": "DataXceiver.java:261",
        "ThreadID": 5977,
        "ThreadName": "",
        "EventID": "614BF0E37C1C1C77",
        "BaggageBytes": "[[248 5] [240 0] [0 89 45 161 109 74 98 252 100] [240 1] [0 131 225 156 23 240 51 27 201] [240 3] [0 2]]",
        "ProcessID": 20775
      },
      {
        "Cycles": 0,
        "Agent": "edu.brown.cs.systems.retro.benchmarks.hdfs_client.Reader",
        "ProcessName": "Read",
        "TaskID": "592DA16D4A62FC64",
        "ParentEventID": [
          "0"
        ],
        "Label": "Reading file",
        "Title": "X-Trace Task",
        "Host": "pinky19.mpi-sws.org",
        "HRT": 25491756041194178,
        "Timestamp": "1556275395981.472656",
        "TenantClass": 0,
        "ThreadID": 1,
        "ThreadName": "",
        "EventID": "9DA4DD6E36FC4288",
        "ProcessID": 21035,
        "Tag": [
          "reader_1kb",
          "Read Size: 1024"
        ]
      }
    ]
  }
]