[
  {
    "id": "C2464783D45ACB29",
    "reports": [
      {
        "Cycles": 0,
        "Agent": "edu.brown.cs.systems.retro.benchmarks.hdfs_client.Reader",
        "ProcessName": "Read",
        "TaskID": "C2464783D45ACB29",
        "ParentEventID": [
          "0"
        ],
        "Label": "Reading file",
        "Title": "X-Trace Task",
        "Host": "pinky19.mpi-sws.org",
        "HRT": 25491747267605026,
        "Timestamp": "1556275387207.956543",
        "TenantClass": 0,
        "ThreadID": 1,
        "ThreadName": "",
        "EventID": "A7D95D6CE87C3794",
        "ProcessID": 21035,
        "Tag": [
          "reader_1kb",
          "Read Size: 1024"
        ]
      },
      {
        "Cycles": 0,
        "Agent": "Execution-CPU",
        "ProcessName": "Read",
        "TaskID": "C2464783D45ACB29",
        "ParentEventID": [
          "23B719FD25089DDD"
        ],
        "Label": "unset",
        "Title": "X-Trace Task",
        "Host": "pinky19.mpi-sws.org",
        "Duration": "21722764",
        "HRT": 25491747267697630,
        "Operation": "unset",
        "Timestamp": "1556275387208.049316",
        "TenantClass": 0,
        "Source": "Client.java:1027",
        "ThreadID": 1,
        "ThreadName": "",
        "EventID": "EF3A656CABF6282E",
        "ProcessID": 21035
      },
      {
        "Cycles": 0,
        "Agent": "edu.brown.cs.systems.retro.benchmarks.hdfs_client.Reader",
        "ProcessName": "Read",
        "TaskID": "C2464783D45ACB29",
        "ParentEventID": [
          "A7D95D6CE87C3794"
        ],
        "Label": "Reading file",
        "Title": "X-Trace Task",
        "Host": "pinky19.mpi-sws.org",
        "HRT": 25491747267623403,
        "Timestamp": "1556275387207.974854",
        "TenantClass": 0,
        "ThreadID": 1,
        "ThreadName": "",
        "EventID": "F10D5E11E2219F38",
        "ProcessID": 21035
      },
      {
        "Cycles": 0,
        "Agent": "edu.brown.cs.systems.xtrace.logging.BaggageWrappers",
        "ProcessName": "Read",
        "TaskID": "C2464783D45ACB29",
        "ParentEventID": [
          "29AA313ADA2EF33C"
        ],
        "Label": "Forking current baggage with Baggage.fork()",
        "Title": "X-Trace Task",
        "Host": "pinky19.mpi-sws.org",
        "HRT": 25491747267749555,
        "Operation": "fork",
        "Timestamp": "1556275387208.101074",
        "TenantClass": 0,
        "Source": "Client.java:1043",
        "ThreadID": 41,
        "ThreadName": "",
        "EventID": "AD87B94986511D59",
        "ProcessID": 21035
      },
      {
        "Cycles": 0,
        "Agent": "Execution-CPU",
        "ProcessName": "Read",
        "TaskID": "C2464783D45ACB29",
        "ParentEventID": [
          "AD87B94986511D59"
        ],
        "Label": "unset",
        "Title": "X-Trace Task",
        "Host": "pinky19.mpi-sws.org",
        "Duration": "90616",
        "HRT": 25491747267838256,
        "Operation": "unset",
        "Timestamp": "1556275387208.189941",
        "TenantClass": 0,
        "Source": "Client.java:1062",
        "ThreadID": 41,
        "ThreadName": "",
        "EventID": "F6F8E2289E7EF4CE",
        "ProcessID": 21035
      },
      {
        "Cycles": 0,
        "Agent": "Execution-CPU",
        "ProcessName": "Read",
        "TaskID": "C2464783D45ACB29",
        "ParentEventID": [
          "EF3A656CABF6282E"
        ],
        "Label": "set",
        "Title": "X-Trace Task",
        "Host": "pinky19.mpi-sws.org",
        "HRT": 25491747267731392,
        "Operation": "set",
        "Timestamp": "1556275387208.083008",
        "TenantClass": 0,
        "Source": "Client.java:1032",
        "ThreadID": 41,
        "ThreadName": "",
        "EventID": "29AA313ADA2EF33C",
        "ProcessID": 21035
      },
      {
        "Cycles": 0,
        "Agent": "Execution-CPU",
        "ProcessName": "Read",
        "TaskID": "C2464783D45ACB29",
        "ParentEventID": [
          "F6F8E2289E7EF4CE"
        ],
        "Label": "set",
        "Title": "X-Trace Task",
        "Host": "pinky19.mpi-sws.org",
        "HRT": 25491747267861346,
        "Operation": "set",
        "Timestamp": "1556275387208.212891",
        "TenantClass": 0,
        "Source": "Client.java:1104",
        "ThreadID": 1,
        "ThreadName": "",
        "EventID": "1718DBC670D9A037",
        "ProcessID": 21035
      },
      {
        "Cycles": 0,
        "Agent": "edu.brown.cs.systems.xtrace.logging.BaggageWrappers",
        "ProcessName": "Name",
        "TaskID": "C2464783D45ACB29",
        "ParentEventID": [
          "A1AFEEBB1EE4A191"
        ],
        "Label": "Forking current baggage with Baggage.fork()",
        "Title": "X-Trace Task",
        "Host": "pinky19.mpi-sws.org",
        "HRT": 25491747267923527,
        "Operation": "fork",
        "Timestamp": "1556275387207.920654",
        "TenantClass": 0,
        "Source": "Server.java:550",
        "ThreadID": 48,
        "ThreadName": "",
        "EventID": "551D1B9D8459CD2C",
        "BaggageBytes": "[[248 5] [240 0] [0 194 70 71 131 212 90 203 41] [240 1] [0 161 175 238 187 30 228 161 145] [240 3] [0 2]]",
        "ProcessID": 2171
      },
      {
        "Cycles": 0,
        "Agent": "org.apache.hadoop.ipc.ProtobufRpcEngine",
        "ProcessName": "Read",
        "TaskID": "C2464783D45ACB29",
        "ParentEventID": [
          "F10D5E11E2219F38"
        ],
        "Label": "Invoking org.apache.hadoop.hdfs.protocol.ClientProtocol.getBlockLocations",
        "Title": "X-Trace Task",
        "Host": "pinky19.mpi-sws.org",
        "HRT": 25491747267665282,
        "Timestamp": "1556275387208.016846",
        "TenantClass": 0,
        "Source": "ProtobufRpcEngine.java:228",
        "ThreadID": 1,
        "ThreadName": "",
        "EventID": "23B719FD25089DDD",
        "ProcessID": 21035
      },
      {
        "Cycles": 0,
        "Agent": "Execution-CPU",
        "ProcessName": "Name",
        "TaskID": "C2464783D45ACB29",
        "ParentEventID": [
          "551D1B9D8459CD2C"
        ],
        "Label": "unset",
        "Title": "X-Trace Task",
        "Host": "pinky19.mpi-sws.org",
        "Duration": "26931",
        "HRT": 25491747267947008,
        "Operation": "unset",
        "Timestamp": "1556275387207.944092",
        "TenantClass": 0,
        "Source": "Server.java:1828",
        "ThreadID": 48,
        "ThreadName": "",
        "EventID": "7F65C739D80C02A4",
        "BaggageBytes": "[[248 5] [240 0] [0 194 70 71 131 212 90 203 41] [240 1] [0 85 29 27 157 132 89 205 44] [240 3] [0 2]]",
        "ProcessID": 2171
      },
      {
        "Cycles": 0,
        "Agent": "Execution-CPU",
        "ProcessName": "Name",
        "TaskID": "C2464783D45ACB29",
        "ParentEventID": [
          "AD87B94986511D59"
        ],
        "Label": "set",
        "Title": "X-Trace Task",
        "Host": "pinky19.mpi-sws.org",
        "HRT": 25491747267894859,
        "Operation": "set",
        "Timestamp": "1556275387207.892090",
        "TenantClass": 0,
        "Source": "Server.java:1840",
        "ThreadID": 48,
        "ThreadName": "",
        "EventID": "A1AFEEBB1EE4A191",
        "BaggageBytes": "[[248 5] [240 0] [0 194 70 71 131 212 90 203 41] [240 1] [0 173 135 185 73 134 81 29 89] [240 3] [0 2]]",
        "ProcessID": 2171
      },
      {
        "Cycles": 0,
        "Agent": "Execution-CPU",
        "ProcessName": "Name",
        "TaskID": "C2464783D45ACB29",
        "ParentEventID": [
          "551D1B9D8459CD2C"
        ],
        "Label": "set",
        "Title": "X-Trace Task",
        "Host": "pinky19.mpi-sws.org",
        "HRT": 25491747267957504,
        "Operation": "set",
        "Timestamp": "1556275387207.954590",
        "TenantClass": 0,
        "Source": "Server.java:2071",
        "ThreadID": 62,
        "ThreadName": "",
        "EventID": "668D08EF970D5C21",
        "BaggageBytes": "[[248 5] [240 0] [0 194 70 71 131 212 90 203 41] [240 1] [0 85 29 27 157 132 89 205 44] [240 3] [0 2]]",
        "ProcessID": 2171
      },
      {
        "Cycles": 0,
        "Agent": "org.apache.hadoop.ipc.Server",
        "ProcessName": "Name",
        "TaskID": "C2464783D45ACB29",
        "ParentEventID": [
          "668D08EF970D5C21"
        ],
        "Label": "getBlockLocations in org.apache.hadoop.hdfs.protocol.ClientProtocol",
        "Title": "X-Trace Task",
        "Host": "pinky19.mpi-sws.org",
        "HRT": 25491747268004094,
        "Timestamp": "1556275387208.001221",
        "TenantClass": 0,
        "Source": "ProtobufRpcEngine.java:601",
        "ThreadID": 62,
        "ThreadName": "",
        "EventID": "1186B02B2980BC78",
        "BaggageBytes": "[[248 5] [240 0] [0 194 70 71 131 212 90 203 41] [240 1] [0 102 141 8 239 151 13 92 33] [240 3] [0 2]]",
        "ProcessID": 2171
      },
      {
        "Cycles": 0,
        "Agent": "edu.brown.cs.systems.xtrace.logging.BaggageWrappers",
        "ProcessName": "Name",
        "TaskID": "C2464783D45ACB29",
        "ParentEventID": [
          "97C7FAECA7E9C71F"
        ],
        "Label": "Forking current baggage with Baggage.fork()",
        "Title": "X-Trace Task",
        "Host": "pinky19.mpi-sws.org",
        "HRT": 25491747268107711,
        "Operation": "fork",
        "Timestamp": "1556275387208.104736",
        "TenantClass": 0,
        "Source": "Server.java:2398",
        "ThreadID": 62,
        "ThreadName": "",
        "EventID": "EE7FCA11E7B4C942",
        "BaggageBytes": "[[248 5] [240 0] [0 194 70 71 131 212 90 203 41] [240 1] [0 151 199 250 236 167 233 199 31] [240 3] [0 2]]",
        "ProcessID": 2171
      },
      {
        "Cycles": 0,
        "Agent": "Execution-CPU",
        "ProcessName": "Name",
        "TaskID": "C2464783D45ACB29",
        "ParentEventID": [
          "EE7FCA11E7B4C942"
        ],
        "Label": "unset",
        "Title": "X-Trace Task",
        "Host": "pinky19.mpi-sws.org",
        "Duration": "243103",
        "HRT": 25491747268230525,
        "Operation": "unset",
        "Timestamp": "1556275387208.227783",
        "TenantClass": 0,
        "Source": "Server.java:1058",
        "ThreadID": 62,
        "ThreadName": "",
        "EventID": "A6CAF3CA01FC5051",
        "BaggageBytes": "[[248 5] [240 0] [0 194 70 71 131 212 90 203 41] [240 1] [0 238 127 202 17 231 180 201 66] [240 3] [0 2]]",
        "ProcessID": 2171
      },
      {
        "Cycles": 0,
        "Agent": "Execution-CPU",
        "ProcessName": "Read",
        "TaskID": "C2464783D45ACB29",
        "ParentEventID": [
          "7C22156C196FC58E"
        ],
        "Label": "unset",
        "Title": "X-Trace Task",
        "Host": "pinky19.mpi-sws.org",
        "Duration": "12917",
        "HRT": 25491747268348588,
        "Operation": "unset",
        "Timestamp": "1556275387208.700195",
        "TenantClass": 0,
        "Source": "Client.java:1168",
        "ThreadID": 37,
        "ThreadName": "",
        "EventID": "B0470F62F9926828",
        "ProcessID": 21035
      },
      {
        "Cycles": 0,
        "Agent": "org.apache.hadoop.hdfs.server.namenode.FSNamesystem.audit",
        "ProcessName": "Name",
        "TaskID": "C2464783D45ACB29",
        "ParentEventID": [
          "1186B02B2980BC78"
        ],
        "Label": "allowed=true\tugi=plascas (auth:SIMPLE)\tip=/139.19.171.63\tcmd=open\tsrc=/ds/vLRDjctEm9qBR3Ko\tdst=null\tperm=null\tproto=rpc",
        "Title": "X-Trace Task",
        "Host": "pinky19.mpi-sws.org",
        "HRT": 25491747268057261,
        "Timestamp": "1556275387208.054443",
        "TenantClass": 0,
        "Source": "FSNamesystem.java:8313",
        "ThreadID": 62,
        "ThreadName": "",
        "EventID": "97C7FAECA7E9C71F",
        "BaggageBytes": "[[248 5] [240 0] [0 194 70 71 131 212 90 203 41] [240 1] [0 17 134 176 43 41 128 188 120] [240 3] [0 2]]",
        "ProcessID": 2171
      },
      {
        "Cycles": 0,
        "Agent": "Execution-Sleep",
        "ProcessName": "Read",
        "TaskID": "C2464783D45ACB29",
        "ParentEventID": [
          "1718DBC670D9A037"
        ],
        "Label": "waited",
        "Title": "X-Trace Task",
        "Host": "pinky19.mpi-sws.org",
        "Duration": "499486",
        "HRT": 25491747268370528,
        "Operation": "waited",
        "Timestamp": "1556275387208.722168",
        "TenantClass": 0,
        "Source": "Client.java:1537",
        "ThreadID": 1,
        "ThreadName": "",
        "EventID": "0E4CB0E5E81BE32F",
        "ProcessID": 21035
      },
      {
        "Cycles": 0,
        "Agent": "org.apache.hadoop.ipc.ProtobufRpcEngine",
        "ProcessName": "Read",
        "TaskID": "C2464783D45ACB29",
        "ParentEventID": [
          "640F0D5045017564"
        ],
        "Label": "org.apache.hadoop.hdfs.protocol.ClientProtocol.getBlockLocations completed",
        "Title": "X-Trace Task",
        "Host": "pinky19.mpi-sws.org",
        "HRT": 25491747268434466,
        "Timestamp": "1556275387208.786133",
        "TenantClass": 0,
        "Source": "ProtobufRpcEngine.java:275",
        "ThreadID": 1,
        "ThreadName": "",
        "EventID": "1BE601A42E07142B",
        "ProcessID": 21035
      },
      {
        "Cycles": 0,
        "Agent": "edu.brown.cs.systems.xtrace.logging.BaggageWrappers",
        "ProcessName": "Read",
        "TaskID": "C2464783D45ACB29",
        "ParentEventID": [
          "1BE601A42E07142B"
        ],
        "Label": "Forking current baggage with Baggage.fork()",
        "Title": "X-Trace Task",
        "Host": "pinky19.mpi-sws.org",
        "HRT": 25491747268508957,
        "Operation": "fork",
        "Timestamp": "1556275387208.860596",
        "TenantClass": 0,
        "Source": "DataTransferProtoUtil.java:94",
        "ThreadID": 1,
        "ThreadName": "",
        "EventID": "CEAD5BEB822B7F2E",
        "ProcessID": 21035
      },
      {
        "Cycles": 0,
        "Agent": "Execution-CPU",
        "ProcessName": "Read",
        "TaskID": "C2464783D45ACB29",
        "ParentEventID": [
          "EE7FCA11E7B4C942"
        ],
        "Label": "set",
        "Title": "X-Trace Task",
        "Host": "pinky19.mpi-sws.org",
        "HRT": 25491747268318055,
        "Operation": "set",
        "Timestamp": "1556275387208.669678",
        "TenantClass": 0,
        "Source": "Client.java:302",
        "ThreadID": 37,
        "ThreadName": "",
        "EventID": "7C22156C196FC58E",
        "ProcessID": 21035
      },
      {
        "Cycles": 0,
        "Agent": "Execution-CPU",
        "ProcessName": "Data",
        "TaskID": "C2464783D45ACB29",
        "ParentEventID": [
          "CEAD5BEB822B7F2E"
        ],
        "Label": "set",
        "Title": "X-Trace Task",
        "Host": "pinky27.mpi-sws.org",
        "HRT": 14091022315174548,
        "Operation": "set",
        "Timestamp": "1556275387209.451416",
        "TenantClass": 0,
        "Source": "Receiver.java:117",
        "ThreadID": 6493,
        "ThreadName": "",
        "EventID": "011B6EE11B55D19F",
        "BaggageBytes": "[[248 5] [240 0] [0 194 70 71 131 212 90 203 41] [240 1] [0 206 173 91 235 130 43 127 46] [240 3] [0 2]]",
        "ProcessID": 31438
      },
      {
        "Cycles": 0,
        "Agent": "edu.brown.cs.systems.xtrace.logging.BaggageWrappers",
        "ProcessName": "Data",
        "TaskID": "C2464783D45ACB29",
        "ParentEventID": [
          "BF0D0A6672C48E64"
        ],
        "Label": "Forking current baggage with Baggage.fork()",
        "Title": "X-Trace Task",
        "Host": "pinky27.mpi-sws.org",
        "HRT": 14091022315449429,
        "Operation": "fork",
        "Timestamp": "1556275387209.726318",
        "TenantClass": 0,
        "Source": "DataXceiver.java:1257",
        "ThreadID": 6493,
        "ThreadName": "",
        "EventID": "422B6961002F8361",
        "BaggageBytes": "[[248 5] [240 0] [0 194 70 71 131 212 90 203 41] [240 1] [0 191 13 10 102 114 196 142 100] [240 3] [0 2]]",
        "ProcessID": 31438
      },
      {
        "Cycles": 0,
        "Agent": "edu.brown.cs.systems.xtrace.logging.BaggageWrappers",
        "ProcessName": "Data",
        "TaskID": "C2464783D45ACB29",
        "ParentEventID": [
          "422B6961002F8361"
        ],
        "Label": "Forking current baggage with Baggage.fork()",
        "Title": "X-Trace Task",
        "Host": "pinky27.mpi-sws.org",
        "HRT": 14091022315552291,
        "Operation": "fork",
        "Timestamp": "1556275387209.829102",
        "TenantClass": 0,
        "Source": "PacketHeader.java:95",
        "ThreadID": 6493,
        "ThreadName": "",
        "EventID": "76BB6C00DB68C869",
        "BaggageBytes": "[[248 5] [240 0] [0 194 70 71 131 212 90 203 41] [240 1] [0 66 43 105 97 0 47 131 97] [240 3] [0 2]]",
        "ProcessID": 31438
      },
      {
        "Cycles": 0,
        "Agent": "edu.brown.cs.systems.xtrace.logging.BaggageWrappers",
        "ProcessName": "Read",
        "TaskID": "C2464783D45ACB29",
        "ParentEventID": [
          "0E4CB0E5E81BE32F",
          "B0470F62F9926828"
        ],
        "Label": "Merged current baggage with other baggage",
        "Title": "X-Trace Task",
        "Host": "pinky19.mpi-sws.org",
        "HRT": 25491747268392798,
        "Operation": "join",
        "Timestamp": "1556275387208.744385",
        "TenantClass": 0,
        "Source": "Client.java:1545",
        "ThreadID": 1,
        "ThreadName": "",
        "EventID": "640F0D5045017564",
        "ProcessID": 21035
      },
      {
        "Cycles": 0,
        "Agent": "Execution-Sleep",
        "ProcessName": "Read",
        "TaskID": "C2464783D45ACB29",
        "ParentEventID": [
          "CEAD5BEB822B7F2E"
        ],
        "Label": "waited",
        "Title": "X-Trace Task",
        "Host": "pinky19.mpi-sws.org",
        "Duration": "656235",
        "HRT": 25491747269311747,
        "Operation": "waited",
        "Timestamp": "1556275387209.663330",
        "TenantClass": 0,
        "Source": "SocketIOWithTimeout.java:335",
        "ThreadID": 1,
        "ThreadName": "",
        "EventID": "23A25FFADD0CA31B",
        "ProcessID": 21035
      },
      {
        "Cycles": 0,
        "Agent": "edu.brown.cs.systems.xtrace.logging.BaggageWrappers",
        "ProcessName": "Read",
        "TaskID": "C2464783D45ACB29",
        "ParentEventID": [
          "422B6961002F8361",
          "23A25FFADD0CA31B"
        ],
        "Label": "Merged current baggage with other baggage",
        "Title": "X-Trace Task",
        "Host": "pinky19.mpi-sws.org",
        "HRT": 25491747269403322,
        "Operation": "join",
        "Timestamp": "1556275387209.754883",
        "TenantClass": 0,
        "Source": "RemoteBlockReader2.java:429",
        "ThreadID": 1,
        "ThreadName": "",
        "EventID": "70CB098D091B9149",
        "ProcessID": 21035
      },
      {
        "Cycles": 0,
        "Agent": "Execution-Sleep",
        "ProcessName": "Read",
        "TaskID": "C2464783D45ACB29",
        "ParentEventID": [
          "70CB098D091B9149"
        ],
        "Label": "waited",
        "Title": "X-Trace Task",
        "Host": "pinky19.mpi-sws.org",
        "Duration": "41671",
        "HRT": 25491747269548157,
        "Operation": "waited",
        "Timestamp": "1556275387209.899658",
        "TenantClass": 0,
        "Source": "SocketIOWithTimeout.java:335",
        "ThreadID": 1,
        "ThreadName": "",
        "EventID": "4AA171ED22A57B49",
        "ProcessID": 21035
      },
      {
        "Cycles": 0,
        "Agent": "edu.brown.cs.systems.xtrace.logging.XTraceInit",
        "ProcessName": "Data",
        "TaskID": "C2464783D45ACB29",
        "ParentEventID": [
          "011B6EE11B55D19F"
        ],
        "Label": "Thread.setName: DataXceiver for client DFSClient_NONMAPREDUCE_1377588049_1 at /139.19.171.63:35816 [Sending block BP-1633380353-139.19.171.63-1554193446451:blk_1073764684_23860]",
        "Title": "X-Trace Task",
        "Host": "pinky27.mpi-sws.org",
        "HRT": 14091022315276458,
        "Timestamp": "1556275387209.553223",
        "TenantClass": 0,
        "Source": "DataXceiver.java:168",
        "ThreadID": 6493,
        "ThreadName": "",
        "EventID": "BF0D0A6672C48E64",
        "BaggageBytes": "[[248 5] [240 0] [0 194 70 71 131 212 90 203 41] [240 1] [0 1 27 110 225 27 85 209 159] [240 3] [0 2]]",
        "ProcessID": 31438
      },
      {
        "Cycles": 0,
        "Agent": "edu.brown.cs.systems.xtrace.logging.BaggageWrappers",
        "ProcessName": "Data",
        "TaskID": "C2464783D45ACB29",
        "ParentEventID": [
          "30C1C13E026AB0F1"
        ],
        "Label": "Forking current baggage with Baggage.fork()",
        "Title": "X-Trace Task",
        "Host": "pinky27.mpi-sws.org",
        "HRT": 14091022315798095,
        "Operation": "fork",
        "Timestamp": "1556275387210.074951",
        "TenantClass": 0,
        "Source": "PacketHeader.java:95",
        "ThreadID": 6493,
        "ThreadName": "",
        "EventID": "E6944D11C0F7984E",
        "BaggageBytes": "[[248 5] [240 0] [0 194 70 71 131 212 90 203 41] [240 1] [0 48 193 193 62 2 106 176 241] [240 3] [0 2]]",
        "ProcessID": 31438
      },
      {
        "Cycles": 0,
        "Agent": "edu.brown.cs.systems.xtrace.logging.BaggageWrappers",
        "ProcessName": "Read",
        "TaskID": "C2464783D45ACB29",
        "ParentEventID": [
          "E6944D11C0F7984E",
          "E474CF7BB1428CAB"
        ],
        "Label": "Merged current baggage with other baggage",
        "Title": "X-Trace Task",
        "Host": "pinky19.mpi-sws.org",
        "HRT": 25491747269734250,
        "Operation": "join",
        "Timestamp": "1556275387210.085693",
        "TenantClass": 0,
        "Source": "PacketHeader.java:168",
        "ThreadID": 1,
        "ThreadName": "",
        "EventID": "AEA9AFD0639AFA83",
        "ProcessID": 21035
      },
      {
        "Cycles": 0,
        "Agent": "edu.brown.cs.systems.xtrace.logging.BaggageWrappers",
        "ProcessName": "Read",
        "TaskID": "C2464783D45ACB29",
        "ParentEventID": [
          "76BB6C00DB68C869",
          "4AA171ED22A57B49"
        ],
        "Label": "Merged current baggage with other baggage",
        "Title": "X-Trace Task",
        "Host": "pinky19.mpi-sws.org",
        "HRT": 25491747269648831,
        "Operation": "join",
        "Timestamp": "1556275387210.000488",
        "TenantClass": 0,
        "Source": "PacketHeader.java:168",
        "ThreadID": 1,
        "ThreadName": "",
        "EventID": "E474CF7BB1428CAB",
        "ProcessID": 21035
      },
      {
        "Cycles": 0,
        "Agent": "edu.brown.cs.systems.xtrace.logging.BaggageWrappers",
        "ProcessName": "Read",
        "TaskID": "C2464783D45ACB29",
        "ParentEventID": [
          "AEA9AFD0639AFA83"
        ],
        "Label": "Forking current baggage with Baggage.fork()",
        "Title": "X-Trace Task",
        "Host": "pinky19.mpi-sws.org",
        "HRT": 25491747269749392,
        "Operation": "fork",
        "Timestamp": "1556275387210.101074",
        "TenantClass": 0,
        "Source": "RemoteBlockReader2.java:361",
        "ThreadID": 1,
        "ThreadName": "",
        "EventID": "F832E143C9817F70",
        "ProcessID": 21035
      },
      {
        "Cycles": 0,
        "Agent": "edu.brown.cs.systems.xtrace.logging.BaggageWrappers",
        "ProcessName": "Data",
        "TaskID": "C2464783D45ACB29",
        "ParentEventID": [
          "BE975662750B86F9",
          "F832E143C9817F70"
        ],
        "Label": "Merged current baggage with other baggage",
        "Title": "X-Trace Task",
        "Host": "pinky27.mpi-sws.org",
        "HRT": 14091022316204343,
        "Operation": "join",
        "Timestamp": "1556275387210.481201",
        "TenantClass": 0,
        "Source": "DataXceiver.java:574",
        "ThreadID": 6493,
        "ThreadName": "",
        "EventID": "231C332737B9664B",
        "BaggageBytes": "[[248 5] [240 0] [0 194 70 71 131 212 90 203 41] [240 1] [0 190 151 86 98 117 11 134 249] [0 248 50 225 67 201 129 127 112] [240 3] [0 2]]",
        "ProcessID": 31438
      },
      {
        "Cycles": 0,
        "Agent": "Execution-Sleep",
        "ProcessName": "Data",
        "TaskID": "C2464783D45ACB29",
        "ParentEventID": [
          "76BB6C00DB68C869"
        ],
        "Label": "waited",
        "Title": "X-Trace Task",
        "Host": "pinky27.mpi-sws.org",
        "Duration": "8691",
        "HRT": 14091022315664873,
        "Operation": "waited",
        "Timestamp": "1556275387209.941650",
        "TenantClass": 0,
        "Source": "SocketIOWithTimeout.java:335",
        "ThreadID": 6493,
        "ThreadName": "",
        "EventID": "30C1C13E026AB0F1",
        "BaggageBytes": "[[248 5] [240 0] [0 194 70 71 131 212 90 203 41] [240 1] [0 118 187 108 0 219 104 200 105] [240 3] [0 2]]",
        "ProcessID": 31438
      },
      {
        "Cycles": 0,
        "Agent": "Execution-CPU",
        "ProcessName": "Data",
        "TaskID": "C2464783D45ACB29",
        "ParentEventID": [
          "231C332737B9664B"
        ],
        "Label": "unset",
        "Title": "X-Trace Task",
        "Host": "pinky27.mpi-sws.org",
        "Duration": "996924",
        "HRT": 14091022316243352,
        "Operation": "unset",
        "Timestamp": "1556275387210.520264",
        "TenantClass": 0,
        "Source": "DataXceiver.java:261",
        "ThreadID": 6493,
        "ThreadName": "",
        "EventID": "FB4BEDE3BC968779",
        "BaggageBytes": "[[248 5] [240 0] [0 194 70 71 131 212 90 203 41] [240 1] [0 35 28 51 39 55 185 102 75] [240 3] [0 2]]",
        "ProcessID": 31438
      },
      {
        "Cycles": 0,
        "Agent": "Execution-Sleep",
        "ProcessName": "Data",
        "TaskID": "C2464783D45ACB29",
        "ParentEventID": [
          "E6944D11C0F7984E"
        ],
        "Label": "waited",
        "Title": "X-Trace Task",
        "Host": "pinky27.mpi-sws.org",
        "Duration": "166354",
        "HRT": 14091022316111862,
        "Operation": "waited",
        "Timestamp": "1556275387210.388672",
        "TenantClass": 0,
        "Source": "SocketIOWithTimeout.java:335",
        "ThreadID": 6493,
        "ThreadName": "",
        "EventID": "BE975662750B86F9",
        "BaggageBytes": "[[248 5] [240 0] [0 194 70 71 131 212 90 203 41] [240 1] [0 230 148 77 17 192 247 152 78] [240 3] [0 2]]",
        "ProcessID": 31438
      }
    ]
  }
]