[
  {
    "id": "88CB02BA0294831E",
    "reports": [
      {
        "Cycles": 0,
        "Agent": "edu.brown.cs.systems.retro.benchmarks.hdfs_client.Reader",
        "ProcessName": "Read",
        "TaskID": "88CB02BA0294831E",
        "ParentEventID": [
          "0"
        ],
        "Label": "Reading file",
        "Title": "X-Trace Task",
        "Host": "pinky19.mpi-sws.org",
        "HRT": 25488985472609672,
        "Timestamp": "1556272625412.598145",
        "TenantClass": 0,
        "ThreadID": 1,
        "ThreadName": "",
        "EventID": "B0E879BCBA0303EA",
        "ProcessID": 6356,
        "Tag": [
          "reader_1mb",
          "Read Size: 1048576"
        ]
      },
      {
        "Cycles": 0,
        "Agent": "org.apache.hadoop.ipc.ProtobufRpcEngine",
        "ProcessName": "Read",
        "TaskID": "88CB02BA0294831E",
        "ParentEventID": [
          "D2CEECFF22098AFC"
        ],
        "Label": "Invoking org.apache.hadoop.hdfs.protocol.ClientProtocol.getBlockLocations",
        "Title": "X-Trace Task",
        "Host": "pinky19.mpi-sws.org",
        "HRT": 25488985472706317,
        "Timestamp": "1556272625412.694580",
        "TenantClass": 0,
        "Source": "ProtobufRpcEngine.java:228",
        "ThreadID": 1,
        "ThreadName": "",
        "EventID": "7C557F98FBE26103",
        "ProcessID": 6356
      },
      {
        "Cycles": 0,
        "Agent": "Execution-CPU",
        "ProcessName": "Read",
        "TaskID": "88CB02BA0294831E",
        "ParentEventID": [
          "7C557F98FBE26103"
        ],
        "Label": "unset",
        "Title": "X-Trace Task",
        "Host": "pinky19.mpi-sws.org",
        "Duration": "33673832",
        "HRT": 25488985472754688,
        "Operation": "unset",
        "Timestamp": "1556272625412.743164",
        "TenantClass": 0,
        "Source": "Client.java:1027",
        "ThreadID": 1,
        "ThreadName": "",
        "EventID": "933A7D51185F61FB",
        "ProcessID": 6356
      },
      {
        "Cycles": 0,
        "Agent": "Execution-CPU",
        "ProcessName": "Read",
        "TaskID": "88CB02BA0294831E",
        "ParentEventID": [
          "933A7D51185F61FB"
        ],
        "Label": "set",
        "Title": "X-Trace Task",
        "Host": "pinky19.mpi-sws.org",
        "HRT": 25488985472798823,
        "Operation": "set",
        "Timestamp": "1556272625412.787109",
        "TenantClass": 0,
        "Source": "Client.java:1032",
        "ThreadID": 41,
        "ThreadName": "",
        "EventID": "5BCC301008EA4124",
        "ProcessID": 6356
      },
      {
        "Cycles": 0,
        "Agent": "edu.brown.cs.systems.retro.benchmarks.hdfs_client.Reader",
        "ProcessName": "Read",
        "TaskID": "88CB02BA0294831E",
        "ParentEventID": [
          "B0E879BCBA0303EA"
        ],
        "Label": "Reading file",
        "Title": "X-Trace Task",
        "Host": "pinky19.mpi-sws.org",
        "HRT": 25488985472633014,
        "Timestamp": "1556272625412.621338",
        "TenantClass": 0,
        "ThreadID": 1,
        "ThreadName": "",
        "EventID": "D2CEECFF22098AFC",
        "ProcessID": 6356
      },
      {
        "Cycles": 0,
        "Agent": "Execution-CPU",
        "ProcessName": "Read",
        "TaskID": "88CB02BA0294831E",
        "ParentEventID": [
          "245AF08CCBF43A45"
        ],
        "Label": "unset",
        "Title": "X-Trace Task",
        "Host": "pinky19.mpi-sws.org",
        "Duration": "93801",
        "HRT": 25488985472911397,
        "Operation": "unset",
        "Timestamp": "1556272625412.899658",
        "TenantClass": 0,
        "Source": "Client.java:1062",
        "ThreadID": 41,
        "ThreadName": "",
        "EventID": "ACE4BB5D723E4638",
        "ProcessID": 6356
      },
      {
        "Cycles": 0,
        "Agent": "Execution-CPU",
        "ProcessName": "Read",
        "TaskID": "88CB02BA0294831E",
        "ParentEventID": [
          "ACE4BB5D723E4638"
        ],
        "Label": "set",
        "Title": "X-Trace Task",
        "Host": "pinky19.mpi-sws.org",
        "HRT": 25488985472942167,
        "Operation": "set",
        "Timestamp": "1556272625412.930664",
        "TenantClass": 0,
        "Source": "Client.java:1104",
        "ThreadID": 1,
        "ThreadName": "",
        "EventID": "D9E3DBC3AAF02C0D",
        "ProcessID": 6356
      },
      {
        "Cycles": 0,
        "Agent": "edu.brown.cs.systems.xtrace.logging.BaggageWrappers",
        "ProcessName": "Read",
        "TaskID": "88CB02BA0294831E",
        "ParentEventID": [
          "5BCC301008EA4124"
        ],
        "Label": "Forking current baggage with Baggage.fork()",
        "Title": "X-Trace Task",
        "Host": "pinky19.mpi-sws.org",
        "HRT": 25488985472819367,
        "Operation": "fork",
        "Timestamp": "1556272625412.807861",
        "TenantClass": 0,
        "Source": "Client.java:1043",
        "ThreadID": 41,
        "ThreadName": "",
        "EventID": "245AF08CCBF43A45",
        "ProcessID": 6356
      },
      {
        "Cycles": 0,
        "Agent": "Execution-CPU",
        "ProcessName": "Name",
        "TaskID": "88CB02BA0294831E",
        "ParentEventID": [
          "245AF08CCBF43A45"
        ],
        "Label": "set",
        "Title": "X-Trace Task",
        "Host": "pinky19.mpi-sws.org",
        "HRT": 25488985473033085,
        "Operation": "set",
        "Timestamp": "1556272625413.022705",
        "TenantClass": 0,
        "Source": "Server.java:1840",
        "ThreadID": 48,
        "ThreadName": "",
        "EventID": "CF348CDCD6539997",
        "BaggageBytes": "[[248 5] [240 0] [0 136 203 2 186 2 148 131 30] [240 1] [0 36 90 240 140 203 244 58 69] [240 3] [0 2]]",
        "ProcessID": 2171
      },
      {
        "Cycles": 0,
        "Agent": "Execution-CPU",
        "ProcessName": "Name",
        "TaskID": "88CB02BA0294831E",
        "ParentEventID": [
          "1D4C7D3A0A07F8A9"
        ],
        "Label": "set",
        "Title": "X-Trace Task",
        "Host": "pinky19.mpi-sws.org",
        "HRT": 25488985473117730,
        "Operation": "set",
        "Timestamp": "1556272625413.107422",
        "TenantClass": 0,
        "Source": "Server.java:2071",
        "ThreadID": 55,
        "ThreadName": "",
        "EventID": "1BAD93A4AF7262CE",
        "BaggageBytes": "[[248 5] [240 0] [0 136 203 2 186 2 148 131 30] [240 1] [0 29 76 125 58 10 7 248 169] [240 3] [0 2]]",
        "ProcessID": 2171
      },
      {
        "Cycles": 0,
        "Agent": "org.apache.hadoop.ipc.Server",
        "ProcessName": "Name",
        "TaskID": "88CB02BA0294831E",
        "ParentEventID": [
          "1BAD93A4AF7262CE"
        ],
        "Label": "getBlockLocations in org.apache.hadoop.hdfs.protocol.ClientProtocol",
        "Title": "X-Trace Task",
        "Host": "pinky19.mpi-sws.org",
        "HRT": 25488985473171528,
        "Timestamp": "1556272625413.161133",
        "TenantClass": 0,
        "Source": "ProtobufRpcEngine.java:601",
        "ThreadID": 55,
        "ThreadName": "",
        "EventID": "31985EF2706DE968",
        "BaggageBytes": "[[248 5] [240 0] [0 136 203 2 186 2 148 131 30] [240 1] [0 27 173 147 164 175 114 98 206] [240 3] [0 2]]",
        "ProcessID": 2171
      },
      {
        "Cycles": 0,
        "Agent": "edu.brown.cs.systems.xtrace.logging.BaggageWrappers",
        "ProcessName": "Name",
        "TaskID": "88CB02BA0294831E",
        "ParentEventID": [
          "CF348CDCD6539997"
        ],
        "Label": "Forking current baggage with Baggage.fork()",
        "Title": "X-Trace Task",
        "Host": "pinky19.mpi-sws.org",
        "HRT": 25488985473082123,
        "Operation": "fork",
        "Timestamp": "1556272625413.071777",
        "TenantClass": 0,
        "Source": "Server.java:550",
        "ThreadID": 48,
        "ThreadName": "",
        "EventID": "1D4C7D3A0A07F8A9",
        "BaggageBytes": "[[248 5] [240 0] [0 136 203 2 186 2 148 131 30] [240 1] [0 207 52 140 220 214 83 153 151] [240 3] [0 2]]",
        "ProcessID": 2171
      },
      {
        "Cycles": 0,
        "Agent": "org.apache.hadoop.hdfs.server.namenode.FSNamesystem.audit",
        "ProcessName": "Name",
        "TaskID": "88CB02BA0294831E",
        "ParentEventID": [
          "31985EF2706DE968"
        ],
        "Label": "allowed=true\tugi=plascas (auth:SIMPLE)\tip=/139.19.171.63\tcmd=open\tsrc=/ds/DuLDEZhTOnKIGocT\tdst=null\tperm=null\tproto=rpc",
        "Title": "X-Trace Task",
        "Host": "pinky19.mpi-sws.org",
        "HRT": 25488985473256241,
        "Timestamp": "1556272625413.245850",
        "TenantClass": 0,
        "Source": "FSNamesystem.java:8313",
        "ThreadID": 55,
        "ThreadName": "",
        "EventID": "411923532889ACB9",
        "BaggageBytes": "[[248 5] [240 0] [0 136 203 2 186 2 148 131 30] [240 1] [0 49 152 94 242 112 109 233 104] [240 3] [0 2]]",
        "ProcessID": 2171
      },
      {
        "Cycles": 0,
        "Agent": "Execution-CPU",
        "ProcessName": "Name",
        "TaskID": "88CB02BA0294831E",
        "ParentEventID": [
          "15629D1EB237D20B"
        ],
        "Label": "unset",
        "Title": "X-Trace Task",
        "Host": "pinky19.mpi-sws.org",
        "Duration": "311785",
        "HRT": 25488985473456190,
        "Operation": "unset",
        "Timestamp": "1556272625413.445801",
        "TenantClass": 0,
        "Source": "Server.java:1058",
        "ThreadID": 55,
        "ThreadName": "",
        "EventID": "F5BBDFADD87A33B3",
        "BaggageBytes": "[[248 5] [240 0] [0 136 203 2 186 2 148 131 30] [240 1] [0 21 98 157 30 178 55 210 11] [240 3] [0 2]]",
        "ProcessID": 2171
      },
      {
        "Cycles": 0,
        "Agent": "Execution-CPU",
        "ProcessName": "Name",
        "TaskID": "88CB02BA0294831E",
        "ParentEventID": [
          "1D4C7D3A0A07F8A9"
        ],
        "Label": "unset",
        "Title": "X-Trace Task",
        "Host": "pinky19.mpi-sws.org",
        "Duration": "33618",
        "HRT": 25488985473106422,
        "Operation": "unset",
        "Timestamp": "1556272625413.096191",
        "TenantClass": 0,
        "Source": "Server.java:1828",
        "ThreadID": 48,
        "ThreadName": "",
        "EventID": "CEEB5A2B95397275",
        "BaggageBytes": "[[248 5] [240 0] [0 136 203 2 186 2 148 131 30] [240 1] [0 29 76 125 58 10 7 248 169] [240 3] [0 2]]",
        "ProcessID": 2171
      },
      {
        "Cycles": 0,
        "Agent": "Execution-CPU",
        "ProcessName": "Read",
        "TaskID": "88CB02BA0294831E",
        "ParentEventID": [
          "15629D1EB237D20B"
        ],
        "Label": "set",
        "Title": "X-Trace Task",
        "Host": "pinky19.mpi-sws.org",
        "HRT": 25488985473540211,
        "Operation": "set",
        "Timestamp": "1556272625413.528564",
        "TenantClass": 0,
        "Source": "Client.java:302",
        "ThreadID": 40,
        "ThreadName": "",
        "EventID": "16BB60048B05DD47",
        "ProcessID": 6356
      },
      {
        "Cycles": 0,
        "Agent": "Execution-Sleep",
        "ProcessName": "Read",
        "TaskID": "88CB02BA0294831E",
        "ParentEventID": [
          "D9E3DBC3AAF02C0D"
        ],
        "Label": "waited",
        "Title": "X-Trace Task",
        "Host": "pinky19.mpi-sws.org",
        "Duration": "640552",
        "HRT": 25488985473595446,
        "Operation": "waited",
        "Timestamp": "1556272625413.583740",
        "TenantClass": 0,
        "Source": "Client.java:1537",
        "ThreadID": 1,
        "ThreadName": "",
        "EventID": "DC01DD3C32CFCB0A",
        "ProcessID": 6356
      },
      {
        "Cycles": 0,
        "Agent": "edu.brown.cs.systems.xtrace.logging.BaggageWrappers",
        "ProcessName": "Read",
        "TaskID": "88CB02BA0294831E",
        "ParentEventID": [
          "E81996F998F0C304",
          "DC01DD3C32CFCB0A"
        ],
        "Label": "Merged current baggage with other baggage",
        "Title": "X-Trace Task",
        "Host": "pinky19.mpi-sws.org",
        "HRT": 25488985473618316,
        "Operation": "join",
        "Timestamp": "1556272625413.606689",
        "TenantClass": 0,
        "Source": "Client.java:1545",
        "ThreadID": 1,
        "ThreadName": "",
        "EventID": "F0F1102A9CDB6F10",
        "ProcessID": 6356
      },
      {
        "Cycles": 0,
        "Agent": "edu.brown.cs.systems.xtrace.logging.BaggageWrappers",
        "ProcessName": "Name",
        "TaskID": "88CB02BA0294831E",
        "ParentEventID": [
          "411923532889ACB9"
        ],
        "Label": "Forking current baggage with Baggage.fork()",
        "Title": "X-Trace Task",
        "Host": "pinky19.mpi-sws.org",
        "HRT": 25488985473324331,
        "Operation": "fork",
        "Timestamp": "1556272625413.313965",
        "TenantClass": 0,
        "Source": "Server.java:2398",
        "ThreadID": 55,
        "ThreadName": "",
        "EventID": "15629D1EB237D20B",
        "BaggageBytes": "[[248 5] [240 0] [0 136 203 2 186 2 148 131 30] [240 1] [0 65 25 35 83 40 137 172 185] [240 3] [0 2]]",
        "ProcessID": 2171
      },
      {
        "Cycles": 0,
        "Agent": "org.apache.hadoop.ipc.ProtobufRpcEngine",
        "ProcessName": "Read",
        "TaskID": "88CB02BA0294831E",
        "ParentEventID": [
          "F0F1102A9CDB6F10"
        ],
        "Label": "org.apache.hadoop.hdfs.protocol.ClientProtocol.getBlockLocations completed",
        "Title": "X-Trace Task",
        "Host": "pinky19.mpi-sws.org",
        "HRT": 25488985473682141,
        "Timestamp": "1556272625413.670410",
        "TenantClass": 0,
        "Source": "ProtobufRpcEngine.java:275",
        "ThreadID": 1,
        "ThreadName": "",
        "EventID": "ECCB27882CC96DC0",
        "ProcessID": 6356
      },
      {
        "Cycles": 0,
        "Agent": "edu.brown.cs.systems.xtrace.logging.BaggageWrappers",
        "ProcessName": "Read",
        "TaskID": "88CB02BA0294831E",
        "ParentEventID": [
          "532B4A8D8E99CC3F"
        ],
        "Label": "Forking current baggage with Baggage.fork()",
        "Title": "X-Trace Task",
        "Host": "pinky19.mpi-sws.org",
        "HRT": 25488985473871702,
        "Operation": "fork",
        "Timestamp": "1556272625413.860107",
        "TenantClass": 0,
        "Source": "DataTransferProtoUtil.java:94",
        "ThreadID": 1,
        "ThreadName": "",
        "EventID": "F54B43A44847C842",
        "ProcessID": 6356
      },
      {
        "Cycles": 0,
        "Agent": "Execution-Sleep",
        "ProcessName": "Read",
        "TaskID": "88CB02BA0294831E",
        "ParentEventID": [
          "ECCB27882CC96DC0"
        ],
        "Label": "waited",
        "Title": "X-Trace Task",
        "Host": "pinky19.mpi-sws.org",
        "Duration": "4426",
        "HRT": 25488985473814789,
        "Operation": "waited",
        "Timestamp": "1556272625413.803223",
        "TenantClass": 0,
        "Source": "SocketIOWithTimeout.java:335",
        "ThreadID": 1,
        "ThreadName": "",
        "EventID": "532B4A8D8E99CC3F",
        "ProcessID": 6356
      },
      {
        "Cycles": 0,
        "Agent": "Execution-CPU",
        "ProcessName": "Data",
        "TaskID": "88CB02BA0294831E",
        "ParentEventID": [
          "F54B43A44847C842"
        ],
        "Label": "set",
        "Title": "X-Trace Task",
        "Host": "pinky19.mpi-sws.org",
        "HRT": 25488985473980821,
        "Operation": "set",
        "Timestamp": "1556272625413.977051",
        "TenantClass": 0,
        "Source": "Receiver.java:117",
        "ThreadID": 8099,
        "ThreadName": "",
        "EventID": "FE1E13FBD44098AD",
        "BaggageBytes": "[[248 5] [240 0] [0 136 203 2 186 2 148 131 30] [240 1] [0 245 75 67 164 72 71 200 66] [240 3] [0 2]]",
        "ProcessID": 2319
      },
      {
        "Cycles": 0,
        "Agent": "edu.brown.cs.systems.xtrace.logging.BaggageWrappers",
        "ProcessName": "Data",
        "TaskID": "88CB02BA0294831E",
        "ParentEventID": [
          "6D61C53E56FF333E"
        ],
        "Label": "Forking current baggage with Baggage.fork()",
        "Title": "X-Trace Task",
        "Host": "pinky19.mpi-sws.org",
        "HRT": 25488985474092599,
        "Operation": "fork",
        "Timestamp": "1556272625414.088867",
        "TenantClass": 0,
        "Source": "DataXceiver.java:1257",
        "ThreadID": 8099,
        "ThreadName": "",
        "EventID": "925D28B60BEC72C8",
        "BaggageBytes": "[[248 5] [240 0] [0 136 203 2 186 2 148 131 30] [240 1] [0 109 97 197 62 86 255 51 62] [240 3] [0 2]]",
        "ProcessID": 2319
      },
      {
        "Cycles": 0,
        "Agent": "Execution-CPU",
        "ProcessName": "Read",
        "TaskID": "88CB02BA0294831E",
        "ParentEventID": [
          "16BB60048B05DD47"
        ],
        "Label": "unset",
        "Title": "X-Trace Task",
        "Host": "pinky19.mpi-sws.org",
        "Duration": "19385",
        "HRT": 25488985473576496,
        "Operation": "unset",
        "Timestamp": "1556272625413.564941",
        "TenantClass": 0,
        "Source": "Client.java:1168",
        "ThreadID": 40,
        "ThreadName": "",
        "EventID": "E81996F998F0C304",
        "ProcessID": 6356
      },
      {
        "Cycles": 0,
        "Agent": "Execution-Sleep",
        "ProcessName": "Read",
        "TaskID": "88CB02BA0294831E",
        "ParentEventID": [
          "F54B43A44847C842"
        ],
        "Label": "waited",
        "Title": "X-Trace Task",
        "Host": "pinky19.mpi-sws.org",
        "Duration": "188327",
        "HRT": 25488985474156710,
        "Operation": "waited",
        "Timestamp": "1556272625414.145020",
        "TenantClass": 0,
        "Source": "SocketIOWithTimeout.java:335",
        "ThreadID": 1,
        "ThreadName": "",
        "EventID": "1B130E1C493DF5F9",
        "ProcessID": 6356
      },
      {
        "Cycles": 0,
        "Agent": "edu.brown.cs.systems.xtrace.logging.BaggageWrappers",
        "ProcessName": "Read",
        "TaskID": "88CB02BA0294831E",
        "ParentEventID": [
          "1B130E1C493DF5F9",
          "925D28B60BEC72C8"
        ],
        "Label": "Merged current baggage with other baggage",
        "Title": "X-Trace Task",
        "Host": "pinky19.mpi-sws.org",
        "HRT": 25488985474222560,
        "Operation": "join",
        "Timestamp": "1556272625414.210938",
        "TenantClass": 0,
        "Source": "RemoteBlockReader2.java:429",
        "ThreadID": 1,
        "ThreadName": "",
        "EventID": "25FF6BA6206DAA55",
        "ProcessID": 6356
      },
      {
        "Cycles": 0,
        "Agent": "edu.brown.cs.systems.xtrace.logging.XTraceInit",
        "ProcessName": "Data",
        "TaskID": "88CB02BA0294831E",
        "ParentEventID": [
          "FE1E13FBD44098AD"
        ],
        "Label": "Thread.setName: DataXceiver for client DFSClient_NONMAPREDUCE_614514224_1 at /139.19.171.63:49930 [Sending block BP-1633380353-139.19.171.63-1554193446451:blk_1073763579_22755]",
        "Title": "X-Trace Task",
        "Host": "pinky19.mpi-sws.org",
        "HRT": 25488985474017407,
        "Timestamp": "1556272625414.013672",
        "TenantClass": 0,
        "Source": "DataXceiver.java:168",
        "ThreadID": 8099,
        "ThreadName": "",
        "EventID": "6D61C53E56FF333E",
        "BaggageBytes": "[[248 5] [240 0] [0 136 203 2 186 2 148 131 30] [240 1] [0 254 30 19 251 212 64 152 173] [240 3] [0 2]]",
        "ProcessID": 2319
      },
      {
        "Cycles": 0,
        "Agent": "Execution-Sleep",
        "ProcessName": "Data",
        "TaskID": "88CB02BA0294831E",
        "ParentEventID": [
          "6A545E9C6819EA8A"
        ],
        "Label": "waited",
        "Title": "X-Trace Task",
        "Host": "pinky19.mpi-sws.org",
        "Duration": "4443",
        "HRT": 25488985474230956,
        "Operation": "waited",
        "Timestamp": "1556272625414.227051",
        "TenantClass": 0,
        "Source": "SocketIOWithTimeout.java:335",
        "ThreadID": 8099,
        "ThreadName": "",
        "EventID": "95DBAC6FFE63B116",
        "BaggageBytes": "[[248 5] [240 0] [0 136 203 2 186 2 148 131 30] [240 1] [0 106 84 94 156 104 25 234 138] [240 3] [0 2]]",
        "ProcessID": 2319
      },
      {
        "Cycles": 0,
        "Agent": "edu.brown.cs.systems.xtrace.logging.BaggageWrappers",
        "ProcessName": "Read",
        "TaskID": "88CB02BA0294831E",
        "ParentEventID": [
          "25FF6BA6206DAA55",
          "6A545E9C6819EA8A"
        ],
        "Label": "Merged current baggage with other baggage",
        "Title": "X-Trace Task",
        "Host": "pinky19.mpi-sws.org",
        "HRT": 25488985474349686,
        "Operation": "join",
        "Timestamp": "1556272625414.338135",
        "TenantClass": 0,
        "Source": "PacketHeader.java:168",
        "ThreadID": 1,
        "ThreadName": "",
        "EventID": "E9E78B52F33C5975",
        "ProcessID": 6356
      },
      {
        "Cycles": 0,
        "Agent": "edu.brown.cs.systems.xtrace.logging.BaggageWrappers",
        "ProcessName": "Data",
        "TaskID": "88CB02BA0294831E",
        "ParentEventID": [
          "925D28B60BEC72C8"
        ],
        "Label": "Forking current baggage with Baggage.fork()",
        "Title": "X-Trace Task",
        "Host": "pinky19.mpi-sws.org",
        "HRT": 25488985474162793,
        "Operation": "fork",
        "Timestamp": "1556272625414.158936",
        "TenantClass": 0,
        "Source": "PacketHeader.java:95",
        "ThreadID": 8099,
        "ThreadName": "",
        "EventID": "6A545E9C6819EA8A",
        "BaggageBytes": "[[248 5] [240 0] [0 136 203 2 186 2 148 131 30] [240 1] [0 146 93 40 182 11 236 114 200] [240 3] [0 2]]",
        "ProcessID": 2319
      },
      {
        "Cycles": 0,
        "Agent": "edu.brown.cs.systems.xtrace.logging.BaggageWrappers",
        "ProcessName": "Read",
        "TaskID": "88CB02BA0294831E",
        "ParentEventID": [
          "E9E78B52F33C5975",
          "B39D0C6A0E3A6FBE"
        ],
        "Label": "Merged current baggage with other baggage",
        "Title": "X-Trace Task",
        "Host": "pinky19.mpi-sws.org",
        "HRT": 25488985474472433,
        "Operation": "join",
        "Timestamp": "1556272625414.460693",
        "TenantClass": 0,
        "Source": "PacketHeader.java:168",
        "ThreadID": 1,
        "ThreadName": "",
        "EventID": "8250E263799B8A3F",
        "ProcessID": 6356
      },
      {
        "Cycles": 0,
        "Agent": "edu.brown.cs.systems.xtrace.logging.BaggageWrappers",
        "ProcessName": "Read",
        "TaskID": "88CB02BA0294831E",
        "ParentEventID": [
          "2866F737574BBB6E"
        ],
        "Label": "Forking current baggage with Baggage.fork()",
        "Title": "X-Trace Task",
        "Host": "pinky19.mpi-sws.org",
        "HRT": 25488985474554426,
        "Operation": "fork",
        "Timestamp": "1556272625414.542725",
        "TenantClass": 0,
        "Source": "DataTransferProtoUtil.java:94",
        "ThreadID": 1,
        "ThreadName": "",
        "EventID": "57071912290AE39C",
        "ProcessID": 6356
      },
      {
        "Cycles": 0,
        "Agent": "edu.brown.cs.systems.xtrace.logging.BaggageWrappers",
        "ProcessName": "Data",
        "TaskID": "88CB02BA0294831E",
        "ParentEventID": [
          "95DBAC6FFE63B116"
        ],
        "Label": "Forking current baggage with Baggage.fork()",
        "Title": "X-Trace Task",
        "Host": "pinky19.mpi-sws.org",
        "HRT": 25488985474306295,
        "Operation": "fork",
        "Timestamp": "1556272625414.302490",
        "TenantClass": 0,
        "Source": "PacketHeader.java:95",
        "ThreadID": 8099,
        "ThreadName": "",
        "EventID": "B39D0C6A0E3A6FBE",
        "BaggageBytes": "[[248 5] [240 0] [0 136 203 2 186 2 148 131 30] [240 1] [0 149 219 172 111 254 99 177 22] [240 3] [0 2]]",
        "ProcessID": 2319
      },
      {
        "Cycles": 0,
        "Agent": "Execution-Sleep",
        "ProcessName": "Data",
        "TaskID": "88CB02BA0294831E",
        "ParentEventID": [
          "B39D0C6A0E3A6FBE"
        ],
        "Label": "waited",
        "Title": "X-Trace Task",
        "Host": "pinky19.mpi-sws.org",
        "Duration": "146587",
        "HRT": 25488985474543761,
        "Operation": "waited",
        "Timestamp": "1556272625414.540039",
        "TenantClass": 0,
        "Source": "SocketIOWithTimeout.java:335",
        "ThreadID": 8099,
        "ThreadName": "",
        "EventID": "309649B37C89F996",
        "BaggageBytes": "[[248 5] [240 0] [0 136 203 2 186 2 148 131 30] [240 1] [0 179 157 12 106 14 58 111 190] [240 3] [0 2]]",
        "ProcessID": 2319
      },
      {
        "Cycles": 0,
        "Agent": "Execution-CPU",
        "ProcessName": "Data",
        "TaskID": "88CB02BA0294831E",
        "ParentEventID": [
          "1BA8B50A0B7F5091"
        ],
        "Label": "unset",
        "Title": "X-Trace Task",
        "Host": "pinky19.mpi-sws.org",
        "Duration": "696261",
        "HRT": 25488985474702830,
        "Operation": "unset",
        "Timestamp": "1556272625414.698975",
        "TenantClass": 0,
        "Source": "DataXceiver.java:261",
        "ThreadID": 8099,
        "ThreadName": "",
        "EventID": "23F4C9C1C51FF687",
        "BaggageBytes": "[[248 5] [240 0] [0 136 203 2 186 2 148 131 30] [240 1] [0 27 168 181 10 11 127 80 145] [240 3] [0 2]]",
        "ProcessID": 2319
      },
      {
        "Cycles": 0,
        "Agent": "edu.brown.cs.systems.xtrace.logging.BaggageWrappers",
        "ProcessName": "Read",
        "TaskID": "88CB02BA0294831E",
        "ParentEventID": [
          "8250E263799B8A3F"
        ],
        "Label": "Forking current baggage with Baggage.fork()",
        "Title": "X-Trace Task",
        "Host": "pinky19.mpi-sws.org",
        "HRT": 25488985474483260,
        "Operation": "fork",
        "Timestamp": "1556272625414.471680",
        "TenantClass": 0,
        "Source": "RemoteBlockReader2.java:361",
        "ThreadID": 1,
        "ThreadName": "",
        "EventID": "2866F737574BBB6E",
        "ProcessID": 6356
      },
      {
        "Cycles": 0,
        "Agent": "Execution-CPU",
        "ProcessName": "Data",
        "TaskID": "88CB02BA0294831E",
        "ParentEventID": [
          "57071912290AE39C"
        ],
        "Label": "set",
        "Title": "X-Trace Task",
        "Host": "pinky19.mpi-sws.org",
        "HRT": 25488985474738306,
        "Operation": "set",
        "Timestamp": "1556272625414.734375",
        "TenantClass": 0,
        "Source": "Receiver.java:117",
        "ThreadID": 8099,
        "ThreadName": "",
        "EventID": "D19EE148E4905126",
        "BaggageBytes": "[[248 5] [240 0] [0 136 203 2 186 2 148 131 30] [240 1] [0 87 7 25 18 41 10 227 156] [240 3] [0 2]]",
        "ProcessID": 2319
      },
      {
        "Cycles": 0,
        "Agent": "edu.brown.cs.systems.xtrace.logging.BaggageWrappers",
        "ProcessName": "Data",
        "TaskID": "88CB02BA0294831E",
        "ParentEventID": [
          "F29BE39248C6131A"
        ],
        "Label": "Forking current baggage with Baggage.fork()",
        "Title": "X-Trace Task",
        "Host": "pinky19.mpi-sws.org",
        "HRT": 25488985474876592,
        "Operation": "fork",
        "Timestamp": "1556272625414.872803",
        "TenantClass": 0,
        "Source": "DataXceiver.java:1257",
        "ThreadID": 8099,
        "ThreadName": "",
        "EventID": "5A05CD0AB49CD9EA",
        "BaggageBytes": "[[248 5] [240 0] [0 136 203 2 186 2 148 131 30] [240 1] [0 242 155 227 146 72 198 19 26] [240 3] [0 2]]",
        "ProcessID": 2319
      },
      {
        "Cycles": 0,
        "Agent": "edu.brown.cs.systems.xtrace.logging.BaggageWrappers",
        "ProcessName": "Data",
        "TaskID": "88CB02BA0294831E",
        "ParentEventID": [
          "2866F737574BBB6E",
          "309649B37C89F996"
        ],
        "Label": "Merged current baggage with other baggage",
        "Title": "X-Trace Task",
        "Host": "pinky19.mpi-sws.org",
        "HRT": 25488985474671936,
        "Operation": "join",
        "Timestamp": "1556272625414.668213",
        "TenantClass": 0,
        "Source": "DataXceiver.java:574",
        "ThreadID": 8099,
        "ThreadName": "",
        "EventID": "1BA8B50A0B7F5091",
        "BaggageBytes": "[[248 5] [240 0] [0 136 203 2 186 2 148 131 30] [240 1] [0 40 102 247 55 87 75 187 110] [0 48 150 73 179 124 137 249 150] [240 3] [0 2]]",
        "ProcessID": 2319
      },
      {
        "Cycles": 0,
        "Agent": "Execution-Sleep",
        "ProcessName": "Read",
        "TaskID": "88CB02BA0294831E",
        "ParentEventID": [
          "57071912290AE39C"
        ],
        "Label": "waited",
        "Title": "X-Trace Task",
        "Host": "pinky19.mpi-sws.org",
        "Duration": "318654",
        "HRT": 25488985474942651,
        "Operation": "waited",
        "Timestamp": "1556272625414.930908",
        "TenantClass": 0,
        "Source": "SocketIOWithTimeout.java:335",
        "ThreadID": 1,
        "ThreadName": "",
        "EventID": "7E98639894536515",
        "ProcessID": 6356
      },
      {
        "Cycles": 0,
        "Agent": "edu.brown.cs.systems.xtrace.logging.BaggageWrappers",
        "ProcessName": "Read",
        "TaskID": "88CB02BA0294831E",
        "ParentEventID": [
          "5A05CD0AB49CD9EA",
          "7E98639894536515"
        ],
        "Label": "Merged current baggage with other baggage",
        "Title": "X-Trace Task",
        "Host": "pinky19.mpi-sws.org",
        "HRT": 25488985475001219,
        "Operation": "join",
        "Timestamp": "1556272625414.989502",
        "TenantClass": 0,
        "Source": "RemoteBlockReader2.java:429",
        "ThreadID": 1,
        "ThreadName": "",
        "EventID": "28040B2EF6C02F71",
        "ProcessID": 6356
      },
      {
        "Cycles": 0,
        "Agent": "edu.brown.cs.systems.xtrace.logging.XTraceInit",
        "ProcessName": "Data",
        "TaskID": "88CB02BA0294831E",
        "ParentEventID": [
          "D19EE148E4905126"
        ],
        "Label": "Thread.setName: DataXceiver for client DFSClient_NONMAPREDUCE_614514224_1 at /139.19.171.63:49930 [Sending block BP-1633380353-139.19.171.63-1554193446451:blk_1073763579_22755]",
        "Title": "X-Trace Task",
        "Host": "pinky19.mpi-sws.org",
        "HRT": 25488985474773369,
        "Timestamp": "1556272625414.769531",
        "TenantClass": 0,
        "Source": "DataXceiver.java:168",
        "ThreadID": 8099,
        "ThreadName": "",
        "EventID": "F29BE39248C6131A",
        "BaggageBytes": "[[248 5] [240 0] [0 136 203 2 186 2 148 131 30] [240 1] [0 209 158 225 72 228 144 81 38] [240 3] [0 2]]",
        "ProcessID": 2319
      },
      {
        "Cycles": 0,
        "Agent": "Execution-Sleep",
        "ProcessName": "Data",
        "TaskID": "88CB02BA0294831E",
        "ParentEventID": [
          "D1DE7718CD21CF68"
        ],
        "Label": "waited",
        "Title": "X-Trace Task",
        "Host": "pinky19.mpi-sws.org",
        "Duration": "4646",
        "HRT": 25488985475017156,
        "Operation": "waited",
        "Timestamp": "1556272625415.013428",
        "TenantClass": 0,
        "Source": "SocketIOWithTimeout.java:335",
        "ThreadID": 8099,
        "ThreadName": "",
        "EventID": "0C045E271872EEA0",
        "BaggageBytes": "[[248 5] [240 0] [0 136 203 2 186 2 148 131 30] [240 1] [0 209 222 119 24 205 33 207 104] [240 3] [0 2]]",
        "ProcessID": 2319
      },
      {
        "Cycles": 0,
        "Agent": "edu.brown.cs.systems.xtrace.logging.BaggageWrappers",
        "ProcessName": "Data",
        "TaskID": "88CB02BA0294831E",
        "ParentEventID": [
          "0C045E271872EEA0"
        ],
        "Label": "Forking current baggage with Baggage.fork()",
        "Title": "X-Trace Task",
        "Host": "pinky19.mpi-sws.org",
        "HRT": 25488985475093536,
        "Operation": "fork",
        "Timestamp": "1556272625415.089600",
        "TenantClass": 0,
        "Source": "PacketHeader.java:95",
        "ThreadID": 8099,
        "ThreadName": "",
        "EventID": "82F0B8CB766FDFA5",
        "BaggageBytes": "[[248 5] [240 0] [0 136 203 2 186 2 148 131 30] [240 1] [0 12 4 94 39 24 114 238 160] [240 3] [0 2]]",
        "ProcessID": 2319
      },
      {
        "Cycles": 0,
        "Agent": "edu.brown.cs.systems.xtrace.logging.BaggageWrappers",
        "ProcessName": "Data",
        "TaskID": "88CB02BA0294831E",
        "ParentEventID": [
          "5A05CD0AB49CD9EA"
        ],
        "Label": "Forking current baggage with Baggage.fork()",
        "Title": "X-Trace Task",
        "Host": "pinky19.mpi-sws.org",
        "HRT": 25488985474952076,
        "Operation": "fork",
        "Timestamp": "1556272625414.948242",
        "TenantClass": 0,
        "Source": "PacketHeader.java:95",
        "ThreadID": 8099,
        "ThreadName": "",
        "EventID": "D1DE7718CD21CF68",
        "BaggageBytes": "[[248 5] [240 0] [0 136 203 2 186 2 148 131 30] [240 1] [0 90 5 205 10 180 156 217 234] [240 3] [0 2]]",
        "ProcessID": 2319
      },
      {
        "Cycles": 0,
        "Agent": "edu.brown.cs.systems.xtrace.logging.BaggageWrappers",
        "ProcessName": "Read",
        "TaskID": "88CB02BA0294831E",
        "ParentEventID": [
          "7724579B54DAAC49",
          "D1DE7718CD21CF68"
        ],
        "Label": "Merged current baggage with other baggage",
        "Title": "X-Trace Task",
        "Host": "pinky19.mpi-sws.org",
        "HRT": 25488985475126721,
        "Operation": "join",
        "Timestamp": "1556272625415.114990",
        "TenantClass": 0,
        "Source": "PacketHeader.java:168",
        "ThreadID": 1,
        "ThreadName": "",
        "EventID": "270FF4A1591BC981",
        "ProcessID": 6356
      },
      {
        "Cycles": 0,
        "Agent": "edu.brown.cs.systems.xtrace.logging.BaggageWrappers",
        "ProcessName": "Data",
        "TaskID": "88CB02BA0294831E",
        "ParentEventID": [
          "4892258F142602B9"
        ],
        "Label": "Forking current baggage with Baggage.fork()",
        "Title": "X-Trace Task",
        "Host": "pinky19.mpi-sws.org",
        "HRT": 25488985475214222,
        "Operation": "fork",
        "Timestamp": "1556272625415.210449",
        "TenantClass": 0,
        "Source": "PacketHeader.java:95",
        "ThreadID": 8099,
        "ThreadName": "",
        "EventID": "932411612CBC8A96",
        "BaggageBytes": "[[248 5] [240 0] [0 136 203 2 186 2 148 131 30] [240 1] [0 72 146 37 143 20 38 2 185] [240 3] [0 2]]",
        "ProcessID": 2319
      },
      {
        "Cycles": 0,
        "Agent": "Execution-Sleep",
        "ProcessName": "Read",
        "TaskID": "88CB02BA0294831E",
        "ParentEventID": [
          "28040B2EF6C02F71"
        ],
        "Label": "waited",
        "Title": "X-Trace Task",
        "Host": "pinky19.mpi-sws.org",
        "Duration": "3303",
        "HRT": 25488985475083723,
        "Operation": "waited",
        "Timestamp": "1556272625415.072021",
        "TenantClass": 0,
        "Source": "SocketIOWithTimeout.java:335",
        "ThreadID": 1,
        "ThreadName": "",
        "EventID": "7724579B54DAAC49",
        "ProcessID": 6356
      },
      {
        "Cycles": 0,
        "Agent": "edu.brown.cs.systems.xtrace.logging.BaggageWrappers",
        "ProcessName": "Read",
        "TaskID": "88CB02BA0294831E",
        "ParentEventID": [
          "82F0B8CB766FDFA5",
          "270FF4A1591BC981"
        ],
        "Label": "Merged current baggage with other baggage",
        "Title": "X-Trace Task",
        "Host": "pinky19.mpi-sws.org",
        "HRT": 25488985475244517,
        "Operation": "join",
        "Timestamp": "1556272625415.232910",
        "TenantClass": 0,
        "Source": "PacketHeader.java:168",
        "ThreadID": 1,
        "ThreadName": "",
        "EventID": "CB7FEC7275EC4B04",
        "ProcessID": 6356
      },
      {
        "Cycles": 0,
        "Agent": "edu.brown.cs.systems.xtrace.logging.BaggageWrappers",
        "ProcessName": "Data",
        "TaskID": "88CB02BA0294831E",
        "ParentEventID": [
          "E343CEB3C65E3EE8"
        ],
        "Label": "Forking current baggage with Baggage.fork()",
        "Title": "X-Trace Task",
        "Host": "pinky19.mpi-sws.org",
        "HRT": 25488985475330091,
        "Operation": "fork",
        "Timestamp": "1556272625415.326172",
        "TenantClass": 0,
        "Source": "PacketHeader.java:95",
        "ThreadID": 8099,
        "ThreadName": "",
        "EventID": "699AB5DB679EFB40",
        "BaggageBytes": "[[248 5] [240 0] [0 136 203 2 186 2 148 131 30] [240 1] [0 227 67 206 179 198 94 62 232] [240 3] [0 2]]",
        "ProcessID": 2319
      },
      {
        "Cycles": 0,
        "Agent": "Execution-Sleep",
        "ProcessName": "Data",
        "TaskID": "88CB02BA0294831E",
        "ParentEventID": [
          "932411612CBC8A96"
        ],
        "Label": "waited",
        "Title": "X-Trace Task",
        "Host": "pinky19.mpi-sws.org",
        "Duration": "3317",
        "HRT": 25488985475267335,
        "Operation": "waited",
        "Timestamp": "1556272625415.263428",
        "TenantClass": 0,
        "Source": "SocketIOWithTimeout.java:335",
        "ThreadID": 8099,
        "ThreadName": "",
        "EventID": "E343CEB3C65E3EE8",
        "BaggageBytes": "[[248 5] [240 0] [0 136 203 2 186 2 148 131 30] [240 1] [0 147 36 17 97 44 188 138 150] [240 3] [0 2]]",
        "ProcessID": 2319
      },
      {
        "Cycles": 0,
        "Agent": "edu.brown.cs.systems.xtrace.logging.BaggageWrappers",
        "ProcessName": "Read",
        "TaskID": "88CB02BA0294831E",
        "ParentEventID": [
          "932411612CBC8A96",
          "CB7FEC7275EC4B04"
        ],
        "Label": "Merged current baggage with other baggage",
        "Title": "X-Trace Task",
        "Host": "pinky19.mpi-sws.org",
        "HRT": 25488985475359355,
        "Operation": "join",
        "Timestamp": "1556272625415.347656",
        "TenantClass": 0,
        "Source": "PacketHeader.java:168",
        "ThreadID": 1,
        "ThreadName": "",
        "EventID": "BA27C61E250356DF",
        "ProcessID": 6356
      },
      {
        "Cycles": 0,
        "Agent": "edu.brown.cs.systems.xtrace.logging.BaggageWrappers",
        "ProcessName": "Data",
        "TaskID": "88CB02BA0294831E",
        "ParentEventID": [
          "9664A1287CDE0BF6"
        ],
        "Label": "Forking current baggage with Baggage.fork()",
        "Title": "X-Trace Task",
        "Host": "pinky19.mpi-sws.org",
        "HRT": 25488985475446335,
        "Operation": "fork",
        "Timestamp": "1556272625415.442627",
        "TenantClass": 0,
        "Source": "PacketHeader.java:95",
        "ThreadID": 8099,
        "ThreadName": "",
        "EventID": "D24E3BC7EFEB79E1",
        "BaggageBytes": "[[248 5] [240 0] [0 136 203 2 186 2 148 131 30] [240 1] [0 150 100 161 40 124 222 11 246] [240 3] [0 2]]",
        "ProcessID": 2319
      },
      {
        "Cycles": 0,
        "Agent": "Execution-Sleep",
        "ProcessName": "Data",
        "TaskID": "88CB02BA0294831E",
        "ParentEventID": [
          "82F0B8CB766FDFA5"
        ],
        "Label": "waited",
        "Title": "X-Trace Task",
        "Host": "pinky19.mpi-sws.org",
        "Duration": "3569",
        "HRT": 25488985475148692,
        "Operation": "waited",
        "Timestamp": "1556272625415.144775",
        "TenantClass": 0,
        "Source": "SocketIOWithTimeout.java:335",
        "ThreadID": 8099,
        "ThreadName": "",
        "EventID": "4892258F142602B9",
        "BaggageBytes": "[[248 5] [240 0] [0 136 203 2 186 2 148 131 30] [240 1] [0 130 240 184 203 118 111 223 165] [240 3] [0 2]]",
        "ProcessID": 2319
      },
      {
        "Cycles": 0,
        "Agent": "edu.brown.cs.systems.xtrace.logging.BaggageWrappers",
        "ProcessName": "Read",
        "TaskID": "88CB02BA0294831E",
        "ParentEventID": [
          "BA27C61E250356DF",
          "699AB5DB679EFB40"
        ],
        "Label": "Merged current baggage with other baggage",
        "Title": "X-Trace Task",
        "Host": "pinky19.mpi-sws.org",
        "HRT": 25488985475473833,
        "Operation": "join",
        "Timestamp": "1556272625415.462158",
        "TenantClass": 0,
        "Source": "PacketHeader.java:168",
        "ThreadID": 1,
        "ThreadName": "",
        "EventID": "8026726D6D933A18",
        "ProcessID": 6356
      },
      {
        "Cycles": 0,
        "Agent": "edu.brown.cs.systems.xtrace.logging.BaggageWrappers",
        "ProcessName": "Data",
        "TaskID": "88CB02BA0294831E",
        "ParentEventID": [
          "B3F3F8840854F6D2"
        ],
        "Label": "Forking current baggage with Baggage.fork()",
        "Title": "X-Trace Task",
        "Host": "pinky19.mpi-sws.org",
        "HRT": 25488985475562556,
        "Operation": "fork",
        "Timestamp": "1556272625415.558838",
        "TenantClass": 0,
        "Source": "PacketHeader.java:95",
        "ThreadID": 8099,
        "ThreadName": "",
        "EventID": "C234ADC5159BC023",
        "BaggageBytes": "[[248 5] [240 0] [0 136 203 2 186 2 148 131 30] [240 1] [0 179 243 248 132 8 84 246 210] [240 3] [0 2]]",
        "ProcessID": 2319
      },
      {
        "Cycles": 0,
        "Agent": "Execution-Sleep",
        "ProcessName": "Data",
        "TaskID": "88CB02BA0294831E",
        "ParentEventID": [
          "699AB5DB679EFB40"
        ],
        "Label": "waited",
        "Title": "X-Trace Task",
        "Host": "pinky19.mpi-sws.org",
        "Duration": "3151",
        "HRT": 25488985475383730,
        "Operation": "waited",
        "Timestamp": "1556272625415.379883",
        "TenantClass": 0,
        "Source": "SocketIOWithTimeout.java:335",
        "ThreadID": 8099,
        "ThreadName": "",
        "EventID": "9664A1287CDE0BF6",
        "BaggageBytes": "[[248 5] [240 0] [0 136 203 2 186 2 148 131 30] [240 1] [0 105 154 181 219 103 158 251 64] [240 3] [0 2]]",
        "ProcessID": 2319
      },
      {
        "Cycles": 0,
        "Agent": "edu.brown.cs.systems.xtrace.logging.BaggageWrappers",
        "ProcessName": "Read",
        "TaskID": "88CB02BA0294831E",
        "ParentEventID": [
          "8026726D6D933A18",
          "D24E3BC7EFEB79E1"
        ],
        "Label": "Merged current baggage with other baggage",
        "Title": "X-Trace Task",
        "Host": "pinky19.mpi-sws.org",
        "HRT": 25488985475588235,
        "Operation": "join",
        "Timestamp": "1556272625415.576660",
        "TenantClass": 0,
        "Source": "PacketHeader.java:168",
        "ThreadID": 1,
        "ThreadName": "",
        "EventID": "0113FBCE0B2281C4",
        "ProcessID": 6356
      },
      {
        "Cycles": 0,
        "Agent": "edu.brown.cs.systems.xtrace.logging.BaggageWrappers",
        "ProcessName": "Data",
        "TaskID": "88CB02BA0294831E",
        "ParentEventID": [
          "8D27D68B0F7441EB"
        ],
        "Label": "Forking current baggage with Baggage.fork()",
        "Title": "X-Trace Task",
        "Host": "pinky19.mpi-sws.org",
        "HRT": 25488985475677127,
        "Operation": "fork",
        "Timestamp": "1556272625415.673340",
        "TenantClass": 0,
        "Source": "PacketHeader.java:95",
        "ThreadID": 8099,
        "ThreadName": "",
        "EventID": "0303E442206BDC8F",
        "BaggageBytes": "[[248 5] [240 0] [0 136 203 2 186 2 148 131 30] [240 1] [0 141 39 214 139 15 116 65 235] [240 3] [0 2]]",
        "ProcessID": 2319
      },
      {
        "Cycles": 0,
        "Agent": "Execution-Sleep",
        "ProcessName": "Data",
        "TaskID": "88CB02BA0294831E",
        "ParentEventID": [
          "C234ADC5159BC023"
        ],
        "Label": "waited",
        "Title": "X-Trace Task",
        "Host": "pinky19.mpi-sws.org",
        "Duration": "3065",
        "HRT": 25488985475614068,
        "Operation": "waited",
        "Timestamp": "1556272625415.610352",
        "TenantClass": 0,
        "Source": "SocketIOWithTimeout.java:335",
        "ThreadID": 8099,
        "ThreadName": "",
        "EventID": "8D27D68B0F7441EB",
        "BaggageBytes": "[[248 5] [240 0] [0 136 203 2 186 2 148 131 30] [240 1] [0 194 52 173 197 21 155 192 35] [240 3] [0 2]]",
        "ProcessID": 2319
      },
      {
        "Cycles": 0,
        "Agent": "edu.brown.cs.systems.xtrace.logging.BaggageWrappers",
        "ProcessName": "Read",
        "TaskID": "88CB02BA0294831E",
        "ParentEventID": [
          "C234ADC5159BC023",
          "0113FBCE0B2281C4"
        ],
        "Label": "Merged current baggage with other baggage",
        "Title": "X-Trace Task",
        "Host": "pinky19.mpi-sws.org",
        "HRT": 25488985475703203,
        "Operation": "join",
        "Timestamp": "1556272625415.691650",
        "TenantClass": 0,
        "Source": "PacketHeader.java:168",
        "ThreadID": 1,
        "ThreadName": "",
        "EventID": "6159E236B13E031C",
        "ProcessID": 6356
      },
      {
        "Cycles": 0,
        "Agent": "edu.brown.cs.systems.xtrace.logging.BaggageWrappers",
        "ProcessName": "Data",
        "TaskID": "88CB02BA0294831E",
        "ParentEventID": [
          "A083F38F3BAAB7C2"
        ],
        "Label": "Forking current baggage with Baggage.fork()",
        "Title": "X-Trace Task",
        "Host": "pinky19.mpi-sws.org",
        "HRT": 25488985475789961,
        "Operation": "fork",
        "Timestamp": "1556272625415.786133",
        "TenantClass": 0,
        "Source": "PacketHeader.java:95",
        "ThreadID": 8099,
        "ThreadName": "",
        "EventID": "76CB268B069D593F",
        "BaggageBytes": "[[248 5] [240 0] [0 136 203 2 186 2 148 131 30] [240 1] [0 160 131 243 143 59 170 183 194] [240 3] [0 2]]",
        "ProcessID": 2319
      },
      {
        "Cycles": 0,
        "Agent": "Execution-Sleep",
        "ProcessName": "Data",
        "TaskID": "88CB02BA0294831E",
        "ParentEventID": [
          "D24E3BC7EFEB79E1"
        ],
        "Label": "waited",
        "Title": "X-Trace Task",
        "Host": "pinky19.mpi-sws.org",
        "Duration": "4481",
        "HRT": 25488985475500917,
        "Operation": "waited",
        "Timestamp": "1556272625415.497070",
        "TenantClass": 0,
        "Source": "SocketIOWithTimeout.java:335",
        "ThreadID": 8099,
        "ThreadName": "",
        "EventID": "B3F3F8840854F6D2",
        "BaggageBytes": "[[248 5] [240 0] [0 136 203 2 186 2 148 131 30] [240 1] [0 210 78 59 199 239 235 121 225] [240 3] [0 2]]",
        "ProcessID": 2319
      },
      {
        "Cycles": 0,
        "Agent": "edu.brown.cs.systems.xtrace.logging.BaggageWrappers",
        "ProcessName": "Read",
        "TaskID": "88CB02BA0294831E",
        "ParentEventID": [
          "0303E442206BDC8F",
          "6159E236B13E031C"
        ],
        "Label": "Merged current baggage with other baggage",
        "Title": "X-Trace Task",
        "Host": "pinky19.mpi-sws.org",
        "HRT": 25488985475819266,
        "Operation": "join",
        "Timestamp": "1556272625415.807617",
        "TenantClass": 0,
        "Source": "PacketHeader.java:168",
        "ThreadID": 1,
        "ThreadName": "",
        "EventID": "CE43BA2DC35B1EA2",
        "ProcessID": 6356
      },
      {
        "Cycles": 0,
        "Agent": "edu.brown.cs.systems.xtrace.logging.BaggageWrappers",
        "ProcessName": "Data",
        "TaskID": "88CB02BA0294831E",
        "ParentEventID": [
          "85A6F112E23292BA"
        ],
        "Label": "Forking current baggage with Baggage.fork()",
        "Title": "X-Trace Task",
        "Host": "pinky19.mpi-sws.org",
        "HRT": 25488985475910739,
        "Operation": "fork",
        "Timestamp": "1556272625415.906982",
        "TenantClass": 0,
        "Source": "PacketHeader.java:95",
        "ThreadID": 8099,
        "ThreadName": "",
        "EventID": "209758064E3999D7",
        "BaggageBytes": "[[248 5] [240 0] [0 136 203 2 186 2 148 131 30] [240 1] [0 133 166 241 18 226 50 146 186] [240 3] [0 2]]",
        "ProcessID": 2319
      },
      {
        "Cycles": 0,
        "Agent": "Execution-Sleep",
        "ProcessName": "Data",
        "TaskID": "88CB02BA0294831E",
        "ParentEventID": [
          "0303E442206BDC8F"
        ],
        "Label": "waited",
        "Title": "X-Trace Task",
        "Host": "pinky19.mpi-sws.org",
        "Duration": "3124",
        "HRT": 25488985475728195,
        "Operation": "waited",
        "Timestamp": "1556272625415.724365",
        "TenantClass": 0,
        "Source": "SocketIOWithTimeout.java:335",
        "ThreadID": 8099,
        "ThreadName": "",
        "EventID": "A083F38F3BAAB7C2",
        "BaggageBytes": "[[248 5] [240 0] [0 136 203 2 186 2 148 131 30] [240 1] [0 3 3 228 66 32 107 220 143] [240 3] [0 2]]",
        "ProcessID": 2319
      },
      {
        "Cycles": 0,
        "Agent": "edu.brown.cs.systems.xtrace.logging.BaggageWrappers",
        "ProcessName": "Read",
        "TaskID": "88CB02BA0294831E",
        "ParentEventID": [
          "76CB268B069D593F",
          "CE43BA2DC35B1EA2"
        ],
        "Label": "Merged current baggage with other baggage",
        "Title": "X-Trace Task",
        "Host": "pinky19.mpi-sws.org",
        "HRT": 25488985475936327,
        "Operation": "join",
        "Timestamp": "1556272625415.924805",
        "TenantClass": 0,
        "Source": "PacketHeader.java:168",
        "ThreadID": 1,
        "ThreadName": "",
        "EventID": "C9A29E57DFB0BDA0",
        "ProcessID": 6356
      },
      {
        "Cycles": 0,
        "Agent": "edu.brown.cs.systems.xtrace.logging.BaggageWrappers",
        "ProcessName": "Data",
        "TaskID": "88CB02BA0294831E",
        "ParentEventID": [
          "ABE592B0CB758E32"
        ],
        "Label": "Forking current baggage with Baggage.fork()",
        "Title": "X-Trace Task",
        "Host": "pinky19.mpi-sws.org",
        "HRT": 25488985476022619,
        "Operation": "fork",
        "Timestamp": "1556272625416.018799",
        "TenantClass": 0,
        "Source": "PacketHeader.java:95",
        "ThreadID": 8099,
        "ThreadName": "",
        "EventID": "07D635B93547A4B5",
        "BaggageBytes": "[[248 5] [240 0] [0 136 203 2 186 2 148 131 30] [240 1] [0 171 229 146 176 203 117 142 50] [240 3] [0 2]]",
        "ProcessID": 2319
      },
      {
        "Cycles": 0,
        "Agent": "Execution-Sleep",
        "ProcessName": "Data",
        "TaskID": "88CB02BA0294831E",
        "ParentEventID": [
          "209758064E3999D7"
        ],
        "Label": "waited",
        "Title": "X-Trace Task",
        "Host": "pinky19.mpi-sws.org",
        "Duration": "3079",
        "HRT": 25488985475961228,
        "Operation": "waited",
        "Timestamp": "1556272625415.957520",
        "TenantClass": 0,
        "Source": "SocketIOWithTimeout.java:335",
        "ThreadID": 8099,
        "ThreadName": "",
        "EventID": "ABE592B0CB758E32",
        "BaggageBytes": "[[248 5] [240 0] [0 136 203 2 186 2 148 131 30] [240 1] [0 32 151 88 6 78 57 153 215] [240 3] [0 2]]",
        "ProcessID": 2319
      },
      {
        "Cycles": 0,
        "Agent": "Execution-Sleep",
        "ProcessName": "Data",
        "TaskID": "88CB02BA0294831E",
        "ParentEventID": [
          "76CB268B069D593F"
        ],
        "Label": "waited",
        "Title": "X-Trace Task",
        "Host": "pinky19.mpi-sws.org",
        "Duration": "3166",
        "HRT": 25488985475848895,
        "Operation": "waited",
        "Timestamp": "1556272625415.844971",
        "TenantClass": 0,
        "Source": "SocketIOWithTimeout.java:335",
        "ThreadID": 8099,
        "ThreadName": "",
        "EventID": "85A6F112E23292BA",
        "BaggageBytes": "[[248 5] [240 0] [0 136 203 2 186 2 148 131 30] [240 1] [0 118 203 38 139 6 157 89 63] [240 3] [0 2]]",
        "ProcessID": 2319
      },
      {
        "Cycles": 0,
        "Agent": "edu.brown.cs.systems.xtrace.logging.BaggageWrappers",
        "ProcessName": "Read",
        "TaskID": "88CB02BA0294831E",
        "ParentEventID": [
          "209758064E3999D7",
          "C9A29E57DFB0BDA0"
        ],
        "Label": "Merged current baggage with other baggage",
        "Title": "X-Trace Task",
        "Host": "pinky19.mpi-sws.org",
        "HRT": 25488985476050253,
        "Operation": "join",
        "Timestamp": "1556272625416.038574",
        "TenantClass": 0,
        "Source": "PacketHeader.java:168",
        "ThreadID": 1,
        "ThreadName": "",
        "EventID": "70425537386A0E79",
        "ProcessID": 6356
      },
      {
        "Cycles": 0,
        "Agent": "edu.brown.cs.systems.xtrace.logging.BaggageWrappers",
        "ProcessName": "Read",
        "TaskID": "88CB02BA0294831E",
        "ParentEventID": [
          "70425537386A0E79",
          "07D635B93547A4B5"
        ],
        "Label": "Merged current baggage with other baggage",
        "Title": "X-Trace Task",
        "Host": "pinky19.mpi-sws.org",
        "HRT": 25488985476165302,
        "Operation": "join",
        "Timestamp": "1556272625416.153564",
        "TenantClass": 0,
        "Source": "PacketHeader.java:168",
        "ThreadID": 1,
        "ThreadName": "",
        "EventID": "D7CB490107FD2BA7",
        "ProcessID": 6356
      },
      {
        "Cycles": 0,
        "Agent": "edu.brown.cs.systems.xtrace.logging.BaggageWrappers",
        "ProcessName": "Data",
        "TaskID": "88CB02BA0294831E",
        "ParentEventID": [
          "5FE6213DCE7874D5"
        ],
        "Label": "Forking current baggage with Baggage.fork()",
        "Title": "X-Trace Task",
        "Host": "pinky19.mpi-sws.org",
        "HRT": 25488985476135543,
        "Operation": "fork",
        "Timestamp": "1556272625416.131836",
        "TenantClass": 0,
        "Source": "PacketHeader.java:95",
        "ThreadID": 8099,
        "ThreadName": "",
        "EventID": "1471680F13F8CB67",
        "BaggageBytes": "[[248 5] [240 0] [0 136 203 2 186 2 148 131 30] [240 1] [0 95 230 33 61 206 120 116 213] [240 3] [0 2]]",
        "ProcessID": 2319
      },
      {
        "Cycles": 0,
        "Agent": "Execution-Sleep",
        "ProcessName": "Data",
        "TaskID": "88CB02BA0294831E",
        "ParentEventID": [
          "1471680F13F8CB67"
        ],
        "Label": "waited",
        "Title": "X-Trace Task",
        "Host": "pinky19.mpi-sws.org",
        "Duration": "3323",
        "HRT": 25488985476187473,
        "Operation": "waited",
        "Timestamp": "1556272625416.183594",
        "TenantClass": 0,
        "Source": "SocketIOWithTimeout.java:335",
        "ThreadID": 8099,
        "ThreadName": "",
        "EventID": "9AEC5C2A8F40C030",
        "BaggageBytes": "[[248 5] [240 0] [0 136 203 2 186 2 148 131 30] [240 1] [0 20 113 104 15 19 248 203 103] [240 3] [0 2]]",
        "ProcessID": 2319
      },
      {
        "Cycles": 0,
        "Agent": "edu.brown.cs.systems.xtrace.logging.BaggageWrappers",
        "ProcessName": "Read",
        "TaskID": "88CB02BA0294831E",
        "ParentEventID": [
          "D7CB490107FD2BA7",
          "1471680F13F8CB67"
        ],
        "Label": "Merged current baggage with other baggage",
        "Title": "X-Trace Task",
        "Host": "pinky19.mpi-sws.org",
        "HRT": 25488985476280765,
        "Operation": "join",
        "Timestamp": "1556272625416.269043",
        "TenantClass": 0,
        "Source": "PacketHeader.java:168",
        "ThreadID": 1,
        "ThreadName": "",
        "EventID": "A5DBA5BD90477268",
        "ProcessID": 6356
      },
      {
        "Cycles": 0,
        "Agent": "Execution-Sleep",
        "ProcessName": "Data",
        "TaskID": "88CB02BA0294831E",
        "ParentEventID": [
          "07D635B93547A4B5"
        ],
        "Label": "waited",
        "Title": "X-Trace Task",
        "Host": "pinky19.mpi-sws.org",
        "Duration": "3018",
        "HRT": 25488985476075724,
        "Operation": "waited",
        "Timestamp": "1556272625416.072021",
        "TenantClass": 0,
        "Source": "SocketIOWithTimeout.java:335",
        "ThreadID": 8099,
        "ThreadName": "",
        "EventID": "5FE6213DCE7874D5",
        "BaggageBytes": "[[248 5] [240 0] [0 136 203 2 186 2 148 131 30] [240 1] [0 7 214 53 185 53 71 164 181] [240 3] [0 2]]",
        "ProcessID": 2319
      },
      {
        "Cycles": 0,
        "Agent": "Execution-Sleep",
        "ProcessName": "Data",
        "TaskID": "88CB02BA0294831E",
        "ParentEventID": [
          "E1E26CDB5412E65D"
        ],
        "Label": "waited",
        "Title": "X-Trace Task",
        "Host": "pinky19.mpi-sws.org",
        "Duration": "3095",
        "HRT": 25488985476297885,
        "Operation": "waited",
        "Timestamp": "1556272625416.293945",
        "TenantClass": 0,
        "Source": "SocketIOWithTimeout.java:335",
        "ThreadID": 8099,
        "ThreadName": "",
        "EventID": "EEA89D2E133C1D84",
        "BaggageBytes": "[[248 5] [240 0] [0 136 203 2 186 2 148 131 30] [240 1] [0 225 226 108 219 84 18 230 93] [240 3] [0 2]]",
        "ProcessID": 2319
      },
      {
        "Cycles": 0,
        "Agent": "edu.brown.cs.systems.xtrace.logging.BaggageWrappers",
        "ProcessName": "Read",
        "TaskID": "88CB02BA0294831E",
        "ParentEventID": [
          "A5DBA5BD90477268",
          "E1E26CDB5412E65D"
        ],
        "Label": "Merged current baggage with other baggage",
        "Title": "X-Trace Task",
        "Host": "pinky19.mpi-sws.org",
        "HRT": 25488985476394893,
        "Operation": "join",
        "Timestamp": "1556272625416.383301",
        "TenantClass": 0,
        "Source": "PacketHeader.java:168",
        "ThreadID": 1,
        "ThreadName": "",
        "EventID": "529DB208427BA956",
        "ProcessID": 6356
      },
      {
        "Cycles": 0,
        "Agent": "edu.brown.cs.systems.xtrace.logging.BaggageWrappers",
        "ProcessName": "Data",
        "TaskID": "88CB02BA0294831E",
        "ParentEventID": [
          "EEA89D2E133C1D84"
        ],
        "Label": "Forking current baggage with Baggage.fork()",
        "Title": "X-Trace Task",
        "Host": "pinky19.mpi-sws.org",
        "HRT": 25488985476359444,
        "Operation": "fork",
        "Timestamp": "1556272625416.355713",
        "TenantClass": 0,
        "Source": "PacketHeader.java:95",
        "ThreadID": 8099,
        "ThreadName": "",
        "EventID": "3C0C9D9D3A1617DF",
        "BaggageBytes": "[[248 5] [240 0] [0 136 203 2 186 2 148 131 30] [240 1] [0 238 168 157 46 19 60 29 132] [240 3] [0 2]]",
        "ProcessID": 2319
      },
      {
        "Cycles": 0,
        "Agent": "Execution-Sleep",
        "ProcessName": "Data",
        "TaskID": "88CB02BA0294831E",
        "ParentEventID": [
          "3C0C9D9D3A1617DF"
        ],
        "Label": "waited",
        "Title": "X-Trace Task",
        "Host": "pinky19.mpi-sws.org",
        "Duration": "3006",
        "HRT": 25488985476409912,
        "Operation": "waited",
        "Timestamp": "1556272625416.406006",
        "TenantClass": 0,
        "Source": "SocketIOWithTimeout.java:335",
        "ThreadID": 8099,
        "ThreadName": "",
        "EventID": "6863122066DAEBDD",
        "BaggageBytes": "[[248 5] [240 0] [0 136 203 2 186 2 148 131 30] [240 1] [0 60 12 157 157 58 22 23 223] [240 3] [0 2]]",
        "ProcessID": 2319
      },
      {
        "Cycles": 0,
        "Agent": "edu.brown.cs.systems.xtrace.logging.BaggageWrappers",
        "ProcessName": "Read",
        "TaskID": "88CB02BA0294831E",
        "ParentEventID": [
          "3C0C9D9D3A1617DF",
          "529DB208427BA956"
        ],
        "Label": "Merged current baggage with other baggage",
        "Title": "X-Trace Task",
        "Host": "pinky19.mpi-sws.org",
        "HRT": 25488985476508987,
        "Operation": "join",
        "Timestamp": "1556272625416.497314",
        "TenantClass": 0,
        "Source": "PacketHeader.java:168",
        "ThreadID": 1,
        "ThreadName": "",
        "EventID": "7965D11D171E0486",
        "ProcessID": 6356
      },
      {
        "Cycles": 0,
        "Agent": "edu.brown.cs.systems.xtrace.logging.BaggageWrappers",
        "ProcessName": "Data",
        "TaskID": "88CB02BA0294831E",
        "ParentEventID": [
          "9AEC5C2A8F40C030"
        ],
        "Label": "Forking current baggage with Baggage.fork()",
        "Title": "X-Trace Task",
        "Host": "pinky19.mpi-sws.org",
        "HRT": 25488985476247271,
        "Operation": "fork",
        "Timestamp": "1556272625416.243408",
        "TenantClass": 0,
        "Source": "PacketHeader.java:95",
        "ThreadID": 8099,
        "ThreadName": "",
        "EventID": "E1E26CDB5412E65D",
        "BaggageBytes": "[[248 5] [240 0] [0 136 203 2 186 2 148 131 30] [240 1] [0 154 236 92 42 143 64 192 48] [240 3] [0 2]]",
        "ProcessID": 2319
      },
      {
        "Cycles": 0,
        "Agent": "Execution-Sleep",
        "ProcessName": "Data",
        "TaskID": "88CB02BA0294831E",
        "ParentEventID": [
          "01BAD60332074A40"
        ],
        "Label": "waited",
        "Title": "X-Trace Task",
        "Host": "pinky19.mpi-sws.org",
        "Duration": "3022",
        "HRT": 25488985476524777,
        "Operation": "waited",
        "Timestamp": "1556272625416.520996",
        "TenantClass": 0,
        "Source": "SocketIOWithTimeout.java:335",
        "ThreadID": 8099,
        "ThreadName": "",
        "EventID": "A0863127E90C0763",
        "BaggageBytes": "[[248 5] [240 0] [0 136 203 2 186 2 148 131 30] [240 1] [0 1 186 214 3 50 7 74 64] [240 3] [0 2]]",
        "ProcessID": 2319
      },
      {
        "Cycles": 0,
        "Agent": "edu.brown.cs.systems.xtrace.logging.BaggageWrappers",
        "ProcessName": "Data",
        "TaskID": "88CB02BA0294831E",
        "ParentEventID": [
          "6863122066DAEBDD"
        ],
        "Label": "Forking current baggage with Baggage.fork()",
        "Title": "X-Trace Task",
        "Host": "pinky19.mpi-sws.org",
        "HRT": 25488985476474699,
        "Operation": "fork",
        "Timestamp": "1556272625416.470947",
        "TenantClass": 0,
        "Source": "PacketHeader.java:95",
        "ThreadID": 8099,
        "ThreadName": "",
        "EventID": "01BAD60332074A40",
        "BaggageBytes": "[[248 5] [240 0] [0 136 203 2 186 2 148 131 30] [240 1] [0 104 99 18 32 102 218 235 221] [240 3] [0 2]]",
        "ProcessID": 2319
      },
      {
        "Cycles": 0,
        "Agent": "edu.brown.cs.systems.xtrace.logging.BaggageWrappers",
        "ProcessName": "Read",
        "TaskID": "88CB02BA0294831E",
        "ParentEventID": [
          "01BAD60332074A40",
          "7965D11D171E0486"
        ],
        "Label": "Merged current baggage with other baggage",
        "Title": "X-Trace Task",
        "Host": "pinky19.mpi-sws.org",
        "HRT": 25488985476622576,
        "Operation": "join",
        "Timestamp": "1556272625416.610840",
        "TenantClass": 0,
        "Source": "PacketHeader.java:168",
        "ThreadID": 1,
        "ThreadName": "",
        "EventID": "A97221301936E3E8",
        "ProcessID": 6356
      },
      {
        "Cycles": 0,
        "Agent": "edu.brown.cs.systems.xtrace.logging.BaggageWrappers",
        "ProcessName": "Data",
        "TaskID": "88CB02BA0294831E",
        "ParentEventID": [
          "D619CB193D5975EF"
        ],
        "Label": "Forking current baggage with Baggage.fork()",
        "Title": "X-Trace Task",
        "Host": "pinky19.mpi-sws.org",
        "HRT": 25488985476696094,
        "Operation": "fork",
        "Timestamp": "1556272625416.692383",
        "TenantClass": 0,
        "Source": "PacketHeader.java:95",
        "ThreadID": 8099,
        "ThreadName": "",
        "EventID": "302600438976371E",
        "BaggageBytes": "[[248 5] [240 0] [0 136 203 2 186 2 148 131 30] [240 1] [0 214 25 203 25 61 89 117 239] [240 3] [0 2]]",
        "ProcessID": 2319
      },
      {
        "Cycles": 0,
        "Agent": "Execution-Sleep",
        "ProcessName": "Data",
        "TaskID": "88CB02BA0294831E",
        "ParentEventID": [
          "CA727EB0EAA7DD54"
        ],
        "Label": "waited",
        "Title": "X-Trace Task",
        "Host": "pinky19.mpi-sws.org",
        "Duration": "3030",
        "HRT": 25488985476637298,
        "Operation": "waited",
        "Timestamp": "1556272625416.633545",
        "TenantClass": 0,
        "Source": "SocketIOWithTimeout.java:335",
        "ThreadID": 8099,
        "ThreadName": "",
        "EventID": "D619CB193D5975EF",
        "BaggageBytes": "[[248 5] [240 0] [0 136 203 2 186 2 148 131 30] [240 1] [0 202 114 126 176 234 167 221 84] [240 3] [0 2]]",
        "ProcessID": 2319
      },
      {
        "Cycles": 0,
        "Agent": "edu.brown.cs.systems.xtrace.logging.BaggageWrappers",
        "ProcessName": "Read",
        "TaskID": "88CB02BA0294831E",
        "ParentEventID": [
          "CA727EB0EAA7DD54",
          "A97221301936E3E8"
        ],
        "Label": "Merged current baggage with other baggage",
        "Title": "X-Trace Task",
        "Host": "pinky19.mpi-sws.org",
        "HRT": 25488985476737434,
        "Operation": "join",
        "Timestamp": "1556272625416.725830",
        "TenantClass": 0,
        "Source": "PacketHeader.java:168",
        "ThreadID": 1,
        "ThreadName": "",
        "EventID": "BDED6713741EA9F2",
        "ProcessID": 6356
      },
      {
        "Cycles": 0,
        "Agent": "edu.brown.cs.systems.xtrace.logging.BaggageWrappers",
        "ProcessName": "Data",
        "TaskID": "88CB02BA0294831E",
        "ParentEventID": [
          "12F26018794AC8E0"
        ],
        "Label": "Forking current baggage with Baggage.fork()",
        "Title": "X-Trace Task",
        "Host": "pinky19.mpi-sws.org",
        "HRT": 25488985476813377,
        "Operation": "fork",
        "Timestamp": "1556272625416.809570",
        "TenantClass": 0,
        "Source": "PacketHeader.java:95",
        "ThreadID": 8099,
        "ThreadName": "",
        "EventID": "8D6CE293DF5A2BCE",
        "BaggageBytes": "[[248 5] [240 0] [0 136 203 2 186 2 148 131 30] [240 1] [0 18 242 96 24 121 74 200 224] [240 3] [0 2]]",
        "ProcessID": 2319
      },
      {
        "Cycles": 0,
        "Agent": "edu.brown.cs.systems.xtrace.logging.BaggageWrappers",
        "ProcessName": "Data",
        "TaskID": "88CB02BA0294831E",
        "ParentEventID": [
          "A0863127E90C0763"
        ],
        "Label": "Forking current baggage with Baggage.fork()",
        "Title": "X-Trace Task",
        "Host": "pinky19.mpi-sws.org",
        "HRT": 25488985476585107,
        "Operation": "fork",
        "Timestamp": "1556272625416.581299",
        "TenantClass": 0,
        "Source": "PacketHeader.java:95",
        "ThreadID": 8099,
        "ThreadName": "",
        "EventID": "CA727EB0EAA7DD54",
        "BaggageBytes": "[[248 5] [240 0] [0 136 203 2 186 2 148 131 30] [240 1] [0 160 134 49 39 233 12 7 99] [240 3] [0 2]]",
        "ProcessID": 2319
      },
      {
        "Cycles": 0,
        "Agent": "Execution-Sleep",
        "ProcessName": "Data",
        "TaskID": "88CB02BA0294831E",
        "ParentEventID": [
          "302600438976371E"
        ],
        "Label": "waited",
        "Title": "X-Trace Task",
        "Host": "pinky19.mpi-sws.org",
        "Duration": "3111",
        "HRT": 25488985476754054,
        "Operation": "waited",
        "Timestamp": "1556272625416.750244",
        "TenantClass": 0,
        "Source": "SocketIOWithTimeout.java:335",
        "ThreadID": 8099,
        "ThreadName": "",
        "EventID": "12F26018794AC8E0",
        "BaggageBytes": "[[248 5] [240 0] [0 136 203 2 186 2 148 131 30] [240 1] [0 48 38 0 67 137 118 55 30] [240 3] [0 2]]",
        "ProcessID": 2319
      },
      {
        "Cycles": 0,
        "Agent": "Execution-CPU",
        "ProcessName": "Data",
        "TaskID": "88CB02BA0294831E",
        "ParentEventID": [
          "8D6CE293DF5A2BCE"
        ],
        "Label": "unset",
        "Title": "X-Trace Task",
        "Host": "pinky19.mpi-sws.org",
        "Duration": "2249249",
        "HRT": 25488985477005012,
        "Operation": "unset",
        "Timestamp": "1556272625417.001221",
        "TenantClass": 0,
        "Source": "DataXceiver.java:261",
        "ThreadID": 8099,
        "ThreadName": "",
        "EventID": "EB6E9A8206AB482F",
        "BaggageBytes": "[[248 5] [240 0] [0 136 203 2 186 2 148 131 30] [240 1] [0 141 108 226 147 223 90 43 206] [240 3] [0 2]]",
        "ProcessID": 2319
      }
    ]
  }
]