[
  {
    "id": "D460B66A7A6FF255",
    "reports": [
      {
        "Cycles": 0,
        "Agent": "Execution-CPU",
        "ProcessName": "Read",
        "TaskID": "D460B66A7A6FF255",
        "ParentEventID": [
          "C7BBF2E454F5769F"
        ],
        "Label": "unset",
        "Title": "X-Trace Task",
        "Host": "pinky19.mpi-sws.org",
        "Duration": "23515876",
        "HRT": 26966636002569572,
        "Operation": "unset",
        "Timestamp": "1557750275942.635742",
        "TenantClass": 0,
        "Source": "Client.java:1027",
        "ThreadID": 1,
        "ThreadName": "",
        "EventID": "F7A010B825B3AAA1",
        "ProcessID": 2801
      },
      {
        "Cycles": 0,
        "Agent": "org.apache.hadoop.ipc.ProtobufRpcEngine",
        "ProcessName": "Read",
        "TaskID": "D460B66A7A6FF255",
        "ParentEventID": [
          "A365762E4CB18885"
        ],
        "Label": "Invoking org.apache.hadoop.hdfs.protocol.ClientProtocol.getBlockLocations",
        "Title": "X-Trace Task",
        "Host": "pinky19.mpi-sws.org",
        "HRT": 26966636002525969,
        "Timestamp": "1557750275942.592041",
        "TenantClass": 0,
        "Source": "ProtobufRpcEngine.java:228",
        "ThreadID": 1,
        "ThreadName": "",
        "EventID": "C7BBF2E454F5769F",
        "ProcessID": 2801
      },
      {
        "Cycles": 0,
        "Agent": "edu.brown.cs.systems.retro.benchmarks.hdfs_client.Reader",
        "ProcessName": "Read",
        "TaskID": "D460B66A7A6FF255",
        "ParentEventID": [
          "0E60B70FB46292DC"
        ],
        "Label": "Reading file",
        "Title": "X-Trace Task",
        "Host": "pinky19.mpi-sws.org",
        "HRT": 26966636002482318,
        "Timestamp": "1557750275942.548340",
        "TenantClass": 0,
        "ThreadID": 1,
        "ThreadName": "",
        "EventID": "A365762E4CB18885",
        "ProcessID": 2801
      },
      {
        "Cycles": 0,
        "Agent": "edu.brown.cs.systems.xtrace.logging.BaggageWrappers",
        "ProcessName": "Read",
        "TaskID": "D460B66A7A6FF255",
        "ParentEventID": [
          "1C0EBB5710C431E4"
        ],
        "Label": "Forking current baggage with Baggage.fork()",
        "Title": "X-Trace Task",
        "Host": "pinky19.mpi-sws.org",
        "HRT": 26966636002618619,
        "Operation": "fork",
        "Timestamp": "1557750275942.684570",
        "TenantClass": 0,
        "Source": "Client.java:1043",
        "ThreadID": 41,
        "ThreadName": "",
        "EventID": "A1B85FBC14363C4C",
        "ProcessID": 2801
      },
      {
        "Cycles": 0,
        "Agent": "Execution-CPU",
        "ProcessName": "Read",
        "TaskID": "D460B66A7A6FF255",
        "ParentEventID": [
          "F7A010B825B3AAA1"
        ],
        "Label": "set",
        "Title": "X-Trace Task",
        "Host": "pinky19.mpi-sws.org",
        "HRT": 26966636002596777,
        "Operation": "set",
        "Timestamp": "1557750275942.662842",
        "TenantClass": 0,
        "Source": "Client.java:1032",
        "ThreadID": 41,
        "ThreadName": "",
        "EventID": "1C0EBB5710C431E4",
        "ProcessID": 2801
      },
      {
        "Cycles": 0,
        "Agent": "Execution-CPU",
        "ProcessName": "Read",
        "TaskID": "D460B66A7A6FF255",
        "ParentEventID": [
          "A1B85FBC14363C4C"
        ],
        "Label": "unset",
        "Title": "X-Trace Task",
        "Host": "pinky19.mpi-sws.org",
        "Duration": "81448",
        "HRT": 26966636002698222,
        "Operation": "unset",
        "Timestamp": "1557750275942.764404",
        "TenantClass": 0,
        "Source": "Client.java:1062",
        "ThreadID": 41,
        "ThreadName": "",
        "EventID": "B7EBE0CB89E2FAD5",
        "ProcessID": 2801
      },
      {
        "Cycles": 0,
        "Agent": "Execution-CPU",
        "ProcessName": "Read",
        "TaskID": "D460B66A7A6FF255",
        "ParentEventID": [
          "B7EBE0CB89E2FAD5"
        ],
        "Label": "set",
        "Title": "X-Trace Task",
        "Host": "pinky19.mpi-sws.org",
        "HRT": 26966636002719361,
        "Operation": "set",
        "Timestamp": "1557750275942.785400",
        "TenantClass": 0,
        "Source": "Client.java:1104",
        "ThreadID": 1,
        "ThreadName": "",
        "EventID": "AD9F3DE56848945B",
        "ProcessID": 2801
      },
      {
        "Cycles": 0,
        "Agent": "Execution-CPU",
        "ProcessName": "Name",
        "TaskID": "D460B66A7A6FF255",
        "ParentEventID": [
          "A1B85FBC14363C4C"
        ],
        "Label": "set",
        "Title": "X-Trace Task",
        "Host": "pinky19.mpi-sws.org",
        "HRT": 26966636002765654,
        "Operation": "set",
        "Timestamp": "1557750275942.850098",
        "TenantClass": 0,
        "Source": "Server.java:1840",
        "ThreadID": 48,
        "ThreadName": "",
        "EventID": "D16998DF0B9E8A01",
        "BaggageBytes": "[[248 5] [240 0] [0 212 96 182 106 122 111 242 85] [240 1] [0 161 184 95 188 20 54 60 76] [240 3] [0 2]]",
        "ProcessID": 2171
      },
      {
        "Cycles": 0,
        "Agent": "edu.brown.cs.systems.xtrace.logging.BaggageWrappers",
        "ProcessName": "Name",
        "TaskID": "D460B66A7A6FF255",
        "ParentEventID": [
          "D16998DF0B9E8A01"
        ],
        "Label": "Forking current baggage with Baggage.fork()",
        "Title": "X-Trace Task",
        "Host": "pinky19.mpi-sws.org",
        "HRT": 26966636002796679,
        "Operation": "fork",
        "Timestamp": "1557750275942.881104",
        "TenantClass": 0,
        "Source": "Server.java:550",
        "ThreadID": 48,
        "ThreadName": "",
        "EventID": "7A41F138A22AAA10",
        "BaggageBytes": "[[248 5] [240 0] [0 212 96 182 106 122 111 242 85] [240 1] [0 209 105 152 223 11 158 138 1] [240 3] [0 2]]",
        "ProcessID": 2171
      },
      {
        "Cycles": 0,
        "Agent": "Execution-CPU",
        "ProcessName": "Name",
        "TaskID": "D460B66A7A6FF255",
        "ParentEventID": [
          "7A41F138A22AAA10"
        ],
        "Label": "unset",
        "Title": "X-Trace Task",
        "Host": "pinky19.mpi-sws.org",
        "Duration": "30804",
        "HRT": 26966636002823593,
        "Operation": "unset",
        "Timestamp": "1557750275942.908203",
        "TenantClass": 0,
        "Source": "Server.java:1828",
        "ThreadID": 48,
        "ThreadName": "",
        "EventID": "FF730FCED980A595",
        "BaggageBytes": "[[248 5] [240 0] [0 212 96 182 106 122 111 242 85] [240 1] [0 122 65 241 56 162 42 170 16] [240 3] [0 2]]",
        "ProcessID": 2171
      },
      {
        "Cycles": 0,
        "Agent": "Execution-CPU",
        "ProcessName": "Name",
        "TaskID": "D460B66A7A6FF255",
        "ParentEventID": [
          "7A41F138A22AAA10"
        ],
        "Label": "set",
        "Title": "X-Trace Task",
        "Host": "pinky19.mpi-sws.org",
        "HRT": 26966636002832273,
        "Operation": "set",
        "Timestamp": "1557750275942.916748",
        "TenantClass": 0,
        "Source": "Server.java:2071",
        "ThreadID": 59,
        "ThreadName": "",
        "EventID": "3B183F09385FB444",
        "BaggageBytes": "[[248 5] [240 0] [0 212 96 182 106 122 111 242 85] [240 1] [0 122 65 241 56 162 42 170 16] [240 3] [0 2]]",
        "ProcessID": 2171
      },
      {
        "Cycles": 0,
        "Agent": "org.apache.hadoop.ipc.Server",
        "ProcessName": "Name",
        "TaskID": "D460B66A7A6FF255",
        "ParentEventID": [
          "3B183F09385FB444"
        ],
        "Label": "getBlockLocations in org.apache.hadoop.hdfs.protocol.ClientProtocol",
        "Title": "X-Trace Task",
        "Host": "pinky19.mpi-sws.org",
        "HRT": 26966636002866564,
        "Timestamp": "1557750275942.951172",
        "TenantClass": 0,
        "Source": "ProtobufRpcEngine.java:601",
        "ThreadID": 59,
        "ThreadName": "",
        "EventID": "3E5077C7CF536433",
        "BaggageBytes": "[[248 5] [240 0] [0 212 96 182 106 122 111 242 85] [240 1] [0 59 24 63 9 56 95 180 68] [240 3] [0 2]]",
        "ProcessID": 2171
      },
      {
        "Cycles": 0,
        "Agent": "org.apache.hadoop.hdfs.server.namenode.FSNamesystem.audit",
        "ProcessName": "Name",
        "TaskID": "D460B66A7A6FF255",
        "ParentEventID": [
          "3E5077C7CF536433"
        ],
        "Label": "allowed=true\tugi=plascas (auth:SIMPLE)\tip=/139.19.171.63\tcmd=open\tsrc=/ds/OmW0OcbxTDflhesB\tdst=null\tperm=null\tproto=rpc",
        "Title": "X-Trace Task",
        "Host": "pinky19.mpi-sws.org",
        "HRT": 26966636002917225,
        "Timestamp": "1557750275943.001709",
        "TenantClass": 0,
        "Source": "FSNamesystem.java:8313",
        "ThreadID": 59,
        "ThreadName": "",
        "EventID": "80239571AFBE0145",
        "BaggageBytes": "[[248 5] [240 0] [0 212 96 182 106 122 111 242 85] [240 1] [0 62 80 119 199 207 83 100 51] [240 3] [0 2]]",
        "ProcessID": 2171
      },
      {
        "Cycles": 0,
        "Agent": "edu.brown.cs.systems.xtrace.logging.BaggageWrappers",
        "ProcessName": "Name",
        "TaskID": "D460B66A7A6FF255",
        "ParentEventID": [
          "80239571AFBE0145"
        ],
        "Label": "Forking current baggage with Baggage.fork()",
        "Title": "X-Trace Task",
        "Host": "pinky19.mpi-sws.org",
        "HRT": 26966636002980345,
        "Operation": "fork",
        "Timestamp": "1557750275943.064941",
        "TenantClass": 0,
        "Source": "Server.java:2398",
        "ThreadID": 59,
        "ThreadName": "",
        "EventID": "A14903BCF63339C3",
        "BaggageBytes": "[[248 5] [240 0] [0 212 96 182 106 122 111 242 85] [240 1] [0 128 35 149 113 175 190 1 69] [240 3] [0 2]]",
        "ProcessID": 2171
      },
      {
        "Cycles": 0,
        "Agent": "Execution-CPU",
        "ProcessName": "Name",
        "TaskID": "D460B66A7A6FF255",
        "ParentEventID": [
          "A14903BCF63339C3"
        ],
        "Label": "unset",
        "Title": "X-Trace Task",
        "Host": "pinky19.mpi-sws.org",
        "Duration": "263216",
        "HRT": 26966636003116952,
        "Operation": "unset",
        "Timestamp": "1557750275943.201416",
        "TenantClass": 0,
        "Source": "Server.java:1058",
        "ThreadID": 59,
        "ThreadName": "",
        "EventID": "6B8AE69AF7FF9C6C",
        "BaggageBytes": "[[248 5] [240 0] [0 212 96 182 106 122 111 242 85] [240 1] [0 161 73 3 188 246 51 57 195] [240 3] [0 2]]",
        "ProcessID": 2171
      },
      {
        "Cycles": 0,
        "Agent": "Execution-CPU",
        "ProcessName": "Read",
        "TaskID": "D460B66A7A6FF255",
        "ParentEventID": [
          "A14903BCF63339C3"
        ],
        "Label": "set",
        "Title": "X-Trace Task",
        "Host": "pinky19.mpi-sws.org",
        "HRT": 26966636003164348,
        "Operation": "set",
        "Timestamp": "1557750275943.230469",
        "TenantClass": 0,
        "Source": "Client.java:302",
        "ThreadID": 40,
        "ThreadName": "",
        "EventID": "5CF94BF682B44820",
        "ProcessID": 2801
      },
      {
        "Cycles": 0,
        "Agent": "Execution-CPU",
        "ProcessName": "Read",
        "TaskID": "D460B66A7A6FF255",
        "ParentEventID": [
          "5CF94BF682B44820"
        ],
        "Label": "unset",
        "Title": "X-Trace Task",
        "Host": "pinky19.mpi-sws.org",
        "Duration": "10887",
        "HRT": 26966636003192446,
        "Operation": "unset",
        "Timestamp": "1557750275943.258545",
        "TenantClass": 0,
        "Source": "Client.java:1168",
        "ThreadID": 40,
        "ThreadName": "",
        "EventID": "7EE5B61BA38FB4CC",
        "ProcessID": 2801
      },
      {
        "Cycles": 0,
        "Agent": "Execution-Sleep",
        "ProcessName": "Read",
        "TaskID": "D460B66A7A6FF255",
        "ParentEventID": [
          "AD9F3DE56848945B"
        ],
        "Label": "waited",
        "Title": "X-Trace Task",
        "Host": "pinky19.mpi-sws.org",
        "Duration": "486309",
        "HRT": 26966636003213781,
        "Operation": "waited",
        "Timestamp": "1557750275943.279785",
        "TenantClass": 0,
        "Source": "Client.java:1537",
        "ThreadID": 1,
        "ThreadName": "",
        "EventID": "730B08C5B4654C0D",
        "ProcessID": 2801
      },
      {
        "Cycles": 0,
        "Agent": "edu.brown.cs.systems.xtrace.logging.BaggageWrappers",
        "ProcessName": "Read",
        "TaskID": "D460B66A7A6FF255",
        "ParentEventID": [
          "7EE5B61BA38FB4CC",
          "730B08C5B4654C0D"
        ],
        "Label": "Merged current baggage with other baggage",
        "Title": "X-Trace Task",
        "Host": "pinky19.mpi-sws.org",
        "HRT": 26966636003226874,
        "Operation": "join",
        "Timestamp": "1557750275943.292969",
        "TenantClass": 0,
        "Source": "Client.java:1545",
        "ThreadID": 1,
        "ThreadName": "",
        "EventID": "C8C1630886A38DF7",
        "ProcessID": 2801
      },
      {
        "Cycles": 0,
        "Agent": "org.apache.hadoop.ipc.ProtobufRpcEngine",
        "ProcessName": "Read",
        "TaskID": "D460B66A7A6FF255",
        "ParentEventID": [
          "C8C1630886A38DF7"
        ],
        "Label": "org.apache.hadoop.hdfs.protocol.ClientProtocol.getBlockLocations completed",
        "Title": "X-Trace Task",
        "Host": "pinky19.mpi-sws.org",
        "HRT": 26966636003316462,
        "Timestamp": "1557750275943.382568",
        "TenantClass": 0,
        "Source": "ProtobufRpcEngine.java:275",
        "ThreadID": 1,
        "ThreadName": "",
        "EventID": "8F299B7EB24E8CD2",
        "ProcessID": 2801
      },
      {
        "Cycles": 0,
        "Agent": "Execution-Sleep",
        "ProcessName": "Read",
        "TaskID": "D460B66A7A6FF255",
        "ParentEventID": [
          "8F299B7EB24E8CD2"
        ],
        "Label": "waited",
        "Title": "X-Trace Task",
        "Host": "pinky19.mpi-sws.org",
        "Duration": "176440",
        "HRT": 26966636003690296,
        "Operation": "waited",
        "Timestamp": "1557750275943.756348",
        "TenantClass": 0,
        "Source": "SocketIOWithTimeout.java:335",
        "ThreadID": 1,
        "ThreadName": "",
        "EventID": "6C78C2D94920C103",
        "ProcessID": 2801
      },
      {
        "Cycles": 0,
        "Agent": "edu.brown.cs.systems.xtrace.logging.BaggageWrappers",
        "ProcessName": "Read",
        "TaskID": "D460B66A7A6FF255",
        "ParentEventID": [
          "6C78C2D94920C103"
        ],
        "Label": "Forking current baggage with Baggage.fork()",
        "Title": "X-Trace Task",
        "Host": "pinky19.mpi-sws.org",
        "HRT": 26966636003773282,
        "Operation": "fork",
        "Timestamp": "1557750275943.839355",
        "TenantClass": 0,
        "Source": "DataTransferProtoUtil.java:94",
        "ThreadID": 1,
        "ThreadName": "",
        "EventID": "22C6042516552E25",
        "ProcessID": 2801
      },
      {
        "Cycles": 0,
        "Agent": "Execution-CPU",
        "ProcessName": "Data",
        "TaskID": "D460B66A7A6FF255",
        "ParentEventID": [
          "22C6042516552E25"
        ],
        "Label": "set",
        "Title": "X-Trace Task",
        "Host": "pinky20.mpi-sws.org",
        "HRT": 6569840363403547,
        "Operation": "set",
        "Timestamp": "1557750275944.280762",
        "TenantClass": 0,
        "Source": "Receiver.java:117",
        "ThreadID": 14739,
        "ThreadName": "",
        "EventID": "3C237769870A360D",
        "BaggageBytes": "[[248 5] [240 0] [0 212 96 182 106 122 111 242 85] [240 1] [0 34 198 4 37 22 85 46 37] [240 3] [0 2]]",
        "ProcessID": 13111
      },
      {
        "Cycles": 0,
        "Agent": "edu.brown.cs.systems.xtrace.logging.XTraceInit",
        "ProcessName": "Data",
        "TaskID": "D460B66A7A6FF255",
        "ParentEventID": [
          "3C237769870A360D"
        ],
        "Label": "Thread.setName: DataXceiver for client DFSClient_NONMAPREDUCE_310321604_1 at /139.19.171.63:47078 [Sending block BP-1633380353-139.19.171.63-1554193446451:blk_1073757107_16283]",
        "Title": "X-Trace Task",
        "Host": "pinky20.mpi-sws.org",
        "HRT": 6569840363512640,
        "Timestamp": "1557750275944.389893",
        "TenantClass": 0,
        "Source": "DataXceiver.java:168",
        "ThreadID": 14739,
        "ThreadName": "",
        "EventID": "A144163E03CD65F9",
        "BaggageBytes": "[[248 5] [240 0] [0 212 96 182 106 122 111 242 85] [240 1] [0 60 35 119 105 135 10 54 13] [240 3] [0 2]]",
        "ProcessID": 13111
      },
      {
        "Cycles": 0,
        "Agent": "Execution-Sleep",
        "ProcessName": "Read",
        "TaskID": "D460B66A7A6FF255",
        "ParentEventID": [
          "22C6042516552E25"
        ],
        "Label": "waited",
        "Title": "X-Trace Task",
        "Host": "pinky19.mpi-sws.org",
        "Duration": "913624",
        "HRT": 26966636004794805,
        "Operation": "waited",
        "Timestamp": "1557750275944.860840",
        "TenantClass": 0,
        "Source": "SocketIOWithTimeout.java:335",
        "ThreadID": 1,
        "ThreadName": "",
        "EventID": "F35A834141EF959A",
        "ProcessID": 2801
      },
      {
        "Cycles": 0,
        "Agent": "edu.brown.cs.systems.xtrace.logging.BaggageWrappers",
        "ProcessName": "Data",
        "TaskID": "D460B66A7A6FF255",
        "ParentEventID": [
          "A144163E03CD65F9"
        ],
        "Label": "Forking current baggage with Baggage.fork()",
        "Title": "X-Trace Task",
        "Host": "pinky20.mpi-sws.org",
        "HRT": 6569840363730284,
        "Operation": "fork",
        "Timestamp": "1557750275944.607666",
        "TenantClass": 0,
        "Source": "DataXceiver.java:1257",
        "ThreadID": 14739,
        "ThreadName": "",
        "EventID": "4FDE459023A0DD2A",
        "BaggageBytes": "[[248 5] [240 0] [0 212 96 182 106 122 111 242 85] [240 1] [0 161 68 22 62 3 205 101 249] [240 3] [0 2]]",
        "ProcessID": 13111
      },
      {
        "Cycles": 0,
        "Agent": "edu.brown.cs.systems.xtrace.logging.BaggageWrappers",
        "ProcessName": "Data",
        "TaskID": "D460B66A7A6FF255",
        "ParentEventID": [
          "4FDE459023A0DD2A"
        ],
        "Label": "Forking current baggage with Baggage.fork()",
        "Title": "X-Trace Task",
        "Host": "pinky20.mpi-sws.org",
        "HRT": 6569840363892281,
        "Operation": "fork",
        "Timestamp": "1557750275944.769531",
        "TenantClass": 0,
        "Source": "PacketHeader.java:95",
        "ThreadID": 14739,
        "ThreadName": "",
        "EventID": "6A268BC85D12FBCE",
        "BaggageBytes": "[[248 5] [240 0] [0 212 96 182 106 122 111 242 85] [240 1] [0 79 222 69 144 35 160 221 42] [240 3] [0 2]]",
        "ProcessID": 13111
      },
      {
        "Cycles": 0,
        "Agent": "edu.brown.cs.systems.xtrace.logging.BaggageWrappers",
        "ProcessName": "Read",
        "TaskID": "D460B66A7A6FF255",
        "ParentEventID": [
          "F35A834141EF959A",
          "4FDE459023A0DD2A"
        ],
        "Label": "Merged current baggage with other baggage",
        "Title": "X-Trace Task",
        "Host": "pinky19.mpi-sws.org",
        "HRT": 26966636004866710,
        "Operation": "join",
        "Timestamp": "1557750275944.932861",
        "TenantClass": 0,
        "Source": "RemoteBlockReader2.java:429",
        "ThreadID": 1,
        "ThreadName": "",
        "EventID": "7CA0141FFF1EC013",
        "ProcessID": 2801
      },
      {
        "Cycles": 0,
        "Agent": "Execution-Sleep",
        "ProcessName": "Read",
        "TaskID": "D460B66A7A6FF255",
        "ParentEventID": [
          "7CA0141FFF1EC013"
        ],
        "Label": "waited",
        "Title": "X-Trace Task",
        "Host": "pinky19.mpi-sws.org",
        "Duration": "22600",
        "HRT": 26966636004932212,
        "Operation": "waited",
        "Timestamp": "1557750275944.998291",
        "TenantClass": 0,
        "Source": "SocketIOWithTimeout.java:335",
        "ThreadID": 1,
        "ThreadName": "",
        "EventID": "5A0F09C3501816E0",
        "ProcessID": 2801
      },
      {
        "Cycles": 0,
        "Agent": "Execution-Sleep",
        "ProcessName": "Data",
        "TaskID": "D460B66A7A6FF255",
        "ParentEventID": [
          "6A268BC85D12FBCE"
        ],
        "Label": "waited",
        "Title": "X-Trace Task",
        "Host": "pinky20.mpi-sws.org",
        "Duration": "14070",
        "HRT": 6569840364048838,
        "Operation": "waited",
        "Timestamp": "1557750275944.926025",
        "TenantClass": 0,
        "Source": "SocketIOWithTimeout.java:335",
        "ThreadID": 14739,
        "ThreadName": "",
        "EventID": "C0C81E275044379D",
        "BaggageBytes": "[[248 5] [240 0] [0 212 96 182 106 122 111 242 85] [240 1] [0 106 38 139 200 93 18 251 206] [240 3] [0 2]]",
        "ProcessID": 13111
      },
      {
        "Cycles": 0,
        "Agent": "edu.brown.cs.systems.retro.benchmarks.hdfs_client.Reader",
        "ProcessName": "Read",
        "TaskID": "D460B66A7A6FF255",
        "ParentEventID": [
          "0"
        ],
        "Label": "Reading file",
        "Title": "X-Trace Task",
        "Host": "pinky19.mpi-sws.org",
        "HRT": 26966636002459194,
        "Timestamp": "1557750275942.525146",
        "TenantClass": 0,
        "ThreadID": 1,
        "ThreadName": "",
        "EventID": "0E60B70FB46292DC",
        "ProcessID": 2801,
        "Tag": [
          "reader_100kb",
          "Read Size: 102400"
        ]
      },
      {
        "Cycles": 0,
        "Agent": "edu.brown.cs.systems.xtrace.logging.BaggageWrappers",
        "ProcessName": "Data",
        "TaskID": "D460B66A7A6FF255",
        "ParentEventID": [
          "C0C81E275044379D"
        ],
        "Label": "Forking current baggage with Baggage.fork()",
        "Title": "X-Trace Task",
        "Host": "pinky20.mpi-sws.org",
        "HRT": 6569840376110811,
        "Operation": "fork",
        "Timestamp": "1557750275956.988037",
        "TenantClass": 0,
        "Source": "PacketHeader.java:95",
        "ThreadID": 14739,
        "ThreadName": "",
        "EventID": "6849CBAC9832BA39",
        "BaggageBytes": "[[248 5] [240 0] [0 212 96 182 106 122 111 242 85] [240 1] [0 192 200 30 39 80 68 55 157] [240 3] [0 2]]",
        "ProcessID": 13111
      },
      {
        "Cycles": 0,
        "Agent": "Execution-Sleep",
        "ProcessName": "Read",
        "TaskID": "D460B66A7A6FF255",
        "ParentEventID": [
          "5A0F09C3501816E0"
        ],
        "Label": "waited",
        "Title": "X-Trace Task",
        "Host": "pinky19.mpi-sws.org",
        "Duration": "12250001",
        "HRT": 26966636017237021,
        "Operation": "waited",
        "Timestamp": "1557750275957.302979",
        "TenantClass": 0,
        "Source": "SocketIOWithTimeout.java:335",
        "ThreadID": 1,
        "ThreadName": "",
        "EventID": "4609FA1BC3B2A710",
        "ProcessID": 2801
      },
      {
        "Cycles": 0,
        "Agent": "Execution-Sleep",
        "ProcessName": "Read",
        "TaskID": "D460B66A7A6FF255",
        "ParentEventID": [
          "4609FA1BC3B2A710"
        ],
        "Label": "waited",
        "Title": "X-Trace Task",
        "Host": "pinky19.mpi-sws.org",
        "Duration": "219411",
        "HRT": 26966636017519995,
        "Operation": "waited",
        "Timestamp": "1557750275957.586182",
        "TenantClass": 0,
        "Source": "SocketIOWithTimeout.java:335",
        "ThreadID": 1,
        "ThreadName": "",
        "EventID": "DA43BC2FED868BA0",
        "ProcessID": 2801
      },
      {
        "Cycles": 0,
        "Agent": "Execution-Sleep",
        "ProcessName": "Read",
        "TaskID": "D460B66A7A6FF255",
        "ParentEventID": [
          "DA43BC2FED868BA0"
        ],
        "Label": "waited",
        "Title": "X-Trace Task",
        "Host": "pinky19.mpi-sws.org",
        "Duration": "131359",
        "HRT": 26966636017724848,
        "Operation": "waited",
        "Timestamp": "1557750275957.791016",
        "TenantClass": 0,
        "Source": "SocketIOWithTimeout.java:335",
        "ThreadID": 1,
        "ThreadName": "",
        "EventID": "EC7E282FF641714E",
        "ProcessID": 2801
      },
      {
        "Cycles": 0,
        "Agent": "edu.brown.cs.systems.xtrace.logging.BaggageWrappers",
        "ProcessName": "Read",
        "TaskID": "D460B66A7A6FF255",
        "ParentEventID": [
          "6A268BC85D12FBCE",
          "EC7E282FF641714E"
        ],
        "Label": "Merged current baggage with other baggage",
        "Title": "X-Trace Task",
        "Host": "pinky19.mpi-sws.org",
        "HRT": 26966636017796867,
        "Operation": "join",
        "Timestamp": "1557750275957.863037",
        "TenantClass": 0,
        "Source": "PacketHeader.java:168",
        "ThreadID": 1,
        "ThreadName": "",
        "EventID": "B1A3CD6D2BA2BDC8",
        "ProcessID": 2801
      },
      {
        "Cycles": 0,
        "Agent": "edu.brown.cs.systems.xtrace.logging.BaggageWrappers",
        "ProcessName": "Read",
        "TaskID": "D460B66A7A6FF255",
        "ParentEventID": [
          "6849CBAC9832BA39",
          "B1A3CD6D2BA2BDC8"
        ],
        "Label": "Merged current baggage with other baggage",
        "Title": "X-Trace Task",
        "Host": "pinky19.mpi-sws.org",
        "HRT": 26966636017916994,
        "Operation": "join",
        "Timestamp": "1557750275957.983154",
        "TenantClass": 0,
        "Source": "PacketHeader.java:168",
        "ThreadID": 1,
        "ThreadName": "",
        "EventID": "8F2AF843427BAD51",
        "ProcessID": 2801
      },
      {
        "Cycles": 0,
        "Agent": "edu.brown.cs.systems.xtrace.logging.BaggageWrappers",
        "ProcessName": "Read",
        "TaskID": "D460B66A7A6FF255",
        "ParentEventID": [
          "8F2AF843427BAD51"
        ],
        "Label": "Forking current baggage with Baggage.fork()",
        "Title": "X-Trace Task",
        "Host": "pinky19.mpi-sws.org",
        "HRT": 26966636017926897,
        "Operation": "fork",
        "Timestamp": "1557750275957.992920",
        "TenantClass": 0,
        "Source": "RemoteBlockReader2.java:361",
        "ThreadID": 1,
        "ThreadName": "",
        "EventID": "FA0A9278D0CFC517",
        "ProcessID": 2801
      },
      {
        "Cycles": 0,
        "Agent": "edu.brown.cs.systems.xtrace.logging.BaggageWrappers",
        "ProcessName": "Read",
        "TaskID": "D460B66A7A6FF255",
        "ParentEventID": [
          "FA0A9278D0CFC517"
        ],
        "Label": "Forking current baggage with Baggage.fork()",
        "Title": "X-Trace Task",
        "Host": "pinky19.mpi-sws.org",
        "HRT": 26966636017986197,
        "Operation": "fork",
        "Timestamp": "1557750275958.052246",
        "TenantClass": 0,
        "Source": "DataTransferProtoUtil.java:94",
        "ThreadID": 1,
        "ThreadName": "",
        "EventID": "5469B2AB186715C3",
        "ProcessID": 2801
      },
      {
        "Cycles": 0,
        "Agent": "Execution-Sleep",
        "ProcessName": "Data",
        "TaskID": "D460B66A7A6FF255",
        "ParentEventID": [
          "6849CBAC9832BA39"
        ],
        "Label": "waited",
        "Title": "X-Trace Task",
        "Host": "pinky20.mpi-sws.org",
        "Duration": "940235",
        "HRT": 6569840377152434,
        "Operation": "waited",
        "Timestamp": "1557750275958.029785",
        "TenantClass": 0,
        "Source": "SocketIOWithTimeout.java:335",
        "ThreadID": 14739,
        "ThreadName": "",
        "EventID": "E3FB6256DD1A0D6E",
        "BaggageBytes": "[[248 5] [240 0] [0 212 96 182 106 122 111 242 85] [240 1] [0 104 73 203 172 152 50 186 57] [240 3] [0 2]]",
        "ProcessID": 13111
      },
      {
        "Cycles": 0,
        "Agent": "edu.brown.cs.systems.xtrace.logging.BaggageWrappers",
        "ProcessName": "Data",
        "TaskID": "D460B66A7A6FF255",
        "ParentEventID": [
          "E3FB6256DD1A0D6E",
          "FA0A9278D0CFC517"
        ],
        "Label": "Merged current baggage with other baggage",
        "Title": "X-Trace Task",
        "Host": "pinky20.mpi-sws.org",
        "HRT": 6569840377440838,
        "Operation": "join",
        "Timestamp": "1557750275958.318115",
        "TenantClass": 0,
        "Source": "DataXceiver.java:574",
        "ThreadID": 14739,
        "ThreadName": "",
        "EventID": "7004BCE49A776C67",
        "BaggageBytes": "[[248 5] [240 0] [0 212 96 182 106 122 111 242 85] [240 1] [0 227 251 98 86 221 26 13 110] [0 250 10 146 120 208 207 197 23] [240 3] [0 2]]",
        "ProcessID": 13111
      },
      {
        "Cycles": 0,
        "Agent": "Execution-CPU",
        "ProcessName": "Data",
        "TaskID": "D460B66A7A6FF255",
        "ParentEventID": [
          "7004BCE49A776C67"
        ],
        "Label": "unset",
        "Title": "X-Trace Task",
        "Host": "pinky20.mpi-sws.org",
        "Duration": "14028088",
        "HRT": 6569840377505495,
        "Operation": "unset",
        "Timestamp": "1557750275958.382812",
        "TenantClass": 0,
        "Source": "DataXceiver.java:261",
        "ThreadID": 14739,
        "ThreadName": "",
        "EventID": "4537F7807EE6FC15",
        "BaggageBytes": "[[248 5] [240 0] [0 212 96 182 106 122 111 242 85] [240 1] [0 112 4 188 228 154 119 108 103] [240 3] [0 2]]",
        "ProcessID": 13111
      },
      {
        "Cycles": 0,
        "Agent": "Execution-CPU",
        "ProcessName": "Data",
        "TaskID": "D460B66A7A6FF255",
        "ParentEventID": [
          "5469B2AB186715C3"
        ],
        "Label": "set",
        "Title": "X-Trace Task",
        "Host": "pinky20.mpi-sws.org",
        "HRT": 6569840377584115,
        "Operation": "set",
        "Timestamp": "1557750275958.461426",
        "TenantClass": 0,
        "Source": "Receiver.java:117",
        "ThreadID": 14739,
        "ThreadName": "",
        "EventID": "58D3B3F956DFEA4D",
        "BaggageBytes": "[[248 5] [240 0] [0 212 96 182 106 122 111 242 85] [240 1] [0 84 105 178 171 24 103 21 195] [240 3] [0 2]]",
        "ProcessID": 13111
      },
      {
        "Cycles": 0,
        "Agent": "edu.brown.cs.systems.xtrace.logging.XTraceInit",
        "ProcessName": "Data",
        "TaskID": "D460B66A7A6FF255",
        "ParentEventID": [
          "58D3B3F956DFEA4D"
        ],
        "Label": "Thread.setName: DataXceiver for client DFSClient_NONMAPREDUCE_310321604_1 at /139.19.171.63:47078 [Sending block BP-1633380353-139.19.171.63-1554193446451:blk_1073757107_16283]",
        "Title": "X-Trace Task",
        "Host": "pinky20.mpi-sws.org",
        "HRT": 6569840377679442,
        "Timestamp": "1557750275958.556641",
        "TenantClass": 0,
        "Source": "DataXceiver.java:168",
        "ThreadID": 14739,
        "ThreadName": "",
        "EventID": "1CB76A7E0CC09274",
        "BaggageBytes": "[[248 5] [240 0] [0 212 96 182 106 122 111 242 85] [240 1] [0 88 211 179 249 86 223 234 77] [240 3] [0 2]]",
        "ProcessID": 13111
      },
      {
        "Cycles": 0,
        "Agent": "edu.brown.cs.systems.xtrace.logging.BaggageWrappers",
        "ProcessName": "Data",
        "TaskID": "D460B66A7A6FF255",
        "ParentEventID": [
          "1CB76A7E0CC09274"
        ],
        "Label": "Forking current baggage with Baggage.fork()",
        "Title": "X-Trace Task",
        "Host": "pinky20.mpi-sws.org",
        "HRT": 6569840377918202,
        "Operation": "fork",
        "Timestamp": "1557750275958.795410",
        "TenantClass": 0,
        "Source": "DataXceiver.java:1257",
        "ThreadID": 14739,
        "ThreadName": "",
        "EventID": "A43B91EA1CC417B4",
        "BaggageBytes": "[[248 5] [240 0] [0 212 96 182 106 122 111 242 85] [240 1] [0 28 183 106 126 12 192 146 116] [240 3] [0 2]]",
        "ProcessID": 13111
      },
      {
        "Cycles": 0,
        "Agent": "edu.brown.cs.systems.xtrace.logging.BaggageWrappers",
        "ProcessName": "Data",
        "TaskID": "D460B66A7A6FF255",
        "ParentEventID": [
          "A43B91EA1CC417B4"
        ],
        "Label": "Forking current baggage with Baggage.fork()",
        "Title": "X-Trace Task",
        "Host": "pinky20.mpi-sws.org",
        "HRT": 6569840378101536,
        "Operation": "fork",
        "Timestamp": "1557750275958.978760",
        "TenantClass": 0,
        "Source": "PacketHeader.java:95",
        "ThreadID": 14739,
        "ThreadName": "",
        "EventID": "8709832CEB30B807",
        "BaggageBytes": "[[248 5] [240 0] [0 212 96 182 106 122 111 242 85] [240 1] [0 164 59 145 234 28 196 23 180] [240 3] [0 2]]",
        "ProcessID": 13111
      },
      {
        "Cycles": 0,
        "Agent": "edu.brown.cs.systems.xtrace.logging.BaggageWrappers",
        "ProcessName": "Read",
        "TaskID": "D460B66A7A6FF255",
        "ParentEventID": [
          "A43B91EA1CC417B4",
          "2B17A3AE3D114914"
        ],
        "Label": "Merged current baggage with other baggage",
        "Title": "X-Trace Task",
        "Host": "pinky19.mpi-sws.org",
        "HRT": 26966636019068192,
        "Operation": "join",
        "Timestamp": "1557750275959.134277",
        "TenantClass": 0,
        "Source": "RemoteBlockReader2.java:429",
        "ThreadID": 1,
        "ThreadName": "",
        "EventID": "A24CDB16343A2684",
        "ProcessID": 2801
      },
      {
        "Cycles": 0,
        "Agent": "Execution-Sleep",
        "ProcessName": "Read",
        "TaskID": "D460B66A7A6FF255",
        "ParentEventID": [
          "5469B2AB186715C3"
        ],
        "Label": "waited",
        "Title": "X-Trace Task",
        "Host": "pinky19.mpi-sws.org",
        "Duration": "925551",
        "HRT": 26966636018995760,
        "Operation": "waited",
        "Timestamp": "1557750275959.061768",
        "TenantClass": 0,
        "Source": "SocketIOWithTimeout.java:335",
        "ThreadID": 1,
        "ThreadName": "",
        "EventID": "2B17A3AE3D114914",
        "ProcessID": 2801
      },
      {
        "Cycles": 0,
        "Agent": "Execution-Sleep",
        "ProcessName": "Read",
        "TaskID": "D460B66A7A6FF255",
        "ParentEventID": [
          "A24CDB16343A2684"
        ],
        "Label": "waited",
        "Title": "X-Trace Task",
        "Host": "pinky19.mpi-sws.org",
        "Duration": "25959",
        "HRT": 26966636019139353,
        "Operation": "waited",
        "Timestamp": "1557750275959.205322",
        "TenantClass": 0,
        "Source": "SocketIOWithTimeout.java:335",
        "ThreadID": 1,
        "ThreadName": "",
        "EventID": "010D4E45AE6E6E41",
        "ProcessID": 2801
      },
      {
        "Cycles": 0,
        "Agent": "Execution-Sleep",
        "ProcessName": "Data",
        "TaskID": "D460B66A7A6FF255",
        "ParentEventID": [
          "8709832CEB30B807"
        ],
        "Label": "waited",
        "Title": "X-Trace Task",
        "Host": "pinky20.mpi-sws.org",
        "Duration": "11937",
        "HRT": 6569840378263229,
        "Operation": "waited",
        "Timestamp": "1557750275959.140625",
        "TenantClass": 0,
        "Source": "SocketIOWithTimeout.java:335",
        "ThreadID": 14739,
        "ThreadName": "",
        "EventID": "26856D522EE24098",
        "BaggageBytes": "[[248 5] [240 0] [0 212 96 182 106 122 111 242 85] [240 1] [0 135 9 131 44 235 48 184 7] [240 3] [0 2]]",
        "ProcessID": 13111
      },
      {
        "Cycles": 0,
        "Agent": "Execution-Sleep",
        "ProcessName": "Read",
        "TaskID": "D460B66A7A6FF255",
        "ParentEventID": [
          "010D4E45AE6E6E41"
        ],
        "Label": "waited",
        "Title": "X-Trace Task",
        "Host": "pinky19.mpi-sws.org",
        "Duration": "367747",
        "HRT": 26966636019568854,
        "Operation": "waited",
        "Timestamp": "1557750275959.635010",
        "TenantClass": 0,
        "Source": "SocketIOWithTimeout.java:335",
        "ThreadID": 1,
        "ThreadName": "",
        "EventID": "E1CBE7AD0BB36F05",
        "ProcessID": 2801
      },
      {
        "Cycles": 0,
        "Agent": "edu.brown.cs.systems.xtrace.logging.BaggageWrappers",
        "ProcessName": "Data",
        "TaskID": "D460B66A7A6FF255",
        "ParentEventID": [
          "26856D522EE24098"
        ],
        "Label": "Forking current baggage with Baggage.fork()",
        "Title": "X-Trace Task",
        "Host": "pinky20.mpi-sws.org",
        "HRT": 6569840378463790,
        "Operation": "fork",
        "Timestamp": "1557750275959.341064",
        "TenantClass": 0,
        "Source": "PacketHeader.java:95",
        "ThreadID": 14739,
        "ThreadName": "",
        "EventID": "CC280C2F35CBD359",
        "BaggageBytes": "[[248 5] [240 0] [0 212 96 182 106 122 111 242 85] [240 1] [0 38 133 109 82 46 226 64 152] [240 3] [0 2]]",
        "ProcessID": 13111
      },
      {
        "Cycles": 0,
        "Agent": "Execution-Sleep",
        "ProcessName": "Read",
        "TaskID": "D460B66A7A6FF255",
        "ParentEventID": [
          "E1CBE7AD0BB36F05"
        ],
        "Label": "waited",
        "Title": "X-Trace Task",
        "Host": "pinky19.mpi-sws.org",
        "Duration": "177714",
        "HRT": 26966636019794714,
        "Operation": "waited",
        "Timestamp": "1557750275959.860840",
        "TenantClass": 0,
        "Source": "SocketIOWithTimeout.java:335",
        "ThreadID": 1,
        "ThreadName": "",
        "EventID": "3C661A207279E291",
        "ProcessID": 2801
      },
      {
        "Cycles": 0,
        "Agent": "Execution-Sleep",
        "ProcessName": "Read",
        "TaskID": "D460B66A7A6FF255",
        "ParentEventID": [
          "3C661A207279E291"
        ],
        "Label": "waited",
        "Title": "X-Trace Task",
        "Host": "pinky19.mpi-sws.org",
        "Duration": "85148",
        "HRT": 26966636019925305,
        "Operation": "waited",
        "Timestamp": "1557750275959.991455",
        "TenantClass": 0,
        "Source": "SocketIOWithTimeout.java:335",
        "ThreadID": 1,
        "ThreadName": "",
        "EventID": "E3D0C675AAE335D6",
        "ProcessID": 2801
      },
      {
        "Cycles": 0,
        "Agent": "edu.brown.cs.systems.xtrace.logging.BaggageWrappers",
        "ProcessName": "Read",
        "TaskID": "D460B66A7A6FF255",
        "ParentEventID": [
          "E3D0C675AAE335D6",
          "8709832CEB30B807"
        ],
        "Label": "Merged current baggage with other baggage",
        "Title": "X-Trace Task",
        "Host": "pinky19.mpi-sws.org",
        "HRT": 26966636019966932,
        "Operation": "join",
        "Timestamp": "1557750275960.032959",
        "TenantClass": 0,
        "Source": "PacketHeader.java:168",
        "ThreadID": 1,
        "ThreadName": "",
        "EventID": "F11667C3BCE9BD16",
        "ProcessID": 2801
      },
      {
        "Cycles": 0,
        "Agent": "Execution-Sleep",
        "ProcessName": "Data",
        "TaskID": "D460B66A7A6FF255",
        "ParentEventID": [
          "CC280C2F35CBD359"
        ],
        "Label": "waited",
        "Title": "X-Trace Task",
        "Host": "pinky20.mpi-sws.org",
        "Duration": "181860",
        "HRT": 6569840378765370,
        "Operation": "waited",
        "Timestamp": "1557750275959.642578",
        "TenantClass": 0,
        "Source": "SocketIOWithTimeout.java:335",
        "ThreadID": 14739,
        "ThreadName": "",
        "EventID": "AD2929C8AAF566B3",
        "BaggageBytes": "[[248 5] [240 0] [0 212 96 182 106 122 111 242 85] [240 1] [0 204 40 12 47 53 203 211 89] [240 3] [0 2]]",
        "ProcessID": 13111
      },
      {
        "Cycles": 0,
        "Agent": "edu.brown.cs.systems.xtrace.logging.BaggageWrappers",
        "ProcessName": "Data",
        "TaskID": "D460B66A7A6FF255",
        "ParentEventID": [
          "AD2929C8AAF566B3"
        ],
        "Label": "Forking current baggage with Baggage.fork()",
        "Title": "X-Trace Task",
        "Host": "pinky20.mpi-sws.org",
        "HRT": 6569840378966740,
        "Operation": "fork",
        "Timestamp": "1557750275959.843994",
        "TenantClass": 0,
        "Source": "PacketHeader.java:95",
        "ThreadID": 14739,
        "ThreadName": "",
        "EventID": "E098D2EBC25E63B9",
        "BaggageBytes": "[[248 5] [240 0] [0 212 96 182 106 122 111 242 85] [240 1] [0 173 41 41 200 170 245 102 179] [240 3] [0 2]]",
        "ProcessID": 13111
      },
      {
        "Cycles": 0,
        "Agent": "Execution-Sleep",
        "ProcessName": "Data",
        "TaskID": "D460B66A7A6FF255",
        "ParentEventID": [
          "E098D2EBC25E63B9"
        ],
        "Label": "waited",
        "Title": "X-Trace Task",
        "Host": "pinky20.mpi-sws.org",
        "Duration": "9954",
        "HRT": 6569840379127461,
        "Operation": "waited",
        "Timestamp": "1557750275960.004639",
        "TenantClass": 0,
        "Source": "SocketIOWithTimeout.java:335",
        "ThreadID": 14739,
        "ThreadName": "",
        "EventID": "1B3FA189D2EA5453",
        "BaggageBytes": "[[248 5] [240 0] [0 212 96 182 106 122 111 242 85] [240 1] [0 224 152 210 235 194 94 99 185] [240 3] [0 2]]",
        "ProcessID": 13111
      },
      {
        "Cycles": 0,
        "Agent": "Execution-CPU",
        "ProcessName": "Data",
        "TaskID": "D460B66A7A6FF255",
        "ParentEventID": [
          "1B3FA189D2EA5453"
        ],
        "Label": "unset",
        "Title": "X-Trace Task",
        "Host": "pinky20.mpi-sws.org",
        "Duration": "2015887",
        "HRT": 6569840379670491,
        "Operation": "unset",
        "Timestamp": "1557750275960.547852",
        "TenantClass": 0,
        "Source": "DataXceiver.java:261",
        "ThreadID": 14739,
        "ThreadName": "",
        "EventID": "736123D959EE022D",
        "BaggageBytes": "[[248 5] [240 0] [0 212 96 182 106 122 111 242 85] [240 1] [0 27 63 161 137 210 234 84 83] [240 3] [0 2]]",
        "ProcessID": 13111
      }
    ]
  }
]