[
  {
    "id": "2C46DC213B10CF20",
    "reports": [
      {
        "Cycles": 0,
        "Agent": "edu.brown.cs.systems.retro.benchmarks.hdfs_client.Reader",
        "ProcessName": "Read",
        "TaskID": "2C46DC213B10CF20",
        "ParentEventID": [
          "BE2A1A41DE8437F6"
        ],
        "Label": "Reading file",
        "Title": "X-Trace Task",
        "Host": "pinky19.mpi-sws.org",
        "HRT": 26966720956136225,
        "Timestamp": "1557750360896.575195",
        "TenantClass": 0,
        "ThreadID": 1,
        "ThreadName": "",
        "EventID": "F2EE1DB0C29AC716",
        "ProcessID": 2801
      },
      {
        "Cycles": 0,
        "Agent": "Execution-CPU",
        "ProcessName": "Read",
        "TaskID": "2C46DC213B10CF20",
        "ParentEventID": [
          "928FAF7F4161C743"
        ],
        "Label": "set",
        "Title": "X-Trace Task",
        "Host": "pinky19.mpi-sws.org",
        "HRT": 26966720956194293,
        "Operation": "set",
        "Timestamp": "1557750360896.633301",
        "TenantClass": 0,
        "Source": "Client.java:1032",
        "ThreadID": 41,
        "ThreadName": "",
        "EventID": "11FF7DC7CC2F9BD9",
        "ProcessID": 2801
      },
      {
        "Cycles": 0,
        "Agent": "edu.brown.cs.systems.xtrace.logging.BaggageWrappers",
        "ProcessName": "Read",
        "TaskID": "2C46DC213B10CF20",
        "ParentEventID": [
          "11FF7DC7CC2F9BD9"
        ],
        "Label": "Forking current baggage with Baggage.fork()",
        "Title": "X-Trace Task",
        "Host": "pinky19.mpi-sws.org",
        "HRT": 26966720956206989,
        "Operation": "fork",
        "Timestamp": "1557750360896.645996",
        "TenantClass": 0,
        "Source": "Client.java:1043",
        "ThreadID": 41,
        "ThreadName": "",
        "EventID": "86B3696D9714C41B",
        "ProcessID": 2801
      },
      {
        "Cycles": 0,
        "Agent": "org.apache.hadoop.ipc.ProtobufRpcEngine",
        "ProcessName": "Read",
        "TaskID": "2C46DC213B10CF20",
        "ParentEventID": [
          "F2EE1DB0C29AC716"
        ],
        "Label": "Invoking org.apache.hadoop.hdfs.protocol.ClientProtocol.getBlockLocations",
        "Title": "X-Trace Task",
        "Host": "pinky19.mpi-sws.org",
        "HRT": 26966720956160641,
        "Timestamp": "1557750360896.599609",
        "TenantClass": 0,
        "Source": "ProtobufRpcEngine.java:228",
        "ThreadID": 1,
        "ThreadName": "",
        "EventID": "39AC363C7FD32650",
        "ProcessID": 2801
      },
      {
        "Cycles": 0,
        "Agent": "Execution-CPU",
        "ProcessName": "Read",
        "TaskID": "2C46DC213B10CF20",
        "ParentEventID": [
          "39AC363C7FD32650"
        ],
        "Label": "unset",
        "Title": "X-Trace Task",
        "Host": "pinky19.mpi-sws.org",
        "Duration": "24666150",
        "HRT": 26966720956175584,
        "Operation": "unset",
        "Timestamp": "1557750360896.614502",
        "TenantClass": 0,
        "Source": "Client.java:1027",
        "ThreadID": 1,
        "ThreadName": "",
        "EventID": "928FAF7F4161C743",
        "ProcessID": 2801
      },
      {
        "Cycles": 0,
        "Agent": "Execution-CPU",
        "ProcessName": "Read",
        "TaskID": "2C46DC213B10CF20",
        "ParentEventID": [
          "86B3696D9714C41B"
        ],
        "Label": "unset",
        "Title": "X-Trace Task",
        "Host": "pinky19.mpi-sws.org",
        "Duration": "56054",
        "HRT": 26966720956263142,
        "Operation": "unset",
        "Timestamp": "1557750360896.702148",
        "TenantClass": 0,
        "Source": "Client.java:1062",
        "ThreadID": 41,
        "ThreadName": "",
        "EventID": "3DAFD9DE6D1FDA8C",
        "ProcessID": 2801
      },
      {
        "Cycles": 0,
        "Agent": "Execution-CPU",
        "ProcessName": "Name",
        "TaskID": "2C46DC213B10CF20",
        "ParentEventID": [
          "86B3696D9714C41B"
        ],
        "Label": "set",
        "Title": "X-Trace Task",
        "Host": "pinky19.mpi-sws.org",
        "HRT": 26966720956342202,
        "Operation": "set",
        "Timestamp": "1557750360896.809814",
        "TenantClass": 0,
        "Source": "Server.java:1840",
        "ThreadID": 48,
        "ThreadName": "",
        "EventID": "A6C254AF70C84000",
        "BaggageBytes": "[[248 5] [240 0] [0 44 70 220 33 59 16 207 32] [240 1] [0 134 179 105 109 151 20 196 27] [240 3] [0 2]]",
        "ProcessID": 2171
      },
      {
        "Cycles": 0,
        "Agent": "edu.brown.cs.systems.xtrace.logging.BaggageWrappers",
        "ProcessName": "Name",
        "TaskID": "2C46DC213B10CF20",
        "ParentEventID": [
          "A6C254AF70C84000"
        ],
        "Label": "Forking current baggage with Baggage.fork()",
        "Title": "X-Trace Task",
        "Host": "pinky19.mpi-sws.org",
        "HRT": 26966720956373928,
        "Operation": "fork",
        "Timestamp": "1557750360896.841553",
        "TenantClass": 0,
        "Source": "Server.java:550",
        "ThreadID": 48,
        "ThreadName": "",
        "EventID": "9F17D9547E2C6CC6",
        "BaggageBytes": "[[248 5] [240 0] [0 44 70 220 33 59 16 207 32] [240 1] [0 166 194 84 175 112 200 64 0] [240 3] [0 2]]",
        "ProcessID": 2171
      },
      {
        "Cycles": 0,
        "Agent": "Execution-CPU",
        "ProcessName": "Read",
        "TaskID": "2C46DC213B10CF20",
        "ParentEventID": [
          "3DAFD9DE6D1FDA8C"
        ],
        "Label": "set",
        "Title": "X-Trace Task",
        "Host": "pinky19.mpi-sws.org",
        "HRT": 26966720956280236,
        "Operation": "set",
        "Timestamp": "1557750360896.719238",
        "TenantClass": 0,
        "Source": "Client.java:1104",
        "ThreadID": 1,
        "ThreadName": "",
        "EventID": "4B77042A691C1DAF",
        "ProcessID": 2801
      },
      {
        "Cycles": 0,
        "Agent": "Execution-CPU",
        "ProcessName": "Name",
        "TaskID": "2C46DC213B10CF20",
        "ParentEventID": [
          "9F17D9547E2C6CC6"
        ],
        "Label": "unset",
        "Title": "X-Trace Task",
        "Host": "pinky19.mpi-sws.org",
        "Duration": "25154",
        "HRT": 26966720956394927,
        "Operation": "unset",
        "Timestamp": "1557750360896.862549",
        "TenantClass": 0,
        "Source": "Server.java:1828",
        "ThreadID": 48,
        "ThreadName": "",
        "EventID": "F8C37CBC5C831778",
        "BaggageBytes": "[[248 5] [240 0] [0 44 70 220 33 59 16 207 32] [240 1] [0 159 23 217 84 126 44 108 198] [240 3] [0 2]]",
        "ProcessID": 2171
      },
      {
        "Cycles": 0,
        "Agent": "org.apache.hadoop.ipc.Server",
        "ProcessName": "Name",
        "TaskID": "2C46DC213B10CF20",
        "ParentEventID": [
          "A8BBFBFB58F344AE"
        ],
        "Label": "getBlockLocations in org.apache.hadoop.hdfs.protocol.ClientProtocol",
        "Title": "X-Trace Task",
        "Host": "pinky19.mpi-sws.org",
        "HRT": 26966720956448938,
        "Timestamp": "1557750360896.916748",
        "TenantClass": 0,
        "Source": "ProtobufRpcEngine.java:601",
        "ThreadID": 55,
        "ThreadName": "",
        "EventID": "FEC729E1487E8593",
        "BaggageBytes": "[[248 5] [240 0] [0 44 70 220 33 59 16 207 32] [240 1] [0 168 187 251 251 88 243 68 174] [240 3] [0 2]]",
        "ProcessID": 2171
      },
      {
        "Cycles": 0,
        "Agent": "org.apache.hadoop.hdfs.server.namenode.FSNamesystem.audit",
        "ProcessName": "Name",
        "TaskID": "2C46DC213B10CF20",
        "ParentEventID": [
          "FEC729E1487E8593"
        ],
        "Label": "allowed=true\tugi=plascas (auth:SIMPLE)\tip=/139.19.171.63\tcmd=open\tsrc=/ds/INdpjZ4OvDAndK1j\tdst=null\tperm=null\tproto=rpc",
        "Title": "X-Trace Task",
        "Host": "pinky19.mpi-sws.org",
        "HRT": 26966720956511396,
        "Timestamp": "1557750360896.979004",
        "TenantClass": 0,
        "Source": "FSNamesystem.java:8313",
        "ThreadID": 55,
        "ThreadName": "",
        "EventID": "46197AF77ABF3D9B",
        "BaggageBytes": "[[248 5] [240 0] [0 44 70 220 33 59 16 207 32] [240 1] [0 254 199 41 225 72 126 133 147] [240 3] [0 2]]",
        "ProcessID": 2171
      },
      {
        "Cycles": 0,
        "Agent": "Execution-CPU",
        "ProcessName": "Name",
        "TaskID": "2C46DC213B10CF20",
        "ParentEventID": [
          "9F17D9547E2C6CC6"
        ],
        "Label": "set",
        "Title": "X-Trace Task",
        "Host": "pinky19.mpi-sws.org",
        "HRT": 26966720956406338,
        "Operation": "set",
        "Timestamp": "1557750360896.874023",
        "TenantClass": 0,
        "Source": "Server.java:2071",
        "ThreadID": 55,
        "ThreadName": "",
        "EventID": "A8BBFBFB58F344AE",
        "BaggageBytes": "[[248 5] [240 0] [0 44 70 220 33 59 16 207 32] [240 1] [0 159 23 217 84 126 44 108 198] [240 3] [0 2]]",
        "ProcessID": 2171
      },
      {
        "Cycles": 0,
        "Agent": "edu.brown.cs.systems.xtrace.logging.BaggageWrappers",
        "ProcessName": "Name",
        "TaskID": "2C46DC213B10CF20",
        "ParentEventID": [
          "46197AF77ABF3D9B"
        ],
        "Label": "Forking current baggage with Baggage.fork()",
        "Title": "X-Trace Task",
        "Host": "pinky19.mpi-sws.org",
        "HRT": 26966720956565591,
        "Operation": "fork",
        "Timestamp": "1557750360897.033203",
        "TenantClass": 0,
        "Source": "Server.java:2398",
        "ThreadID": 55,
        "ThreadName": "",
        "EventID": "A47AA1AF54386C47",
        "BaggageBytes": "[[248 5] [240 0] [0 44 70 220 33 59 16 207 32] [240 1] [0 70 25 122 247 122 191 61 155] [240 3] [0 2]]",
        "ProcessID": 2171
      },
      {
        "Cycles": 0,
        "Agent": "Execution-CPU",
        "ProcessName": "Read",
        "TaskID": "2C46DC213B10CF20",
        "ParentEventID": [
          "A47AA1AF54386C47"
        ],
        "Label": "set",
        "Title": "X-Trace Task",
        "Host": "pinky19.mpi-sws.org",
        "HRT": 26966720956757811,
        "Operation": "set",
        "Timestamp": "1557750360897.196777",
        "TenantClass": 0,
        "Source": "Client.java:302",
        "ThreadID": 40,
        "ThreadName": "",
        "EventID": "4C624CE84F636C64",
        "ProcessID": 2801
      },
      {
        "Cycles": 0,
        "Agent": "Execution-CPU",
        "ProcessName": "Read",
        "TaskID": "2C46DC213B10CF20",
        "ParentEventID": [
          "4C624CE84F636C64"
        ],
        "Label": "unset",
        "Title": "X-Trace Task",
        "Host": "pinky19.mpi-sws.org",
        "Duration": "5058",
        "HRT": 26966720956777550,
        "Operation": "unset",
        "Timestamp": "1557750360897.216553",
        "TenantClass": 0,
        "Source": "Client.java:1168",
        "ThreadID": 40,
        "ThreadName": "",
        "EventID": "6BDA338FA4E6B43F",
        "ProcessID": 2801
      },
      {
        "Cycles": 0,
        "Agent": "Execution-CPU",
        "ProcessName": "Name",
        "TaskID": "2C46DC213B10CF20",
        "ParentEventID": [
          "A47AA1AF54386C47"
        ],
        "Label": "unset",
        "Title": "X-Trace Task",
        "Host": "pinky19.mpi-sws.org",
        "Duration": "272312",
        "HRT": 26966720956707217,
        "Operation": "unset",
        "Timestamp": "1557750360897.174805",
        "TenantClass": 0,
        "Source": "Server.java:1058",
        "ThreadID": 55,
        "ThreadName": "",
        "EventID": "10FF1206FB5D2243",
        "BaggageBytes": "[[248 5] [240 0] [0 44 70 220 33 59 16 207 32] [240 1] [0 164 122 161 175 84 56 108 71] [240 3] [0 2]]",
        "ProcessID": 2171
      },
      {
        "Cycles": 0,
        "Agent": "Execution-Sleep",
        "ProcessName": "Read",
        "TaskID": "2C46DC213B10CF20",
        "ParentEventID": [
          "4B77042A691C1DAF"
        ],
        "Label": "waited",
        "Title": "X-Trace Task",
        "Host": "pinky19.mpi-sws.org",
        "Duration": "507964",
        "HRT": 26966720956794982,
        "Operation": "waited",
        "Timestamp": "1557750360897.233887",
        "TenantClass": 0,
        "Source": "Client.java:1537",
        "ThreadID": 1,
        "ThreadName": "",
        "EventID": "7293ADCADEDE5C0D",
        "ProcessID": 2801
      },
      {
        "Cycles": 0,
        "Agent": "org.apache.hadoop.ipc.ProtobufRpcEngine",
        "ProcessName": "Read",
        "TaskID": "2C46DC213B10CF20",
        "ParentEventID": [
          "B7C7834D171B3214"
        ],
        "Label": "org.apache.hadoop.hdfs.protocol.ClientProtocol.getBlockLocations completed",
        "Title": "X-Trace Task",
        "Host": "pinky19.mpi-sws.org",
        "HRT": 26966720956840438,
        "Timestamp": "1557750360897.279541",
        "TenantClass": 0,
        "Source": "ProtobufRpcEngine.java:275",
        "ThreadID": 1,
        "ThreadName": "",
        "EventID": "19598F27B632C4DE",
        "ProcessID": 2801
      },
      {
        "Cycles": 0,
        "Agent": "Execution-Sleep",
        "ProcessName": "Read",
        "TaskID": "2C46DC213B10CF20",
        "ParentEventID": [
          "19598F27B632C4DE"
        ],
        "Label": "waited",
        "Title": "X-Trace Task",
        "Host": "pinky19.mpi-sws.org",
        "Duration": "168206",
        "HRT": 26966720957083436,
        "Operation": "waited",
        "Timestamp": "1557750360897.522461",
        "TenantClass": 0,
        "Source": "SocketIOWithTimeout.java:335",
        "ThreadID": 1,
        "ThreadName": "",
        "EventID": "4CBBD9C3FCB39E8C",
        "ProcessID": 2801
      },
      {
        "Cycles": 0,
        "Agent": "edu.brown.cs.systems.xtrace.logging.BaggageWrappers",
        "ProcessName": "Read",
        "TaskID": "2C46DC213B10CF20",
        "ParentEventID": [
          "6BDA338FA4E6B43F",
          "7293ADCADEDE5C0D"
        ],
        "Label": "Merged current baggage with other baggage",
        "Title": "X-Trace Task",
        "Host": "pinky19.mpi-sws.org",
        "HRT": 26966720956805624,
        "Operation": "join",
        "Timestamp": "1557750360897.244629",
        "TenantClass": 0,
        "Source": "Client.java:1545",
        "ThreadID": 1,
        "ThreadName": "",
        "EventID": "B7C7834D171B3214",
        "ProcessID": 2801
      },
      {
        "Cycles": 0,
        "Agent": "edu.brown.cs.systems.xtrace.logging.BaggageWrappers",
        "ProcessName": "Read",
        "TaskID": "2C46DC213B10CF20",
        "ParentEventID": [
          "4CBBD9C3FCB39E8C"
        ],
        "Label": "Forking current baggage with Baggage.fork()",
        "Title": "X-Trace Task",
        "Host": "pinky19.mpi-sws.org",
        "HRT": 26966720957121083,
        "Operation": "fork",
        "Timestamp": "1557750360897.560059",
        "TenantClass": 0,
        "Source": "DataTransferProtoUtil.java:94",
        "ThreadID": 1,
        "ThreadName": "",
        "EventID": "5BB3D6DE6E4EEE05",
        "ProcessID": 2801
      },
      {
        "Cycles": 0,
        "Agent": "edu.brown.cs.systems.xtrace.logging.XTraceInit",
        "ProcessName": "Data",
        "TaskID": "2C46DC213B10CF20",
        "ParentEventID": [
          "8DD10E8A84FD1586"
        ],
        "Label": "Thread.setName: DataXceiver for client DFSClient_NONMAPREDUCE_310321604_1 at /139.19.171.63:53384 [Sending block BP-1633380353-139.19.171.63-1554193446451:blk_1073766107_25283]",
        "Title": "X-Trace Task",
        "Host": "pinky20.mpi-sws.org",
        "HRT": 6569925316640488,
        "Timestamp": "1557750360897.890137",
        "TenantClass": 0,
        "Source": "DataXceiver.java:168",
        "ThreadID": 15098,
        "ThreadName": "",
        "EventID": "D45E12E86B5D5743",
        "BaggageBytes": "[[248 5] [240 0] [0 44 70 220 33 59 16 207 32] [240 1] [0 141 209 14 138 132 253 21 134] [240 3] [0 2]]",
        "ProcessID": 13111
      },
      {
        "Cycles": 0,
        "Agent": "Execution-CPU",
        "ProcessName": "Data",
        "TaskID": "2C46DC213B10CF20",
        "ParentEventID": [
          "5BB3D6DE6E4EEE05"
        ],
        "Label": "set",
        "Title": "X-Trace Task",
        "Host": "pinky20.mpi-sws.org",
        "HRT": 6569925316599243,
        "Operation": "set",
        "Timestamp": "1557750360897.848877",
        "TenantClass": 0,
        "Source": "Receiver.java:117",
        "ThreadID": 15098,
        "ThreadName": "",
        "EventID": "8DD10E8A84FD1586",
        "BaggageBytes": "[[248 5] [240 0] [0 44 70 220 33 59 16 207 32] [240 1] [0 91 179 214 222 110 78 238 5] [240 3] [0 2]]",
        "ProcessID": 13111
      },
      {
        "Cycles": 0,
        "Agent": "edu.brown.cs.systems.xtrace.logging.BaggageWrappers",
        "ProcessName": "Data",
        "TaskID": "2C46DC213B10CF20",
        "ParentEventID": [
          "D45E12E86B5D5743"
        ],
        "Label": "Forking current baggage with Baggage.fork()",
        "Title": "X-Trace Task",
        "Host": "pinky20.mpi-sws.org",
        "HRT": 6569925316725088,
        "Operation": "fork",
        "Timestamp": "1557750360897.974609",
        "TenantClass": 0,
        "Source": "DataXceiver.java:1257",
        "ThreadID": 15098,
        "ThreadName": "",
        "EventID": "C127573A49505680",
        "BaggageBytes": "[[248 5] [240 0] [0 44 70 220 33 59 16 207 32] [240 1] [0 212 94 18 232 107 93 87 67] [240 3] [0 2]]",
        "ProcessID": 13111
      },
      {
        "Cycles": 0,
        "Agent": "edu.brown.cs.systems.xtrace.logging.BaggageWrappers",
        "ProcessName": "Data",
        "TaskID": "2C46DC213B10CF20",
        "ParentEventID": [
          "C127573A49505680"
        ],
        "Label": "Forking current baggage with Baggage.fork()",
        "Title": "X-Trace Task",
        "Host": "pinky20.mpi-sws.org",
        "HRT": 6569925316788330,
        "Operation": "fork",
        "Timestamp": "1557750360898.038086",
        "TenantClass": 0,
        "Source": "PacketHeader.java:95",
        "ThreadID": 15098,
        "ThreadName": "",
        "EventID": "4431E584DE261AD4",
        "BaggageBytes": "[[248 5] [240 0] [0 44 70 220 33 59 16 207 32] [240 1] [0 193 39 87 58 73 80 86 128] [240 3] [0 2]]",
        "ProcessID": 13111
      },
      {
        "Cycles": 0,
        "Agent": "Execution-Sleep",
        "ProcessName": "Read",
        "TaskID": "2C46DC213B10CF20",
        "ParentEventID": [
          "5BB3D6DE6E4EEE05"
        ],
        "Label": "waited",
        "Title": "X-Trace Task",
        "Host": "pinky19.mpi-sws.org",
        "Duration": "469175",
        "HRT": 26966720957680055,
        "Operation": "waited",
        "Timestamp": "1557750360898.119141",
        "TenantClass": 0,
        "Source": "SocketIOWithTimeout.java:335",
        "ThreadID": 1,
        "ThreadName": "",
        "EventID": "CDA8C53574D68E76",
        "ProcessID": 2801
      },
      {
        "Cycles": 0,
        "Agent": "edu.brown.cs.systems.xtrace.logging.BaggageWrappers",
        "ProcessName": "Read",
        "TaskID": "2C46DC213B10CF20",
        "ParentEventID": [
          "C127573A49505680",
          "CDA8C53574D68E76"
        ],
        "Label": "Merged current baggage with other baggage",
        "Title": "X-Trace Task",
        "Host": "pinky19.mpi-sws.org",
        "HRT": 26966720957738487,
        "Operation": "join",
        "Timestamp": "1557750360898.177490",
        "TenantClass": 0,
        "Source": "RemoteBlockReader2.java:429",
        "ThreadID": 1,
        "ThreadName": "",
        "EventID": "06E1C9D2FBE56503",
        "ProcessID": 2801
      },
      {
        "Cycles": 0,
        "Agent": "edu.brown.cs.systems.xtrace.logging.BaggageWrappers",
        "ProcessName": "Data",
        "TaskID": "2C46DC213B10CF20",
        "ParentEventID": [
          "01DD81F5996F626E"
        ],
        "Label": "Forking current baggage with Baggage.fork()",
        "Title": "X-Trace Task",
        "Host": "pinky20.mpi-sws.org",
        "HRT": 6569925316928620,
        "Operation": "fork",
        "Timestamp": "1557750360898.178223",
        "TenantClass": 0,
        "Source": "PacketHeader.java:95",
        "ThreadID": 15098,
        "ThreadName": "",
        "EventID": "42A347C3B3792402",
        "BaggageBytes": "[[248 5] [240 0] [0 44 70 220 33 59 16 207 32] [240 1] [0 1 221 129 245 153 111 98 110] [240 3] [0 2]]",
        "ProcessID": 13111
      },
      {
        "Cycles": 0,
        "Agent": "Execution-Sleep",
        "ProcessName": "Read",
        "TaskID": "2C46DC213B10CF20",
        "ParentEventID": [
          "06E1C9D2FBE56503"
        ],
        "Label": "waited",
        "Title": "X-Trace Task",
        "Host": "pinky19.mpi-sws.org",
        "Duration": "237197",
        "HRT": 26966720958039981,
        "Operation": "waited",
        "Timestamp": "1557750360898.479004",
        "TenantClass": 0,
        "Source": "SocketIOWithTimeout.java:335",
        "ThreadID": 1,
        "ThreadName": "",
        "EventID": "11CBF71A03A2859F",
        "ProcessID": 2801
      },
      {
        "Cycles": 0,
        "Agent": "Execution-Sleep",
        "ProcessName": "Read",
        "TaskID": "2C46DC213B10CF20",
        "ParentEventID": [
          "11CBF71A03A2859F"
        ],
        "Label": "waited",
        "Title": "X-Trace Task",
        "Host": "pinky19.mpi-sws.org",
        "Duration": "215270",
        "HRT": 26966720958321860,
        "Operation": "waited",
        "Timestamp": "1557750360898.760742",
        "TenantClass": 0,
        "Source": "SocketIOWithTimeout.java:335",
        "ThreadID": 1,
        "ThreadName": "",
        "EventID": "51158FF3EE27CB5B",
        "ProcessID": 2801
      },
      {
        "Cycles": 0,
        "Agent": "Execution-Sleep",
        "ProcessName": "Read",
        "TaskID": "2C46DC213B10CF20",
        "ParentEventID": [
          "51158FF3EE27CB5B"
        ],
        "Label": "waited",
        "Title": "X-Trace Task",
        "Host": "pinky19.mpi-sws.org",
        "Duration": "151997",
        "HRT": 26966720958532905,
        "Operation": "waited",
        "Timestamp": "1557750360898.971924",
        "TenantClass": 0,
        "Source": "SocketIOWithTimeout.java:335",
        "ThreadID": 1,
        "ThreadName": "",
        "EventID": "68F891D44C555DAD",
        "ProcessID": 2801
      },
      {
        "Cycles": 0,
        "Agent": "Execution-Sleep",
        "ProcessName": "Data",
        "TaskID": "2C46DC213B10CF20",
        "ParentEventID": [
          "4431E584DE261AD4"
        ],
        "Label": "waited",
        "Title": "X-Trace Task",
        "Host": "pinky20.mpi-sws.org",
        "Duration": "5415",
        "HRT": 6569925316856169,
        "Operation": "waited",
        "Timestamp": "1557750360898.105713",
        "TenantClass": 0,
        "Source": "SocketIOWithTimeout.java:335",
        "ThreadID": 15098,
        "ThreadName": "",
        "EventID": "01DD81F5996F626E",
        "BaggageBytes": "[[248 5] [240 0] [0 44 70 220 33 59 16 207 32] [240 1] [0 68 49 229 132 222 38 26 212] [240 3] [0 2]]",
        "ProcessID": 13111
      },
      {
        "Cycles": 0,
        "Agent": "edu.brown.cs.systems.xtrace.logging.BaggageWrappers",
        "ProcessName": "Read",
        "TaskID": "2C46DC213B10CF20",
        "ParentEventID": [
          "4431E584DE261AD4",
          "68F891D44C555DAD"
        ],
        "Label": "Merged current baggage with other baggage",
        "Title": "X-Trace Task",
        "Host": "pinky19.mpi-sws.org",
        "HRT": 26966720958588016,
        "Operation": "join",
        "Timestamp": "1557750360899.027100",
        "TenantClass": 0,
        "Source": "PacketHeader.java:168",
        "ThreadID": 1,
        "ThreadName": "",
        "EventID": "260D7478F2744B85",
        "ProcessID": 2801
      },
      {
        "Cycles": 0,
        "Agent": "edu.brown.cs.systems.xtrace.logging.BaggageWrappers",
        "ProcessName": "Read",
        "TaskID": "2C46DC213B10CF20",
        "ParentEventID": [
          "260D7478F2744B85",
          "42A347C3B3792402"
        ],
        "Label": "Merged current baggage with other baggage",
        "Title": "X-Trace Task",
        "Host": "pinky19.mpi-sws.org",
        "HRT": 26966720958684896,
        "Operation": "join",
        "Timestamp": "1557750360899.123779",
        "TenantClass": 0,
        "Source": "PacketHeader.java:168",
        "ThreadID": 1,
        "ThreadName": "",
        "EventID": "EC752C874582C62A",
        "ProcessID": 2801
      },
      {
        "Cycles": 0,
        "Agent": "edu.brown.cs.systems.xtrace.logging.BaggageWrappers",
        "ProcessName": "Read",
        "TaskID": "2C46DC213B10CF20",
        "ParentEventID": [
          "EC752C874582C62A"
        ],
        "Label": "Forking current baggage with Baggage.fork()",
        "Title": "X-Trace Task",
        "Host": "pinky19.mpi-sws.org",
        "HRT": 26966720958693891,
        "Operation": "fork",
        "Timestamp": "1557750360899.132812",
        "TenantClass": 0,
        "Source": "RemoteBlockReader2.java:361",
        "ThreadID": 1,
        "ThreadName": "",
        "EventID": "C3CA666D7730E929",
        "ProcessID": 2801
      },
      {
        "Cycles": 0,
        "Agent": "Execution-Sleep",
        "ProcessName": "Data",
        "TaskID": "2C46DC213B10CF20",
        "ParentEventID": [
          "42A347C3B3792402"
        ],
        "Label": "waited",
        "Title": "X-Trace Task",
        "Host": "pinky20.mpi-sws.org",
        "Duration": "906630",
        "HRT": 6569925317908600,
        "Operation": "waited",
        "Timestamp": "1557750360899.158203",
        "TenantClass": 0,
        "Source": "SocketIOWithTimeout.java:335",
        "ThreadID": 15098,
        "ThreadName": "",
        "EventID": "B961060E0454505B",
        "BaggageBytes": "[[248 5] [240 0] [0 44 70 220 33 59 16 207 32] [240 1] [0 66 163 71 195 179 121 36 2] [240 3] [0 2]]",
        "ProcessID": 13111
      },
      {
        "Cycles": 0,
        "Agent": "edu.brown.cs.systems.xtrace.logging.BaggageWrappers",
        "ProcessName": "Read",
        "TaskID": "2C46DC213B10CF20",
        "ParentEventID": [
          "C3CA666D7730E929"
        ],
        "Label": "Forking current baggage with Baggage.fork()",
        "Title": "X-Trace Task",
        "Host": "pinky19.mpi-sws.org",
        "HRT": 26966720958748913,
        "Operation": "fork",
        "Timestamp": "1557750360899.187988",
        "TenantClass": 0,
        "Source": "DataTransferProtoUtil.java:94",
        "ThreadID": 1,
        "ThreadName": "",
        "EventID": "E85BB14139AA31E3",
        "ProcessID": 2801
      },
      {
        "Cycles": 0,
        "Agent": "edu.brown.cs.systems.xtrace.logging.BaggageWrappers",
        "ProcessName": "Data",
        "TaskID": "2C46DC213B10CF20",
        "ParentEventID": [
          "B961060E0454505B",
          "C3CA666D7730E929"
        ],
        "Label": "Merged current baggage with other baggage",
        "Title": "X-Trace Task",
        "Host": "pinky20.mpi-sws.org",
        "HRT": 6569925318086351,
        "Operation": "join",
        "Timestamp": "1557750360899.335938",
        "TenantClass": 0,
        "Source": "DataXceiver.java:574",
        "ThreadID": 15098,
        "ThreadName": "",
        "EventID": "373EC082BBBFCD50",
        "BaggageBytes": "[[248 5] [240 0] [0 44 70 220 33 59 16 207 32] [240 1] [0 185 97 6 14 4 84 80 91] [0 195 202 102 109 119 48 233 41] [240 3] [0 2]]",
        "ProcessID": 13111
      },
      {
        "Cycles": 0,
        "Agent": "Execution-CPU",
        "ProcessName": "Data",
        "TaskID": "2C46DC213B10CF20",
        "ParentEventID": [
          "E85BB14139AA31E3"
        ],
        "Label": "set",
        "Title": "X-Trace Task",
        "Host": "pinky20.mpi-sws.org",
        "HRT": 6569925318210133,
        "Operation": "set",
        "Timestamp": "1557750360899.459717",
        "TenantClass": 0,
        "Source": "Receiver.java:117",
        "ThreadID": 15098,
        "ThreadName": "",
        "EventID": "589F403883403097",
        "BaggageBytes": "[[248 5] [240 0] [0 44 70 220 33 59 16 207 32] [240 1] [0 232 91 177 65 57 170 49 227] [240 3] [0 2]]",
        "ProcessID": 13111
      },
      {
        "Cycles": 0,
        "Agent": "edu.brown.cs.systems.xtrace.logging.XTraceInit",
        "ProcessName": "Data",
        "TaskID": "2C46DC213B10CF20",
        "ParentEventID": [
          "589F403883403097"
        ],
        "Label": "Thread.setName: DataXceiver for client DFSClient_NONMAPREDUCE_310321604_1 at /139.19.171.63:53384 [Sending block BP-1633380353-139.19.171.63-1554193446451:blk_1073766107_25283]",
        "Title": "X-Trace Task",
        "Host": "pinky20.mpi-sws.org",
        "HRT": 6569925318287068,
        "Timestamp": "1557750360899.536621",
        "TenantClass": 0,
        "Source": "DataXceiver.java:168",
        "ThreadID": 15098,
        "ThreadName": "",
        "EventID": "8B7746B8CF96BF46",
        "BaggageBytes": "[[248 5] [240 0] [0 44 70 220 33 59 16 207 32] [240 1] [0 88 159 64 56 131 64 48 151] [240 3] [0 2]]",
        "ProcessID": 13111
      },
      {
        "Cycles": 0,
        "Agent": "Execution-CPU",
        "ProcessName": "Data",
        "TaskID": "2C46DC213B10CF20",
        "ParentEventID": [
          "373EC082BBBFCD50"
        ],
        "Label": "unset",
        "Title": "X-Trace Task",
        "Host": "pinky20.mpi-sws.org",
        "Duration": "1522592",
        "HRT": 6569925318151666,
        "Operation": "unset",
        "Timestamp": "1557750360899.401367",
        "TenantClass": 0,
        "Source": "DataXceiver.java:261",
        "ThreadID": 15098,
        "ThreadName": "",
        "EventID": "DE935E1EB5F9ED23",
        "BaggageBytes": "[[248 5] [240 0] [0 44 70 220 33 59 16 207 32] [240 1] [0 55 62 192 130 187 191 205 80] [240 3] [0 2]]",
        "ProcessID": 13111
      },
      {
        "Cycles": 0,
        "Agent": "edu.brown.cs.systems.xtrace.logging.BaggageWrappers",
        "ProcessName": "Data",
        "TaskID": "2C46DC213B10CF20",
        "ParentEventID": [
          "8B7746B8CF96BF46"
        ],
        "Label": "Forking current baggage with Baggage.fork()",
        "Title": "X-Trace Task",
        "Host": "pinky20.mpi-sws.org",
        "HRT": 6569925318466649,
        "Operation": "fork",
        "Timestamp": "1557750360899.716309",
        "TenantClass": 0,
        "Source": "DataXceiver.java:1257",
        "ThreadID": 15098,
        "ThreadName": "",
        "EventID": "A26F3A374FF800F6",
        "BaggageBytes": "[[248 5] [240 0] [0 44 70 220 33 59 16 207 32] [240 1] [0 139 119 70 184 207 150 191 70] [240 3] [0 2]]",
        "ProcessID": 13111
      },
      {
        "Cycles": 0,
        "Agent": "edu.brown.cs.systems.xtrace.logging.BaggageWrappers",
        "ProcessName": "Read",
        "TaskID": "2C46DC213B10CF20",
        "ParentEventID": [
          "4F0F7D6CD40F2089",
          "A26F3A374FF800F6"
        ],
        "Label": "Merged current baggage with other baggage",
        "Title": "X-Trace Task",
        "Host": "pinky19.mpi-sws.org",
        "HRT": 26966720959510113,
        "Operation": "join",
        "Timestamp": "1557750360899.949219",
        "TenantClass": 0,
        "Source": "RemoteBlockReader2.java:429",
        "ThreadID": 1,
        "ThreadName": "",
        "EventID": "589679614AADC573",
        "ProcessID": 2801
      },
      {
        "Cycles": 0,
        "Agent": "Execution-Sleep",
        "ProcessName": "Read",
        "TaskID": "2C46DC213B10CF20",
        "ParentEventID": [
          "E85BB14139AA31E3"
        ],
        "Label": "waited",
        "Title": "X-Trace Task",
        "Host": "pinky19.mpi-sws.org",
        "Duration": "649399",
        "HRT": 26966720959460511,
        "Operation": "waited",
        "Timestamp": "1557750360899.899414",
        "TenantClass": 0,
        "Source": "SocketIOWithTimeout.java:335",
        "ThreadID": 1,
        "ThreadName": "",
        "EventID": "4F0F7D6CD40F2089",
        "ProcessID": 2801
      },
      {
        "Cycles": 0,
        "Agent": "edu.brown.cs.systems.xtrace.logging.BaggageWrappers",
        "ProcessName": "Data",
        "TaskID": "2C46DC213B10CF20",
        "ParentEventID": [
          "A26F3A374FF800F6"
        ],
        "Label": "Forking current baggage with Baggage.fork()",
        "Title": "X-Trace Task",
        "Host": "pinky20.mpi-sws.org",
        "HRT": 6569925318601981,
        "Operation": "fork",
        "Timestamp": "1557750360899.851562",
        "TenantClass": 0,
        "Source": "PacketHeader.java:95",
        "ThreadID": 15098,
        "ThreadName": "",
        "EventID": "3820C3425E63F3FF",
        "BaggageBytes": "[[248 5] [240 0] [0 44 70 220 33 59 16 207 32] [240 1] [0 162 111 58 55 79 248 0 246] [240 3] [0 2]]",
        "ProcessID": 13111
      },
      {
        "Cycles": 0,
        "Agent": "Execution-Sleep",
        "ProcessName": "Data",
        "TaskID": "2C46DC213B10CF20",
        "ParentEventID": [
          "3820C3425E63F3FF"
        ],
        "Label": "waited",
        "Title": "X-Trace Task",
        "Host": "pinky20.mpi-sws.org",
        "Duration": "9022",
        "HRT": 6569925318722581,
        "Operation": "waited",
        "Timestamp": "1557750360899.972168",
        "TenantClass": 0,
        "Source": "SocketIOWithTimeout.java:335",
        "ThreadID": 15098,
        "ThreadName": "",
        "EventID": "878B8E2F15F69006",
        "BaggageBytes": "[[248 5] [240 0] [0 44 70 220 33 59 16 207 32] [240 1] [0 56 32 195 66 94 99 243 255] [240 3] [0 2]]",
        "ProcessID": 13111
      },
      {
        "Cycles": 0,
        "Agent": "Execution-Sleep",
        "ProcessName": "Read",
        "TaskID": "2C46DC213B10CF20",
        "ParentEventID": [
          "589679614AADC573"
        ],
        "Label": "waited",
        "Title": "X-Trace Task",
        "Host": "pinky19.mpi-sws.org",
        "Duration": "47451",
        "HRT": 26966720959593893,
        "Operation": "waited",
        "Timestamp": "1557750360900.032959",
        "TenantClass": 0,
        "Source": "SocketIOWithTimeout.java:335",
        "ThreadID": 1,
        "ThreadName": "",
        "EventID": "EFCE86AF62A5893E",
        "ProcessID": 2801
      },
      {
        "Cycles": 0,
        "Agent": "edu.brown.cs.systems.xtrace.logging.BaggageWrappers",
        "ProcessName": "Data",
        "TaskID": "2C46DC213B10CF20",
        "ParentEventID": [
          "878B8E2F15F69006"
        ],
        "Label": "Forking current baggage with Baggage.fork()",
        "Title": "X-Trace Task",
        "Host": "pinky20.mpi-sws.org",
        "HRT": 6569925318880001,
        "Operation": "fork",
        "Timestamp": "1557750360900.129639",
        "TenantClass": 0,
        "Source": "PacketHeader.java:95",
        "ThreadID": 15098,
        "ThreadName": "",
        "EventID": "89A60D199C3D8995",
        "BaggageBytes": "[[248 5] [240 0] [0 44 70 220 33 59 16 207 32] [240 1] [0 135 139 142 47 21 246 144 6] [240 3] [0 2]]",
        "ProcessID": 13111
      },
      {
        "Cycles": 0,
        "Agent": "Execution-Sleep",
        "ProcessName": "Data",
        "TaskID": "2C46DC213B10CF20",
        "ParentEventID": [
          "89A60D199C3D8995"
        ],
        "Label": "waited",
        "Title": "X-Trace Task",
        "Host": "pinky20.mpi-sws.org",
        "Duration": "190023",
        "HRT": 6569925319166339,
        "Operation": "waited",
        "Timestamp": "1557750360900.416016",
        "TenantClass": 0,
        "Source": "SocketIOWithTimeout.java:335",
        "ThreadID": 15098,
        "ThreadName": "",
        "EventID": "39AD05FA2A357252",
        "BaggageBytes": "[[248 5] [240 0] [0 44 70 220 33 59 16 207 32] [240 1] [0 137 166 13 25 156 61 137 149] [240 3] [0 2]]",
        "ProcessID": 13111
      },
      {
        "Cycles": 0,
        "Agent": "Execution-Sleep",
        "ProcessName": "Read",
        "TaskID": "2C46DC213B10CF20",
        "ParentEventID": [
          "EFCE86AF62A5893E"
        ],
        "Label": "waited",
        "Title": "X-Trace Task",
        "Host": "pinky19.mpi-sws.org",
        "Duration": "326040",
        "HRT": 26966720959977965,
        "Operation": "waited",
        "Timestamp": "1557750360900.416992",
        "TenantClass": 0,
        "Source": "SocketIOWithTimeout.java:335",
        "ThreadID": 1,
        "ThreadName": "",
        "EventID": "80684C361CB11B1A",
        "ProcessID": 2801
      },
      {
        "Cycles": 0,
        "Agent": "Execution-Sleep",
        "ProcessName": "Read",
        "TaskID": "2C46DC213B10CF20",
        "ParentEventID": [
          "80684C361CB11B1A"
        ],
        "Label": "waited",
        "Title": "X-Trace Task",
        "Host": "pinky19.mpi-sws.org",
        "Duration": "156366",
        "HRT": 26966720960198314,
        "Operation": "waited",
        "Timestamp": "1557750360900.637207",
        "TenantClass": 0,
        "Source": "SocketIOWithTimeout.java:335",
        "ThreadID": 1,
        "ThreadName": "",
        "EventID": "1561DE45C6F47026",
        "ProcessID": 2801
      },
      {
        "Cycles": 0,
        "Agent": "Execution-Sleep",
        "ProcessName": "Read",
        "TaskID": "2C46DC213B10CF20",
        "ParentEventID": [
          "1561DE45C6F47026"
        ],
        "Label": "waited",
        "Title": "X-Trace Task",
        "Host": "pinky19.mpi-sws.org",
        "Duration": "136088",
        "HRT": 26966720960388981,
        "Operation": "waited",
        "Timestamp": "1557750360900.827881",
        "TenantClass": 0,
        "Source": "SocketIOWithTimeout.java:335",
        "ThreadID": 1,
        "ThreadName": "",
        "EventID": "722323E60DFFEFD2",
        "ProcessID": 2801
      },
      {
        "Cycles": 0,
        "Agent": "Execution-Sleep",
        "ProcessName": "Data",
        "TaskID": "2C46DC213B10CF20",
        "ParentEventID": [
          "4F0DD0FEFC6A4AF0"
        ],
        "Label": "waited",
        "Title": "X-Trace Task",
        "Host": "pinky20.mpi-sws.org",
        "Duration": "7453",
        "HRT": 6569925319423467,
        "Operation": "waited",
        "Timestamp": "1557750360900.673096",
        "TenantClass": 0,
        "Source": "SocketIOWithTimeout.java:335",
        "ThreadID": 15098,
        "ThreadName": "",
        "EventID": "0B056B94B7F27706",
        "BaggageBytes": "[[248 5] [240 0] [0 44 70 220 33 59 16 207 32] [240 1] [0 79 13 208 254 252 106 74 240] [240 3] [0 2]]",
        "ProcessID": 13111
      },
      {
        "Cycles": 0,
        "Agent": "edu.brown.cs.systems.xtrace.logging.BaggageWrappers",
        "ProcessName": "Data",
        "TaskID": "2C46DC213B10CF20",
        "ParentEventID": [
          "39AD05FA2A357252"
        ],
        "Label": "Forking current baggage with Baggage.fork()",
        "Title": "X-Trace Task",
        "Host": "pinky20.mpi-sws.org",
        "HRT": 6569925319278830,
        "Operation": "fork",
        "Timestamp": "1557750360900.528564",
        "TenantClass": 0,
        "Source": "PacketHeader.java:95",
        "ThreadID": 15098,
        "ThreadName": "",
        "EventID": "4F0DD0FEFC6A4AF0",
        "BaggageBytes": "[[248 5] [240 0] [0 44 70 220 33 59 16 207 32] [240 1] [0 57 173 5 250 42 53 114 82] [240 3] [0 2]]",
        "ProcessID": 13111
      },
      {
        "Cycles": 0,
        "Agent": "Execution-Sleep",
        "ProcessName": "Read",
        "TaskID": "2C46DC213B10CF20",
        "ParentEventID": [
          "722323E60DFFEFD2"
        ],
        "Label": "waited",
        "Title": "X-Trace Task",
        "Host": "pinky19.mpi-sws.org",
        "Duration": "155623",
        "HRT": 26966720960587693,
        "Operation": "waited",
        "Timestamp": "1557750360901.026611",
        "TenantClass": 0,
        "Source": "SocketIOWithTimeout.java:335",
        "ThreadID": 1,
        "ThreadName": "",
        "EventID": "69B418A2D7459C9C",
        "ProcessID": 2801
      },
      {
        "Cycles": 0,
        "Agent": "edu.brown.cs.systems.xtrace.logging.BaggageWrappers",
        "ProcessName": "Read",
        "TaskID": "2C46DC213B10CF20",
        "ParentEventID": [
          "3820C3425E63F3FF",
          "69B418A2D7459C9C"
        ],
        "Label": "Merged current baggage with other baggage",
        "Title": "X-Trace Task",
        "Host": "pinky19.mpi-sws.org",
        "HRT": 26966720960627183,
        "Operation": "join",
        "Timestamp": "1557750360901.066162",
        "TenantClass": 0,
        "Source": "PacketHeader.java:168",
        "ThreadID": 1,
        "ThreadName": "",
        "EventID": "B88BDC90930A0DA4",
        "ProcessID": 2801
      },
      {
        "Cycles": 0,
        "Agent": "Execution-Sleep",
        "ProcessName": "Data",
        "TaskID": "2C46DC213B10CF20",
        "ParentEventID": [
          "BF195EB344AF706E"
        ],
        "Label": "waited",
        "Title": "X-Trace Task",
        "Host": "pinky20.mpi-sws.org",
        "Duration": "161025",
        "HRT": 6569925319812780,
        "Operation": "waited",
        "Timestamp": "1557750360901.062500",
        "TenantClass": 0,
        "Source": "SocketIOWithTimeout.java:335",
        "ThreadID": 15098,
        "ThreadName": "",
        "EventID": "D9897B6C2D84E6E5",
        "BaggageBytes": "[[248 5] [240 0] [0 44 70 220 33 59 16 207 32] [240 1] [0 191 25 94 179 68 175 112 110] [240 3] [0 2]]",
        "ProcessID": 13111
      },
      {
        "Cycles": 0,
        "Agent": "edu.brown.cs.systems.xtrace.logging.BaggageWrappers",
        "ProcessName": "Data",
        "TaskID": "2C46DC213B10CF20",
        "ParentEventID": [
          "0B056B94B7F27706"
        ],
        "Label": "Forking current baggage with Baggage.fork()",
        "Title": "X-Trace Task",
        "Host": "pinky20.mpi-sws.org",
        "HRT": 6569925319526155,
        "Operation": "fork",
        "Timestamp": "1557750360900.775879",
        "TenantClass": 0,
        "Source": "PacketHeader.java:95",
        "ThreadID": 15098,
        "ThreadName": "",
        "EventID": "BF195EB344AF706E",
        "BaggageBytes": "[[248 5] [240 0] [0 44 70 220 33 59 16 207 32] [240 1] [0 11 5 107 148 183 242 119 6] [240 3] [0 2]]",
        "ProcessID": 13111
      },
      {
        "Cycles": 0,
        "Agent": "Execution-CPU",
        "ProcessName": "Data",
        "TaskID": "2C46DC213B10CF20",
        "ParentEventID": [
          "D9897B6C2D84E6E5"
        ],
        "Label": "unset",
        "Title": "X-Trace Task",
        "Host": "pinky20.mpi-sws.org",
        "Duration": "1838407",
        "HRT": 6569925320109958,
        "Operation": "unset",
        "Timestamp": "1557750360901.359619",
        "TenantClass": 0,
        "Source": "DataXceiver.java:261",
        "ThreadID": 15098,
        "ThreadName": "",
        "EventID": "068FAEDAB0BCF9F7",
        "BaggageBytes": "[[248 5] [240 0] [0 44 70 220 33 59 16 207 32] [240 1] [0 217 137 123 108 45 132 230 229] [240 3] [0 2]]",
        "ProcessID": 13111
      },
      {
        "Cycles": 0,
        "Agent": "edu.brown.cs.systems.retro.benchmarks.hdfs_client.Reader",
        "ProcessName": "Read",
        "TaskID": "2C46DC213B10CF20",
        "ParentEventID": [
          "0"
        ],
        "Label": "Reading file",
        "Title": "X-Trace Task",
        "Host": "pinky19.mpi-sws.org",
        "HRT": 26966720956121073,
        "Timestamp": "1557750360896.560059",
        "TenantClass": 0,
        "ThreadID": 1,
        "ThreadName": "",
        "EventID": "BE2A1A41DE8437F6",
        "ProcessID": 2801,
        "Tag": [
          "reader_100kb",
          "Read Size: 102400"
        ]
      }
    ]
  }
]