[
  {
    "id": "031ED57C264E7B53",
    "reports": [
      {
        "Cycles": 0,
        "Agent": "Execution-CPU",
        "ProcessName": "Read",
        "TaskID": "031ED57C264E7B53",
        "ParentEventID": [
          "1AEE9F820702B0DC"
        ],
        "Label": "unset",
        "Title": "X-Trace Task",
        "Host": "pinky19.mpi-sws.org",
        "Duration": "40355215",
        "HRT": 26962645849013783,
        "Operation": "unset",
        "Timestamp": "1557746285789.221680",
        "TenantClass": 0,
        "Source": "Client.java:1027",
        "ThreadID": 1,
        "ThreadName": "",
        "EventID": "5922442E9E3775ED",
        "ProcessID": 36430
      },
      {
        "Cycles": 0,
        "Agent": "edu.brown.cs.systems.retro.benchmarks.hdfs_client.Reader",
        "ProcessName": "Read",
        "TaskID": "031ED57C264E7B53",
        "ParentEventID": [
          "128BDC9DC37C35A0"
        ],
        "Label": "Reading file",
        "Title": "X-Trace Task",
        "Host": "pinky19.mpi-sws.org",
        "HRT": 26962645848952365,
        "Timestamp": "1557746285789.160156",
        "TenantClass": 0,
        "ThreadID": 1,
        "ThreadName": "",
        "EventID": "8DC7AC97FA5ABBC8",
        "ProcessID": 36430
      },
      {
        "Cycles": 0,
        "Agent": "org.apache.hadoop.ipc.ProtobufRpcEngine",
        "ProcessName": "Read",
        "TaskID": "031ED57C264E7B53",
        "ParentEventID": [
          "8DC7AC97FA5ABBC8"
        ],
        "Label": "Invoking org.apache.hadoop.hdfs.protocol.ClientProtocol.getBlockLocations",
        "Title": "X-Trace Task",
        "Host": "pinky19.mpi-sws.org",
        "HRT": 26962645848988425,
        "Timestamp": "1557746285789.196289",
        "TenantClass": 0,
        "Source": "ProtobufRpcEngine.java:228",
        "ThreadID": 1,
        "ThreadName": "",
        "EventID": "1AEE9F820702B0DC",
        "ProcessID": 36430
      },
      {
        "Cycles": 0,
        "Agent": "Execution-CPU",
        "ProcessName": "Read",
        "TaskID": "031ED57C264E7B53",
        "ParentEventID": [
          "5922442E9E3775ED"
        ],
        "Label": "set",
        "Title": "X-Trace Task",
        "Host": "pinky19.mpi-sws.org",
        "HRT": 26962645849102084,
        "Operation": "set",
        "Timestamp": "1557746285789.309814",
        "TenantClass": 0,
        "Source": "Client.java:1032",
        "ThreadID": 41,
        "ThreadName": "",
        "EventID": "E1D596595F9A0676",
        "ProcessID": 36430
      },
      {
        "Cycles": 0,
        "Agent": "edu.brown.cs.systems.xtrace.logging.BaggageWrappers",
        "ProcessName": "Read",
        "TaskID": "031ED57C264E7B53",
        "ParentEventID": [
          "E1D596595F9A0676"
        ],
        "Label": "Forking current baggage with Baggage.fork()",
        "Title": "X-Trace Task",
        "Host": "pinky19.mpi-sws.org",
        "HRT": 26962645849131840,
        "Operation": "fork",
        "Timestamp": "1557746285789.339600",
        "TenantClass": 0,
        "Source": "Client.java:1043",
        "ThreadID": 41,
        "ThreadName": "",
        "EventID": "4B0DD6D05AFD4176",
        "ProcessID": 36430
      },
      {
        "Cycles": 0,
        "Agent": "Execution-CPU",
        "ProcessName": "Read",
        "TaskID": "031ED57C264E7B53",
        "ParentEventID": [
          "FF18E466960F046E"
        ],
        "Label": "set",
        "Title": "X-Trace Task",
        "Host": "pinky19.mpi-sws.org",
        "HRT": 26962645849276094,
        "Operation": "set",
        "Timestamp": "1557746285789.483887",
        "TenantClass": 0,
        "Source": "Client.java:1104",
        "ThreadID": 1,
        "ThreadName": "",
        "EventID": "065D17B3ED5E25A9",
        "ProcessID": 36430
      },
      {
        "Cycles": 0,
        "Agent": "Execution-CPU",
        "ProcessName": "Read",
        "TaskID": "031ED57C264E7B53",
        "ParentEventID": [
          "4B0DD6D05AFD4176"
        ],
        "Label": "unset",
        "Title": "X-Trace Task",
        "Host": "pinky19.mpi-sws.org",
        "Duration": "95529",
        "HRT": 26962645849225769,
        "Operation": "unset",
        "Timestamp": "1557746285789.433594",
        "TenantClass": 0,
        "Source": "Client.java:1062",
        "ThreadID": 41,
        "ThreadName": "",
        "EventID": "FF18E466960F046E",
        "ProcessID": 36430
      },
      {
        "Cycles": 0,
        "Agent": "Execution-CPU",
        "ProcessName": "Name",
        "TaskID": "031ED57C264E7B53",
        "ParentEventID": [
          "4B0DD6D05AFD4176"
        ],
        "Label": "set",
        "Title": "X-Trace Task",
        "Host": "pinky19.mpi-sws.org",
        "HRT": 26962645849282026,
        "Operation": "set",
        "Timestamp": "1557746285789.505615",
        "TenantClass": 0,
        "Source": "Server.java:1840",
        "ThreadID": 48,
        "ThreadName": "",
        "EventID": "EAAE3154B4B30199",
        "BaggageBytes": "[[248 5] [240 0] [0 3 30 213 124 38 78 123 83] [240 1] [0 75 13 214 208 90 253 65 118] [240 3] [0 2]]",
        "ProcessID": 2171
      },
      {
        "Cycles": 0,
        "Agent": "Execution-CPU",
        "ProcessName": "Name",
        "TaskID": "031ED57C264E7B53",
        "ParentEventID": [
          "885CE834B0684526"
        ],
        "Label": "unset",
        "Title": "X-Trace Task",
        "Host": "pinky19.mpi-sws.org",
        "Duration": "24049",
        "HRT": 26962645849347037,
        "Operation": "unset",
        "Timestamp": "1557746285789.570801",
        "TenantClass": 0,
        "Source": "Server.java:1828",
        "ThreadID": 48,
        "ThreadName": "",
        "EventID": "414869AC7988CA8A",
        "BaggageBytes": "[[248 5] [240 0] [0 3 30 213 124 38 78 123 83] [240 1] [0 136 92 232 52 176 104 69 38] [240 3] [0 2]]",
        "ProcessID": 2171
      },
      {
        "Cycles": 0,
        "Agent": "Execution-CPU",
        "ProcessName": "Name",
        "TaskID": "031ED57C264E7B53",
        "ParentEventID": [
          "885CE834B0684526"
        ],
        "Label": "set",
        "Title": "X-Trace Task",
        "Host": "pinky19.mpi-sws.org",
        "HRT": 26962645849357325,
        "Operation": "set",
        "Timestamp": "1557746285789.581055",
        "TenantClass": 0,
        "Source": "Server.java:2071",
        "ThreadID": 64,
        "ThreadName": "",
        "EventID": "0B8B7B4E8DE3954B",
        "BaggageBytes": "[[248 5] [240 0] [0 3 30 213 124 38 78 123 83] [240 1] [0 136 92 232 52 176 104 69 38] [240 3] [0 2]]",
        "ProcessID": 2171
      },
      {
        "Cycles": 0,
        "Agent": "org.apache.hadoop.ipc.Server",
        "ProcessName": "Name",
        "TaskID": "031ED57C264E7B53",
        "ParentEventID": [
          "0B8B7B4E8DE3954B"
        ],
        "Label": "getBlockLocations in org.apache.hadoop.hdfs.protocol.ClientProtocol",
        "Title": "X-Trace Task",
        "Host": "pinky19.mpi-sws.org",
        "HRT": 26962645849390241,
        "Timestamp": "1557746285789.614014",
        "TenantClass": 0,
        "Source": "ProtobufRpcEngine.java:601",
        "ThreadID": 64,
        "ThreadName": "",
        "EventID": "5121F465ED3277AC",
        "BaggageBytes": "[[248 5] [240 0] [0 3 30 213 124 38 78 123 83] [240 1] [0 11 139 123 78 141 227 149 75] [240 3] [0 2]]",
        "ProcessID": 2171
      },
      {
        "Cycles": 0,
        "Agent": "edu.brown.cs.systems.xtrace.logging.BaggageWrappers",
        "ProcessName": "Name",
        "TaskID": "031ED57C264E7B53",
        "ParentEventID": [
          "EAAE3154B4B30199"
        ],
        "Label": "Forking current baggage with Baggage.fork()",
        "Title": "X-Trace Task",
        "Host": "pinky19.mpi-sws.org",
        "HRT": 26962645849326988,
        "Operation": "fork",
        "Timestamp": "1557746285789.550781",
        "TenantClass": 0,
        "Source": "Server.java:550",
        "ThreadID": 48,
        "ThreadName": "",
        "EventID": "885CE834B0684526",
        "BaggageBytes": "[[248 5] [240 0] [0 3 30 213 124 38 78 123 83] [240 1] [0 234 174 49 84 180 179 1 153] [240 3] [0 2]]",
        "ProcessID": 2171
      },
      {
        "Cycles": 0,
        "Agent": "org.apache.hadoop.hdfs.server.namenode.FSNamesystem.audit",
        "ProcessName": "Name",
        "TaskID": "031ED57C264E7B53",
        "ParentEventID": [
          "5121F465ED3277AC"
        ],
        "Label": "allowed=true\tugi=plascas (auth:SIMPLE)\tip=/139.19.171.63\tcmd=open\tsrc=/ds/MLxYFaHbW6nYRX3T\tdst=null\tperm=null\tproto=rpc",
        "Title": "X-Trace Task",
        "Host": "pinky19.mpi-sws.org",
        "HRT": 26962645849436201,
        "Timestamp": "1557746285789.659912",
        "TenantClass": 0,
        "Source": "FSNamesystem.java:8313",
        "ThreadID": 64,
        "ThreadName": "",
        "EventID": "0D0A52C5393512D1",
        "BaggageBytes": "[[248 5] [240 0] [0 3 30 213 124 38 78 123 83] [240 1] [0 81 33 244 101 237 50 119 172] [240 3] [0 2]]",
        "ProcessID": 2171
      },
      {
        "Cycles": 0,
        "Agent": "Execution-CPU",
        "ProcessName": "Name",
        "TaskID": "031ED57C264E7B53",
        "ParentEventID": [
          "B57871F5743105EA"
        ],
        "Label": "unset",
        "Title": "X-Trace Task",
        "Host": "pinky19.mpi-sws.org",
        "Duration": "202260",
        "HRT": 26962645849581723,
        "Operation": "unset",
        "Timestamp": "1557746285789.805420",
        "TenantClass": 0,
        "Source": "Server.java:1058",
        "ThreadID": 64,
        "ThreadName": "",
        "EventID": "1CC62C4D16A93F0A",
        "BaggageBytes": "[[248 5] [240 0] [0 3 30 213 124 38 78 123 83] [240 1] [0 181 120 113 245 116 49 5 234] [240 3] [0 2]]",
        "ProcessID": 2171
      },
      {
        "Cycles": 0,
        "Agent": "edu.brown.cs.systems.xtrace.logging.BaggageWrappers",
        "ProcessName": "Name",
        "TaskID": "031ED57C264E7B53",
        "ParentEventID": [
          "0D0A52C5393512D1"
        ],
        "Label": "Forking current baggage with Baggage.fork()",
        "Title": "X-Trace Task",
        "Host": "pinky19.mpi-sws.org",
        "HRT": 26962645849477225,
        "Operation": "fork",
        "Timestamp": "1557746285789.700928",
        "TenantClass": 0,
        "Source": "Server.java:2398",
        "ThreadID": 64,
        "ThreadName": "",
        "EventID": "B57871F5743105EA",
        "BaggageBytes": "[[248 5] [240 0] [0 3 30 213 124 38 78 123 83] [240 1] [0 13 10 82 197 57 53 18 209] [240 3] [0 2]]",
        "ProcessID": 2171
      },
      {
        "Cycles": 0,
        "Agent": "Execution-CPU",
        "ProcessName": "Read",
        "TaskID": "031ED57C264E7B53",
        "ParentEventID": [
          "B57871F5743105EA"
        ],
        "Label": "set",
        "Title": "X-Trace Task",
        "Host": "pinky19.mpi-sws.org",
        "HRT": 26962645849659150,
        "Operation": "set",
        "Timestamp": "1557746285789.866943",
        "TenantClass": 0,
        "Source": "Client.java:302",
        "ThreadID": 37,
        "ThreadName": "",
        "EventID": "4D9BC6DF1E90DD70",
        "ProcessID": 36430
      },
      {
        "Cycles": 0,
        "Agent": "Execution-CPU",
        "ProcessName": "Read",
        "TaskID": "031ED57C264E7B53",
        "ParentEventID": [
          "4D9BC6DF1E90DD70"
        ],
        "Label": "unset",
        "Title": "X-Trace Task",
        "Host": "pinky19.mpi-sws.org",
        "Duration": "5200",
        "HRT": 26962645849680437,
        "Operation": "unset",
        "Timestamp": "1557746285789.888184",
        "TenantClass": 0,
        "Source": "Client.java:1168",
        "ThreadID": 37,
        "ThreadName": "",
        "EventID": "3DAB8C12AA2E1A20",
        "ProcessID": 36430
      },
      {
        "Cycles": 0,
        "Agent": "Execution-Sleep",
        "ProcessName": "Read",
        "TaskID": "031ED57C264E7B53",
        "ParentEventID": [
          "065D17B3ED5E25A9"
        ],
        "Label": "waited",
        "Title": "X-Trace Task",
        "Host": "pinky19.mpi-sws.org",
        "Duration": "425019",
        "HRT": 26962645849722690,
        "Operation": "waited",
        "Timestamp": "1557746285789.930420",
        "TenantClass": 0,
        "Source": "Client.java:1537",
        "ThreadID": 1,
        "ThreadName": "",
        "EventID": "C9CB80508335A135",
        "ProcessID": 36430
      },
      {
        "Cycles": 0,
        "Agent": "org.apache.hadoop.ipc.ProtobufRpcEngine",
        "ProcessName": "Read",
        "TaskID": "031ED57C264E7B53",
        "ParentEventID": [
          "C61EA5B1D0EC4FCD"
        ],
        "Label": "org.apache.hadoop.hdfs.protocol.ClientProtocol.getBlockLocations completed",
        "Title": "X-Trace Task",
        "Host": "pinky19.mpi-sws.org",
        "HRT": 26962645849773699,
        "Timestamp": "1557746285789.981445",
        "TenantClass": 0,
        "Source": "ProtobufRpcEngine.java:275",
        "ThreadID": 1,
        "ThreadName": "",
        "EventID": "D55D075FCCA35729",
        "ProcessID": 36430
      },
      {
        "Cycles": 0,
        "Agent": "edu.brown.cs.systems.xtrace.logging.BaggageWrappers",
        "ProcessName": "Read",
        "TaskID": "031ED57C264E7B53",
        "ParentEventID": [
          "C9CB80508335A135",
          "3DAB8C12AA2E1A20"
        ],
        "Label": "Merged current baggage with other baggage",
        "Title": "X-Trace Task",
        "Host": "pinky19.mpi-sws.org",
        "HRT": 26962645849738692,
        "Operation": "join",
        "Timestamp": "1557746285789.946533",
        "TenantClass": 0,
        "Source": "Client.java:1545",
        "ThreadID": 1,
        "ThreadName": "",
        "EventID": "C61EA5B1D0EC4FCD",
        "ProcessID": 36430
      },
      {
        "Cycles": 0,
        "Agent": "edu.brown.cs.systems.xtrace.logging.BaggageWrappers",
        "ProcessName": "Read",
        "TaskID": "031ED57C264E7B53",
        "ParentEventID": [
          "D55D075FCCA35729"
        ],
        "Label": "Forking current baggage with Baggage.fork()",
        "Title": "X-Trace Task",
        "Host": "pinky19.mpi-sws.org",
        "HRT": 26962645849829070,
        "Operation": "fork",
        "Timestamp": "1557746285790.036865",
        "TenantClass": 0,
        "Source": "DataTransferProtoUtil.java:94",
        "ThreadID": 1,
        "ThreadName": "",
        "EventID": "DC8572C061A9863E",
        "ProcessID": 36430
      },
      {
        "Cycles": 0,
        "Agent": "Execution-CPU",
        "ProcessName": "Data",
        "TaskID": "031ED57C264E7B53",
        "ParentEventID": [
          "DC8572C061A9863E"
        ],
        "Label": "set",
        "Title": "X-Trace Task",
        "Host": "pinky22.mpi-sws.org",
        "HRT": 47512618104661605,
        "Operation": "set",
        "Timestamp": "1557746285790.323730",
        "TenantClass": 0,
        "Source": "Receiver.java:117",
        "ThreadID": 15142,
        "ThreadName": "",
        "EventID": "D85C0640A52D2A16",
        "BaggageBytes": "[[248 5] [240 0] [0 3 30 213 124 38 78 123 83] [240 1] [0 220 133 114 192 97 169 134 62] [240 3] [0 2]]",
        "ProcessID": 28841
      },
      {
        "Cycles": 0,
        "Agent": "edu.brown.cs.systems.xtrace.logging.BaggageWrappers",
        "ProcessName": "Data",
        "TaskID": "031ED57C264E7B53",
        "ParentEventID": [
          "F7036799CEDF96EC"
        ],
        "Label": "Forking current baggage with Baggage.fork()",
        "Title": "X-Trace Task",
        "Host": "pinky22.mpi-sws.org",
        "HRT": 47512618104947776,
        "Operation": "fork",
        "Timestamp": "1557746285790.609863",
        "TenantClass": 0,
        "Source": "DataXceiver.java:1257",
        "ThreadID": 15142,
        "ThreadName": "",
        "EventID": "79A6AC0FB7E3D1F4",
        "BaggageBytes": "[[248 5] [240 0] [0 3 30 213 124 38 78 123 83] [240 1] [0 247 3 103 153 206 223 150 236] [240 3] [0 2]]",
        "ProcessID": 28841
      },
      {
        "Cycles": 0,
        "Agent": "edu.brown.cs.systems.xtrace.logging.XTraceInit",
        "ProcessName": "Data",
        "TaskID": "031ED57C264E7B53",
        "ParentEventID": [
          "D85C0640A52D2A16"
        ],
        "Label": "Thread.setName: DataXceiver for client DFSClient_NONMAPREDUCE_778905418_1 at /139.19.171.63:45362 [Sending block BP-1633380353-139.19.171.63-1554193446451:blk_1073761931_21107]",
        "Title": "X-Trace Task",
        "Host": "pinky22.mpi-sws.org",
        "HRT": 47512618104758472,
        "Timestamp": "1557746285790.420654",
        "TenantClass": 0,
        "Source": "DataXceiver.java:168",
        "ThreadID": 15142,
        "ThreadName": "",
        "EventID": "F7036799CEDF96EC",
        "BaggageBytes": "[[248 5] [240 0] [0 3 30 213 124 38 78 123 83] [240 1] [0 216 92 6 64 165 45 42 22] [240 3] [0 2]]",
        "ProcessID": 28841
      },
      {
        "Cycles": 0,
        "Agent": "Execution-Sleep",
        "ProcessName": "Read",
        "TaskID": "031ED57C264E7B53",
        "ParentEventID": [
          "DC8572C061A9863E"
        ],
        "Label": "waited",
        "Title": "X-Trace Task",
        "Host": "pinky19.mpi-sws.org",
        "Duration": "633635",
        "HRT": 26962645850537621,
        "Operation": "waited",
        "Timestamp": "1557746285790.745361",
        "TenantClass": 0,
        "Source": "SocketIOWithTimeout.java:335",
        "ThreadID": 1,
        "ThreadName": "",
        "EventID": "CDAA6CB7065D9F4E",
        "ProcessID": 36430
      },
      {
        "Cycles": 0,
        "Agent": "edu.brown.cs.systems.xtrace.logging.BaggageWrappers",
        "ProcessName": "Data",
        "TaskID": "031ED57C264E7B53",
        "ParentEventID": [
          "79A6AC0FB7E3D1F4"
        ],
        "Label": "Forking current baggage with Baggage.fork()",
        "Title": "X-Trace Task",
        "Host": "pinky22.mpi-sws.org",
        "HRT": 47512618105104217,
        "Operation": "fork",
        "Timestamp": "1557746285790.766357",
        "TenantClass": 0,
        "Source": "PacketHeader.java:95",
        "ThreadID": 15142,
        "ThreadName": "",
        "EventID": "D5032AB8D4454969",
        "BaggageBytes": "[[248 5] [240 0] [0 3 30 213 124 38 78 123 83] [240 1] [0 121 166 172 15 183 227 209 244] [240 3] [0 2]]",
        "ProcessID": 28841
      },
      {
        "Cycles": 0,
        "Agent": "Execution-Sleep",
        "ProcessName": "Read",
        "TaskID": "031ED57C264E7B53",
        "ParentEventID": [
          "4322F6E30EA7F121"
        ],
        "Label": "waited",
        "Title": "X-Trace Task",
        "Host": "pinky19.mpi-sws.org",
        "Duration": "39742",
        "HRT": 26962645850684329,
        "Operation": "waited",
        "Timestamp": "1557746285790.892090",
        "TenantClass": 0,
        "Source": "SocketIOWithTimeout.java:335",
        "ThreadID": 1,
        "ThreadName": "",
        "EventID": "A2AC2C3C79D1FD5F",
        "ProcessID": 36430
      },
      {
        "Cycles": 0,
        "Agent": "edu.brown.cs.systems.xtrace.logging.BaggageWrappers",
        "ProcessName": "Read",
        "TaskID": "031ED57C264E7B53",
        "ParentEventID": [
          "79A6AC0FB7E3D1F4",
          "CDAA6CB7065D9F4E"
        ],
        "Label": "Merged current baggage with other baggage",
        "Title": "X-Trace Task",
        "Host": "pinky19.mpi-sws.org",
        "HRT": 26962645850593660,
        "Operation": "join",
        "Timestamp": "1557746285790.801514",
        "TenantClass": 0,
        "Source": "RemoteBlockReader2.java:429",
        "ThreadID": 1,
        "ThreadName": "",
        "EventID": "4322F6E30EA7F121",
        "ProcessID": 36430
      },
      {
        "Cycles": 0,
        "Agent": "Execution-Sleep",
        "ProcessName": "Data",
        "TaskID": "031ED57C264E7B53",
        "ParentEventID": [
          "D5032AB8D4454969"
        ],
        "Label": "waited",
        "Title": "X-Trace Task",
        "Host": "pinky22.mpi-sws.org",
        "Duration": "9067",
        "HRT": 47512618105238717,
        "Operation": "waited",
        "Timestamp": "1557746285790.900879",
        "TenantClass": 0,
        "Source": "SocketIOWithTimeout.java:335",
        "ThreadID": 15142,
        "ThreadName": "",
        "EventID": "C3D06F308F23C028",
        "BaggageBytes": "[[248 5] [240 0] [0 3 30 213 124 38 78 123 83] [240 1] [0 213 3 42 184 212 69 73 105] [240 3] [0 2]]",
        "ProcessID": 28841
      },
      {
        "Cycles": 0,
        "Agent": "edu.brown.cs.systems.xtrace.logging.BaggageWrappers",
        "ProcessName": "Data",
        "TaskID": "031ED57C264E7B53",
        "ParentEventID": [
          "C3D06F308F23C028"
        ],
        "Label": "Forking current baggage with Baggage.fork()",
        "Title": "X-Trace Task",
        "Host": "pinky22.mpi-sws.org",
        "HRT": 47512618105431151,
        "Operation": "fork",
        "Timestamp": "1557746285791.093262",
        "TenantClass": 0,
        "Source": "PacketHeader.java:95",
        "ThreadID": 15142,
        "ThreadName": "",
        "EventID": "060C3F2ECF9F68FB",
        "BaggageBytes": "[[248 5] [240 0] [0 3 30 213 124 38 78 123 83] [240 1] [0 195 208 111 48 143 35 192 40] [240 3] [0 2]]",
        "ProcessID": 28841
      },
      {
        "Cycles": 0,
        "Agent": "Execution-Sleep",
        "ProcessName": "Read",
        "TaskID": "031ED57C264E7B53",
        "ParentEventID": [
          "A2AC2C3C79D1FD5F"
        ],
        "Label": "waited",
        "Title": "X-Trace Task",
        "Host": "pinky19.mpi-sws.org",
        "Duration": "208676",
        "HRT": 26962645850961542,
        "Operation": "waited",
        "Timestamp": "1557746285791.169434",
        "TenantClass": 0,
        "Source": "SocketIOWithTimeout.java:335",
        "ThreadID": 1,
        "ThreadName": "",
        "EventID": "EE9C818C6CD5720A",
        "ProcessID": 36430
      },
      {
        "Cycles": 0,
        "Agent": "edu.brown.cs.systems.xtrace.logging.BaggageWrappers",
        "ProcessName": "Read",
        "TaskID": "031ED57C264E7B53",
        "ParentEventID": [
          "8399DD85D03B3238",
          "060C3F2ECF9F68FB"
        ],
        "Label": "Merged current baggage with other baggage",
        "Title": "X-Trace Task",
        "Host": "pinky19.mpi-sws.org",
        "HRT": 26962645851142460,
        "Operation": "join",
        "Timestamp": "1557746285791.350342",
        "TenantClass": 0,
        "Source": "PacketHeader.java:168",
        "ThreadID": 1,
        "ThreadName": "",
        "EventID": "D646959191092A74",
        "ProcessID": 36430
      },
      {
        "Cycles": 0,
        "Agent": "edu.brown.cs.systems.xtrace.logging.BaggageWrappers",
        "ProcessName": "Read",
        "TaskID": "031ED57C264E7B53",
        "ParentEventID": [
          "D5032AB8D4454969",
          "EE9C818C6CD5720A"
        ],
        "Label": "Merged current baggage with other baggage",
        "Title": "X-Trace Task",
        "Host": "pinky19.mpi-sws.org",
        "HRT": 26962645851074160,
        "Operation": "join",
        "Timestamp": "1557746285791.281982",
        "TenantClass": 0,
        "Source": "PacketHeader.java:168",
        "ThreadID": 1,
        "ThreadName": "",
        "EventID": "8399DD85D03B3238",
        "ProcessID": 36430
      },
      {
        "Cycles": 0,
        "Agent": "edu.brown.cs.systems.xtrace.logging.BaggageWrappers",
        "ProcessName": "Read",
        "TaskID": "031ED57C264E7B53",
        "ParentEventID": [
          "D646959191092A74"
        ],
        "Label": "Forking current baggage with Baggage.fork()",
        "Title": "X-Trace Task",
        "Host": "pinky19.mpi-sws.org",
        "HRT": 26962645851153063,
        "Operation": "fork",
        "Timestamp": "1557746285791.360840",
        "TenantClass": 0,
        "Source": "RemoteBlockReader2.java:361",
        "ThreadID": 1,
        "ThreadName": "",
        "EventID": "3700F78C8A164774",
        "ProcessID": 36430
      },
      {
        "Cycles": 0,
        "Agent": "Execution-Sleep",
        "ProcessName": "Data",
        "TaskID": "031ED57C264E7B53",
        "ParentEventID": [
          "060C3F2ECF9F68FB"
        ],
        "Label": "waited",
        "Title": "X-Trace Task",
        "Host": "pinky22.mpi-sws.org",
        "Duration": "157517",
        "HRT": 47512618105780202,
        "Operation": "waited",
        "Timestamp": "1557746285791.442383",
        "TenantClass": 0,
        "Source": "SocketIOWithTimeout.java:335",
        "ThreadID": 15142,
        "ThreadName": "",
        "EventID": "84BCD1F996ED314E",
        "BaggageBytes": "[[248 5] [240 0] [0 3 30 213 124 38 78 123 83] [240 1] [0 6 12 63 46 207 159 104 251] [240 3] [0 2]]",
        "ProcessID": 28841
      },
      {
        "Cycles": 0,
        "Agent": "edu.brown.cs.systems.xtrace.logging.BaggageWrappers",
        "ProcessName": "Data",
        "TaskID": "031ED57C264E7B53",
        "ParentEventID": [
          "3700F78C8A164774",
          "84BCD1F996ED314E"
        ],
        "Label": "Merged current baggage with other baggage",
        "Title": "X-Trace Task",
        "Host": "pinky22.mpi-sws.org",
        "HRT": 47512618105890432,
        "Operation": "join",
        "Timestamp": "1557746285791.552734",
        "TenantClass": 0,
        "Source": "DataXceiver.java:574",
        "ThreadID": 15142,
        "ThreadName": "",
        "EventID": "8D7FF3D34BA06E54",
        "BaggageBytes": "[[248 5] [240 0] [0 3 30 213 124 38 78 123 83] [240 1] [0 132 188 209 249 150 237 49 78] [0 55 0 247 140 138 22 71 116] [240 3] [0 2]]",
        "ProcessID": 28841
      },
      {
        "Cycles": 0,
        "Agent": "Execution-CPU",
        "ProcessName": "Data",
        "TaskID": "031ED57C264E7B53",
        "ParentEventID": [
          "8D7FF3D34BA06E54"
        ],
        "Label": "unset",
        "Title": "X-Trace Task",
        "Host": "pinky22.mpi-sws.org",
        "Duration": "1200723",
        "HRT": 47512618105931062,
        "Operation": "unset",
        "Timestamp": "1557746285791.593262",
        "TenantClass": 0,
        "Source": "DataXceiver.java:261",
        "ThreadID": 15142,
        "ThreadName": "",
        "EventID": "06BEFFD7B2922AD7",
        "BaggageBytes": "[[248 5] [240 0] [0 3 30 213 124 38 78 123 83] [240 1] [0 141 127 243 211 75 160 110 84] [240 3] [0 2]]",
        "ProcessID": 28841
      },
      {
        "Cycles": 0,
        "Agent": "edu.brown.cs.systems.retro.benchmarks.hdfs_client.Reader",
        "ProcessName": "Read",
        "TaskID": "031ED57C264E7B53",
        "ParentEventID": [
          "0"
        ],
        "Label": "Reading file",
        "Title": "X-Trace Task",
        "Host": "pinky19.mpi-sws.org",
        "HRT": 26962645848927315,
        "Timestamp": "1557746285789.135254",
        "TenantClass": 0,
        "ThreadID": 1,
        "ThreadName": "",
        "EventID": "128BDC9DC37C35A0",
        "ProcessID": 36430,
        "Tag": [
          "reader_10kb",
          "Read Size: 10240"
        ]
      }
    ]
  }
]