[
  {
    "id": "40543800AE885FA5",
    "reports": [
      {
        "Cycles": 0,
        "Agent": "org.apache.hadoop.ipc.ProtobufRpcEngine",
        "ProcessName": "Read",
        "TaskID": "40543800AE885FA5",
        "ParentEventID": [
          "CBD1458AD2027152"
        ],
        "Label": "Invoking org.apache.hadoop.hdfs.protocol.ClientProtocol.getBlockLocations",
        "Title": "X-Trace Task",
        "Host": "pinky19.mpi-sws.org",
        "HRT": 26966729940270479,
        "Timestamp": "1557750369880.347168",
        "TenantClass": 0,
        "Source": "ProtobufRpcEngine.java:228",
        "ThreadID": 1,
        "ThreadName": "",
        "EventID": "8CD672DEA08A6DEB",
        "ProcessID": 2801
      },
      {
        "Cycles": 0,
        "Agent": "Execution-CPU",
        "ProcessName": "Read",
        "TaskID": "40543800AE885FA5",
        "ParentEventID": [
          "8CD672DEA08A6DEB"
        ],
        "Label": "unset",
        "Title": "X-Trace Task",
        "Host": "pinky19.mpi-sws.org",
        "Duration": "24426471",
        "HRT": 26966729940290880,
        "Operation": "unset",
        "Timestamp": "1557750369880.367676",
        "TenantClass": 0,
        "Source": "Client.java:1027",
        "ThreadID": 1,
        "ThreadName": "",
        "EventID": "C51D7FFF89B06CE0",
        "ProcessID": 2801
      },
      {
        "Cycles": 0,
        "Agent": "edu.brown.cs.systems.retro.benchmarks.hdfs_client.Reader",
        "ProcessName": "Read",
        "TaskID": "40543800AE885FA5",
        "ParentEventID": [
          "219EE191BC035857"
        ],
        "Label": "Reading file",
        "Title": "X-Trace Task",
        "Host": "pinky19.mpi-sws.org",
        "HRT": 26966729940214092,
        "Timestamp": "1557750369880.290771",
        "TenantClass": 0,
        "ThreadID": 1,
        "ThreadName": "",
        "EventID": "CBD1458AD2027152",
        "ProcessID": 2801
      },
      {
        "Cycles": 0,
        "Agent": "edu.brown.cs.systems.xtrace.logging.BaggageWrappers",
        "ProcessName": "Read",
        "TaskID": "40543800AE885FA5",
        "ParentEventID": [
          "8794F3E2CC90ADA0"
        ],
        "Label": "Forking current baggage with Baggage.fork()",
        "Title": "X-Trace Task",
        "Host": "pinky19.mpi-sws.org",
        "HRT": 26966729940330532,
        "Operation": "fork",
        "Timestamp": "1557750369880.407227",
        "TenantClass": 0,
        "Source": "Client.java:1043",
        "ThreadID": 41,
        "ThreadName": "",
        "EventID": "E65F45A51106374D",
        "ProcessID": 2801
      },
      {
        "Cycles": 0,
        "Agent": "Execution-CPU",
        "ProcessName": "Read",
        "TaskID": "40543800AE885FA5",
        "ParentEventID": [
          "C51D7FFF89B06CE0"
        ],
        "Label": "set",
        "Title": "X-Trace Task",
        "Host": "pinky19.mpi-sws.org",
        "HRT": 26966729940312157,
        "Operation": "set",
        "Timestamp": "1557750369880.388916",
        "TenantClass": 0,
        "Source": "Client.java:1032",
        "ThreadID": 41,
        "ThreadName": "",
        "EventID": "8794F3E2CC90ADA0",
        "ProcessID": 2801
      },
      {
        "Cycles": 0,
        "Agent": "Execution-CPU",
        "ProcessName": "Read",
        "TaskID": "40543800AE885FA5",
        "ParentEventID": [
          "E65F45A51106374D"
        ],
        "Label": "unset",
        "Title": "X-Trace Task",
        "Host": "pinky19.mpi-sws.org",
        "Duration": "62479",
        "HRT": 26966729940393169,
        "Operation": "unset",
        "Timestamp": "1557750369880.469971",
        "TenantClass": 0,
        "Source": "Client.java:1062",
        "ThreadID": 41,
        "ThreadName": "",
        "EventID": "BCB34795B6307844",
        "ProcessID": 2801
      },
      {
        "Cycles": 0,
        "Agent": "Execution-CPU",
        "ProcessName": "Name",
        "TaskID": "40543800AE885FA5",
        "ParentEventID": [
          "E65F45A51106374D"
        ],
        "Label": "set",
        "Title": "X-Trace Task",
        "Host": "pinky19.mpi-sws.org",
        "HRT": 26966729940447605,
        "Operation": "set",
        "Timestamp": "1557750369880.549072",
        "TenantClass": 0,
        "Source": "Server.java:1840",
        "ThreadID": 48,
        "ThreadName": "",
        "EventID": "DEB8CA7527806D5C",
        "BaggageBytes": "[[248 5] [240 0] [0 64 84 56 0 174 136 95 165] [240 1] [0 230 95 69 165 17 6 55 77] [240 3] [0 2]]",
        "ProcessID": 2171
      },
      {
        "Cycles": 0,
        "Agent": "edu.brown.cs.systems.xtrace.logging.BaggageWrappers",
        "ProcessName": "Name",
        "TaskID": "40543800AE885FA5",
        "ParentEventID": [
          "DEB8CA7527806D5C"
        ],
        "Label": "Forking current baggage with Baggage.fork()",
        "Title": "X-Trace Task",
        "Host": "pinky19.mpi-sws.org",
        "HRT": 26966729940478374,
        "Operation": "fork",
        "Timestamp": "1557750369880.579834",
        "TenantClass": 0,
        "Source": "Server.java:550",
        "ThreadID": 48,
        "ThreadName": "",
        "EventID": "96D4072295BFE882",
        "BaggageBytes": "[[248 5] [240 0] [0 64 84 56 0 174 136 95 165] [240 1] [0 222 184 202 117 39 128 109 92] [240 3] [0 2]]",
        "ProcessID": 2171
      },
      {
        "Cycles": 0,
        "Agent": "Execution-CPU",
        "ProcessName": "Name",
        "TaskID": "40543800AE885FA5",
        "ParentEventID": [
          "96D4072295BFE882"
        ],
        "Label": "unset",
        "Title": "X-Trace Task",
        "Host": "pinky19.mpi-sws.org",
        "Duration": "24727",
        "HRT": 26966729940499100,
        "Operation": "unset",
        "Timestamp": "1557750369880.600586",
        "TenantClass": 0,
        "Source": "Server.java:1828",
        "ThreadID": 48,
        "ThreadName": "",
        "EventID": "980512B2EB0FD9B9",
        "BaggageBytes": "[[248 5] [240 0] [0 64 84 56 0 174 136 95 165] [240 1] [0 150 212 7 34 149 191 232 130] [240 3] [0 2]]",
        "ProcessID": 2171
      },
      {
        "Cycles": 0,
        "Agent": "Execution-CPU",
        "ProcessName": "Name",
        "TaskID": "40543800AE885FA5",
        "ParentEventID": [
          "96D4072295BFE882"
        ],
        "Label": "set",
        "Title": "X-Trace Task",
        "Host": "pinky19.mpi-sws.org",
        "HRT": 26966729940510176,
        "Operation": "set",
        "Timestamp": "1557750369880.611572",
        "TenantClass": 0,
        "Source": "Server.java:2071",
        "ThreadID": 63,
        "ThreadName": "",
        "EventID": "E0BAE20298C979B4",
        "BaggageBytes": "[[248 5] [240 0] [0 64 84 56 0 174 136 95 165] [240 1] [0 150 212 7 34 149 191 232 130] [240 3] [0 2]]",
        "ProcessID": 2171
      },
      {
        "Cycles": 0,
        "Agent": "Execution-CPU",
        "ProcessName": "Read",
        "TaskID": "40543800AE885FA5",
        "ParentEventID": [
          "BCB34795B6307844"
        ],
        "Label": "set",
        "Title": "X-Trace Task",
        "Host": "pinky19.mpi-sws.org",
        "HRT": 26966729940423705,
        "Operation": "set",
        "Timestamp": "1557750369880.500488",
        "TenantClass": 0,
        "Source": "Client.java:1104",
        "ThreadID": 1,
        "ThreadName": "",
        "EventID": "E852E0F6C9090632",
        "ProcessID": 2801
      },
      {
        "Cycles": 0,
        "Agent": "org.apache.hadoop.ipc.Server",
        "ProcessName": "Name",
        "TaskID": "40543800AE885FA5",
        "ParentEventID": [
          "E0BAE20298C979B4"
        ],
        "Label": "getBlockLocations in org.apache.hadoop.hdfs.protocol.ClientProtocol",
        "Title": "X-Trace Task",
        "Host": "pinky19.mpi-sws.org",
        "HRT": 26966729940551617,
        "Timestamp": "1557750369880.653076",
        "TenantClass": 0,
        "Source": "ProtobufRpcEngine.java:601",
        "ThreadID": 63,
        "ThreadName": "",
        "EventID": "3976E0800B61ACFE",
        "BaggageBytes": "[[248 5] [240 0] [0 64 84 56 0 174 136 95 165] [240 1] [0 224 186 226 2 152 201 121 180] [240 3] [0 2]]",
        "ProcessID": 2171
      },
      {
        "Cycles": 0,
        "Agent": "edu.brown.cs.systems.xtrace.logging.BaggageWrappers",
        "ProcessName": "Name",
        "TaskID": "40543800AE885FA5",
        "ParentEventID": [
          "DA2C702FCE8CC722"
        ],
        "Label": "Forking current baggage with Baggage.fork()",
        "Title": "X-Trace Task",
        "Host": "pinky19.mpi-sws.org",
        "HRT": 26966729940639899,
        "Operation": "fork",
        "Timestamp": "1557750369880.741455",
        "TenantClass": 0,
        "Source": "Server.java:2398",
        "ThreadID": 63,
        "ThreadName": "",
        "EventID": "01685B5993D53C38",
        "BaggageBytes": "[[248 5] [240 0] [0 64 84 56 0 174 136 95 165] [240 1] [0 218 44 112 47 206 140 199 34] [240 3] [0 2]]",
        "ProcessID": 2171
      },
      {
        "Cycles": 0,
        "Agent": "org.apache.hadoop.hdfs.server.namenode.FSNamesystem.audit",
        "ProcessName": "Name",
        "TaskID": "40543800AE885FA5",
        "ParentEventID": [
          "3976E0800B61ACFE"
        ],
        "Label": "allowed=true\tugi=plascas (auth:SIMPLE)\tip=/139.19.171.63\tcmd=open\tsrc=/ds/u97JhtLIbdcbaWVY\tdst=null\tperm=null\tproto=rpc",
        "Title": "X-Trace Task",
        "Host": "pinky19.mpi-sws.org",
        "HRT": 26966729940595428,
        "Timestamp": "1557750369880.697021",
        "TenantClass": 0,
        "Source": "FSNamesystem.java:8313",
        "ThreadID": 63,
        "ThreadName": "",
        "EventID": "DA2C702FCE8CC722",
        "BaggageBytes": "[[248 5] [240 0] [0 64 84 56 0 174 136 95 165] [240 1] [0 57 118 224 128 11 97 172 254] [240 3] [0 2]]",
        "ProcessID": 2171
      },
      {
        "Cycles": 0,
        "Agent": "Execution-CPU",
        "ProcessName": "Name",
        "TaskID": "40543800AE885FA5",
        "ParentEventID": [
          "01685B5993D53C38"
        ],
        "Label": "unset",
        "Title": "X-Trace Task",
        "Host": "pinky19.mpi-sws.org",
        "Duration": "211272",
        "HRT": 26966729940748967,
        "Operation": "unset",
        "Timestamp": "1557750369880.850586",
        "TenantClass": 0,
        "Source": "Server.java:1058",
        "ThreadID": 63,
        "ThreadName": "",
        "EventID": "9C4B51D05E85B88A",
        "BaggageBytes": "[[248 5] [240 0] [0 64 84 56 0 174 136 95 165] [240 1] [0 1 104 91 89 147 213 60 56] [240 3] [0 2]]",
        "ProcessID": 2171
      },
      {
        "Cycles": 0,
        "Agent": "Execution-CPU",
        "ProcessName": "Read",
        "TaskID": "40543800AE885FA5",
        "ParentEventID": [
          "D71A51B0E3BC39FF"
        ],
        "Label": "unset",
        "Title": "X-Trace Task",
        "Host": "pinky19.mpi-sws.org",
        "Duration": "6671",
        "HRT": 26966729940829549,
        "Operation": "unset",
        "Timestamp": "1557750369880.906250",
        "TenantClass": 0,
        "Source": "Client.java:1168",
        "ThreadID": 40,
        "ThreadName": "",
        "EventID": "9F646DCB55644813",
        "ProcessID": 2801
      },
      {
        "Cycles": 0,
        "Agent": "Execution-CPU",
        "ProcessName": "Read",
        "TaskID": "40543800AE885FA5",
        "ParentEventID": [
          "01685B5993D53C38"
        ],
        "Label": "set",
        "Title": "X-Trace Task",
        "Host": "pinky19.mpi-sws.org",
        "HRT": 26966729940806529,
        "Operation": "set",
        "Timestamp": "1557750369880.883301",
        "TenantClass": 0,
        "Source": "Client.java:302",
        "ThreadID": 40,
        "ThreadName": "",
        "EventID": "D71A51B0E3BC39FF",
        "ProcessID": 2801
      },
      {
        "Cycles": 0,
        "Agent": "Execution-Sleep",
        "ProcessName": "Read",
        "TaskID": "40543800AE885FA5",
        "ParentEventID": [
          "E852E0F6C9090632"
        ],
        "Label": "waited",
        "Title": "X-Trace Task",
        "Host": "pinky19.mpi-sws.org",
        "Duration": "411414",
        "HRT": 26966729940853034,
        "Operation": "waited",
        "Timestamp": "1557750369880.929688",
        "TenantClass": 0,
        "Source": "Client.java:1537",
        "ThreadID": 1,
        "ThreadName": "",
        "EventID": "B1D55A6ED9E4FCC7",
        "ProcessID": 2801
      },
      {
        "Cycles": 0,
        "Agent": "edu.brown.cs.systems.xtrace.logging.BaggageWrappers",
        "ProcessName": "Read",
        "TaskID": "40543800AE885FA5",
        "ParentEventID": [
          "9F646DCB55644813",
          "B1D55A6ED9E4FCC7"
        ],
        "Label": "Merged current baggage with other baggage",
        "Title": "X-Trace Task",
        "Host": "pinky19.mpi-sws.org",
        "HRT": 26966729940872704,
        "Operation": "join",
        "Timestamp": "1557750369880.949463",
        "TenantClass": 0,
        "Source": "Client.java:1545",
        "ThreadID": 1,
        "ThreadName": "",
        "EventID": "A4A06CB647743DF8",
        "ProcessID": 2801
      },
      {
        "Cycles": 0,
        "Agent": "org.apache.hadoop.ipc.ProtobufRpcEngine",
        "ProcessName": "Read",
        "TaskID": "40543800AE885FA5",
        "ParentEventID": [
          "A4A06CB647743DF8"
        ],
        "Label": "org.apache.hadoop.hdfs.protocol.ClientProtocol.getBlockLocations completed",
        "Title": "X-Trace Task",
        "Host": "pinky19.mpi-sws.org",
        "HRT": 26966729940919799,
        "Timestamp": "1557750369880.996582",
        "TenantClass": 0,
        "Source": "ProtobufRpcEngine.java:275",
        "ThreadID": 1,
        "ThreadName": "",
        "EventID": "9E006A9654932E19",
        "ProcessID": 2801
      },
      {
        "Cycles": 0,
        "Agent": "edu.brown.cs.systems.xtrace.logging.BaggageWrappers",
        "ProcessName": "Read",
        "TaskID": "40543800AE885FA5",
        "ParentEventID": [
          "A58FA8AD9A681A3C"
        ],
        "Label": "Forking current baggage with Baggage.fork()",
        "Title": "X-Trace Task",
        "Host": "pinky19.mpi-sws.org",
        "HRT": 26966729941075660,
        "Operation": "fork",
        "Timestamp": "1557750369881.152344",
        "TenantClass": 0,
        "Source": "DataTransferProtoUtil.java:94",
        "ThreadID": 1,
        "ThreadName": "",
        "EventID": "2871E3B825998BE5",
        "ProcessID": 2801
      },
      {
        "Cycles": 0,
        "Agent": "Execution-Sleep",
        "ProcessName": "Read",
        "TaskID": "40543800AE885FA5",
        "ParentEventID": [
          "9E006A9654932E19"
        ],
        "Label": "waited",
        "Title": "X-Trace Task",
        "Host": "pinky19.mpi-sws.org",
        "Duration": "4627",
        "HRT": 26966729941031465,
        "Operation": "waited",
        "Timestamp": "1557750369881.108154",
        "TenantClass": 0,
        "Source": "SocketIOWithTimeout.java:335",
        "ThreadID": 1,
        "ThreadName": "",
        "EventID": "A58FA8AD9A681A3C",
        "ProcessID": 2801
      },
      {
        "Cycles": 0,
        "Agent": "Execution-CPU",
        "ProcessName": "Data",
        "TaskID": "40543800AE885FA5",
        "ParentEventID": [
          "2871E3B825998BE5"
        ],
        "Label": "set",
        "Title": "X-Trace Task",
        "Host": "pinky19.mpi-sws.org",
        "HRT": 26966729941208229,
        "Operation": "set",
        "Timestamp": "1557750369881.296875",
        "TenantClass": 0,
        "Source": "Receiver.java:117",
        "ThreadID": 38343,
        "ThreadName": "",
        "EventID": "EE7DE5020429C12D",
        "BaggageBytes": "[[248 5] [240 0] [0 64 84 56 0 174 136 95 165] [240 1] [0 40 113 227 184 37 153 139 229] [240 3] [0 2]]",
        "ProcessID": 2319
      },
      {
        "Cycles": 0,
        "Agent": "edu.brown.cs.systems.xtrace.logging.BaggageWrappers",
        "ProcessName": "Data",
        "TaskID": "40543800AE885FA5",
        "ParentEventID": [
          "F57988395527D7A1"
        ],
        "Label": "Forking current baggage with Baggage.fork()",
        "Title": "X-Trace Task",
        "Host": "pinky19.mpi-sws.org",
        "HRT": 26966729941335140,
        "Operation": "fork",
        "Timestamp": "1557750369881.423828",
        "TenantClass": 0,
        "Source": "DataXceiver.java:1257",
        "ThreadID": 38343,
        "ThreadName": "",
        "EventID": "1D90D142AB5A8743",
        "BaggageBytes": "[[248 5] [240 0] [0 64 84 56 0 174 136 95 165] [240 1] [0 245 121 136 57 85 39 215 161] [240 3] [0 2]]",
        "ProcessID": 2319
      },
      {
        "Cycles": 0,
        "Agent": "edu.brown.cs.systems.xtrace.logging.XTraceInit",
        "ProcessName": "Data",
        "TaskID": "40543800AE885FA5",
        "ParentEventID": [
          "EE7DE5020429C12D"
        ],
        "Label": "Thread.setName: DataXceiver for client DFSClient_NONMAPREDUCE_310321604_1 at /139.19.171.63:57284 [Sending block BP-1633380353-139.19.171.63-1554193446451:blk_1073763875_23051]",
        "Title": "X-Trace Task",
        "Host": "pinky19.mpi-sws.org",
        "HRT": 26966729941248179,
        "Timestamp": "1557750369881.336670",
        "TenantClass": 0,
        "Source": "DataXceiver.java:168",
        "ThreadID": 38343,
        "ThreadName": "",
        "EventID": "F57988395527D7A1",
        "BaggageBytes": "[[248 5] [240 0] [0 64 84 56 0 174 136 95 165] [240 1] [0 238 125 229 2 4 41 193 45] [240 3] [0 2]]",
        "ProcessID": 2319
      },
      {
        "Cycles": 0,
        "Agent": "edu.brown.cs.systems.xtrace.logging.BaggageWrappers",
        "ProcessName": "Data",
        "TaskID": "40543800AE885FA5",
        "ParentEventID": [
          "1D90D142AB5A8743"
        ],
        "Label": "Forking current baggage with Baggage.fork()",
        "Title": "X-Trace Task",
        "Host": "pinky19.mpi-sws.org",
        "HRT": 26966729941417066,
        "Operation": "fork",
        "Timestamp": "1557750369881.505615",
        "TenantClass": 0,
        "Source": "PacketHeader.java:95",
        "ThreadID": 38343,
        "ThreadName": "",
        "EventID": "46BD6CF23ADD4029",
        "BaggageBytes": "[[248 5] [240 0] [0 64 84 56 0 174 136 95 165] [240 1] [0 29 144 209 66 171 90 135 67] [240 3] [0 2]]",
        "ProcessID": 2319
      },
      {
        "Cycles": 0,
        "Agent": "Execution-Sleep",
        "ProcessName": "Read",
        "TaskID": "40543800AE885FA5",
        "ParentEventID": [
          "2871E3B825998BE5"
        ],
        "Label": "waited",
        "Title": "X-Trace Task",
        "Host": "pinky19.mpi-sws.org",
        "Duration": "246284",
        "HRT": 26966729941410984,
        "Operation": "waited",
        "Timestamp": "1557750369881.487793",
        "TenantClass": 0,
        "Source": "SocketIOWithTimeout.java:335",
        "ThreadID": 1,
        "ThreadName": "",
        "EventID": "003952F07366B8A4",
        "ProcessID": 2801
      },
      {
        "Cycles": 0,
        "Agent": "Execution-Sleep",
        "ProcessName": "Data",
        "TaskID": "40543800AE885FA5",
        "ParentEventID": [
          "46BD6CF23ADD4029"
        ],
        "Label": "waited",
        "Title": "X-Trace Task",
        "Host": "pinky19.mpi-sws.org",
        "Duration": "5723",
        "HRT": 26966729941487200,
        "Operation": "waited",
        "Timestamp": "1557750369881.575684",
        "TenantClass": 0,
        "Source": "SocketIOWithTimeout.java:335",
        "ThreadID": 38343,
        "ThreadName": "",
        "EventID": "D3AC68AAD18BFCF6",
        "BaggageBytes": "[[248 5] [240 0] [0 64 84 56 0 174 136 95 165] [240 1] [0 70 189 108 242 58 221 64 41] [240 3] [0 2]]",
        "ProcessID": 2319
      },
      {
        "Cycles": 0,
        "Agent": "edu.brown.cs.systems.xtrace.logging.BaggageWrappers",
        "ProcessName": "Data",
        "TaskID": "40543800AE885FA5",
        "ParentEventID": [
          "D3AC68AAD18BFCF6"
        ],
        "Label": "Forking current baggage with Baggage.fork()",
        "Title": "X-Trace Task",
        "Host": "pinky19.mpi-sws.org",
        "HRT": 26966729941564777,
        "Operation": "fork",
        "Timestamp": "1557750369881.653320",
        "TenantClass": 0,
        "Source": "PacketHeader.java:95",
        "ThreadID": 38343,
        "ThreadName": "",
        "EventID": "CBC49CA79028903D",
        "BaggageBytes": "[[248 5] [240 0] [0 64 84 56 0 174 136 95 165] [240 1] [0 211 172 104 170 209 139 252 246] [240 3] [0 2]]",
        "ProcessID": 2319
      },
      {
        "Cycles": 0,
        "Agent": "edu.brown.cs.systems.xtrace.logging.BaggageWrappers",
        "ProcessName": "Read",
        "TaskID": "40543800AE885FA5",
        "ParentEventID": [
          "003952F07366B8A4",
          "1D90D142AB5A8743"
        ],
        "Label": "Merged current baggage with other baggage",
        "Title": "X-Trace Task",
        "Host": "pinky19.mpi-sws.org",
        "HRT": 26966729941505907,
        "Operation": "join",
        "Timestamp": "1557750369881.582764",
        "TenantClass": 0,
        "Source": "RemoteBlockReader2.java:429",
        "ThreadID": 1,
        "ThreadName": "",
        "EventID": "F12ED8B58A756CC9",
        "ProcessID": 2801
      },
      {
        "Cycles": 0,
        "Agent": "edu.brown.cs.systems.xtrace.logging.BaggageWrappers",
        "ProcessName": "Read",
        "TaskID": "40543800AE885FA5",
        "ParentEventID": [
          "46BD6CF23ADD4029",
          "F12ED8B58A756CC9"
        ],
        "Label": "Merged current baggage with other baggage",
        "Title": "X-Trace Task",
        "Host": "pinky19.mpi-sws.org",
        "HRT": 26966729941607294,
        "Operation": "join",
        "Timestamp": "1557750369881.684082",
        "TenantClass": 0,
        "Source": "PacketHeader.java:168",
        "ThreadID": 1,
        "ThreadName": "",
        "EventID": "AED0792473BE43B3",
        "ProcessID": 2801
      },
      {
        "Cycles": 0,
        "Agent": "edu.brown.cs.systems.xtrace.logging.BaggageWrappers",
        "ProcessName": "Read",
        "TaskID": "40543800AE885FA5",
        "ParentEventID": [
          "B9ADEA84CDCED782"
        ],
        "Label": "Forking current baggage with Baggage.fork()",
        "Title": "X-Trace Task",
        "Host": "pinky19.mpi-sws.org",
        "HRT": 26966729941723274,
        "Operation": "fork",
        "Timestamp": "1557750369881.800049",
        "TenantClass": 0,
        "Source": "RemoteBlockReader2.java:361",
        "ThreadID": 1,
        "ThreadName": "",
        "EventID": "574039BF52D85B3B",
        "ProcessID": 2801
      },
      {
        "Cycles": 0,
        "Agent": "edu.brown.cs.systems.xtrace.logging.BaggageWrappers",
        "ProcessName": "Read",
        "TaskID": "40543800AE885FA5",
        "ParentEventID": [
          "AED0792473BE43B3",
          "CBC49CA79028903D"
        ],
        "Label": "Merged current baggage with other baggage",
        "Title": "X-Trace Task",
        "Host": "pinky19.mpi-sws.org",
        "HRT": 26966729941714373,
        "Operation": "join",
        "Timestamp": "1557750369881.791016",
        "TenantClass": 0,
        "Source": "PacketHeader.java:168",
        "ThreadID": 1,
        "ThreadName": "",
        "EventID": "B9ADEA84CDCED782",
        "ProcessID": 2801
      },
      {
        "Cycles": 0,
        "Agent": "Execution-Sleep",
        "ProcessName": "Data",
        "TaskID": "40543800AE885FA5",
        "ParentEventID": [
          "CBC49CA79028903D"
        ],
        "Label": "waited",
        "Title": "X-Trace Task",
        "Host": "pinky19.mpi-sws.org",
        "Duration": "110793",
        "HRT": 26966729941767470,
        "Operation": "waited",
        "Timestamp": "1557750369881.855957",
        "TenantClass": 0,
        "Source": "SocketIOWithTimeout.java:335",
        "ThreadID": 38343,
        "ThreadName": "",
        "EventID": "DE8AFACC70195641",
        "BaggageBytes": "[[248 5] [240 0] [0 64 84 56 0 174 136 95 165] [240 1] [0 203 196 156 167 144 40 144 61] [240 3] [0 2]]",
        "ProcessID": 2319
      },
      {
        "Cycles": 0,
        "Agent": "edu.brown.cs.systems.xtrace.logging.BaggageWrappers",
        "ProcessName": "Read",
        "TaskID": "40543800AE885FA5",
        "ParentEventID": [
          "574039BF52D85B3B"
        ],
        "Label": "Forking current baggage with Baggage.fork()",
        "Title": "X-Trace Task",
        "Host": "pinky19.mpi-sws.org",
        "HRT": 26966729941788095,
        "Operation": "fork",
        "Timestamp": "1557750369881.864746",
        "TenantClass": 0,
        "Source": "DataTransferProtoUtil.java:94",
        "ThreadID": 1,
        "ThreadName": "",
        "EventID": "34E4AD347D9E1D9F",
        "ProcessID": 2801
      },
      {
        "Cycles": 0,
        "Agent": "edu.brown.cs.systems.xtrace.logging.BaggageWrappers",
        "ProcessName": "Data",
        "TaskID": "40543800AE885FA5",
        "ParentEventID": [
          "DE8AFACC70195641",
          "574039BF52D85B3B"
        ],
        "Label": "Merged current baggage with other baggage",
        "Title": "X-Trace Task",
        "Host": "pinky19.mpi-sws.org",
        "HRT": 26966729941822476,
        "Operation": "join",
        "Timestamp": "1557750369881.911133",
        "TenantClass": 0,
        "Source": "DataXceiver.java:574",
        "ThreadID": 38343,
        "ThreadName": "",
        "EventID": "88D6F39B15DD5F84",
        "BaggageBytes": "[[248 5] [240 0] [0 64 84 56 0 174 136 95 165] [240 1] [0 222 138 250 204 112 25 86 65] [0 87 64 57 191 82 216 91 59] [240 3] [0 2]]",
        "ProcessID": 2319
      },
      {
        "Cycles": 0,
        "Agent": "Execution-CPU",
        "ProcessName": "Data",
        "TaskID": "40543800AE885FA5",
        "ParentEventID": [
          "34E4AD347D9E1D9F"
        ],
        "Label": "set",
        "Title": "X-Trace Task",
        "Host": "pinky19.mpi-sws.org",
        "HRT": 26966729941915444,
        "Operation": "set",
        "Timestamp": "1557750369882.003906",
        "TenantClass": 0,
        "Source": "Receiver.java:117",
        "ThreadID": 38343,
        "ThreadName": "",
        "EventID": "29380F6A141E4847",
        "BaggageBytes": "[[248 5] [240 0] [0 64 84 56 0 174 136 95 165] [240 1] [0 52 228 173 52 125 158 29 159] [240 3] [0 2]]",
        "ProcessID": 2319
      },
      {
        "Cycles": 0,
        "Agent": "edu.brown.cs.systems.xtrace.logging.XTraceInit",
        "ProcessName": "Data",
        "TaskID": "40543800AE885FA5",
        "ParentEventID": [
          "29380F6A141E4847"
        ],
        "Label": "Thread.setName: DataXceiver for client DFSClient_NONMAPREDUCE_310321604_1 at /139.19.171.63:57284 [Sending block BP-1633380353-139.19.171.63-1554193446451:blk_1073763875_23051]",
        "Title": "X-Trace Task",
        "Host": "pinky19.mpi-sws.org",
        "HRT": 26966729941942816,
        "Timestamp": "1557750369882.031494",
        "TenantClass": 0,
        "Source": "DataXceiver.java:168",
        "ThreadID": 38343,
        "ThreadName": "",
        "EventID": "137E6C3A8B5707E7",
        "BaggageBytes": "[[248 5] [240 0] [0 64 84 56 0 174 136 95 165] [240 1] [0 41 56 15 106 20 30 72 71] [240 3] [0 2]]",
        "ProcessID": 2319
      },
      {
        "Cycles": 0,
        "Agent": "Execution-CPU",
        "ProcessName": "Data",
        "TaskID": "40543800AE885FA5",
        "ParentEventID": [
          "88D6F39B15DD5F84"
        ],
        "Label": "unset",
        "Title": "X-Trace Task",
        "Host": "pinky19.mpi-sws.org",
        "Duration": "612848",
        "HRT": 26966729941845303,
        "Operation": "unset",
        "Timestamp": "1557750369881.933838",
        "TenantClass": 0,
        "Source": "DataXceiver.java:261",
        "ThreadID": 38343,
        "ThreadName": "",
        "EventID": "FF9DDF5BE787D00D",
        "BaggageBytes": "[[248 5] [240 0] [0 64 84 56 0 174 136 95 165] [240 1] [0 136 214 243 155 21 221 95 132] [240 3] [0 2]]",
        "ProcessID": 2319
      },
      {
        "Cycles": 0,
        "Agent": "edu.brown.cs.systems.xtrace.logging.BaggageWrappers",
        "ProcessName": "Data",
        "TaskID": "40543800AE885FA5",
        "ParentEventID": [
          "137E6C3A8B5707E7"
        ],
        "Label": "Forking current baggage with Baggage.fork()",
        "Title": "X-Trace Task",
        "Host": "pinky19.mpi-sws.org",
        "HRT": 26966729942005047,
        "Operation": "fork",
        "Timestamp": "1557750369882.093506",
        "TenantClass": 0,
        "Source": "DataXceiver.java:1257",
        "ThreadID": 38343,
        "ThreadName": "",
        "EventID": "A7985EB449BDE843",
        "BaggageBytes": "[[248 5] [240 0] [0 64 84 56 0 174 136 95 165] [240 1] [0 19 126 108 58 139 87 7 231] [240 3] [0 2]]",
        "ProcessID": 2319
      },
      {
        "Cycles": 0,
        "Agent": "Execution-Sleep",
        "ProcessName": "Read",
        "TaskID": "40543800AE885FA5",
        "ParentEventID": [
          "34E4AD347D9E1D9F"
        ],
        "Label": "waited",
        "Title": "X-Trace Task",
        "Host": "pinky19.mpi-sws.org",
        "Duration": "188624",
        "HRT": 26966729942060105,
        "Operation": "waited",
        "Timestamp": "1557750369882.136963",
        "TenantClass": 0,
        "Source": "SocketIOWithTimeout.java:335",
        "ThreadID": 1,
        "ThreadName": "",
        "EventID": "D81C5AA91F319037",
        "ProcessID": 2801
      },
      {
        "Cycles": 0,
        "Agent": "edu.brown.cs.systems.xtrace.logging.BaggageWrappers",
        "ProcessName": "Data",
        "TaskID": "40543800AE885FA5",
        "ParentEventID": [
          "A7985EB449BDE843"
        ],
        "Label": "Forking current baggage with Baggage.fork()",
        "Title": "X-Trace Task",
        "Host": "pinky19.mpi-sws.org",
        "HRT": 26966729942061348,
        "Operation": "fork",
        "Timestamp": "1557750369882.149902",
        "TenantClass": 0,
        "Source": "PacketHeader.java:95",
        "ThreadID": 38343,
        "ThreadName": "",
        "EventID": "C069C7B3FA529AF3",
        "BaggageBytes": "[[248 5] [240 0] [0 64 84 56 0 174 136 95 165] [240 1] [0 167 152 94 180 73 189 232 67] [240 3] [0 2]]",
        "ProcessID": 2319
      },
      {
        "Cycles": 0,
        "Agent": "Execution-Sleep",
        "ProcessName": "Data",
        "TaskID": "40543800AE885FA5",
        "ParentEventID": [
          "C069C7B3FA529AF3"
        ],
        "Label": "waited",
        "Title": "X-Trace Task",
        "Host": "pinky19.mpi-sws.org",
        "Duration": "4257",
        "HRT": 26966729942120868,
        "Operation": "waited",
        "Timestamp": "1557750369882.209473",
        "TenantClass": 0,
        "Source": "SocketIOWithTimeout.java:335",
        "ThreadID": 38343,
        "ThreadName": "",
        "EventID": "5E950701816E9ABF",
        "BaggageBytes": "[[248 5] [240 0] [0 64 84 56 0 174 136 95 165] [240 1] [0 192 105 199 179 250 82 154 243] [240 3] [0 2]]",
        "ProcessID": 2319
      },
      {
        "Cycles": 0,
        "Agent": "edu.brown.cs.systems.xtrace.logging.BaggageWrappers",
        "ProcessName": "Read",
        "TaskID": "40543800AE885FA5",
        "ParentEventID": [
          "A7985EB449BDE843",
          "D81C5AA91F319037"
        ],
        "Label": "Merged current baggage with other baggage",
        "Title": "X-Trace Task",
        "Host": "pinky19.mpi-sws.org",
        "HRT": 26966729942127722,
        "Operation": "join",
        "Timestamp": "1557750369882.204590",
        "TenantClass": 0,
        "Source": "RemoteBlockReader2.java:429",
        "ThreadID": 1,
        "ThreadName": "",
        "EventID": "0957D92D3B03ED76",
        "ProcessID": 2801
      },
      {
        "Cycles": 0,
        "Agent": "edu.brown.cs.systems.xtrace.logging.BaggageWrappers",
        "ProcessName": "Data",
        "TaskID": "40543800AE885FA5",
        "ParentEventID": [
          "5E950701816E9ABF"
        ],
        "Label": "Forking current baggage with Baggage.fork()",
        "Title": "X-Trace Task",
        "Host": "pinky19.mpi-sws.org",
        "HRT": 26966729942185628,
        "Operation": "fork",
        "Timestamp": "1557750369882.274170",
        "TenantClass": 0,
        "Source": "PacketHeader.java:95",
        "ThreadID": 38343,
        "ThreadName": "",
        "EventID": "BF311B0203EA4020",
        "BaggageBytes": "[[248 5] [240 0] [0 64 84 56 0 174 136 95 165] [240 1] [0 94 149 7 1 129 110 154 191] [240 3] [0 2]]",
        "ProcessID": 2319
      },
      {
        "Cycles": 0,
        "Agent": "Execution-Sleep",
        "ProcessName": "Data",
        "TaskID": "40543800AE885FA5",
        "ParentEventID": [
          "BF311B0203EA4020"
        ],
        "Label": "waited",
        "Title": "X-Trace Task",
        "Host": "pinky19.mpi-sws.org",
        "Duration": "3332",
        "HRT": 26966729942237909,
        "Operation": "waited",
        "Timestamp": "1557750369882.326416",
        "TenantClass": 0,
        "Source": "SocketIOWithTimeout.java:335",
        "ThreadID": 38343,
        "ThreadName": "",
        "EventID": "16B5C4E3776B3FDF",
        "BaggageBytes": "[[248 5] [240 0] [0 64 84 56 0 174 136 95 165] [240 1] [0 191 49 27 2 3 234 64 32] [240 3] [0 2]]",
        "ProcessID": 2319
      },
      {
        "Cycles": 0,
        "Agent": "edu.brown.cs.systems.xtrace.logging.BaggageWrappers",
        "ProcessName": "Read",
        "TaskID": "40543800AE885FA5",
        "ParentEventID": [
          "0957D92D3B03ED76",
          "C069C7B3FA529AF3"
        ],
        "Label": "Merged current baggage with other baggage",
        "Title": "X-Trace Task",
        "Host": "pinky19.mpi-sws.org",
        "HRT": 26966729942196702,
        "Operation": "join",
        "Timestamp": "1557750369882.273438",
        "TenantClass": 0,
        "Source": "PacketHeader.java:168",
        "ThreadID": 1,
        "ThreadName": "",
        "EventID": "0CB2261F3A2C49D8",
        "ProcessID": 2801
      },
      {
        "Cycles": 0,
        "Agent": "Execution-CPU",
        "ProcessName": "Data",
        "TaskID": "40543800AE885FA5",
        "ParentEventID": [
          "16B5C4E3776B3FDF"
        ],
        "Label": "unset",
        "Title": "X-Trace Task",
        "Host": "pinky19.mpi-sws.org",
        "Duration": "452287",
        "HRT": 26966729942387113,
        "Operation": "unset",
        "Timestamp": "1557750369882.475586",
        "TenantClass": 0,
        "Source": "DataXceiver.java:261",
        "ThreadID": 38343,
        "ThreadName": "",
        "EventID": "E09BE91641B4D19C",
        "BaggageBytes": "[[248 5] [240 0] [0 64 84 56 0 174 136 95 165] [240 1] [0 22 181 196 227 119 107 63 223] [240 3] [0 2]]",
        "ProcessID": 2319
      },
      {
        "Cycles": 0,
        "Agent": "edu.brown.cs.systems.retro.benchmarks.hdfs_client.Reader",
        "ProcessName": "Read",
        "TaskID": "40543800AE885FA5",
        "ParentEventID": [
          "0"
        ],
        "Label": "Reading file",
        "Title": "X-Trace Task",
        "Host": "pinky19.mpi-sws.org",
        "HRT": 26966729940194368,
        "Timestamp": "1557750369880.271240",
        "TenantClass": 0,
        "ThreadID": 1,
        "ThreadName": "",
        "EventID": "219EE191BC035857",
        "ProcessID": 2801,
        "Tag": [
          "reader_100kb",
          "Read Size: 102400"
        ]
      }
    ]
  }
]