[
  {
    "id": "A9AF7F44E03188ED",
    "reports": [
      {
        "Cycles": 0,
        "Agent": "edu.brown.cs.systems.retro.benchmarks.hdfs_client.Reader",
        "ProcessName": "Read",
        "TaskID": "A9AF7F44E03188ED",
        "ParentEventID": [
          "408EBE332C73283D"
        ],
        "Label": "Reading file",
        "Title": "X-Trace Task",
        "Host": "pinky19.mpi-sws.org",
        "HRT": 25488880918107206,
        "Timestamp": "1556272520858.236084",
        "TenantClass": 0,
        "ThreadID": 1,
        "ThreadName": "",
        "EventID": "325B597D2514AD11",
        "ProcessID": 6356
      },
      {
        "Cycles": 0,
        "Agent": "edu.brown.cs.systems.retro.benchmarks.hdfs_client.Reader",
        "ProcessName": "Read",
        "TaskID": "A9AF7F44E03188ED",
        "ParentEventID": [
          "0"
        ],
        "Label": "Reading file",
        "Title": "X-Trace Task",
        "Host": "pinky19.mpi-sws.org",
        "HRT": 25488880918077028,
        "Timestamp": "1556272520858.206055",
        "TenantClass": 0,
        "ThreadID": 1,
        "ThreadName": "",
        "EventID": "408EBE332C73283D",
        "ProcessID": 6356,
        "Tag": [
          "reader_1mb",
          "Read Size: 1048576"
        ]
      },
      {
        "Cycles": 0,
        "Agent": "Execution-CPU",
        "ProcessName": "Read",
        "TaskID": "A9AF7F44E03188ED",
        "ParentEventID": [
          "46AAFECD1FA256A8"
        ],
        "Label": "unset",
        "Title": "X-Trace Task",
        "Host": "pinky19.mpi-sws.org",
        "Duration": "41069210",
        "HRT": 25488880918293523,
        "Operation": "unset",
        "Timestamp": "1556272520858.422607",
        "TenantClass": 0,
        "Source": "Client.java:1027",
        "ThreadID": 1,
        "ThreadName": "",
        "EventID": "11A382D084B8BFC5",
        "ProcessID": 6356
      },
      {
        "Cycles": 0,
        "Agent": "Execution-CPU",
        "ProcessName": "Read",
        "TaskID": "A9AF7F44E03188ED",
        "ParentEventID": [
          "11A382D084B8BFC5"
        ],
        "Label": "set",
        "Title": "X-Trace Task",
        "Host": "pinky19.mpi-sws.org",
        "HRT": 25488880918362856,
        "Operation": "set",
        "Timestamp": "1556272520858.491943",
        "TenantClass": 0,
        "Source": "Client.java:1032",
        "ThreadID": 41,
        "ThreadName": "",
        "EventID": "FE92683CF860B66E",
        "ProcessID": 6356
      },
      {
        "Cycles": 0,
        "Agent": "edu.brown.cs.systems.xtrace.logging.BaggageWrappers",
        "ProcessName": "Read",
        "TaskID": "A9AF7F44E03188ED",
        "ParentEventID": [
          "FE92683CF860B66E"
        ],
        "Label": "Forking current baggage with Baggage.fork()",
        "Title": "X-Trace Task",
        "Host": "pinky19.mpi-sws.org",
        "HRT": 25488880918385621,
        "Operation": "fork",
        "Timestamp": "1556272520858.514648",
        "TenantClass": 0,
        "Source": "Client.java:1043",
        "ThreadID": 41,
        "ThreadName": "",
        "EventID": "86F526085F941BBA",
        "ProcessID": 6356
      },
      {
        "Cycles": 0,
        "Agent": "Execution-CPU",
        "ProcessName": "Read",
        "TaskID": "A9AF7F44E03188ED",
        "ParentEventID": [
          "1A98BCAE01C7E645"
        ],
        "Label": "set",
        "Title": "X-Trace Task",
        "Host": "pinky19.mpi-sws.org",
        "HRT": 25488880918496900,
        "Operation": "set",
        "Timestamp": "1556272520858.625977",
        "TenantClass": 0,
        "Source": "Client.java:1104",
        "ThreadID": 1,
        "ThreadName": "",
        "EventID": "A1BE1639BACB7901",
        "ProcessID": 6356
      },
      {
        "Cycles": 0,
        "Agent": "Execution-CPU",
        "ProcessName": "Name",
        "TaskID": "A9AF7F44E03188ED",
        "ParentEventID": [
          "86F526085F941BBA"
        ],
        "Label": "set",
        "Title": "X-Trace Task",
        "Host": "pinky19.mpi-sws.org",
        "HRT": 25488880918597769,
        "Operation": "set",
        "Timestamp": "1556272520858.720215",
        "TenantClass": 0,
        "Source": "Server.java:1840",
        "ThreadID": 48,
        "ThreadName": "",
        "EventID": "C0B83A07BD95DD83",
        "BaggageBytes": "[[248 5] [240 0] [0 169 175 127 68 224 49 136 237] [240 1] [0 134 245 38 8 95 148 27 186] [240 3] [0 2]]",
        "ProcessID": 2171
      },
      {
        "Cycles": 0,
        "Agent": "Execution-CPU",
        "ProcessName": "Name",
        "TaskID": "A9AF7F44E03188ED",
        "ParentEventID": [
          "94BF0699D03E845F"
        ],
        "Label": "unset",
        "Title": "X-Trace Task",
        "Host": "pinky19.mpi-sws.org",
        "Duration": "37539",
        "HRT": 25488880918687960,
        "Operation": "unset",
        "Timestamp": "1556272520858.810547",
        "TenantClass": 0,
        "Source": "Server.java:1828",
        "ThreadID": 48,
        "ThreadName": "",
        "EventID": "006699C7AE7C36E1",
        "BaggageBytes": "[[248 5] [240 0] [0 169 175 127 68 224 49 136 237] [240 1] [0 148 191 6 153 208 62 132 95] [240 3] [0 2]]",
        "ProcessID": 2171
      },
      {
        "Cycles": 0,
        "Agent": "Execution-CPU",
        "ProcessName": "Name",
        "TaskID": "A9AF7F44E03188ED",
        "ParentEventID": [
          "94BF0699D03E845F"
        ],
        "Label": "set",
        "Title": "X-Trace Task",
        "Host": "pinky19.mpi-sws.org",
        "HRT": 25488880918700823,
        "Operation": "set",
        "Timestamp": "1556272520858.823242",
        "TenantClass": 0,
        "Source": "Server.java:2071",
        "ThreadID": 59,
        "ThreadName": "",
        "EventID": "E7958A8BDF5F83B2",
        "BaggageBytes": "[[248 5] [240 0] [0 169 175 127 68 224 49 136 237] [240 1] [0 148 191 6 153 208 62 132 95] [240 3] [0 2]]",
        "ProcessID": 2171
      },
      {
        "Cycles": 0,
        "Agent": "edu.brown.cs.systems.xtrace.logging.BaggageWrappers",
        "ProcessName": "Name",
        "TaskID": "A9AF7F44E03188ED",
        "ParentEventID": [
          "C0B83A07BD95DD83"
        ],
        "Label": "Forking current baggage with Baggage.fork()",
        "Title": "X-Trace Task",
        "Host": "pinky19.mpi-sws.org",
        "HRT": 25488880918661262,
        "Operation": "fork",
        "Timestamp": "1556272520858.783691",
        "TenantClass": 0,
        "Source": "Server.java:550",
        "ThreadID": 48,
        "ThreadName": "",
        "EventID": "94BF0699D03E845F",
        "BaggageBytes": "[[248 5] [240 0] [0 169 175 127 68 224 49 136 237] [240 1] [0 192 184 58 7 189 149 221 131] [240 3] [0 2]]",
        "ProcessID": 2171
      },
      {
        "Cycles": 0,
        "Agent": "org.apache.hadoop.ipc.Server",
        "ProcessName": "Name",
        "TaskID": "A9AF7F44E03188ED",
        "ParentEventID": [
          "E7958A8BDF5F83B2"
        ],
        "Label": "getBlockLocations in org.apache.hadoop.hdfs.protocol.ClientProtocol",
        "Title": "X-Trace Task",
        "Host": "pinky19.mpi-sws.org",
        "HRT": 25488880918768497,
        "Timestamp": "1556272520858.891113",
        "TenantClass": 0,
        "Source": "ProtobufRpcEngine.java:601",
        "ThreadID": 59,
        "ThreadName": "",
        "EventID": "7189EA164D893084",
        "BaggageBytes": "[[248 5] [240 0] [0 169 175 127 68 224 49 136 237] [240 1] [0 231 149 138 139 223 95 131 178] [240 3] [0 2]]",
        "ProcessID": 2171
      },
      {
        "Cycles": 0,
        "Agent": "org.apache.hadoop.hdfs.server.namenode.FSNamesystem.audit",
        "ProcessName": "Name",
        "TaskID": "A9AF7F44E03188ED",
        "ParentEventID": [
          "7189EA164D893084"
        ],
        "Label": "allowed=true\tugi=plascas (auth:SIMPLE)\tip=/139.19.171.63\tcmd=open\tsrc=/ds/Knb0H1DQgMPN4fUT\tdst=null\tperm=null\tproto=rpc",
        "Title": "X-Trace Task",
        "Host": "pinky19.mpi-sws.org",
        "HRT": 25488880918862574,
        "Timestamp": "1556272520858.985107",
        "TenantClass": 0,
        "Source": "FSNamesystem.java:8313",
        "ThreadID": 59,
        "ThreadName": "",
        "EventID": "435696CEB4466DEE",
        "BaggageBytes": "[[248 5] [240 0] [0 169 175 127 68 224 49 136 237] [240 1] [0 113 137 234 22 77 137 48 132] [240 3] [0 2]]",
        "ProcessID": 2171
      },
      {
        "Cycles": 0,
        "Agent": "edu.brown.cs.systems.xtrace.logging.BaggageWrappers",
        "ProcessName": "Name",
        "TaskID": "A9AF7F44E03188ED",
        "ParentEventID": [
          "435696CEB4466DEE"
        ],
        "Label": "Forking current baggage with Baggage.fork()",
        "Title": "X-Trace Task",
        "Host": "pinky19.mpi-sws.org",
        "HRT": 25488880918936181,
        "Operation": "fork",
        "Timestamp": "1556272520859.058594",
        "TenantClass": 0,
        "Source": "Server.java:2398",
        "ThreadID": 59,
        "ThreadName": "",
        "EventID": "5C0462B11BF4CACB",
        "BaggageBytes": "[[248 5] [240 0] [0 169 175 127 68 224 49 136 237] [240 1] [0 67 86 150 206 180 70 109 238] [240 3] [0 2]]",
        "ProcessID": 2171
      },
      {
        "Cycles": 0,
        "Agent": "org.apache.hadoop.ipc.ProtobufRpcEngine",
        "ProcessName": "Read",
        "TaskID": "A9AF7F44E03188ED",
        "ParentEventID": [
          "325B597D2514AD11"
        ],
        "Label": "Invoking org.apache.hadoop.hdfs.protocol.ClientProtocol.getBlockLocations",
        "Title": "X-Trace Task",
        "Host": "pinky19.mpi-sws.org",
        "HRT": 25488880918212489,
        "Timestamp": "1556272520858.341553",
        "TenantClass": 0,
        "Source": "ProtobufRpcEngine.java:228",
        "ThreadID": 1,
        "ThreadName": "",
        "EventID": "46AAFECD1FA256A8",
        "ProcessID": 6356
      },
      {
        "Cycles": 0,
        "Agent": "Execution-CPU",
        "ProcessName": "Name",
        "TaskID": "A9AF7F44E03188ED",
        "ParentEventID": [
          "5C0462B11BF4CACB"
        ],
        "Label": "unset",
        "Title": "X-Trace Task",
        "Host": "pinky19.mpi-sws.org",
        "Duration": "337097",
        "HRT": 25488880919072414,
        "Operation": "unset",
        "Timestamp": "1556272520859.194824",
        "TenantClass": 0,
        "Source": "Server.java:1058",
        "ThreadID": 59,
        "ThreadName": "",
        "EventID": "D5860FCF1B2E93D6",
        "BaggageBytes": "[[248 5] [240 0] [0 169 175 127 68 224 49 136 237] [240 1] [0 92 4 98 177 27 244 202 203] [240 3] [0 2]]",
        "ProcessID": 2171
      },
      {
        "Cycles": 0,
        "Agent": "Execution-CPU",
        "ProcessName": "Read",
        "TaskID": "A9AF7F44E03188ED",
        "ParentEventID": [
          "5C0462B11BF4CACB"
        ],
        "Label": "set",
        "Title": "X-Trace Task",
        "Host": "pinky19.mpi-sws.org",
        "HRT": 25488880919135120,
        "Operation": "set",
        "Timestamp": "1556272520859.264160",
        "TenantClass": 0,
        "Source": "Client.java:302",
        "ThreadID": 40,
        "ThreadName": "",
        "EventID": "0082135ADED38977",
        "ProcessID": 6356
      },
      {
        "Cycles": 0,
        "Agent": "Execution-Sleep",
        "ProcessName": "Read",
        "TaskID": "A9AF7F44E03188ED",
        "ParentEventID": [
          "A1BE1639BACB7901"
        ],
        "Label": "waited",
        "Title": "X-Trace Task",
        "Host": "pinky19.mpi-sws.org",
        "Duration": "689405",
        "HRT": 25488880919194431,
        "Operation": "waited",
        "Timestamp": "1556272520859.323486",
        "TenantClass": 0,
        "Source": "Client.java:1537",
        "ThreadID": 1,
        "ThreadName": "",
        "EventID": "AE4B732DF5EA77AE",
        "ProcessID": 6356
      },
      {
        "Cycles": 0,
        "Agent": "edu.brown.cs.systems.xtrace.logging.BaggageWrappers",
        "ProcessName": "Read",
        "TaskID": "A9AF7F44E03188ED",
        "ParentEventID": [
          "AE4B732DF5EA77AE",
          "582997DB52DD1BBD"
        ],
        "Label": "Merged current baggage with other baggage",
        "Title": "X-Trace Task",
        "Host": "pinky19.mpi-sws.org",
        "HRT": 25488880919207811,
        "Operation": "join",
        "Timestamp": "1556272520859.336914",
        "TenantClass": 0,
        "Source": "Client.java:1545",
        "ThreadID": 1,
        "ThreadName": "",
        "EventID": "80F235F71243BA1A",
        "ProcessID": 6356
      },
      {
        "Cycles": 0,
        "Agent": "Execution-CPU",
        "ProcessName": "Read",
        "TaskID": "A9AF7F44E03188ED",
        "ParentEventID": [
          "86F526085F941BBA"
        ],
        "Label": "unset",
        "Title": "X-Trace Task",
        "Host": "pinky19.mpi-sws.org",
        "Duration": "90843",
        "HRT": 25488880918474350,
        "Operation": "unset",
        "Timestamp": "1556272520858.603271",
        "TenantClass": 0,
        "Source": "Client.java:1062",
        "ThreadID": 41,
        "ThreadName": "",
        "EventID": "1A98BCAE01C7E645",
        "ProcessID": 6356
      },
      {
        "Cycles": 0,
        "Agent": "org.apache.hadoop.ipc.ProtobufRpcEngine",
        "ProcessName": "Read",
        "TaskID": "A9AF7F44E03188ED",
        "ParentEventID": [
          "80F235F71243BA1A"
        ],
        "Label": "org.apache.hadoop.hdfs.protocol.ClientProtocol.getBlockLocations completed",
        "Title": "X-Trace Task",
        "Host": "pinky19.mpi-sws.org",
        "HRT": 25488880919288126,
        "Timestamp": "1556272520859.417236",
        "TenantClass": 0,
        "Source": "ProtobufRpcEngine.java:275",
        "ThreadID": 1,
        "ThreadName": "",
        "EventID": "2D0FF3AA422A9612",
        "ProcessID": 6356
      },
      {
        "Cycles": 0,
        "Agent": "Execution-Sleep",
        "ProcessName": "Read",
        "TaskID": "A9AF7F44E03188ED",
        "ParentEventID": [
          "2D0FF3AA422A9612"
        ],
        "Label": "waited",
        "Title": "X-Trace Task",
        "Host": "pinky19.mpi-sws.org",
        "Duration": "5102",
        "HRT": 25488880919452679,
        "Operation": "waited",
        "Timestamp": "1556272520859.581787",
        "TenantClass": 0,
        "Source": "SocketIOWithTimeout.java:335",
        "ThreadID": 1,
        "ThreadName": "",
        "EventID": "8C2527BF578D4D7D",
        "ProcessID": 6356
      },
      {
        "Cycles": 0,
        "Agent": "Execution-CPU",
        "ProcessName": "Data",
        "TaskID": "A9AF7F44E03188ED",
        "ParentEventID": [
          "DCA4880AFA70AD95"
        ],
        "Label": "set",
        "Title": "X-Trace Task",
        "Host": "pinky19.mpi-sws.org",
        "HRT": 25488880919682385,
        "Operation": "set",
        "Timestamp": "1556272520859.816162",
        "TenantClass": 0,
        "Source": "Receiver.java:117",
        "ThreadID": 7442,
        "ThreadName": "",
        "EventID": "46092A7D68450090",
        "BaggageBytes": "[[248 5] [240 0] [0 169 175 127 68 224 49 136 237] [240 1] [0 220 164 136 10 250 112 173 149] [240 3] [0 2]]",
        "ProcessID": 2319
      },
      {
        "Cycles": 0,
        "Agent": "Execution-CPU",
        "ProcessName": "Read",
        "TaskID": "A9AF7F44E03188ED",
        "ParentEventID": [
          "0082135ADED38977"
        ],
        "Label": "unset",
        "Title": "X-Trace Task",
        "Host": "pinky19.mpi-sws.org",
        "Duration": "23764",
        "HRT": 25488880919175244,
        "Operation": "unset",
        "Timestamp": "1556272520859.304199",
        "TenantClass": 0,
        "Source": "Client.java:1168",
        "ThreadID": 40,
        "ThreadName": "",
        "EventID": "582997DB52DD1BBD",
        "ProcessID": 6356
      },
      {
        "Cycles": 0,
        "Agent": "edu.brown.cs.systems.xtrace.logging.XTraceInit",
        "ProcessName": "Data",
        "TaskID": "A9AF7F44E03188ED",
        "ParentEventID": [
          "46092A7D68450090"
        ],
        "Label": "Thread.setName: DataXceiver for client DFSClient_NONMAPREDUCE_614514224_1 at /139.19.171.63:43498 [Sending block BP-1633380353-139.19.171.63-1554193446451:blk_1073761691_20867]",
        "Title": "X-Trace Task",
        "Host": "pinky19.mpi-sws.org",
        "HRT": 25488880919724938,
        "Timestamp": "1556272520859.858643",
        "TenantClass": 0,
        "Source": "DataXceiver.java:168",
        "ThreadID": 7442,
        "ThreadName": "",
        "EventID": "2C238EDD2E1756DA",
        "BaggageBytes": "[[248 5] [240 0] [0 169 175 127 68 224 49 136 237] [240 1] [0 70 9 42 125 104 69 0 144] [240 3] [0 2]]",
        "ProcessID": 2319
      },
      {
        "Cycles": 0,
        "Agent": "edu.brown.cs.systems.xtrace.logging.BaggageWrappers",
        "ProcessName": "Data",
        "TaskID": "A9AF7F44E03188ED",
        "ParentEventID": [
          "06C2A0C08DE30A0E"
        ],
        "Label": "Forking current baggage with Baggage.fork()",
        "Title": "X-Trace Task",
        "Host": "pinky19.mpi-sws.org",
        "HRT": 25488880919890428,
        "Operation": "fork",
        "Timestamp": "1556272520860.024170",
        "TenantClass": 0,
        "Source": "PacketHeader.java:95",
        "ThreadID": 7442,
        "ThreadName": "",
        "EventID": "4731AF153CDAB481",
        "BaggageBytes": "[[248 5] [240 0] [0 169 175 127 68 224 49 136 237] [240 1] [0 6 194 160 192 141 227 10 14] [240 3] [0 2]]",
        "ProcessID": 2319
      },
      {
        "Cycles": 0,
        "Agent": "Execution-Sleep",
        "ProcessName": "Read",
        "TaskID": "A9AF7F44E03188ED",
        "ParentEventID": [
          "DCA4880AFA70AD95"
        ],
        "Label": "waited",
        "Title": "X-Trace Task",
        "Host": "pinky19.mpi-sws.org",
        "Duration": "216210",
        "HRT": 25488880919887036,
        "Operation": "waited",
        "Timestamp": "1556272520860.016113",
        "TenantClass": 0,
        "Source": "SocketIOWithTimeout.java:335",
        "ThreadID": 1,
        "ThreadName": "",
        "EventID": "19780A43357142FD",
        "ProcessID": 6356
      },
      {
        "Cycles": 0,
        "Agent": "edu.brown.cs.systems.xtrace.logging.BaggageWrappers",
        "ProcessName": "Data",
        "TaskID": "A9AF7F44E03188ED",
        "ParentEventID": [
          "2C238EDD2E1756DA"
        ],
        "Label": "Forking current baggage with Baggage.fork()",
        "Title": "X-Trace Task",
        "Host": "pinky19.mpi-sws.org",
        "HRT": 25488880919816044,
        "Operation": "fork",
        "Timestamp": "1556272520859.949951",
        "TenantClass": 0,
        "Source": "DataXceiver.java:1257",
        "ThreadID": 7442,
        "ThreadName": "",
        "EventID": "06C2A0C08DE30A0E",
        "BaggageBytes": "[[248 5] [240 0] [0 169 175 127 68 224 49 136 237] [240 1] [0 44 35 142 221 46 23 86 218] [240 3] [0 2]]",
        "ProcessID": 2319
      },
      {
        "Cycles": 0,
        "Agent": "Execution-Sleep",
        "ProcessName": "Data",
        "TaskID": "A9AF7F44E03188ED",
        "ParentEventID": [
          "4731AF153CDAB481"
        ],
        "Label": "waited",
        "Title": "X-Trace Task",
        "Host": "pinky19.mpi-sws.org",
        "Duration": "6019",
        "HRT": 25488880919960168,
        "Operation": "waited",
        "Timestamp": "1556272520860.093994",
        "TenantClass": 0,
        "Source": "SocketIOWithTimeout.java:335",
        "ThreadID": 7442,
        "ThreadName": "",
        "EventID": "DEF0BC0697118CD6",
        "BaggageBytes": "[[248 5] [240 0] [0 169 175 127 68 224 49 136 237] [240 1] [0 71 49 175 21 60 218 180 129] [240 3] [0 2]]",
        "ProcessID": 2319
      },
      {
        "Cycles": 0,
        "Agent": "edu.brown.cs.systems.xtrace.logging.BaggageWrappers",
        "ProcessName": "Read",
        "TaskID": "A9AF7F44E03188ED",
        "ParentEventID": [
          "19780A43357142FD",
          "06C2A0C08DE30A0E"
        ],
        "Label": "Merged current baggage with other baggage",
        "Title": "X-Trace Task",
        "Host": "pinky19.mpi-sws.org",
        "HRT": 25488880919998051,
        "Operation": "join",
        "Timestamp": "1556272520860.126953",
        "TenantClass": 0,
        "Source": "RemoteBlockReader2.java:429",
        "ThreadID": 1,
        "ThreadName": "",
        "EventID": "EF82D8AC73D6D28D",
        "ProcessID": 6356
      },
      {
        "Cycles": 0,
        "Agent": "edu.brown.cs.systems.xtrace.logging.BaggageWrappers",
        "ProcessName": "Read",
        "TaskID": "A9AF7F44E03188ED",
        "ParentEventID": [
          "EF82D8AC73D6D28D",
          "4731AF153CDAB481"
        ],
        "Label": "Merged current baggage with other baggage",
        "Title": "X-Trace Task",
        "Host": "pinky19.mpi-sws.org",
        "HRT": 25488880920119947,
        "Operation": "join",
        "Timestamp": "1556272520860.249023",
        "TenantClass": 0,
        "Source": "PacketHeader.java:168",
        "ThreadID": 1,
        "ThreadName": "",
        "EventID": "CD99F2803034BF10",
        "ProcessID": 6356
      },
      {
        "Cycles": 0,
        "Agent": "edu.brown.cs.systems.xtrace.logging.BaggageWrappers",
        "ProcessName": "Read",
        "TaskID": "A9AF7F44E03188ED",
        "ParentEventID": [
          "8C2527BF578D4D7D"
        ],
        "Label": "Forking current baggage with Baggage.fork()",
        "Title": "X-Trace Task",
        "Host": "pinky19.mpi-sws.org",
        "HRT": 25488880919547606,
        "Operation": "fork",
        "Timestamp": "1556272520859.676514",
        "TenantClass": 0,
        "Source": "DataTransferProtoUtil.java:94",
        "ThreadID": 1,
        "ThreadName": "",
        "EventID": "DCA4880AFA70AD95",
        "ProcessID": 6356
      },
      {
        "Cycles": 0,
        "Agent": "edu.brown.cs.systems.xtrace.logging.BaggageWrappers",
        "ProcessName": "Read",
        "TaskID": "A9AF7F44E03188ED",
        "ParentEventID": [
          "25836D1DBA0DA690",
          "CD99F2803034BF10"
        ],
        "Label": "Merged current baggage with other baggage",
        "Title": "X-Trace Task",
        "Host": "pinky19.mpi-sws.org",
        "HRT": 25488880920227795,
        "Operation": "join",
        "Timestamp": "1556272520860.356689",
        "TenantClass": 0,
        "Source": "PacketHeader.java:168",
        "ThreadID": 1,
        "ThreadName": "",
        "EventID": "A53DCEA6ADF93182",
        "ProcessID": 6356
      },
      {
        "Cycles": 0,
        "Agent": "Execution-Sleep",
        "ProcessName": "Data",
        "TaskID": "A9AF7F44E03188ED",
        "ParentEventID": [
          "25836D1DBA0DA690"
        ],
        "Label": "waited",
        "Title": "X-Trace Task",
        "Host": "pinky19.mpi-sws.org",
        "Duration": "165901",
        "HRT": 25488880920294326,
        "Operation": "waited",
        "Timestamp": "1556272520860.428223",
        "TenantClass": 0,
        "Source": "SocketIOWithTimeout.java:335",
        "ThreadID": 7442,
        "ThreadName": "",
        "EventID": "B7EE51EC0AD5BB20",
        "BaggageBytes": "[[248 5] [240 0] [0 169 175 127 68 224 49 136 237] [240 1] [0 37 131 109 29 186 13 166 144] [240 3] [0 2]]",
        "ProcessID": 2319
      },
      {
        "Cycles": 0,
        "Agent": "edu.brown.cs.systems.xtrace.logging.BaggageWrappers",
        "ProcessName": "Read",
        "TaskID": "A9AF7F44E03188ED",
        "ParentEventID": [
          "A53DCEA6ADF93182"
        ],
        "Label": "Forking current baggage with Baggage.fork()",
        "Title": "X-Trace Task",
        "Host": "pinky19.mpi-sws.org",
        "HRT": 25488880920238693,
        "Operation": "fork",
        "Timestamp": "1556272520860.367676",
        "TenantClass": 0,
        "Source": "RemoteBlockReader2.java:361",
        "ThreadID": 1,
        "ThreadName": "",
        "EventID": "86F51B9D5562E889",
        "ProcessID": 6356
      },
      {
        "Cycles": 0,
        "Agent": "edu.brown.cs.systems.xtrace.logging.BaggageWrappers",
        "ProcessName": "Read",
        "TaskID": "A9AF7F44E03188ED",
        "ParentEventID": [
          "86F51B9D5562E889"
        ],
        "Label": "Forking current baggage with Baggage.fork()",
        "Title": "X-Trace Task",
        "Host": "pinky19.mpi-sws.org",
        "HRT": 25488880920344431,
        "Operation": "fork",
        "Timestamp": "1556272520860.473389",
        "TenantClass": 0,
        "Source": "DataTransferProtoUtil.java:94",
        "ThreadID": 1,
        "ThreadName": "",
        "EventID": "A840B5C1EBFA5549",
        "ProcessID": 6356
      },
      {
        "Cycles": 0,
        "Agent": "edu.brown.cs.systems.xtrace.logging.BaggageWrappers",
        "ProcessName": "Data",
        "TaskID": "A9AF7F44E03188ED",
        "ParentEventID": [
          "DEF0BC0697118CD6"
        ],
        "Label": "Forking current baggage with Baggage.fork()",
        "Title": "X-Trace Task",
        "Host": "pinky19.mpi-sws.org",
        "HRT": 25488880920043752,
        "Operation": "fork",
        "Timestamp": "1556272520860.177490",
        "TenantClass": 0,
        "Source": "PacketHeader.java:95",
        "ThreadID": 7442,
        "ThreadName": "",
        "EventID": "25836D1DBA0DA690",
        "BaggageBytes": "[[248 5] [240 0] [0 169 175 127 68 224 49 136 237] [240 1] [0 222 240 188 6 151 17 140 214] [240 3] [0 2]]",
        "ProcessID": 2319
      },
      {
        "Cycles": 0,
        "Agent": "edu.brown.cs.systems.xtrace.logging.BaggageWrappers",
        "ProcessName": "Data",
        "TaskID": "A9AF7F44E03188ED",
        "ParentEventID": [
          "B7EE51EC0AD5BB20",
          "86F51B9D5562E889"
        ],
        "Label": "Merged current baggage with other baggage",
        "Title": "X-Trace Task",
        "Host": "pinky19.mpi-sws.org",
        "HRT": 25488880920348820,
        "Operation": "join",
        "Timestamp": "1556272520860.482666",
        "TenantClass": 0,
        "Source": "DataXceiver.java:574",
        "ThreadID": 7442,
        "ThreadName": "",
        "EventID": "4077FCCFFDDF76D0",
        "BaggageBytes": "[[248 5] [240 0] [0 169 175 127 68 224 49 136 237] [240 1] [0 134 245 27 157 85 98 232 137] [0 183 238 81 236 10 213 187 32] [240 3] [0 2]]",
        "ProcessID": 2319
      },
      {
        "Cycles": 0,
        "Agent": "edu.brown.cs.systems.xtrace.logging.XTraceInit",
        "ProcessName": "Data",
        "TaskID": "A9AF7F44E03188ED",
        "ParentEventID": [
          "B631D888EA6A46D8"
        ],
        "Label": "Thread.setName: DataXceiver for client DFSClient_NONMAPREDUCE_614514224_1 at /139.19.171.63:43498 [Sending block BP-1633380353-139.19.171.63-1554193446451:blk_1073761691_20867]",
        "Title": "X-Trace Task",
        "Host": "pinky19.mpi-sws.org",
        "HRT": 25488880920486750,
        "Timestamp": "1556272520860.620605",
        "TenantClass": 0,
        "Source": "DataXceiver.java:168",
        "ThreadID": 7442,
        "ThreadName": "",
        "EventID": "C819E82766420B4D",
        "BaggageBytes": "[[248 5] [240 0] [0 169 175 127 68 224 49 136 237] [240 1] [0 182 49 216 136 234 106 70 216] [240 3] [0 2]]",
        "ProcessID": 2319
      },
      {
        "Cycles": 0,
        "Agent": "Execution-CPU",
        "ProcessName": "Data",
        "TaskID": "A9AF7F44E03188ED",
        "ParentEventID": [
          "A840B5C1EBFA5549"
        ],
        "Label": "set",
        "Title": "X-Trace Task",
        "Host": "pinky19.mpi-sws.org",
        "HRT": 25488880920459544,
        "Operation": "set",
        "Timestamp": "1556272520860.593262",
        "TenantClass": 0,
        "Source": "Receiver.java:117",
        "ThreadID": 7442,
        "ThreadName": "",
        "EventID": "B631D888EA6A46D8",
        "BaggageBytes": "[[248 5] [240 0] [0 169 175 127 68 224 49 136 237] [240 1] [0 168 64 181 193 235 250 85 73] [240 3] [0 2]]",
        "ProcessID": 2319
      },
      {
        "Cycles": 0,
        "Agent": "edu.brown.cs.systems.xtrace.logging.BaggageWrappers",
        "ProcessName": "Data",
        "TaskID": "A9AF7F44E03188ED",
        "ParentEventID": [
          "C819E82766420B4D"
        ],
        "Label": "Forking current baggage with Baggage.fork()",
        "Title": "X-Trace Task",
        "Host": "pinky19.mpi-sws.org",
        "HRT": 25488880920556011,
        "Operation": "fork",
        "Timestamp": "1556272520860.689941",
        "TenantClass": 0,
        "Source": "DataXceiver.java:1257",
        "ThreadID": 7442,
        "ThreadName": "",
        "EventID": "65713D2BDED575C4",
        "BaggageBytes": "[[248 5] [240 0] [0 169 175 127 68 224 49 136 237] [240 1] [0 200 25 232 39 102 66 11 77] [240 3] [0 2]]",
        "ProcessID": 2319
      },
      {
        "Cycles": 0,
        "Agent": "Execution-Sleep",
        "ProcessName": "Read",
        "TaskID": "A9AF7F44E03188ED",
        "ParentEventID": [
          "A840B5C1EBFA5549"
        ],
        "Label": "waited",
        "Title": "X-Trace Task",
        "Host": "pinky19.mpi-sws.org",
        "Duration": "168812",
        "HRT": 25488880920611962,
        "Operation": "waited",
        "Timestamp": "1556272520860.740967",
        "TenantClass": 0,
        "Source": "SocketIOWithTimeout.java:335",
        "ThreadID": 1,
        "ThreadName": "",
        "EventID": "4DE6B57080CA6EC1",
        "ProcessID": 6356
      },
      {
        "Cycles": 0,
        "Agent": "Execution-CPU",
        "ProcessName": "Data",
        "TaskID": "A9AF7F44E03188ED",
        "ParentEventID": [
          "4077FCCFFDDF76D0"
        ],
        "Label": "unset",
        "Title": "X-Trace Task",
        "Host": "pinky19.mpi-sws.org",
        "Duration": "664841",
        "HRT": 25488880920372683,
        "Operation": "unset",
        "Timestamp": "1556272520860.506592",
        "TenantClass": 0,
        "Source": "DataXceiver.java:261",
        "ThreadID": 7442,
        "ThreadName": "",
        "EventID": "3FCF9B64DD1A2A10",
        "BaggageBytes": "[[248 5] [240 0] [0 169 175 127 68 224 49 136 237] [240 1] [0 64 119 252 207 253 223 118 208] [240 3] [0 2]]",
        "ProcessID": 2319
      },
      {
        "Cycles": 0,
        "Agent": "edu.brown.cs.systems.xtrace.logging.BaggageWrappers",
        "ProcessName": "Read",
        "TaskID": "A9AF7F44E03188ED",
        "ParentEventID": [
          "65713D2BDED575C4",
          "4DE6B57080CA6EC1"
        ],
        "Label": "Merged current baggage with other baggage",
        "Title": "X-Trace Task",
        "Host": "pinky19.mpi-sws.org",
        "HRT": 25488880920675605,
        "Operation": "join",
        "Timestamp": "1556272520860.804688",
        "TenantClass": 0,
        "Source": "RemoteBlockReader2.java:429",
        "ThreadID": 1,
        "ThreadName": "",
        "EventID": "04441888CB3D3A51",
        "ProcessID": 6356
      },
      {
        "Cycles": 0,
        "Agent": "edu.brown.cs.systems.xtrace.logging.BaggageWrappers",
        "ProcessName": "Data",
        "TaskID": "A9AF7F44E03188ED",
        "ParentEventID": [
          "07CBE26BC74C2D23"
        ],
        "Label": "Forking current baggage with Baggage.fork()",
        "Title": "X-Trace Task",
        "Host": "pinky19.mpi-sws.org",
        "HRT": 25488880920732045,
        "Operation": "fork",
        "Timestamp": "1556272520860.865967",
        "TenantClass": 0,
        "Source": "PacketHeader.java:95",
        "ThreadID": 7442,
        "ThreadName": "",
        "EventID": "8B8A9426652D0C08",
        "BaggageBytes": "[[248 5] [240 0] [0 169 175 127 68 224 49 136 237] [240 1] [0 7 203 226 107 199 76 45 35] [240 3] [0 2]]",
        "ProcessID": 2319
      },
      {
        "Cycles": 0,
        "Agent": "edu.brown.cs.systems.xtrace.logging.BaggageWrappers",
        "ProcessName": "Data",
        "TaskID": "A9AF7F44E03188ED",
        "ParentEventID": [
          "65713D2BDED575C4"
        ],
        "Label": "Forking current baggage with Baggage.fork()",
        "Title": "X-Trace Task",
        "Host": "pinky19.mpi-sws.org",
        "HRT": 25488880920613210,
        "Operation": "fork",
        "Timestamp": "1556272520860.747070",
        "TenantClass": 0,
        "Source": "PacketHeader.java:95",
        "ThreadID": 7442,
        "ThreadName": "",
        "EventID": "8CB8A44927BDEBD3",
        "BaggageBytes": "[[248 5] [240 0] [0 169 175 127 68 224 49 136 237] [240 1] [0 101 113 61 43 222 213 117 196] [240 3] [0 2]]",
        "ProcessID": 2319
      },
      {
        "Cycles": 0,
        "Agent": "edu.brown.cs.systems.xtrace.logging.BaggageWrappers",
        "ProcessName": "Read",
        "TaskID": "A9AF7F44E03188ED",
        "ParentEventID": [
          "04441888CB3D3A51",
          "8CB8A44927BDEBD3"
        ],
        "Label": "Merged current baggage with other baggage",
        "Title": "X-Trace Task",
        "Host": "pinky19.mpi-sws.org",
        "HRT": 25488880920746875,
        "Operation": "join",
        "Timestamp": "1556272520860.875977",
        "TenantClass": 0,
        "Source": "PacketHeader.java:168",
        "ThreadID": 1,
        "ThreadName": "",
        "EventID": "D8C697484310BF14",
        "ProcessID": 6356
      },
      {
        "Cycles": 0,
        "Agent": "edu.brown.cs.systems.xtrace.logging.BaggageWrappers",
        "ProcessName": "Data",
        "TaskID": "A9AF7F44E03188ED",
        "ParentEventID": [
          "E471734A509B4935"
        ],
        "Label": "Forking current baggage with Baggage.fork()",
        "Title": "X-Trace Task",
        "Host": "pinky19.mpi-sws.org",
        "HRT": 25488880920844752,
        "Operation": "fork",
        "Timestamp": "1556272520860.978516",
        "TenantClass": 0,
        "Source": "PacketHeader.java:95",
        "ThreadID": 7442,
        "ThreadName": "",
        "EventID": "852C6A881EB3A50D",
        "BaggageBytes": "[[248 5] [240 0] [0 169 175 127 68 224 49 136 237] [240 1] [0 228 113 115 74 80 155 73 53] [240 3] [0 2]]",
        "ProcessID": 2319
      },
      {
        "Cycles": 0,
        "Agent": "Execution-Sleep",
        "ProcessName": "Data",
        "TaskID": "A9AF7F44E03188ED",
        "ParentEventID": [
          "8CB8A44927BDEBD3"
        ],
        "Label": "waited",
        "Title": "X-Trace Task",
        "Host": "pinky19.mpi-sws.org",
        "Duration": "3826",
        "HRT": 25488880920667764,
        "Operation": "waited",
        "Timestamp": "1556272520860.801514",
        "TenantClass": 0,
        "Source": "SocketIOWithTimeout.java:335",
        "ThreadID": 7442,
        "ThreadName": "",
        "EventID": "07CBE26BC74C2D23",
        "BaggageBytes": "[[248 5] [240 0] [0 169 175 127 68 224 49 136 237] [240 1] [0 140 184 164 73 39 189 235 211] [240 3] [0 2]]",
        "ProcessID": 2319
      },
      {
        "Cycles": 0,
        "Agent": "edu.brown.cs.systems.xtrace.logging.BaggageWrappers",
        "ProcessName": "Read",
        "TaskID": "A9AF7F44E03188ED",
        "ParentEventID": [
          "D8C697484310BF14",
          "8B8A9426652D0C08"
        ],
        "Label": "Merged current baggage with other baggage",
        "Title": "X-Trace Task",
        "Host": "pinky19.mpi-sws.org",
        "HRT": 25488880920866738,
        "Operation": "join",
        "Timestamp": "1556272520860.995850",
        "TenantClass": 0,
        "Source": "PacketHeader.java:168",
        "ThreadID": 1,
        "ThreadName": "",
        "EventID": "73F1BAB6315CC33C",
        "ProcessID": 6356
      },
      {
        "Cycles": 0,
        "Agent": "edu.brown.cs.systems.xtrace.logging.BaggageWrappers",
        "ProcessName": "Data",
        "TaskID": "A9AF7F44E03188ED",
        "ParentEventID": [
          "AAA08ADC03C91055"
        ],
        "Label": "Forking current baggage with Baggage.fork()",
        "Title": "X-Trace Task",
        "Host": "pinky19.mpi-sws.org",
        "HRT": 25488880920958314,
        "Operation": "fork",
        "Timestamp": "1556272520861.092041",
        "TenantClass": 0,
        "Source": "PacketHeader.java:95",
        "ThreadID": 7442,
        "ThreadName": "",
        "EventID": "C2541D01AADFAF57",
        "BaggageBytes": "[[248 5] [240 0] [0 169 175 127 68 224 49 136 237] [240 1] [0 170 160 138 220 3 201 16 85] [240 3] [0 2]]",
        "ProcessID": 2319
      },
      {
        "Cycles": 0,
        "Agent": "Execution-Sleep",
        "ProcessName": "Data",
        "TaskID": "A9AF7F44E03188ED",
        "ParentEventID": [
          "8B8A9426652D0C08"
        ],
        "Label": "waited",
        "Title": "X-Trace Task",
        "Host": "pinky19.mpi-sws.org",
        "Duration": "3450",
        "HRT": 25488880920783702,
        "Operation": "waited",
        "Timestamp": "1556272520860.917480",
        "TenantClass": 0,
        "Source": "SocketIOWithTimeout.java:335",
        "ThreadID": 7442,
        "ThreadName": "",
        "EventID": "E471734A509B4935",
        "BaggageBytes": "[[248 5] [240 0] [0 169 175 127 68 224 49 136 237] [240 1] [0 139 138 148 38 101 45 12 8] [240 3] [0 2]]",
        "ProcessID": 2319
      },
      {
        "Cycles": 0,
        "Agent": "edu.brown.cs.systems.xtrace.logging.BaggageWrappers",
        "ProcessName": "Read",
        "TaskID": "A9AF7F44E03188ED",
        "ParentEventID": [
          "73F1BAB6315CC33C",
          "852C6A881EB3A50D"
        ],
        "Label": "Merged current baggage with other baggage",
        "Title": "X-Trace Task",
        "Host": "pinky19.mpi-sws.org",
        "HRT": 25488880920984901,
        "Operation": "join",
        "Timestamp": "1556272520861.114014",
        "TenantClass": 0,
        "Source": "PacketHeader.java:168",
        "ThreadID": 1,
        "ThreadName": "",
        "EventID": "0170DAE6EE3E9D8F",
        "ProcessID": 6356
      },
      {
        "Cycles": 0,
        "Agent": "edu.brown.cs.systems.xtrace.logging.BaggageWrappers",
        "ProcessName": "Data",
        "TaskID": "A9AF7F44E03188ED",
        "ParentEventID": [
          "EAE8394EDC2C6DB4"
        ],
        "Label": "Forking current baggage with Baggage.fork()",
        "Title": "X-Trace Task",
        "Host": "pinky19.mpi-sws.org",
        "HRT": 25488880921070331,
        "Operation": "fork",
        "Timestamp": "1556272520861.204102",
        "TenantClass": 0,
        "Source": "PacketHeader.java:95",
        "ThreadID": 7442,
        "ThreadName": "",
        "EventID": "10629A9BC1FAFE7D",
        "BaggageBytes": "[[248 5] [240 0] [0 169 175 127 68 224 49 136 237] [240 1] [0 234 232 57 78 220 44 109 180] [240 3] [0 2]]",
        "ProcessID": 2319
      },
      {
        "Cycles": 0,
        "Agent": "Execution-Sleep",
        "ProcessName": "Data",
        "TaskID": "A9AF7F44E03188ED",
        "ParentEventID": [
          "852C6A881EB3A50D"
        ],
        "Label": "waited",
        "Title": "X-Trace Task",
        "Host": "pinky19.mpi-sws.org",
        "Duration": "3536",
        "HRT": 25488880920898641,
        "Operation": "waited",
        "Timestamp": "1556272520861.032471",
        "TenantClass": 0,
        "Source": "SocketIOWithTimeout.java:335",
        "ThreadID": 7442,
        "ThreadName": "",
        "EventID": "AAA08ADC03C91055",
        "BaggageBytes": "[[248 5] [240 0] [0 169 175 127 68 224 49 136 237] [240 1] [0 133 44 106 136 30 179 165 13] [240 3] [0 2]]",
        "ProcessID": 2319
      },
      {
        "Cycles": 0,
        "Agent": "edu.brown.cs.systems.xtrace.logging.BaggageWrappers",
        "ProcessName": "Read",
        "TaskID": "A9AF7F44E03188ED",
        "ParentEventID": [
          "0170DAE6EE3E9D8F",
          "C2541D01AADFAF57"
        ],
        "Label": "Merged current baggage with other baggage",
        "Title": "X-Trace Task",
        "Host": "pinky19.mpi-sws.org",
        "HRT": 25488880921102477,
        "Operation": "join",
        "Timestamp": "1556272520861.231445",
        "TenantClass": 0,
        "Source": "PacketHeader.java:168",
        "ThreadID": 1,
        "ThreadName": "",
        "EventID": "E7E355D8C34D62B1",
        "ProcessID": 6356
      },
      {
        "Cycles": 0,
        "Agent": "edu.brown.cs.systems.xtrace.logging.BaggageWrappers",
        "ProcessName": "Data",
        "TaskID": "A9AF7F44E03188ED",
        "ParentEventID": [
          "2D8E552DA0B0A347"
        ],
        "Label": "Forking current baggage with Baggage.fork()",
        "Title": "X-Trace Task",
        "Host": "pinky19.mpi-sws.org",
        "HRT": 25488880921195608,
        "Operation": "fork",
        "Timestamp": "1556272520861.329346",
        "TenantClass": 0,
        "Source": "PacketHeader.java:95",
        "ThreadID": 7442,
        "ThreadName": "",
        "EventID": "3A07C8B50B42C652",
        "BaggageBytes": "[[248 5] [240 0] [0 169 175 127 68 224 49 136 237] [240 1] [0 45 142 85 45 160 176 163 71] [240 3] [0 2]]",
        "ProcessID": 2319
      },
      {
        "Cycles": 0,
        "Agent": "Execution-Sleep",
        "ProcessName": "Data",
        "TaskID": "A9AF7F44E03188ED",
        "ParentEventID": [
          "C2541D01AADFAF57"
        ],
        "Label": "waited",
        "Title": "X-Trace Task",
        "Host": "pinky19.mpi-sws.org",
        "Duration": "3247",
        "HRT": 25488880921010452,
        "Operation": "waited",
        "Timestamp": "1556272520861.144287",
        "TenantClass": 0,
        "Source": "SocketIOWithTimeout.java:335",
        "ThreadID": 7442,
        "ThreadName": "",
        "EventID": "EAE8394EDC2C6DB4",
        "BaggageBytes": "[[248 5] [240 0] [0 169 175 127 68 224 49 136 237] [240 1] [0 194 84 29 1 170 223 175 87] [240 3] [0 2]]",
        "ProcessID": 2319
      },
      {
        "Cycles": 0,
        "Agent": "edu.brown.cs.systems.xtrace.logging.BaggageWrappers",
        "ProcessName": "Read",
        "TaskID": "A9AF7F44E03188ED",
        "ParentEventID": [
          "10629A9BC1FAFE7D",
          "E7E355D8C34D62B1"
        ],
        "Label": "Merged current baggage with other baggage",
        "Title": "X-Trace Task",
        "Host": "pinky19.mpi-sws.org",
        "HRT": 25488880921232496,
        "Operation": "join",
        "Timestamp": "1556272520861.361572",
        "TenantClass": 0,
        "Source": "PacketHeader.java:168",
        "ThreadID": 1,
        "ThreadName": "",
        "EventID": "249FA3CB82B114E7",
        "ProcessID": 6356
      },
      {
        "Cycles": 0,
        "Agent": "edu.brown.cs.systems.xtrace.logging.BaggageWrappers",
        "ProcessName": "Data",
        "TaskID": "A9AF7F44E03188ED",
        "ParentEventID": [
          "FB331CE2F24DA702"
        ],
        "Label": "Forking current baggage with Baggage.fork()",
        "Title": "X-Trace Task",
        "Host": "pinky19.mpi-sws.org",
        "HRT": 25488880921307339,
        "Operation": "fork",
        "Timestamp": "1556272520861.441162",
        "TenantClass": 0,
        "Source": "PacketHeader.java:95",
        "ThreadID": 7442,
        "ThreadName": "",
        "EventID": "582EEA254369DD36",
        "BaggageBytes": "[[248 5] [240 0] [0 169 175 127 68 224 49 136 237] [240 1] [0 251 51 28 226 242 77 167 2] [240 3] [0 2]]",
        "ProcessID": 2319
      },
      {
        "Cycles": 0,
        "Agent": "Execution-Sleep",
        "ProcessName": "Data",
        "TaskID": "A9AF7F44E03188ED",
        "ParentEventID": [
          "10629A9BC1FAFE7D"
        ],
        "Label": "waited",
        "Title": "X-Trace Task",
        "Host": "pinky19.mpi-sws.org",
        "Duration": "3347",
        "HRT": 25488880921132856,
        "Operation": "waited",
        "Timestamp": "1556272520861.266602",
        "TenantClass": 0,
        "Source": "SocketIOWithTimeout.java:335",
        "ThreadID": 7442,
        "ThreadName": "",
        "EventID": "2D8E552DA0B0A347",
        "BaggageBytes": "[[248 5] [240 0] [0 169 175 127 68 224 49 136 237] [240 1] [0 16 98 154 155 193 250 254 125] [240 3] [0 2]]",
        "ProcessID": 2319
      },
      {
        "Cycles": 0,
        "Agent": "edu.brown.cs.systems.xtrace.logging.BaggageWrappers",
        "ProcessName": "Read",
        "TaskID": "A9AF7F44E03188ED",
        "ParentEventID": [
          "249FA3CB82B114E7",
          "3A07C8B50B42C652"
        ],
        "Label": "Merged current baggage with other baggage",
        "Title": "X-Trace Task",
        "Host": "pinky19.mpi-sws.org",
        "HRT": 25488880921350854,
        "Operation": "join",
        "Timestamp": "1556272520861.479736",
        "TenantClass": 0,
        "Source": "PacketHeader.java:168",
        "ThreadID": 1,
        "ThreadName": "",
        "EventID": "ADBDFC34090F0E6F",
        "ProcessID": 6356
      },
      {
        "Cycles": 0,
        "Agent": "edu.brown.cs.systems.xtrace.logging.BaggageWrappers",
        "ProcessName": "Data",
        "TaskID": "A9AF7F44E03188ED",
        "ParentEventID": [
          "474EEC7E1D8C9F46"
        ],
        "Label": "Forking current baggage with Baggage.fork()",
        "Title": "X-Trace Task",
        "Host": "pinky19.mpi-sws.org",
        "HRT": 25488880921416021,
        "Operation": "fork",
        "Timestamp": "1556272520861.549805",
        "TenantClass": 0,
        "Source": "PacketHeader.java:95",
        "ThreadID": 7442,
        "ThreadName": "",
        "EventID": "6227D4A0944C4FA9",
        "BaggageBytes": "[[248 5] [240 0] [0 169 175 127 68 224 49 136 237] [240 1] [0 71 78 236 126 29 140 159 70] [240 3] [0 2]]",
        "ProcessID": 2319
      },
      {
        "Cycles": 0,
        "Agent": "Execution-Sleep",
        "ProcessName": "Data",
        "TaskID": "A9AF7F44E03188ED",
        "ParentEventID": [
          "3A07C8B50B42C652"
        ],
        "Label": "waited",
        "Title": "X-Trace Task",
        "Host": "pinky19.mpi-sws.org",
        "Duration": "3183",
        "HRT": 25488880921246337,
        "Operation": "waited",
        "Timestamp": "1556272520861.380127",
        "TenantClass": 0,
        "Source": "SocketIOWithTimeout.java:335",
        "ThreadID": 7442,
        "ThreadName": "",
        "EventID": "FB331CE2F24DA702",
        "BaggageBytes": "[[248 5] [240 0] [0 169 175 127 68 224 49 136 237] [240 1] [0 58 7 200 181 11 66 198 82] [240 3] [0 2]]",
        "ProcessID": 2319
      },
      {
        "Cycles": 0,
        "Agent": "edu.brown.cs.systems.xtrace.logging.BaggageWrappers",
        "ProcessName": "Read",
        "TaskID": "A9AF7F44E03188ED",
        "ParentEventID": [
          "ADBDFC34090F0E6F",
          "582EEA254369DD36"
        ],
        "Label": "Merged current baggage with other baggage",
        "Title": "X-Trace Task",
        "Host": "pinky19.mpi-sws.org",
        "HRT": 25488880921468921,
        "Operation": "join",
        "Timestamp": "1556272520861.597900",
        "TenantClass": 0,
        "Source": "PacketHeader.java:168",
        "ThreadID": 1,
        "ThreadName": "",
        "EventID": "A38396B97E14F1AC",
        "ProcessID": 6356
      },
      {
        "Cycles": 0,
        "Agent": "edu.brown.cs.systems.xtrace.logging.BaggageWrappers",
        "ProcessName": "Data",
        "TaskID": "A9AF7F44E03188ED",
        "ParentEventID": [
          "82AF0BB57E733297"
        ],
        "Label": "Forking current baggage with Baggage.fork()",
        "Title": "X-Trace Task",
        "Host": "pinky19.mpi-sws.org",
        "HRT": 25488880921532979,
        "Operation": "fork",
        "Timestamp": "1556272520861.666748",
        "TenantClass": 0,
        "Source": "PacketHeader.java:95",
        "ThreadID": 7442,
        "ThreadName": "",
        "EventID": "B463986335101920",
        "BaggageBytes": "[[248 5] [240 0] [0 169 175 127 68 224 49 136 237] [240 1] [0 130 175 11 181 126 115 50 151] [240 3] [0 2]]",
        "ProcessID": 2319
      },
      {
        "Cycles": 0,
        "Agent": "Execution-Sleep",
        "ProcessName": "Data",
        "TaskID": "A9AF7F44E03188ED",
        "ParentEventID": [
          "582EEA254369DD36"
        ],
        "Label": "waited",
        "Title": "X-Trace Task",
        "Host": "pinky19.mpi-sws.org",
        "Duration": "3034",
        "HRT": 25488880921357566,
        "Operation": "waited",
        "Timestamp": "1556272520861.491455",
        "TenantClass": 0,
        "Source": "SocketIOWithTimeout.java:335",
        "ThreadID": 7442,
        "ThreadName": "",
        "EventID": "474EEC7E1D8C9F46",
        "BaggageBytes": "[[248 5] [240 0] [0 169 175 127 68 224 49 136 237] [240 1] [0 88 46 234 37 67 105 221 54] [240 3] [0 2]]",
        "ProcessID": 2319
      },
      {
        "Cycles": 0,
        "Agent": "edu.brown.cs.systems.xtrace.logging.BaggageWrappers",
        "ProcessName": "Read",
        "TaskID": "A9AF7F44E03188ED",
        "ParentEventID": [
          "A38396B97E14F1AC",
          "6227D4A0944C4FA9"
        ],
        "Label": "Merged current baggage with other baggage",
        "Title": "X-Trace Task",
        "Host": "pinky19.mpi-sws.org",
        "HRT": 25488880921588026,
        "Operation": "join",
        "Timestamp": "1556272520861.717041",
        "TenantClass": 0,
        "Source": "PacketHeader.java:168",
        "ThreadID": 1,
        "ThreadName": "",
        "EventID": "2DE645E6E922CFA6",
        "ProcessID": 6356
      },
      {
        "Cycles": 0,
        "Agent": "edu.brown.cs.systems.xtrace.logging.BaggageWrappers",
        "ProcessName": "Data",
        "TaskID": "A9AF7F44E03188ED",
        "ParentEventID": [
          "6AE2D82AD4A79E91"
        ],
        "Label": "Forking current baggage with Baggage.fork()",
        "Title": "X-Trace Task",
        "Host": "pinky19.mpi-sws.org",
        "HRT": 25488880921644468,
        "Operation": "fork",
        "Timestamp": "1556272520861.778320",
        "TenantClass": 0,
        "Source": "PacketHeader.java:95",
        "ThreadID": 7442,
        "ThreadName": "",
        "EventID": "11617E098158161C",
        "BaggageBytes": "[[248 5] [240 0] [0 169 175 127 68 224 49 136 237] [240 1] [0 106 226 216 42 212 167 158 145] [240 3] [0 2]]",
        "ProcessID": 2319
      },
      {
        "Cycles": 0,
        "Agent": "Execution-Sleep",
        "ProcessName": "Data",
        "TaskID": "A9AF7F44E03188ED",
        "ParentEventID": [
          "B463986335101920"
        ],
        "Label": "waited",
        "Title": "X-Trace Task",
        "Host": "pinky19.mpi-sws.org",
        "Duration": "3079",
        "HRT": 25488880921584451,
        "Operation": "waited",
        "Timestamp": "1556272520861.718262",
        "TenantClass": 0,
        "Source": "SocketIOWithTimeout.java:335",
        "ThreadID": 7442,
        "ThreadName": "",
        "EventID": "6AE2D82AD4A79E91",
        "BaggageBytes": "[[248 5] [240 0] [0 169 175 127 68 224 49 136 237] [240 1] [0 180 99 152 99 53 16 25 32] [240 3] [0 2]]",
        "ProcessID": 2319
      },
      {
        "Cycles": 0,
        "Agent": "Execution-Sleep",
        "ProcessName": "Data",
        "TaskID": "A9AF7F44E03188ED",
        "ParentEventID": [
          "11617E098158161C"
        ],
        "Label": "waited",
        "Title": "X-Trace Task",
        "Host": "pinky19.mpi-sws.org",
        "Duration": "3034",
        "HRT": 25488880921694785,
        "Operation": "waited",
        "Timestamp": "1556272520861.828613",
        "TenantClass": 0,
        "Source": "SocketIOWithTimeout.java:335",
        "ThreadID": 7442,
        "ThreadName": "",
        "EventID": "32DACFF39C4ACA1C",
        "BaggageBytes": "[[248 5] [240 0] [0 169 175 127 68 224 49 136 237] [240 1] [0 17 97 126 9 129 88 22 28] [240 3] [0 2]]",
        "ProcessID": 2319
      },
      {
        "Cycles": 0,
        "Agent": "edu.brown.cs.systems.xtrace.logging.BaggageWrappers",
        "ProcessName": "Data",
        "TaskID": "A9AF7F44E03188ED",
        "ParentEventID": [
          "32DACFF39C4ACA1C"
        ],
        "Label": "Forking current baggage with Baggage.fork()",
        "Title": "X-Trace Task",
        "Host": "pinky19.mpi-sws.org",
        "HRT": 25488880921755418,
        "Operation": "fork",
        "Timestamp": "1556272520861.889160",
        "TenantClass": 0,
        "Source": "PacketHeader.java:95",
        "ThreadID": 7442,
        "ThreadName": "",
        "EventID": "42D37EBE52EB8377",
        "BaggageBytes": "[[248 5] [240 0] [0 169 175 127 68 224 49 136 237] [240 1] [0 50 218 207 243 156 74 202 28] [240 3] [0 2]]",
        "ProcessID": 2319
      },
      {
        "Cycles": 0,
        "Agent": "Execution-Sleep",
        "ProcessName": "Data",
        "TaskID": "A9AF7F44E03188ED",
        "ParentEventID": [
          "6227D4A0944C4FA9"
        ],
        "Label": "waited",
        "Title": "X-Trace Task",
        "Host": "pinky19.mpi-sws.org",
        "Duration": "3029",
        "HRT": 25488880921473971,
        "Operation": "waited",
        "Timestamp": "1556272520861.607666",
        "TenantClass": 0,
        "Source": "SocketIOWithTimeout.java:335",
        "ThreadID": 7442,
        "ThreadName": "",
        "EventID": "82AF0BB57E733297",
        "BaggageBytes": "[[248 5] [240 0] [0 169 175 127 68 224 49 136 237] [240 1] [0 98 39 212 160 148 76 79 169] [240 3] [0 2]]",
        "ProcessID": 2319
      },
      {
        "Cycles": 0,
        "Agent": "Execution-Sleep",
        "ProcessName": "Data",
        "TaskID": "A9AF7F44E03188ED",
        "ParentEventID": [
          "42D37EBE52EB8377"
        ],
        "Label": "waited",
        "Title": "X-Trace Task",
        "Host": "pinky19.mpi-sws.org",
        "Duration": "3011",
        "HRT": 25488880921805747,
        "Operation": "waited",
        "Timestamp": "1556272520861.939453",
        "TenantClass": 0,
        "Source": "SocketIOWithTimeout.java:335",
        "ThreadID": 7442,
        "ThreadName": "",
        "EventID": "650F40582E24C6DE",
        "BaggageBytes": "[[248 5] [240 0] [0 169 175 127 68 224 49 136 237] [240 1] [0 66 211 126 190 82 235 131 119] [240 3] [0 2]]",
        "ProcessID": 2319
      },
      {
        "Cycles": 0,
        "Agent": "edu.brown.cs.systems.xtrace.logging.BaggageWrappers",
        "ProcessName": "Data",
        "TaskID": "A9AF7F44E03188ED",
        "ParentEventID": [
          "650F40582E24C6DE"
        ],
        "Label": "Forking current baggage with Baggage.fork()",
        "Title": "X-Trace Task",
        "Host": "pinky19.mpi-sws.org",
        "HRT": 25488880921867391,
        "Operation": "fork",
        "Timestamp": "1556272520862.001221",
        "TenantClass": 0,
        "Source": "PacketHeader.java:95",
        "ThreadID": 7442,
        "ThreadName": "",
        "EventID": "B7CF9A970C859F00",
        "BaggageBytes": "[[248 5] [240 0] [0 169 175 127 68 224 49 136 237] [240 1] [0 101 15 64 88 46 36 198 222] [240 3] [0 2]]",
        "ProcessID": 2319
      },
      {
        "Cycles": 0,
        "Agent": "edu.brown.cs.systems.xtrace.logging.BaggageWrappers",
        "ProcessName": "Read",
        "TaskID": "A9AF7F44E03188ED",
        "ParentEventID": [
          "2DE645E6E922CFA6",
          "B463986335101920"
        ],
        "Label": "Merged current baggage with other baggage",
        "Title": "X-Trace Task",
        "Host": "pinky19.mpi-sws.org",
        "HRT": 25488880921705963,
        "Operation": "join",
        "Timestamp": "1556272520861.834961",
        "TenantClass": 0,
        "Source": "PacketHeader.java:168",
        "ThreadID": 1,
        "ThreadName": "",
        "EventID": "F9EDC57345C23CBD",
        "ProcessID": 6356
      },
      {
        "Cycles": 0,
        "Agent": "Execution-Sleep",
        "ProcessName": "Data",
        "TaskID": "A9AF7F44E03188ED",
        "ParentEventID": [
          "B7CF9A970C859F00"
        ],
        "Label": "waited",
        "Title": "X-Trace Task",
        "Host": "pinky19.mpi-sws.org",
        "Duration": "3062",
        "HRT": 25488880921918956,
        "Operation": "waited",
        "Timestamp": "1556272520862.052734",
        "TenantClass": 0,
        "Source": "SocketIOWithTimeout.java:335",
        "ThreadID": 7442,
        "ThreadName": "",
        "EventID": "689C9CD6929375F1",
        "BaggageBytes": "[[248 5] [240 0] [0 169 175 127 68 224 49 136 237] [240 1] [0 183 207 154 151 12 133 159 0] [240 3] [0 2]]",
        "ProcessID": 2319
      },
      {
        "Cycles": 0,
        "Agent": "edu.brown.cs.systems.xtrace.logging.BaggageWrappers",
        "ProcessName": "Data",
        "TaskID": "A9AF7F44E03188ED",
        "ParentEventID": [
          "689C9CD6929375F1"
        ],
        "Label": "Forking current baggage with Baggage.fork()",
        "Title": "X-Trace Task",
        "Host": "pinky19.mpi-sws.org",
        "HRT": 25488880921977378,
        "Operation": "fork",
        "Timestamp": "1556272520862.111084",
        "TenantClass": 0,
        "Source": "PacketHeader.java:95",
        "ThreadID": 7442,
        "ThreadName": "",
        "EventID": "AA55B13EC3A63D4A",
        "BaggageBytes": "[[248 5] [240 0] [0 169 175 127 68 224 49 136 237] [240 1] [0 104 156 156 214 146 147 117 241] [240 3] [0 2]]",
        "ProcessID": 2319
      },
      {
        "Cycles": 0,
        "Agent": "edu.brown.cs.systems.xtrace.logging.BaggageWrappers",
        "ProcessName": "Read",
        "TaskID": "A9AF7F44E03188ED",
        "ParentEventID": [
          "DF67AC4C56588481",
          "42D37EBE52EB8377"
        ],
        "Label": "Merged current baggage with other baggage",
        "Title": "X-Trace Task",
        "Host": "pinky19.mpi-sws.org",
        "HRT": 25488880921941623,
        "Operation": "join",
        "Timestamp": "1556272520862.070557",
        "TenantClass": 0,
        "Source": "PacketHeader.java:168",
        "ThreadID": 1,
        "ThreadName": "",
        "EventID": "674612C7213068FE",
        "ProcessID": 6356
      },
      {
        "Cycles": 0,
        "Agent": "Execution-Sleep",
        "ProcessName": "Data",
        "TaskID": "A9AF7F44E03188ED",
        "ParentEventID": [
          "AA55B13EC3A63D4A"
        ],
        "Label": "waited",
        "Title": "X-Trace Task",
        "Host": "pinky19.mpi-sws.org",
        "Duration": "3078",
        "HRT": 25488880922029387,
        "Operation": "waited",
        "Timestamp": "1556272520862.163086",
        "TenantClass": 0,
        "Source": "SocketIOWithTimeout.java:335",
        "ThreadID": 7442,
        "ThreadName": "",
        "EventID": "AD1FC26D0D7243D5",
        "BaggageBytes": "[[248 5] [240 0] [0 169 175 127 68 224 49 136 237] [240 1] [0 170 85 177 62 195 166 61 74] [240 3] [0 2]]",
        "ProcessID": 2319
      },
      {
        "Cycles": 0,
        "Agent": "edu.brown.cs.systems.xtrace.logging.BaggageWrappers",
        "ProcessName": "Data",
        "TaskID": "A9AF7F44E03188ED",
        "ParentEventID": [
          "AD1FC26D0D7243D5"
        ],
        "Label": "Forking current baggage with Baggage.fork()",
        "Title": "X-Trace Task",
        "Host": "pinky19.mpi-sws.org",
        "HRT": 25488880922088438,
        "Operation": "fork",
        "Timestamp": "1556272520862.222168",
        "TenantClass": 0,
        "Source": "PacketHeader.java:95",
        "ThreadID": 7442,
        "ThreadName": "",
        "EventID": "C0C7C0D4BB7568C1",
        "BaggageBytes": "[[248 5] [240 0] [0 169 175 127 68 224 49 136 237] [240 1] [0 173 31 194 109 13 114 67 213] [240 3] [0 2]]",
        "ProcessID": 2319
      },
      {
        "Cycles": 0,
        "Agent": "edu.brown.cs.systems.xtrace.logging.BaggageWrappers",
        "ProcessName": "Read",
        "TaskID": "A9AF7F44E03188ED",
        "ParentEventID": [
          "11617E098158161C",
          "F9EDC57345C23CBD"
        ],
        "Label": "Merged current baggage with other baggage",
        "Title": "X-Trace Task",
        "Host": "pinky19.mpi-sws.org",
        "HRT": 25488880921824016,
        "Operation": "join",
        "Timestamp": "1556272520861.953125",
        "TenantClass": 0,
        "Source": "PacketHeader.java:168",
        "ThreadID": 1,
        "ThreadName": "",
        "EventID": "DF67AC4C56588481",
        "ProcessID": 6356
      },
      {
        "Cycles": 0,
        "Agent": "Execution-Sleep",
        "ProcessName": "Data",
        "TaskID": "A9AF7F44E03188ED",
        "ParentEventID": [
          "C0C7C0D4BB7568C1"
        ],
        "Label": "waited",
        "Title": "X-Trace Task",
        "Host": "pinky19.mpi-sws.org",
        "Duration": "3068",
        "HRT": 25488880922139339,
        "Operation": "waited",
        "Timestamp": "1556272520862.273193",
        "TenantClass": 0,
        "Source": "SocketIOWithTimeout.java:335",
        "ThreadID": 7442,
        "ThreadName": "",
        "EventID": "7CFCAB17212D2FA8",
        "BaggageBytes": "[[248 5] [240 0] [0 169 175 127 68 224 49 136 237] [240 1] [0 192 199 192 212 187 117 104 193] [240 3] [0 2]]",
        "ProcessID": 2319
      },
      {
        "Cycles": 0,
        "Agent": "edu.brown.cs.systems.xtrace.logging.BaggageWrappers",
        "ProcessName": "Data",
        "TaskID": "A9AF7F44E03188ED",
        "ParentEventID": [
          "7CFCAB17212D2FA8"
        ],
        "Label": "Forking current baggage with Baggage.fork()",
        "Title": "X-Trace Task",
        "Host": "pinky19.mpi-sws.org",
        "HRT": 25488880922198476,
        "Operation": "fork",
        "Timestamp": "1556272520862.332275",
        "TenantClass": 0,
        "Source": "PacketHeader.java:95",
        "ThreadID": 7442,
        "ThreadName": "",
        "EventID": "316CAF13A9595DFD",
        "BaggageBytes": "[[248 5] [240 0] [0 169 175 127 68 224 49 136 237] [240 1] [0 124 252 171 23 33 45 47 168] [240 3] [0 2]]",
        "ProcessID": 2319
      },
      {
        "Cycles": 0,
        "Agent": "edu.brown.cs.systems.xtrace.logging.BaggageWrappers",
        "ProcessName": "Read",
        "TaskID": "A9AF7F44E03188ED",
        "ParentEventID": [
          "B7CF9A970C859F00",
          "674612C7213068FE"
        ],
        "Label": "Merged current baggage with other baggage",
        "Title": "X-Trace Task",
        "Host": "pinky19.mpi-sws.org",
        "HRT": 25488880922058085,
        "Operation": "join",
        "Timestamp": "1556272520862.187012",
        "TenantClass": 0,
        "Source": "PacketHeader.java:168",
        "ThreadID": 1,
        "ThreadName": "",
        "EventID": "866BB7A446BEA707",
        "ProcessID": 6356
      },
      {
        "Cycles": 0,
        "Agent": "Execution-Sleep",
        "ProcessName": "Data",
        "TaskID": "A9AF7F44E03188ED",
        "ParentEventID": [
          "316CAF13A9595DFD"
        ],
        "Label": "waited",
        "Title": "X-Trace Task",
        "Host": "pinky19.mpi-sws.org",
        "Duration": "3518",
        "HRT": 25488880922249092,
        "Operation": "waited",
        "Timestamp": "1556272520862.382812",
        "TenantClass": 0,
        "Source": "SocketIOWithTimeout.java:335",
        "ThreadID": 7442,
        "ThreadName": "",
        "EventID": "675E55953BA09194",
        "BaggageBytes": "[[248 5] [240 0] [0 169 175 127 68 224 49 136 237] [240 1] [0 49 108 175 19 169 89 93 253] [240 3] [0 2]]",
        "ProcessID": 2319
      },
      {
        "Cycles": 0,
        "Agent": "edu.brown.cs.systems.xtrace.logging.BaggageWrappers",
        "ProcessName": "Data",
        "TaskID": "A9AF7F44E03188ED",
        "ParentEventID": [
          "675E55953BA09194"
        ],
        "Label": "Forking current baggage with Baggage.fork()",
        "Title": "X-Trace Task",
        "Host": "pinky19.mpi-sws.org",
        "HRT": 25488880922309400,
        "Operation": "fork",
        "Timestamp": "1556272520862.443115",
        "TenantClass": 0,
        "Source": "PacketHeader.java:95",
        "ThreadID": 7442,
        "ThreadName": "",
        "EventID": "F4F400B455FF795A",
        "BaggageBytes": "[[248 5] [240 0] [0 169 175 127 68 224 49 136 237] [240 1] [0 103 94 85 149 59 160 145 148] [240 3] [0 2]]",
        "ProcessID": 2319
      },
      {
        "Cycles": 0,
        "Agent": "Execution-Sleep",
        "ProcessName": "Data",
        "TaskID": "A9AF7F44E03188ED",
        "ParentEventID": [
          "F4F400B455FF795A"
        ],
        "Label": "waited",
        "Title": "X-Trace Task",
        "Host": "pinky19.mpi-sws.org",
        "Duration": "3175",
        "HRT": 25488880922365774,
        "Operation": "waited",
        "Timestamp": "1556272520862.499512",
        "TenantClass": 0,
        "Source": "SocketIOWithTimeout.java:335",
        "ThreadID": 7442,
        "ThreadName": "",
        "EventID": "32E6E570438A5488",
        "BaggageBytes": "[[248 5] [240 0] [0 169 175 127 68 224 49 136 237] [240 1] [0 244 244 0 180 85 255 121 90] [240 3] [0 2]]",
        "ProcessID": 2319
      },
      {
        "Cycles": 0,
        "Agent": "edu.brown.cs.systems.xtrace.logging.BaggageWrappers",
        "ProcessName": "Read",
        "TaskID": "A9AF7F44E03188ED",
        "ParentEventID": [
          "C0C7C0D4BB7568C1",
          "A2B552CD7F932848"
        ],
        "Label": "Merged current baggage with other baggage",
        "Title": "X-Trace Task",
        "Host": "pinky19.mpi-sws.org",
        "HRT": 25488880922292084,
        "Operation": "join",
        "Timestamp": "1556272520862.421143",
        "TenantClass": 0,
        "Source": "PacketHeader.java:168",
        "ThreadID": 1,
        "ThreadName": "",
        "EventID": "A843E2F1CCC72D23",
        "ProcessID": 6356
      },
      {
        "Cycles": 0,
        "Agent": "edu.brown.cs.systems.xtrace.logging.BaggageWrappers",
        "ProcessName": "Read",
        "TaskID": "A9AF7F44E03188ED",
        "ParentEventID": [
          "A843E2F1CCC72D23",
          "316CAF13A9595DFD"
        ],
        "Label": "Merged current baggage with other baggage",
        "Title": "X-Trace Task",
        "Host": "pinky19.mpi-sws.org",
        "HRT": 25488880922408740,
        "Operation": "join",
        "Timestamp": "1556272520862.537842",
        "TenantClass": 0,
        "Source": "PacketHeader.java:168",
        "ThreadID": 1,
        "ThreadName": "",
        "EventID": "9B9AAB6FD03B1BA1",
        "ProcessID": 6356
      },
      {
        "Cycles": 0,
        "Agent": "Execution-Sleep",
        "ProcessName": "Data",
        "TaskID": "A9AF7F44E03188ED",
        "ParentEventID": [
          "03732310408DE9C7"
        ],
        "Label": "waited",
        "Title": "X-Trace Task",
        "Host": "pinky19.mpi-sws.org",
        "Duration": "3266",
        "HRT": 25488880922475247,
        "Operation": "waited",
        "Timestamp": "1556272520862.609131",
        "TenantClass": 0,
        "Source": "SocketIOWithTimeout.java:335",
        "ThreadID": 7442,
        "ThreadName": "",
        "EventID": "B3F33F3D98689729",
        "BaggageBytes": "[[248 5] [240 0] [0 169 175 127 68 224 49 136 237] [240 1] [0 3 115 35 16 64 141 233 199] [240 3] [0 2]]",
        "ProcessID": 2319
      },
      {
        "Cycles": 0,
        "Agent": "edu.brown.cs.systems.xtrace.logging.BaggageWrappers",
        "ProcessName": "Read",
        "TaskID": "A9AF7F44E03188ED",
        "ParentEventID": [
          "AA55B13EC3A63D4A",
          "866BB7A446BEA707"
        ],
        "Label": "Merged current baggage with other baggage",
        "Title": "X-Trace Task",
        "Host": "pinky19.mpi-sws.org",
        "HRT": 25488880922174680,
        "Operation": "join",
        "Timestamp": "1556272520862.303711",
        "TenantClass": 0,
        "Source": "PacketHeader.java:168",
        "ThreadID": 1,
        "ThreadName": "",
        "EventID": "A2B552CD7F932848",
        "ProcessID": 6356
      },
      {
        "Cycles": 0,
        "Agent": "Execution-CPU",
        "ProcessName": "Data",
        "TaskID": "A9AF7F44E03188ED",
        "ParentEventID": [
          "B3F33F3D98689729"
        ],
        "Label": "unset",
        "Title": "X-Trace Task",
        "Host": "pinky19.mpi-sws.org",
        "Duration": "2145438",
        "HRT": 25488880922622272,
        "Operation": "unset",
        "Timestamp": "1556272520862.756104",
        "TenantClass": 0,
        "Source": "DataXceiver.java:261",
        "ThreadID": 7442,
        "ThreadName": "",
        "EventID": "43BB2C082EBD3CDE",
        "BaggageBytes": "[[248 5] [240 0] [0 169 175 127 68 224 49 136 237] [240 1] [0 179 243 63 61 152 104 151 41] [240 3] [0 2]]",
        "ProcessID": 2319
      },
      {
        "Cycles": 0,
        "Agent": "edu.brown.cs.systems.xtrace.logging.BaggageWrappers",
        "ProcessName": "Data",
        "TaskID": "A9AF7F44E03188ED",
        "ParentEventID": [
          "32E6E570438A5488"
        ],
        "Label": "Forking current baggage with Baggage.fork()",
        "Title": "X-Trace Task",
        "Host": "pinky19.mpi-sws.org",
        "HRT": 25488880922424053,
        "Operation": "fork",
        "Timestamp": "1556272520862.557861",
        "TenantClass": 0,
        "Source": "PacketHeader.java:95",
        "ThreadID": 7442,
        "ThreadName": "",
        "EventID": "03732310408DE9C7",
        "BaggageBytes": "[[248 5] [240 0] [0 169 175 127 68 224 49 136 237] [240 1] [0 50 230 229 112 67 138 84 136] [240 3] [0 2]]",
        "ProcessID": 2319
      }
    ]
  }
]