[
  {
    "id": "09C8D97802DE14E1",
    "reports": [
      {
        "Cycles": 0,
        "Agent": "Execution-CPU",
        "ProcessName": "Read",
        "TaskID": "09C8D97802DE14E1",
        "ParentEventID": [
          "5599524F58F27AE2"
        ],
        "Label": "unset",
        "Title": "X-Trace Task",
        "Host": "pinky19.mpi-sws.org",
        "Duration": "33414596",
        "HRT": 25489141453892435,
        "Operation": "unset",
        "Timestamp": "1556272781394.254639",
        "TenantClass": 0,
        "Source": "Client.java:1027",
        "ThreadID": 1,
        "ThreadName": "",
        "EventID": "9CA268C7BE8AE1B6",
        "ProcessID": 6356
      },
      {
        "Cycles": 0,
        "Agent": "org.apache.hadoop.ipc.ProtobufRpcEngine",
        "ProcessName": "Read",
        "TaskID": "09C8D97802DE14E1",
        "ParentEventID": [
          "ADC341CCF2DC075D"
        ],
        "Label": "Invoking org.apache.hadoop.hdfs.protocol.ClientProtocol.getBlockLocations",
        "Title": "X-Trace Task",
        "Host": "pinky19.mpi-sws.org",
        "HRT": 25489141453854915,
        "Timestamp": "1556272781394.217041",
        "TenantClass": 0,
        "Source": "ProtobufRpcEngine.java:228",
        "ThreadID": 1,
        "ThreadName": "",
        "EventID": "5599524F58F27AE2",
        "ProcessID": 6356
      },
      {
        "Cycles": 0,
        "Agent": "edu.brown.cs.systems.retro.benchmarks.hdfs_client.Reader",
        "ProcessName": "Read",
        "TaskID": "09C8D97802DE14E1",
        "ParentEventID": [
          "1F8E362EF7A3F833"
        ],
        "Label": "Reading file",
        "Title": "X-Trace Task",
        "Host": "pinky19.mpi-sws.org",
        "HRT": 25489141453820484,
        "Timestamp": "1556272781394.182617",
        "TenantClass": 0,
        "ThreadID": 1,
        "ThreadName": "",
        "EventID": "ADC341CCF2DC075D",
        "ProcessID": 6356
      },
      {
        "Cycles": 0,
        "Agent": "Execution-CPU",
        "ProcessName": "Read",
        "TaskID": "09C8D97802DE14E1",
        "ParentEventID": [
          "9CA268C7BE8AE1B6"
        ],
        "Label": "set",
        "Title": "X-Trace Task",
        "Host": "pinky19.mpi-sws.org",
        "HRT": 25489141453923384,
        "Operation": "set",
        "Timestamp": "1556272781394.285400",
        "TenantClass": 0,
        "Source": "Client.java:1032",
        "ThreadID": 41,
        "ThreadName": "",
        "EventID": "33AF25E52CC6FF02",
        "ProcessID": 6356
      },
      {
        "Cycles": 0,
        "Agent": "edu.brown.cs.systems.retro.benchmarks.hdfs_client.Reader",
        "ProcessName": "Read",
        "TaskID": "09C8D97802DE14E1",
        "ParentEventID": [
          "0"
        ],
        "Label": "Reading file",
        "Title": "X-Trace Task",
        "Host": "pinky19.mpi-sws.org",
        "HRT": 25489141453801948,
        "Timestamp": "1556272781394.164062",
        "TenantClass": 0,
        "ThreadID": 1,
        "ThreadName": "",
        "EventID": "1F8E362EF7A3F833",
        "ProcessID": 6356,
        "Tag": [
          "reader_1mb",
          "Read Size: 1048576"
        ]
      },
      {
        "Cycles": 0,
        "Agent": "edu.brown.cs.systems.xtrace.logging.BaggageWrappers",
        "ProcessName": "Read",
        "TaskID": "09C8D97802DE14E1",
        "ParentEventID": [
          "33AF25E52CC6FF02"
        ],
        "Label": "Forking current baggage with Baggage.fork()",
        "Title": "X-Trace Task",
        "Host": "pinky19.mpi-sws.org",
        "HRT": 25489141453942805,
        "Operation": "fork",
        "Timestamp": "1556272781394.304932",
        "TenantClass": 0,
        "Source": "Client.java:1043",
        "ThreadID": 41,
        "ThreadName": "",
        "EventID": "F141382FE5ADB1B8",
        "ProcessID": 6356
      },
      {
        "Cycles": 0,
        "Agent": "Execution-CPU",
        "ProcessName": "Read",
        "TaskID": "09C8D97802DE14E1",
        "ParentEventID": [
          "F141382FE5ADB1B8"
        ],
        "Label": "unset",
        "Title": "X-Trace Task",
        "Host": "pinky19.mpi-sws.org",
        "Duration": "66353",
        "HRT": 25489141454007830,
        "Operation": "unset",
        "Timestamp": "1556272781394.369873",
        "TenantClass": 0,
        "Source": "Client.java:1062",
        "ThreadID": 41,
        "ThreadName": "",
        "EventID": "FA04F12523F78FF0",
        "ProcessID": 6356
      },
      {
        "Cycles": 0,
        "Agent": "Execution-CPU",
        "ProcessName": "Read",
        "TaskID": "09C8D97802DE14E1",
        "ParentEventID": [
          "FA04F12523F78FF0"
        ],
        "Label": "set",
        "Title": "X-Trace Task",
        "Host": "pinky19.mpi-sws.org",
        "HRT": 25489141454032899,
        "Operation": "set",
        "Timestamp": "1556272781394.395020",
        "TenantClass": 0,
        "Source": "Client.java:1104",
        "ThreadID": 1,
        "ThreadName": "",
        "EventID": "DA1E969E81784358",
        "ProcessID": 6356
      },
      {
        "Cycles": 0,
        "Agent": "Execution-CPU",
        "ProcessName": "Name",
        "TaskID": "09C8D97802DE14E1",
        "ParentEventID": [
          "F141382FE5ADB1B8"
        ],
        "Label": "set",
        "Title": "X-Trace Task",
        "Host": "pinky19.mpi-sws.org",
        "HRT": 25489141454077638,
        "Operation": "set",
        "Timestamp": "1556272781394.457275",
        "TenantClass": 0,
        "Source": "Server.java:1840",
        "ThreadID": 48,
        "ThreadName": "",
        "EventID": "78C8BA729BFF946A",
        "BaggageBytes": "[[248 5] [240 0] [0 9 200 217 120 2 222 20 225] [240 1] [0 241 65 56 47 229 173 177 184] [240 3] [0 2]]",
        "ProcessID": 2171
      },
      {
        "Cycles": 0,
        "Agent": "Execution-CPU",
        "ProcessName": "Name",
        "TaskID": "09C8D97802DE14E1",
        "ParentEventID": [
          "51FE7C5332A80686"
        ],
        "Label": "unset",
        "Title": "X-Trace Task",
        "Host": "pinky19.mpi-sws.org",
        "Duration": "29432",
        "HRT": 25489141454138421,
        "Operation": "unset",
        "Timestamp": "1556272781394.518066",
        "TenantClass": 0,
        "Source": "Server.java:1828",
        "ThreadID": 48,
        "ThreadName": "",
        "EventID": "1DDF1EDF2E1035C9",
        "BaggageBytes": "[[248 5] [240 0] [0 9 200 217 120 2 222 20 225] [240 1] [0 81 254 124 83 50 168 6 134] [240 3] [0 2]]",
        "ProcessID": 2171
      },
      {
        "Cycles": 0,
        "Agent": "edu.brown.cs.systems.xtrace.logging.BaggageWrappers",
        "ProcessName": "Name",
        "TaskID": "09C8D97802DE14E1",
        "ParentEventID": [
          "78C8BA729BFF946A"
        ],
        "Label": "Forking current baggage with Baggage.fork()",
        "Title": "X-Trace Task",
        "Host": "pinky19.mpi-sws.org",
        "HRT": 25489141454112752,
        "Operation": "fork",
        "Timestamp": "1556272781394.492432",
        "TenantClass": 0,
        "Source": "Server.java:550",
        "ThreadID": 48,
        "ThreadName": "",
        "EventID": "51FE7C5332A80686",
        "BaggageBytes": "[[248 5] [240 0] [0 9 200 217 120 2 222 20 225] [240 1] [0 120 200 186 114 155 255 148 106] [240 3] [0 2]]",
        "ProcessID": 2171
      },
      {
        "Cycles": 0,
        "Agent": "Execution-CPU",
        "ProcessName": "Name",
        "TaskID": "09C8D97802DE14E1",
        "ParentEventID": [
          "51FE7C5332A80686"
        ],
        "Label": "set",
        "Title": "X-Trace Task",
        "Host": "pinky19.mpi-sws.org",
        "HRT": 25489141454148937,
        "Operation": "set",
        "Timestamp": "1556272781394.528564",
        "TenantClass": 0,
        "Source": "Server.java:2071",
        "ThreadID": 58,
        "ThreadName": "",
        "EventID": "A6E909FDADABE967",
        "BaggageBytes": "[[248 5] [240 0] [0 9 200 217 120 2 222 20 225] [240 1] [0 81 254 124 83 50 168 6 134] [240 3] [0 2]]",
        "ProcessID": 2171
      },
      {
        "Cycles": 0,
        "Agent": "org.apache.hadoop.hdfs.server.namenode.FSNamesystem.audit",
        "ProcessName": "Name",
        "TaskID": "09C8D97802DE14E1",
        "ParentEventID": [
          "8609501341B08AF4"
        ],
        "Label": "allowed=true\tugi=plascas (auth:SIMPLE)\tip=/139.19.171.63\tcmd=open\tsrc=/ds/SMA3icddcQa8zd8l\tdst=null\tperm=null\tproto=rpc",
        "Title": "X-Trace Task",
        "Host": "pinky19.mpi-sws.org",
        "HRT": 25489141454238008,
        "Timestamp": "1556272781394.617676",
        "TenantClass": 0,
        "Source": "FSNamesystem.java:8313",
        "ThreadID": 58,
        "ThreadName": "",
        "EventID": "82CF42044ABE6DD3",
        "BaggageBytes": "[[248 5] [240 0] [0 9 200 217 120 2 222 20 225] [240 1] [0 134 9 80 19 65 176 138 244] [240 3] [0 2]]",
        "ProcessID": 2171
      },
      {
        "Cycles": 0,
        "Agent": "org.apache.hadoop.ipc.Server",
        "ProcessName": "Name",
        "TaskID": "09C8D97802DE14E1",
        "ParentEventID": [
          "A6E909FDADABE967"
        ],
        "Label": "getBlockLocations in org.apache.hadoop.hdfs.protocol.ClientProtocol",
        "Title": "X-Trace Task",
        "Host": "pinky19.mpi-sws.org",
        "HRT": 25489141454190992,
        "Timestamp": "1556272781394.570557",
        "TenantClass": 0,
        "Source": "ProtobufRpcEngine.java:601",
        "ThreadID": 58,
        "ThreadName": "",
        "EventID": "8609501341B08AF4",
        "BaggageBytes": "[[248 5] [240 0] [0 9 200 217 120 2 222 20 225] [240 1] [0 166 233 9 253 173 171 233 103] [240 3] [0 2]]",
        "ProcessID": 2171
      },
      {
        "Cycles": 0,
        "Agent": "edu.brown.cs.systems.xtrace.logging.BaggageWrappers",
        "ProcessName": "Name",
        "TaskID": "09C8D97802DE14E1",
        "ParentEventID": [
          "82CF42044ABE6DD3"
        ],
        "Label": "Forking current baggage with Baggage.fork()",
        "Title": "X-Trace Task",
        "Host": "pinky19.mpi-sws.org",
        "HRT": 25489141454282992,
        "Operation": "fork",
        "Timestamp": "1556272781394.662598",
        "TenantClass": 0,
        "Source": "Server.java:2398",
        "ThreadID": 58,
        "ThreadName": "",
        "EventID": "A0187D04A22553CF",
        "BaggageBytes": "[[248 5] [240 0] [0 9 200 217 120 2 222 20 225] [240 1] [0 130 207 66 4 74 190 109 211] [240 3] [0 2]]",
        "ProcessID": 2171
      },
      {
        "Cycles": 0,
        "Agent": "Execution-CPU",
        "ProcessName": "Read",
        "TaskID": "09C8D97802DE14E1",
        "ParentEventID": [
          "A0187D04A22553CF"
        ],
        "Label": "set",
        "Title": "X-Trace Task",
        "Host": "pinky19.mpi-sws.org",
        "HRT": 25489141454453144,
        "Operation": "set",
        "Timestamp": "1556272781394.815186",
        "TenantClass": 0,
        "Source": "Client.java:302",
        "ThreadID": 40,
        "ThreadName": "",
        "EventID": "9A0AC82CFF3DE946",
        "ProcessID": 6356
      },
      {
        "Cycles": 0,
        "Agent": "Execution-CPU",
        "ProcessName": "Name",
        "TaskID": "09C8D97802DE14E1",
        "ParentEventID": [
          "A0187D04A22553CF"
        ],
        "Label": "unset",
        "Title": "X-Trace Task",
        "Host": "pinky19.mpi-sws.org",
        "Duration": "211473",
        "HRT": 25489141454390111,
        "Operation": "unset",
        "Timestamp": "1556272781394.769775",
        "TenantClass": 0,
        "Source": "Server.java:1058",
        "ThreadID": 58,
        "ThreadName": "",
        "EventID": "F7487288AF18CB27",
        "BaggageBytes": "[[248 5] [240 0] [0 9 200 217 120 2 222 20 225] [240 1] [0 160 24 125 4 162 37 83 207] [240 3] [0 2]]",
        "ProcessID": 2171
      },
      {
        "Cycles": 0,
        "Agent": "Execution-CPU",
        "ProcessName": "Read",
        "TaskID": "09C8D97802DE14E1",
        "ParentEventID": [
          "9A0AC82CFF3DE946"
        ],
        "Label": "unset",
        "Title": "X-Trace Task",
        "Host": "pinky19.mpi-sws.org",
        "Duration": "6213",
        "HRT": 25489141454476064,
        "Operation": "unset",
        "Timestamp": "1556272781394.838135",
        "TenantClass": 0,
        "Source": "Client.java:1168",
        "ThreadID": 40,
        "ThreadName": "",
        "EventID": "AFF97C433C5C1029",
        "ProcessID": 6356
      },
      {
        "Cycles": 0,
        "Agent": "edu.brown.cs.systems.xtrace.logging.BaggageWrappers",
        "ProcessName": "Read",
        "TaskID": "09C8D97802DE14E1",
        "ParentEventID": [
          "AEBFBF6B8F20356F",
          "AFF97C433C5C1029"
        ],
        "Label": "Merged current baggage with other baggage",
        "Title": "X-Trace Task",
        "Host": "pinky19.mpi-sws.org",
        "HRT": 25489141454537969,
        "Operation": "join",
        "Timestamp": "1556272781394.900146",
        "TenantClass": 0,
        "Source": "Client.java:1545",
        "ThreadID": 1,
        "ThreadName": "",
        "EventID": "0F930FE2E7703215",
        "ProcessID": 6356
      },
      {
        "Cycles": 0,
        "Agent": "Execution-Sleep",
        "ProcessName": "Read",
        "TaskID": "09C8D97802DE14E1",
        "ParentEventID": [
          "DA1E969E81784358"
        ],
        "Label": "waited",
        "Title": "X-Trace Task",
        "Host": "pinky19.mpi-sws.org",
        "Duration": "466880",
        "HRT": 25489141454517373,
        "Operation": "waited",
        "Timestamp": "1556272781394.879395",
        "TenantClass": 0,
        "Source": "Client.java:1537",
        "ThreadID": 1,
        "ThreadName": "",
        "EventID": "AEBFBF6B8F20356F",
        "ProcessID": 6356
      },
      {
        "Cycles": 0,
        "Agent": "org.apache.hadoop.ipc.ProtobufRpcEngine",
        "ProcessName": "Read",
        "TaskID": "09C8D97802DE14E1",
        "ParentEventID": [
          "0F930FE2E7703215"
        ],
        "Label": "org.apache.hadoop.hdfs.protocol.ClientProtocol.getBlockLocations completed",
        "Title": "X-Trace Task",
        "Host": "pinky19.mpi-sws.org",
        "HRT": 25489141454577286,
        "Timestamp": "1556272781394.939453",
        "TenantClass": 0,
        "Source": "ProtobufRpcEngine.java:275",
        "ThreadID": 1,
        "ThreadName": "",
        "EventID": "53F1FA409E8EA17D",
        "ProcessID": 6356
      },
      {
        "Cycles": 0,
        "Agent": "Execution-Sleep",
        "ProcessName": "Read",
        "TaskID": "09C8D97802DE14E1",
        "ParentEventID": [
          "53F1FA409E8EA17D"
        ],
        "Label": "waited",
        "Title": "X-Trace Task",
        "Host": "pinky19.mpi-sws.org",
        "Duration": "5127",
        "HRT": 25489141454677958,
        "Operation": "waited",
        "Timestamp": "1556272781395.040039",
        "TenantClass": 0,
        "Source": "SocketIOWithTimeout.java:335",
        "ThreadID": 1,
        "ThreadName": "",
        "EventID": "710710205C594D48",
        "ProcessID": 6356
      },
      {
        "Cycles": 0,
        "Agent": "Execution-CPU",
        "ProcessName": "Data",
        "TaskID": "09C8D97802DE14E1",
        "ParentEventID": [
          "F71E7FE1F5A5DA39"
        ],
        "Label": "set",
        "Title": "X-Trace Task",
        "Host": "pinky19.mpi-sws.org",
        "HRT": 25489141454868284,
        "Operation": "set",
        "Timestamp": "1556272781395.240234",
        "TenantClass": 0,
        "Source": "Receiver.java:117",
        "ThreadID": 9119,
        "ThreadName": "",
        "EventID": "7840ED90D71EE5D8",
        "BaggageBytes": "[[248 5] [240 0] [0 9 200 217 120 2 222 20 225] [240 1] [0 247 30 127 225 245 165 218 57] [240 3] [0 2]]",
        "ProcessID": 2319
      },
      {
        "Cycles": 0,
        "Agent": "edu.brown.cs.systems.xtrace.logging.BaggageWrappers",
        "ProcessName": "Read",
        "TaskID": "09C8D97802DE14E1",
        "ParentEventID": [
          "710710205C594D48"
        ],
        "Label": "Forking current baggage with Baggage.fork()",
        "Title": "X-Trace Task",
        "Host": "pinky19.mpi-sws.org",
        "HRT": 25489141454714662,
        "Operation": "fork",
        "Timestamp": "1556272781395.076660",
        "TenantClass": 0,
        "Source": "DataTransferProtoUtil.java:94",
        "ThreadID": 1,
        "ThreadName": "",
        "EventID": "F71E7FE1F5A5DA39",
        "ProcessID": 6356
      },
      {
        "Cycles": 0,
        "Agent": "edu.brown.cs.systems.xtrace.logging.XTraceInit",
        "ProcessName": "Data",
        "TaskID": "09C8D97802DE14E1",
        "ParentEventID": [
          "7840ED90D71EE5D8"
        ],
        "Label": "Thread.setName: DataXceiver for client DFSClient_NONMAPREDUCE_614514224_1 at /139.19.171.63:59608 [Sending block BP-1633380353-139.19.171.63-1554193446451:blk_1073756035_15211]",
        "Title": "X-Trace Task",
        "Host": "pinky19.mpi-sws.org",
        "HRT": 25489141454906886,
        "Timestamp": "1556272781395.278809",
        "TenantClass": 0,
        "Source": "DataXceiver.java:168",
        "ThreadID": 9119,
        "ThreadName": "",
        "EventID": "55D2776F537C1E14",
        "BaggageBytes": "[[248 5] [240 0] [0 9 200 217 120 2 222 20 225] [240 1] [0 120 64 237 144 215 30 229 216] [240 3] [0 2]]",
        "ProcessID": 2319
      },
      {
        "Cycles": 0,
        "Agent": "Execution-Sleep",
        "ProcessName": "Read",
        "TaskID": "09C8D97802DE14E1",
        "ParentEventID": [
          "F71E7FE1F5A5DA39"
        ],
        "Label": "waited",
        "Title": "X-Trace Task",
        "Host": "pinky19.mpi-sws.org",
        "Duration": "254810",
        "HRT": 25489141455055082,
        "Operation": "waited",
        "Timestamp": "1556272781395.417236",
        "TenantClass": 0,
        "Source": "SocketIOWithTimeout.java:335",
        "ThreadID": 1,
        "ThreadName": "",
        "EventID": "B76B0CFD2F71A56F",
        "ProcessID": 6356
      },
      {
        "Cycles": 0,
        "Agent": "edu.brown.cs.systems.xtrace.logging.BaggageWrappers",
        "ProcessName": "Data",
        "TaskID": "09C8D97802DE14E1",
        "ParentEventID": [
          "55D2776F537C1E14"
        ],
        "Label": "Forking current baggage with Baggage.fork()",
        "Title": "X-Trace Task",
        "Host": "pinky19.mpi-sws.org",
        "HRT": 25489141454992066,
        "Operation": "fork",
        "Timestamp": "1556272781395.364014",
        "TenantClass": 0,
        "Source": "DataXceiver.java:1257",
        "ThreadID": 9119,
        "ThreadName": "",
        "EventID": "0ED23510A729D3B2",
        "BaggageBytes": "[[248 5] [240 0] [0 9 200 217 120 2 222 20 225] [240 1] [0 85 210 119 111 83 124 30 20] [240 3] [0 2]]",
        "ProcessID": 2319
      },
      {
        "Cycles": 0,
        "Agent": "edu.brown.cs.systems.xtrace.logging.BaggageWrappers",
        "ProcessName": "Data",
        "TaskID": "09C8D97802DE14E1",
        "ParentEventID": [
          "0ED23510A729D3B2"
        ],
        "Label": "Forking current baggage with Baggage.fork()",
        "Title": "X-Trace Task",
        "Host": "pinky19.mpi-sws.org",
        "HRT": 25489141455063557,
        "Operation": "fork",
        "Timestamp": "1556272781395.435547",
        "TenantClass": 0,
        "Source": "PacketHeader.java:95",
        "ThreadID": 9119,
        "ThreadName": "",
        "EventID": "D107863912777CE5",
        "BaggageBytes": "[[248 5] [240 0] [0 9 200 217 120 2 222 20 225] [240 1] [0 14 210 53 16 167 41 211 178] [240 3] [0 2]]",
        "ProcessID": 2319
      },
      {
        "Cycles": 0,
        "Agent": "edu.brown.cs.systems.xtrace.logging.BaggageWrappers",
        "ProcessName": "Read",
        "TaskID": "09C8D97802DE14E1",
        "ParentEventID": [
          "0ED23510A729D3B2",
          "B76B0CFD2F71A56F"
        ],
        "Label": "Merged current baggage with other baggage",
        "Title": "X-Trace Task",
        "Host": "pinky19.mpi-sws.org",
        "HRT": 25489141455121288,
        "Operation": "join",
        "Timestamp": "1556272781395.483398",
        "TenantClass": 0,
        "Source": "RemoteBlockReader2.java:429",
        "ThreadID": 1,
        "ThreadName": "",
        "EventID": "D97EFA7E8073C67B",
        "ProcessID": 6356
      },
      {
        "Cycles": 0,
        "Agent": "Execution-Sleep",
        "ProcessName": "Data",
        "TaskID": "09C8D97802DE14E1",
        "ParentEventID": [
          "D107863912777CE5"
        ],
        "Label": "waited",
        "Title": "X-Trace Task",
        "Host": "pinky19.mpi-sws.org",
        "Duration": "4981",
        "HRT": 25489141455129825,
        "Operation": "waited",
        "Timestamp": "1556272781395.501953",
        "TenantClass": 0,
        "Source": "SocketIOWithTimeout.java:335",
        "ThreadID": 9119,
        "ThreadName": "",
        "EventID": "42159EA18D9D3763",
        "BaggageBytes": "[[248 5] [240 0] [0 9 200 217 120 2 222 20 225] [240 1] [0 209 7 134 57 18 119 124 229] [240 3] [0 2]]",
        "ProcessID": 2319
      },
      {
        "Cycles": 0,
        "Agent": "edu.brown.cs.systems.xtrace.logging.BaggageWrappers",
        "ProcessName": "Data",
        "TaskID": "09C8D97802DE14E1",
        "ParentEventID": [
          "42159EA18D9D3763"
        ],
        "Label": "Forking current baggage with Baggage.fork()",
        "Title": "X-Trace Task",
        "Host": "pinky19.mpi-sws.org",
        "HRT": 25489141455204440,
        "Operation": "fork",
        "Timestamp": "1556272781395.576416",
        "TenantClass": 0,
        "Source": "PacketHeader.java:95",
        "ThreadID": 9119,
        "ThreadName": "",
        "EventID": "963705AB79C28941",
        "BaggageBytes": "[[248 5] [240 0] [0 9 200 217 120 2 222 20 225] [240 1] [0 66 21 158 161 141 157 55 99] [240 3] [0 2]]",
        "ProcessID": 2319
      },
      {
        "Cycles": 0,
        "Agent": "edu.brown.cs.systems.xtrace.logging.BaggageWrappers",
        "ProcessName": "Read",
        "TaskID": "09C8D97802DE14E1",
        "ParentEventID": [
          "963705AB79C28941",
          "0F6935A13540D222"
        ],
        "Label": "Merged current baggage with other baggage",
        "Title": "X-Trace Task",
        "Host": "pinky19.mpi-sws.org",
        "HRT": 25489141455350547,
        "Operation": "join",
        "Timestamp": "1556272781395.712646",
        "TenantClass": 0,
        "Source": "PacketHeader.java:168",
        "ThreadID": 1,
        "ThreadName": "",
        "EventID": "6311C4A5F59D12BC",
        "ProcessID": 6356
      },
      {
        "Cycles": 0,
        "Agent": "edu.brown.cs.systems.xtrace.logging.BaggageWrappers",
        "ProcessName": "Read",
        "TaskID": "09C8D97802DE14E1",
        "ParentEventID": [
          "D97EFA7E8073C67B",
          "D107863912777CE5"
        ],
        "Label": "Merged current baggage with other baggage",
        "Title": "X-Trace Task",
        "Host": "pinky19.mpi-sws.org",
        "HRT": 25489141455247339,
        "Operation": "join",
        "Timestamp": "1556272781395.609375",
        "TenantClass": 0,
        "Source": "PacketHeader.java:168",
        "ThreadID": 1,
        "ThreadName": "",
        "EventID": "0F6935A13540D222",
        "ProcessID": 6356
      },
      {
        "Cycles": 0,
        "Agent": "edu.brown.cs.systems.xtrace.logging.BaggageWrappers",
        "ProcessName": "Read",
        "TaskID": "09C8D97802DE14E1",
        "ParentEventID": [
          "6311C4A5F59D12BC"
        ],
        "Label": "Forking current baggage with Baggage.fork()",
        "Title": "X-Trace Task",
        "Host": "pinky19.mpi-sws.org",
        "HRT": 25489141455358902,
        "Operation": "fork",
        "Timestamp": "1556272781395.720947",
        "TenantClass": 0,
        "Source": "RemoteBlockReader2.java:361",
        "ThreadID": 1,
        "ThreadName": "",
        "EventID": "A393BE59BB55C69D",
        "ProcessID": 6356
      },
      {
        "Cycles": 0,
        "Agent": "edu.brown.cs.systems.xtrace.logging.BaggageWrappers",
        "ProcessName": "Read",
        "TaskID": "09C8D97802DE14E1",
        "ParentEventID": [
          "A393BE59BB55C69D"
        ],
        "Label": "Forking current baggage with Baggage.fork()",
        "Title": "X-Trace Task",
        "Host": "pinky19.mpi-sws.org",
        "HRT": 25489141455418003,
        "Operation": "fork",
        "Timestamp": "1556272781395.780029",
        "TenantClass": 0,
        "Source": "DataTransferProtoUtil.java:94",
        "ThreadID": 1,
        "ThreadName": "",
        "EventID": "6C4AE8E81F9761E9",
        "ProcessID": 6356
      },
      {
        "Cycles": 0,
        "Agent": "Execution-Sleep",
        "ProcessName": "Data",
        "TaskID": "09C8D97802DE14E1",
        "ParentEventID": [
          "963705AB79C28941"
        ],
        "Label": "waited",
        "Title": "X-Trace Task",
        "Host": "pinky19.mpi-sws.org",
        "Duration": "110666",
        "HRT": 25489141455399652,
        "Operation": "waited",
        "Timestamp": "1556272781395.771729",
        "TenantClass": 0,
        "Source": "SocketIOWithTimeout.java:335",
        "ThreadID": 9119,
        "ThreadName": "",
        "EventID": "D45D5F18C7D7EAD5",
        "BaggageBytes": "[[248 5] [240 0] [0 9 200 217 120 2 222 20 225] [240 1] [0 150 55 5 171 121 194 137 65] [240 3] [0 2]]",
        "ProcessID": 2319
      },
      {
        "Cycles": 0,
        "Agent": "edu.brown.cs.systems.xtrace.logging.BaggageWrappers",
        "ProcessName": "Data",
        "TaskID": "09C8D97802DE14E1",
        "ParentEventID": [
          "D45D5F18C7D7EAD5",
          "A393BE59BB55C69D"
        ],
        "Label": "Merged current baggage with other baggage",
        "Title": "X-Trace Task",
        "Host": "pinky19.mpi-sws.org",
        "HRT": 25489141455453008,
        "Operation": "join",
        "Timestamp": "1556272781395.824951",
        "TenantClass": 0,
        "Source": "DataXceiver.java:574",
        "ThreadID": 9119,
        "ThreadName": "",
        "EventID": "43AE7C66379F48F2",
        "BaggageBytes": "[[248 5] [240 0] [0 9 200 217 120 2 222 20 225] [240 1] [0 163 147 190 89 187 85 198 157] [0 212 93 95 24 199 215 234 213] [240 3] [0 2]]",
        "ProcessID": 2319
      },
      {
        "Cycles": 0,
        "Agent": "Execution-CPU",
        "ProcessName": "Data",
        "TaskID": "09C8D97802DE14E1",
        "ParentEventID": [
          "43AE7C66379F48F2"
        ],
        "Label": "unset",
        "Title": "X-Trace Task",
        "Host": "pinky19.mpi-sws.org",
        "Duration": "580821",
        "HRT": 25489141455474415,
        "Operation": "unset",
        "Timestamp": "1556272781395.846436",
        "TenantClass": 0,
        "Source": "DataXceiver.java:261",
        "ThreadID": 9119,
        "ThreadName": "",
        "EventID": "FC7988453B8BB3FE",
        "BaggageBytes": "[[248 5] [240 0] [0 9 200 217 120 2 222 20 225] [240 1] [0 67 174 124 102 55 159 72 242] [240 3] [0 2]]",
        "ProcessID": 2319
      },
      {
        "Cycles": 0,
        "Agent": "Execution-CPU",
        "ProcessName": "Data",
        "TaskID": "09C8D97802DE14E1",
        "ParentEventID": [
          "6C4AE8E81F9761E9"
        ],
        "Label": "set",
        "Title": "X-Trace Task",
        "Host": "pinky19.mpi-sws.org",
        "HRT": 25489141455524823,
        "Operation": "set",
        "Timestamp": "1556272781395.896729",
        "TenantClass": 0,
        "Source": "Receiver.java:117",
        "ThreadID": 9119,
        "ThreadName": "",
        "EventID": "FCD4DA33178317B1",
        "BaggageBytes": "[[248 5] [240 0] [0 9 200 217 120 2 222 20 225] [240 1] [0 108 74 232 232 31 151 97 233] [240 3] [0 2]]",
        "ProcessID": 2319
      },
      {
        "Cycles": 0,
        "Agent": "edu.brown.cs.systems.xtrace.logging.BaggageWrappers",
        "ProcessName": "Data",
        "TaskID": "09C8D97802DE14E1",
        "ParentEventID": [
          "7159B6563C8BF078"
        ],
        "Label": "Forking current baggage with Baggage.fork()",
        "Title": "X-Trace Task",
        "Host": "pinky19.mpi-sws.org",
        "HRT": 25489141455611045,
        "Operation": "fork",
        "Timestamp": "1556272781395.983154",
        "TenantClass": 0,
        "Source": "DataXceiver.java:1257",
        "ThreadID": 9119,
        "ThreadName": "",
        "EventID": "D5C07DFE9E0ECEDA",
        "BaggageBytes": "[[248 5] [240 0] [0 9 200 217 120 2 222 20 225] [240 1] [0 113 89 182 86 60 139 240 120] [240 3] [0 2]]",
        "ProcessID": 2319
      },
      {
        "Cycles": 0,
        "Agent": "edu.brown.cs.systems.xtrace.logging.XTraceInit",
        "ProcessName": "Data",
        "TaskID": "09C8D97802DE14E1",
        "ParentEventID": [
          "FCD4DA33178317B1"
        ],
        "Label": "Thread.setName: DataXceiver for client DFSClient_NONMAPREDUCE_614514224_1 at /139.19.171.63:59608 [Sending block BP-1633380353-139.19.171.63-1554193446451:blk_1073756035_15211]",
        "Title": "X-Trace Task",
        "Host": "pinky19.mpi-sws.org",
        "HRT": 25489141455551503,
        "Timestamp": "1556272781395.923584",
        "TenantClass": 0,
        "Source": "DataXceiver.java:168",
        "ThreadID": 9119,
        "ThreadName": "",
        "EventID": "7159B6563C8BF078",
        "BaggageBytes": "[[248 5] [240 0] [0 9 200 217 120 2 222 20 225] [240 1] [0 252 212 218 51 23 131 23 177] [240 3] [0 2]]",
        "ProcessID": 2319
      },
      {
        "Cycles": 0,
        "Agent": "Execution-Sleep",
        "ProcessName": "Read",
        "TaskID": "09C8D97802DE14E1",
        "ParentEventID": [
          "6C4AE8E81F9761E9"
        ],
        "Label": "waited",
        "Title": "X-Trace Task",
        "Host": "pinky19.mpi-sws.org",
        "Duration": "180140",
        "HRT": 25489141455665501,
        "Operation": "waited",
        "Timestamp": "1556272781396.027588",
        "TenantClass": 0,
        "Source": "SocketIOWithTimeout.java:335",
        "ThreadID": 1,
        "ThreadName": "",
        "EventID": "ED7A22E5368D20B6",
        "ProcessID": 6356
      },
      {
        "Cycles": 0,
        "Agent": "edu.brown.cs.systems.xtrace.logging.BaggageWrappers",
        "ProcessName": "Read",
        "TaskID": "09C8D97802DE14E1",
        "ParentEventID": [
          "ED7A22E5368D20B6",
          "D5C07DFE9E0ECEDA"
        ],
        "Label": "Merged current baggage with other baggage",
        "Title": "X-Trace Task",
        "Host": "pinky19.mpi-sws.org",
        "HRT": 25489141455725015,
        "Operation": "join",
        "Timestamp": "1556272781396.087158",
        "TenantClass": 0,
        "Source": "RemoteBlockReader2.java:429",
        "ThreadID": 1,
        "ThreadName": "",
        "EventID": "FDE2F7BD42153779",
        "ProcessID": 6356
      },
      {
        "Cycles": 0,
        "Agent": "edu.brown.cs.systems.xtrace.logging.BaggageWrappers",
        "ProcessName": "Data",
        "TaskID": "09C8D97802DE14E1",
        "ParentEventID": [
          "D5C07DFE9E0ECEDA"
        ],
        "Label": "Forking current baggage with Baggage.fork()",
        "Title": "X-Trace Task",
        "Host": "pinky19.mpi-sws.org",
        "HRT": 25489141455667610,
        "Operation": "fork",
        "Timestamp": "1556272781396.039551",
        "TenantClass": 0,
        "Source": "PacketHeader.java:95",
        "ThreadID": 9119,
        "ThreadName": "",
        "EventID": "7851AF7BAAA2E650",
        "BaggageBytes": "[[248 5] [240 0] [0 9 200 217 120 2 222 20 225] [240 1] [0 213 192 125 254 158 14 206 218] [240 3] [0 2]]",
        "ProcessID": 2319
      },
      {
        "Cycles": 0,
        "Agent": "Execution-Sleep",
        "ProcessName": "Data",
        "TaskID": "09C8D97802DE14E1",
        "ParentEventID": [
          "7851AF7BAAA2E650"
        ],
        "Label": "waited",
        "Title": "X-Trace Task",
        "Host": "pinky19.mpi-sws.org",
        "Duration": "3889",
        "HRT": 25489141455722101,
        "Operation": "waited",
        "Timestamp": "1556272781396.093994",
        "TenantClass": 0,
        "Source": "SocketIOWithTimeout.java:335",
        "ThreadID": 9119,
        "ThreadName": "",
        "EventID": "89191825FA353463",
        "BaggageBytes": "[[248 5] [240 0] [0 9 200 217 120 2 222 20 225] [240 1] [0 120 81 175 123 170 162 230 80] [240 3] [0 2]]",
        "ProcessID": 2319
      },
      {
        "Cycles": 0,
        "Agent": "edu.brown.cs.systems.xtrace.logging.BaggageWrappers",
        "ProcessName": "Data",
        "TaskID": "09C8D97802DE14E1",
        "ParentEventID": [
          "89191825FA353463"
        ],
        "Label": "Forking current baggage with Baggage.fork()",
        "Title": "X-Trace Task",
        "Host": "pinky19.mpi-sws.org",
        "HRT": 25489141455783898,
        "Operation": "fork",
        "Timestamp": "1556272781396.156006",
        "TenantClass": 0,
        "Source": "PacketHeader.java:95",
        "ThreadID": 9119,
        "ThreadName": "",
        "EventID": "FB15D9CD862ACE1D",
        "BaggageBytes": "[[248 5] [240 0] [0 9 200 217 120 2 222 20 225] [240 1] [0 137 25 24 37 250 53 52 99] [240 3] [0 2]]",
        "ProcessID": 2319
      },
      {
        "Cycles": 0,
        "Agent": "edu.brown.cs.systems.xtrace.logging.BaggageWrappers",
        "ProcessName": "Read",
        "TaskID": "09C8D97802DE14E1",
        "ParentEventID": [
          "FDE2F7BD42153779",
          "7851AF7BAAA2E650"
        ],
        "Label": "Merged current baggage with other baggage",
        "Title": "X-Trace Task",
        "Host": "pinky19.mpi-sws.org",
        "HRT": 25489141455817449,
        "Operation": "join",
        "Timestamp": "1556272781396.179443",
        "TenantClass": 0,
        "Source": "PacketHeader.java:168",
        "ThreadID": 1,
        "ThreadName": "",
        "EventID": "FB59C8EBEAF8F30B",
        "ProcessID": 6356
      },
      {
        "Cycles": 0,
        "Agent": "edu.brown.cs.systems.xtrace.logging.BaggageWrappers",
        "ProcessName": "Data",
        "TaskID": "09C8D97802DE14E1",
        "ParentEventID": [
          "DEBEECF3C9E4E50A"
        ],
        "Label": "Forking current baggage with Baggage.fork()",
        "Title": "X-Trace Task",
        "Host": "pinky19.mpi-sws.org",
        "HRT": 25489141455901320,
        "Operation": "fork",
        "Timestamp": "1556272781396.273438",
        "TenantClass": 0,
        "Source": "PacketHeader.java:95",
        "ThreadID": 9119,
        "ThreadName": "",
        "EventID": "EC6EAB6CA064EA54",
        "BaggageBytes": "[[248 5] [240 0] [0 9 200 217 120 2 222 20 225] [240 1] [0 222 190 236 243 201 228 229 10] [240 3] [0 2]]",
        "ProcessID": 2319
      },
      {
        "Cycles": 0,
        "Agent": "Execution-Sleep",
        "ProcessName": "Data",
        "TaskID": "09C8D97802DE14E1",
        "ParentEventID": [
          "FB15D9CD862ACE1D"
        ],
        "Label": "waited",
        "Title": "X-Trace Task",
        "Host": "pinky19.mpi-sws.org",
        "Duration": "3328",
        "HRT": 25489141455836100,
        "Operation": "waited",
        "Timestamp": "1556272781396.208008",
        "TenantClass": 0,
        "Source": "SocketIOWithTimeout.java:335",
        "ThreadID": 9119,
        "ThreadName": "",
        "EventID": "DEBEECF3C9E4E50A",
        "BaggageBytes": "[[248 5] [240 0] [0 9 200 217 120 2 222 20 225] [240 1] [0 251 21 217 205 134 42 206 29] [240 3] [0 2]]",
        "ProcessID": 2319
      },
      {
        "Cycles": 0,
        "Agent": "edu.brown.cs.systems.xtrace.logging.BaggageWrappers",
        "ProcessName": "Read",
        "TaskID": "09C8D97802DE14E1",
        "ParentEventID": [
          "FB15D9CD862ACE1D",
          "FB59C8EBEAF8F30B"
        ],
        "Label": "Merged current baggage with other baggage",
        "Title": "X-Trace Task",
        "Host": "pinky19.mpi-sws.org",
        "HRT": 25489141455937618,
        "Operation": "join",
        "Timestamp": "1556272781396.299805",
        "TenantClass": 0,
        "Source": "PacketHeader.java:168",
        "ThreadID": 1,
        "ThreadName": "",
        "EventID": "8E22D7A4697DEEC1",
        "ProcessID": 6356
      },
      {
        "Cycles": 0,
        "Agent": "edu.brown.cs.systems.xtrace.logging.BaggageWrappers",
        "ProcessName": "Data",
        "TaskID": "09C8D97802DE14E1",
        "ParentEventID": [
          "59453B66A42A2DCD"
        ],
        "Label": "Forking current baggage with Baggage.fork()",
        "Title": "X-Trace Task",
        "Host": "pinky19.mpi-sws.org",
        "HRT": 25489141456013792,
        "Operation": "fork",
        "Timestamp": "1556272781396.385742",
        "TenantClass": 0,
        "Source": "PacketHeader.java:95",
        "ThreadID": 9119,
        "ThreadName": "",
        "EventID": "90F078E8B15A3FDB",
        "BaggageBytes": "[[248 5] [240 0] [0 9 200 217 120 2 222 20 225] [240 1] [0 89 69 59 102 164 42 45 205] [240 3] [0 2]]",
        "ProcessID": 2319
      },
      {
        "Cycles": 0,
        "Agent": "Execution-Sleep",
        "ProcessName": "Data",
        "TaskID": "09C8D97802DE14E1",
        "ParentEventID": [
          "EC6EAB6CA064EA54"
        ],
        "Label": "waited",
        "Title": "X-Trace Task",
        "Host": "pinky19.mpi-sws.org",
        "Duration": "3195",
        "HRT": 25489141455953342,
        "Operation": "waited",
        "Timestamp": "1556272781396.325439",
        "TenantClass": 0,
        "Source": "SocketIOWithTimeout.java:335",
        "ThreadID": 9119,
        "ThreadName": "",
        "EventID": "59453B66A42A2DCD",
        "BaggageBytes": "[[248 5] [240 0] [0 9 200 217 120 2 222 20 225] [240 1] [0 236 110 171 108 160 100 234 84] [240 3] [0 2]]",
        "ProcessID": 2319
      },
      {
        "Cycles": 0,
        "Agent": "edu.brown.cs.systems.xtrace.logging.BaggageWrappers",
        "ProcessName": "Read",
        "TaskID": "09C8D97802DE14E1",
        "ParentEventID": [
          "EC6EAB6CA064EA54",
          "8E22D7A4697DEEC1"
        ],
        "Label": "Merged current baggage with other baggage",
        "Title": "X-Trace Task",
        "Host": "pinky19.mpi-sws.org",
        "HRT": 25489141456055743,
        "Operation": "join",
        "Timestamp": "1556272781396.417725",
        "TenantClass": 0,
        "Source": "PacketHeader.java:168",
        "ThreadID": 1,
        "ThreadName": "",
        "EventID": "E7D7C6CF033E7E7A",
        "ProcessID": 6356
      },
      {
        "Cycles": 0,
        "Agent": "Execution-Sleep",
        "ProcessName": "Data",
        "TaskID": "09C8D97802DE14E1",
        "ParentEventID": [
          "90F078E8B15A3FDB"
        ],
        "Label": "waited",
        "Title": "X-Trace Task",
        "Host": "pinky19.mpi-sws.org",
        "Duration": "3204",
        "HRT": 25489141456066444,
        "Operation": "waited",
        "Timestamp": "1556272781396.438477",
        "TenantClass": 0,
        "Source": "SocketIOWithTimeout.java:335",
        "ThreadID": 9119,
        "ThreadName": "",
        "EventID": "ECE5CC3A2110889F",
        "BaggageBytes": "[[248 5] [240 0] [0 9 200 217 120 2 222 20 225] [240 1] [0 144 240 120 232 177 90 63 219] [240 3] [0 2]]",
        "ProcessID": 2319
      },
      {
        "Cycles": 0,
        "Agent": "edu.brown.cs.systems.xtrace.logging.BaggageWrappers",
        "ProcessName": "Data",
        "TaskID": "09C8D97802DE14E1",
        "ParentEventID": [
          "ECE5CC3A2110889F"
        ],
        "Label": "Forking current baggage with Baggage.fork()",
        "Title": "X-Trace Task",
        "Host": "pinky19.mpi-sws.org",
        "HRT": 25489141456126687,
        "Operation": "fork",
        "Timestamp": "1556272781396.498779",
        "TenantClass": 0,
        "Source": "PacketHeader.java:95",
        "ThreadID": 9119,
        "ThreadName": "",
        "EventID": "7DF745E1B5B6C3DB",
        "BaggageBytes": "[[248 5] [240 0] [0 9 200 217 120 2 222 20 225] [240 1] [0 236 229 204 58 33 16 136 159] [240 3] [0 2]]",
        "ProcessID": 2319
      },
      {
        "Cycles": 0,
        "Agent": "Execution-Sleep",
        "ProcessName": "Data",
        "TaskID": "09C8D97802DE14E1",
        "ParentEventID": [
          "7DF745E1B5B6C3DB"
        ],
        "Label": "waited",
        "Title": "X-Trace Task",
        "Host": "pinky19.mpi-sws.org",
        "Duration": "3133",
        "HRT": 25489141456178977,
        "Operation": "waited",
        "Timestamp": "1556272781396.551025",
        "TenantClass": 0,
        "Source": "SocketIOWithTimeout.java:335",
        "ThreadID": 9119,
        "ThreadName": "",
        "EventID": "F86FED1E27D2B058",
        "BaggageBytes": "[[248 5] [240 0] [0 9 200 217 120 2 222 20 225] [240 1] [0 125 247 69 225 181 182 195 219] [240 3] [0 2]]",
        "ProcessID": 2319
      },
      {
        "Cycles": 0,
        "Agent": "edu.brown.cs.systems.xtrace.logging.BaggageWrappers",
        "ProcessName": "Data",
        "TaskID": "09C8D97802DE14E1",
        "ParentEventID": [
          "F86FED1E27D2B058"
        ],
        "Label": "Forking current baggage with Baggage.fork()",
        "Title": "X-Trace Task",
        "Host": "pinky19.mpi-sws.org",
        "HRT": 25489141456239887,
        "Operation": "fork",
        "Timestamp": "1556272781396.611816",
        "TenantClass": 0,
        "Source": "PacketHeader.java:95",
        "ThreadID": 9119,
        "ThreadName": "",
        "EventID": "12FC7BF1ECC912DA",
        "BaggageBytes": "[[248 5] [240 0] [0 9 200 217 120 2 222 20 225] [240 1] [0 248 111 237 30 39 210 176 88] [240 3] [0 2]]",
        "ProcessID": 2319
      },
      {
        "Cycles": 0,
        "Agent": "edu.brown.cs.systems.xtrace.logging.BaggageWrappers",
        "ProcessName": "Read",
        "TaskID": "09C8D97802DE14E1",
        "ParentEventID": [
          "B759F38DC51D5386",
          "7DF745E1B5B6C3DB"
        ],
        "Label": "Merged current baggage with other baggage",
        "Title": "X-Trace Task",
        "Host": "pinky19.mpi-sws.org",
        "HRT": 25489141456291107,
        "Operation": "join",
        "Timestamp": "1556272781396.653076",
        "TenantClass": 0,
        "Source": "PacketHeader.java:168",
        "ThreadID": 1,
        "ThreadName": "",
        "EventID": "03C9D2A6B1918ED5",
        "ProcessID": 6356
      },
      {
        "Cycles": 0,
        "Agent": "edu.brown.cs.systems.xtrace.logging.BaggageWrappers",
        "ProcessName": "Read",
        "TaskID": "09C8D97802DE14E1",
        "ParentEventID": [
          "E7D7C6CF033E7E7A",
          "90F078E8B15A3FDB"
        ],
        "Label": "Merged current baggage with other baggage",
        "Title": "X-Trace Task",
        "Host": "pinky19.mpi-sws.org",
        "HRT": 25489141456172329,
        "Operation": "join",
        "Timestamp": "1556272781396.534424",
        "TenantClass": 0,
        "Source": "PacketHeader.java:168",
        "ThreadID": 1,
        "ThreadName": "",
        "EventID": "B759F38DC51D5386",
        "ProcessID": 6356
      },
      {
        "Cycles": 0,
        "Agent": "Execution-Sleep",
        "ProcessName": "Data",
        "TaskID": "09C8D97802DE14E1",
        "ParentEventID": [
          "12FC7BF1ECC912DA"
        ],
        "Label": "waited",
        "Title": "X-Trace Task",
        "Host": "pinky19.mpi-sws.org",
        "Duration": "3084",
        "HRT": 25489141456290103,
        "Operation": "waited",
        "Timestamp": "1556272781396.662109",
        "TenantClass": 0,
        "Source": "SocketIOWithTimeout.java:335",
        "ThreadID": 9119,
        "ThreadName": "",
        "EventID": "48155C49D1637FEC",
        "BaggageBytes": "[[248 5] [240 0] [0 9 200 217 120 2 222 20 225] [240 1] [0 18 252 123 241 236 201 18 218] [240 3] [0 2]]",
        "ProcessID": 2319
      },
      {
        "Cycles": 0,
        "Agent": "Execution-Sleep",
        "ProcessName": "Data",
        "TaskID": "09C8D97802DE14E1",
        "ParentEventID": [
          "C256ABCA5EDE0508"
        ],
        "Label": "waited",
        "Title": "X-Trace Task",
        "Host": "pinky19.mpi-sws.org",
        "Duration": "3052",
        "HRT": 25489141456402885,
        "Operation": "waited",
        "Timestamp": "1556272781396.774902",
        "TenantClass": 0,
        "Source": "SocketIOWithTimeout.java:335",
        "ThreadID": 9119,
        "ThreadName": "",
        "EventID": "271BE835C74910DF",
        "BaggageBytes": "[[248 5] [240 0] [0 9 200 217 120 2 222 20 225] [240 1] [0 194 86 171 202 94 222 5 8] [240 3] [0 2]]",
        "ProcessID": 2319
      },
      {
        "Cycles": 0,
        "Agent": "edu.brown.cs.systems.xtrace.logging.BaggageWrappers",
        "ProcessName": "Data",
        "TaskID": "09C8D97802DE14E1",
        "ParentEventID": [
          "48155C49D1637FEC"
        ],
        "Label": "Forking current baggage with Baggage.fork()",
        "Title": "X-Trace Task",
        "Host": "pinky19.mpi-sws.org",
        "HRT": 25489141456352161,
        "Operation": "fork",
        "Timestamp": "1556272781396.724121",
        "TenantClass": 0,
        "Source": "PacketHeader.java:95",
        "ThreadID": 9119,
        "ThreadName": "",
        "EventID": "C256ABCA5EDE0508",
        "BaggageBytes": "[[248 5] [240 0] [0 9 200 217 120 2 222 20 225] [240 1] [0 72 21 92 73 209 99 127 236] [240 3] [0 2]]",
        "ProcessID": 2319
      },
      {
        "Cycles": 0,
        "Agent": "edu.brown.cs.systems.xtrace.logging.BaggageWrappers",
        "ProcessName": "Read",
        "TaskID": "09C8D97802DE14E1",
        "ParentEventID": [
          "03C9D2A6B1918ED5",
          "12FC7BF1ECC912DA"
        ],
        "Label": "Merged current baggage with other baggage",
        "Title": "X-Trace Task",
        "Host": "pinky19.mpi-sws.org",
        "HRT": 25489141456410255,
        "Operation": "join",
        "Timestamp": "1556272781396.772461",
        "TenantClass": 0,
        "Source": "PacketHeader.java:168",
        "ThreadID": 1,
        "ThreadName": "",
        "EventID": "A61E6B7C535BAFD4",
        "ProcessID": 6356
      },
      {
        "Cycles": 0,
        "Agent": "edu.brown.cs.systems.xtrace.logging.BaggageWrappers",
        "ProcessName": "Data",
        "TaskID": "09C8D97802DE14E1",
        "ParentEventID": [
          "271BE835C74910DF"
        ],
        "Label": "Forking current baggage with Baggage.fork()",
        "Title": "X-Trace Task",
        "Host": "pinky19.mpi-sws.org",
        "HRT": 25489141456465412,
        "Operation": "fork",
        "Timestamp": "1556272781396.837402",
        "TenantClass": 0,
        "Source": "PacketHeader.java:95",
        "ThreadID": 9119,
        "ThreadName": "",
        "EventID": "FCD1BC9A4FD0B3D8",
        "BaggageBytes": "[[248 5] [240 0] [0 9 200 217 120 2 222 20 225] [240 1] [0 39 27 232 53 199 73 16 223] [240 3] [0 2]]",
        "ProcessID": 2319
      },
      {
        "Cycles": 0,
        "Agent": "Execution-Sleep",
        "ProcessName": "Data",
        "TaskID": "09C8D97802DE14E1",
        "ParentEventID": [
          "FCD1BC9A4FD0B3D8"
        ],
        "Label": "waited",
        "Title": "X-Trace Task",
        "Host": "pinky19.mpi-sws.org",
        "Duration": "3299",
        "HRT": 25489141456523139,
        "Operation": "waited",
        "Timestamp": "1556272781396.895264",
        "TenantClass": 0,
        "Source": "SocketIOWithTimeout.java:335",
        "ThreadID": 9119,
        "ThreadName": "",
        "EventID": "08A2C7A20866CCF8",
        "BaggageBytes": "[[248 5] [240 0] [0 9 200 217 120 2 222 20 225] [240 1] [0 252 209 188 154 79 208 179 216] [240 3] [0 2]]",
        "ProcessID": 2319
      },
      {
        "Cycles": 0,
        "Agent": "edu.brown.cs.systems.xtrace.logging.BaggageWrappers",
        "ProcessName": "Data",
        "TaskID": "09C8D97802DE14E1",
        "ParentEventID": [
          "08A2C7A20866CCF8"
        ],
        "Label": "Forking current baggage with Baggage.fork()",
        "Title": "X-Trace Task",
        "Host": "pinky19.mpi-sws.org",
        "HRT": 25489141456585072,
        "Operation": "fork",
        "Timestamp": "1556272781396.957031",
        "TenantClass": 0,
        "Source": "PacketHeader.java:95",
        "ThreadID": 9119,
        "ThreadName": "",
        "EventID": "F1902DB60E1CC4D2",
        "BaggageBytes": "[[248 5] [240 0] [0 9 200 217 120 2 222 20 225] [240 1] [0 8 162 199 162 8 102 204 248] [240 3] [0 2]]",
        "ProcessID": 2319
      },
      {
        "Cycles": 0,
        "Agent": "edu.brown.cs.systems.xtrace.logging.BaggageWrappers",
        "ProcessName": "Read",
        "TaskID": "09C8D97802DE14E1",
        "ParentEventID": [
          "C256ABCA5EDE0508",
          "A61E6B7C535BAFD4"
        ],
        "Label": "Merged current baggage with other baggage",
        "Title": "X-Trace Task",
        "Host": "pinky19.mpi-sws.org",
        "HRT": 25489141456529298,
        "Operation": "join",
        "Timestamp": "1556272781396.891357",
        "TenantClass": 0,
        "Source": "PacketHeader.java:168",
        "ThreadID": 1,
        "ThreadName": "",
        "EventID": "1DF09D8742BC6ED6",
        "ProcessID": 6356
      },
      {
        "Cycles": 0,
        "Agent": "Execution-Sleep",
        "ProcessName": "Data",
        "TaskID": "09C8D97802DE14E1",
        "ParentEventID": [
          "F1902DB60E1CC4D2"
        ],
        "Label": "waited",
        "Title": "X-Trace Task",
        "Host": "pinky19.mpi-sws.org",
        "Duration": "3130",
        "HRT": 25489141456635276,
        "Operation": "waited",
        "Timestamp": "1556272781397.007324",
        "TenantClass": 0,
        "Source": "SocketIOWithTimeout.java:335",
        "ThreadID": 9119,
        "ThreadName": "",
        "EventID": "F516EDDBADEA6734",
        "BaggageBytes": "[[248 5] [240 0] [0 9 200 217 120 2 222 20 225] [240 1] [0 241 144 45 182 14 28 196 210] [240 3] [0 2]]",
        "ProcessID": 2319
      },
      {
        "Cycles": 0,
        "Agent": "edu.brown.cs.systems.xtrace.logging.BaggageWrappers",
        "ProcessName": "Data",
        "TaskID": "09C8D97802DE14E1",
        "ParentEventID": [
          "F516EDDBADEA6734"
        ],
        "Label": "Forking current baggage with Baggage.fork()",
        "Title": "X-Trace Task",
        "Host": "pinky19.mpi-sws.org",
        "HRT": 25489141456694349,
        "Operation": "fork",
        "Timestamp": "1556272781397.066406",
        "TenantClass": 0,
        "Source": "PacketHeader.java:95",
        "ThreadID": 9119,
        "ThreadName": "",
        "EventID": "678C4E75E54A0DA7",
        "BaggageBytes": "[[248 5] [240 0] [0 9 200 217 120 2 222 20 225] [240 1] [0 245 22 237 219 173 234 103 52] [240 3] [0 2]]",
        "ProcessID": 2319
      },
      {
        "Cycles": 0,
        "Agent": "edu.brown.cs.systems.xtrace.logging.BaggageWrappers",
        "ProcessName": "Read",
        "TaskID": "09C8D97802DE14E1",
        "ParentEventID": [
          "FCD1BC9A4FD0B3D8",
          "1DF09D8742BC6ED6"
        ],
        "Label": "Merged current baggage with other baggage",
        "Title": "X-Trace Task",
        "Host": "pinky19.mpi-sws.org",
        "HRT": 25489141456646995,
        "Operation": "join",
        "Timestamp": "1556272781397.009033",
        "TenantClass": 0,
        "Source": "PacketHeader.java:168",
        "ThreadID": 1,
        "ThreadName": "",
        "EventID": "D5CD2B660B08630D",
        "ProcessID": 6356
      },
      {
        "Cycles": 0,
        "Agent": "Execution-Sleep",
        "ProcessName": "Data",
        "TaskID": "09C8D97802DE14E1",
        "ParentEventID": [
          "678C4E75E54A0DA7"
        ],
        "Label": "waited",
        "Title": "X-Trace Task",
        "Host": "pinky19.mpi-sws.org",
        "Duration": "3092",
        "HRT": 25489141456748347,
        "Operation": "waited",
        "Timestamp": "1556272781397.120361",
        "TenantClass": 0,
        "Source": "SocketIOWithTimeout.java:335",
        "ThreadID": 9119,
        "ThreadName": "",
        "EventID": "11E1DF43255AEFFD",
        "BaggageBytes": "[[248 5] [240 0] [0 9 200 217 120 2 222 20 225] [240 1] [0 103 140 78 117 229 74 13 167] [240 3] [0 2]]",
        "ProcessID": 2319
      },
      {
        "Cycles": 0,
        "Agent": "edu.brown.cs.systems.xtrace.logging.BaggageWrappers",
        "ProcessName": "Read",
        "TaskID": "09C8D97802DE14E1",
        "ParentEventID": [
          "F1902DB60E1CC4D2",
          "D5CD2B660B08630D"
        ],
        "Label": "Merged current baggage with other baggage",
        "Title": "X-Trace Task",
        "Host": "pinky19.mpi-sws.org",
        "HRT": 25489141456763820,
        "Operation": "join",
        "Timestamp": "1556272781397.125977",
        "TenantClass": 0,
        "Source": "PacketHeader.java:168",
        "ThreadID": 1,
        "ThreadName": "",
        "EventID": "B9E61F03AF1EA750",
        "ProcessID": 6356
      },
      {
        "Cycles": 0,
        "Agent": "Execution-Sleep",
        "ProcessName": "Data",
        "TaskID": "09C8D97802DE14E1",
        "ParentEventID": [
          "BA1A905CA865E585"
        ],
        "Label": "waited",
        "Title": "X-Trace Task",
        "Host": "pinky19.mpi-sws.org",
        "Duration": "3023",
        "HRT": 25489141456859790,
        "Operation": "waited",
        "Timestamp": "1556272781397.231689",
        "TenantClass": 0,
        "Source": "SocketIOWithTimeout.java:335",
        "ThreadID": 9119,
        "ThreadName": "",
        "EventID": "6792CA064908789B",
        "BaggageBytes": "[[248 5] [240 0] [0 9 200 217 120 2 222 20 225] [240 1] [0 186 26 144 92 168 101 229 133] [240 3] [0 2]]",
        "ProcessID": 2319
      },
      {
        "Cycles": 0,
        "Agent": "edu.brown.cs.systems.xtrace.logging.BaggageWrappers",
        "ProcessName": "Data",
        "TaskID": "09C8D97802DE14E1",
        "ParentEventID": [
          "11E1DF43255AEFFD"
        ],
        "Label": "Forking current baggage with Baggage.fork()",
        "Title": "X-Trace Task",
        "Host": "pinky19.mpi-sws.org",
        "HRT": 25489141456807783,
        "Operation": "fork",
        "Timestamp": "1556272781397.179688",
        "TenantClass": 0,
        "Source": "PacketHeader.java:95",
        "ThreadID": 9119,
        "ThreadName": "",
        "EventID": "BA1A905CA865E585",
        "BaggageBytes": "[[248 5] [240 0] [0 9 200 217 120 2 222 20 225] [240 1] [0 17 225 223 67 37 90 239 253] [240 3] [0 2]]",
        "ProcessID": 2319
      },
      {
        "Cycles": 0,
        "Agent": "edu.brown.cs.systems.xtrace.logging.BaggageWrappers",
        "ProcessName": "Data",
        "TaskID": "09C8D97802DE14E1",
        "ParentEventID": [
          "6792CA064908789B"
        ],
        "Label": "Forking current baggage with Baggage.fork()",
        "Title": "X-Trace Task",
        "Host": "pinky19.mpi-sws.org",
        "HRT": 25489141456917681,
        "Operation": "fork",
        "Timestamp": "1556272781397.289795",
        "TenantClass": 0,
        "Source": "PacketHeader.java:95",
        "ThreadID": 9119,
        "ThreadName": "",
        "EventID": "D43C577BEFAFB7AC",
        "BaggageBytes": "[[248 5] [240 0] [0 9 200 217 120 2 222 20 225] [240 1] [0 103 146 202 6 73 8 120 155] [240 3] [0 2]]",
        "ProcessID": 2319
      },
      {
        "Cycles": 0,
        "Agent": "edu.brown.cs.systems.xtrace.logging.BaggageWrappers",
        "ProcessName": "Read",
        "TaskID": "09C8D97802DE14E1",
        "ParentEventID": [
          "B9E61F03AF1EA750",
          "678C4E75E54A0DA7"
        ],
        "Label": "Merged current baggage with other baggage",
        "Title": "X-Trace Task",
        "Host": "pinky19.mpi-sws.org",
        "HRT": 25489141456882509,
        "Operation": "join",
        "Timestamp": "1556272781397.244629",
        "TenantClass": 0,
        "Source": "PacketHeader.java:168",
        "ThreadID": 1,
        "ThreadName": "",
        "EventID": "08BA0C5E8ACE5644",
        "ProcessID": 6356
      },
      {
        "Cycles": 0,
        "Agent": "Execution-Sleep",
        "ProcessName": "Data",
        "TaskID": "09C8D97802DE14E1",
        "ParentEventID": [
          "D43C577BEFAFB7AC"
        ],
        "Label": "waited",
        "Title": "X-Trace Task",
        "Host": "pinky19.mpi-sws.org",
        "Duration": "3042",
        "HRT": 25489141456967497,
        "Operation": "waited",
        "Timestamp": "1556272781397.339600",
        "TenantClass": 0,
        "Source": "SocketIOWithTimeout.java:335",
        "ThreadID": 9119,
        "ThreadName": "",
        "EventID": "A879E731710DF9EB",
        "BaggageBytes": "[[248 5] [240 0] [0 9 200 217 120 2 222 20 225] [240 1] [0 212 60 87 123 239 175 183 172] [240 3] [0 2]]",
        "ProcessID": 2319
      },
      {
        "Cycles": 0,
        "Agent": "edu.brown.cs.systems.xtrace.logging.BaggageWrappers",
        "ProcessName": "Read",
        "TaskID": "09C8D97802DE14E1",
        "ParentEventID": [
          "BA1A905CA865E585",
          "08BA0C5E8ACE5644"
        ],
        "Label": "Merged current baggage with other baggage",
        "Title": "X-Trace Task",
        "Host": "pinky19.mpi-sws.org",
        "HRT": 25489141456998644,
        "Operation": "join",
        "Timestamp": "1556272781397.360840",
        "TenantClass": 0,
        "Source": "PacketHeader.java:168",
        "ThreadID": 1,
        "ThreadName": "",
        "EventID": "7AA694F6CD7BFDA7",
        "ProcessID": 6356
      },
      {
        "Cycles": 0,
        "Agent": "edu.brown.cs.systems.xtrace.logging.BaggageWrappers",
        "ProcessName": "Data",
        "TaskID": "09C8D97802DE14E1",
        "ParentEventID": [
          "A879E731710DF9EB"
        ],
        "Label": "Forking current baggage with Baggage.fork()",
        "Title": "X-Trace Task",
        "Host": "pinky19.mpi-sws.org",
        "HRT": 25489141457028236,
        "Operation": "fork",
        "Timestamp": "1556272781397.400146",
        "TenantClass": 0,
        "Source": "PacketHeader.java:95",
        "ThreadID": 9119,
        "ThreadName": "",
        "EventID": "E9A4ED1838E3AB41",
        "BaggageBytes": "[[248 5] [240 0] [0 9 200 217 120 2 222 20 225] [240 1] [0 168 121 231 49 113 13 249 235] [240 3] [0 2]]",
        "ProcessID": 2319
      },
      {
        "Cycles": 0,
        "Agent": "edu.brown.cs.systems.xtrace.logging.BaggageWrappers",
        "ProcessName": "Read",
        "TaskID": "09C8D97802DE14E1",
        "ParentEventID": [
          "D43C577BEFAFB7AC",
          "7AA694F6CD7BFDA7"
        ],
        "Label": "Merged current baggage with other baggage",
        "Title": "X-Trace Task",
        "Host": "pinky19.mpi-sws.org",
        "HRT": 25489141457115178,
        "Operation": "join",
        "Timestamp": "1556272781397.477295",
        "TenantClass": 0,
        "Source": "PacketHeader.java:168",
        "ThreadID": 1,
        "ThreadName": "",
        "EventID": "0DDE63F5018AE1CB",
        "ProcessID": 6356
      },
      {
        "Cycles": 0,
        "Agent": "Execution-Sleep",
        "ProcessName": "Data",
        "TaskID": "09C8D97802DE14E1",
        "ParentEventID": [
          "E9A4ED1838E3AB41"
        ],
        "Label": "waited",
        "Title": "X-Trace Task",
        "Host": "pinky19.mpi-sws.org",
        "Duration": "3004",
        "HRT": 25489141457077937,
        "Operation": "waited",
        "Timestamp": "1556272781397.449951",
        "TenantClass": 0,
        "Source": "SocketIOWithTimeout.java:335",
        "ThreadID": 9119,
        "ThreadName": "",
        "EventID": "92AA67E99BFE724D",
        "BaggageBytes": "[[248 5] [240 0] [0 9 200 217 120 2 222 20 225] [240 1] [0 233 164 237 24 56 227 171 65] [240 3] [0 2]]",
        "ProcessID": 2319
      },
      {
        "Cycles": 0,
        "Agent": "edu.brown.cs.systems.xtrace.logging.BaggageWrappers",
        "ProcessName": "Data",
        "TaskID": "09C8D97802DE14E1",
        "ParentEventID": [
          "92AA67E99BFE724D"
        ],
        "Label": "Forking current baggage with Baggage.fork()",
        "Title": "X-Trace Task",
        "Host": "pinky19.mpi-sws.org",
        "HRT": 25489141457139093,
        "Operation": "fork",
        "Timestamp": "1556272781397.510986",
        "TenantClass": 0,
        "Source": "PacketHeader.java:95",
        "ThreadID": 9119,
        "ThreadName": "",
        "EventID": "8648788A24E77462",
        "BaggageBytes": "[[248 5] [240 0] [0 9 200 217 120 2 222 20 225] [240 1] [0 146 170 103 233 155 254 114 77] [240 3] [0 2]]",
        "ProcessID": 2319
      },
      {
        "Cycles": 0,
        "Agent": "edu.brown.cs.systems.xtrace.logging.BaggageWrappers",
        "ProcessName": "Read",
        "TaskID": "09C8D97802DE14E1",
        "ParentEventID": [
          "0DDE63F5018AE1CB",
          "E9A4ED1838E3AB41"
        ],
        "Label": "Merged current baggage with other baggage",
        "Title": "X-Trace Task",
        "Host": "pinky19.mpi-sws.org",
        "HRT": 25489141457232162,
        "Operation": "join",
        "Timestamp": "1556272781397.594238",
        "TenantClass": 0,
        "Source": "PacketHeader.java:168",
        "ThreadID": 1,
        "ThreadName": "",
        "EventID": "1E433B812B186582",
        "ProcessID": 6356
      },
      {
        "Cycles": 0,
        "Agent": "Execution-Sleep",
        "ProcessName": "Data",
        "TaskID": "09C8D97802DE14E1",
        "ParentEventID": [
          "8648788A24E77462"
        ],
        "Label": "waited",
        "Title": "X-Trace Task",
        "Host": "pinky19.mpi-sws.org",
        "Duration": "3297",
        "HRT": 25489141457188530,
        "Operation": "waited",
        "Timestamp": "1556272781397.560547",
        "TenantClass": 0,
        "Source": "SocketIOWithTimeout.java:335",
        "ThreadID": 9119,
        "ThreadName": "",
        "EventID": "8CD772F6F2716EE2",
        "BaggageBytes": "[[248 5] [240 0] [0 9 200 217 120 2 222 20 225] [240 1] [0 134 72 120 138 36 231 116 98] [240 3] [0 2]]",
        "ProcessID": 2319
      },
      {
        "Cycles": 0,
        "Agent": "edu.brown.cs.systems.xtrace.logging.BaggageWrappers",
        "ProcessName": "Data",
        "TaskID": "09C8D97802DE14E1",
        "ParentEventID": [
          "8CD772F6F2716EE2"
        ],
        "Label": "Forking current baggage with Baggage.fork()",
        "Title": "X-Trace Task",
        "Host": "pinky19.mpi-sws.org",
        "HRT": 25489141457246162,
        "Operation": "fork",
        "Timestamp": "1556272781397.618164",
        "TenantClass": 0,
        "Source": "PacketHeader.java:95",
        "ThreadID": 9119,
        "ThreadName": "",
        "EventID": "68672265ED4AA27A",
        "BaggageBytes": "[[248 5] [240 0] [0 9 200 217 120 2 222 20 225] [240 1] [0 140 215 114 246 242 113 110 226] [240 3] [0 2]]",
        "ProcessID": 2319
      },
      {
        "Cycles": 0,
        "Agent": "edu.brown.cs.systems.xtrace.logging.BaggageWrappers",
        "ProcessName": "Read",
        "TaskID": "09C8D97802DE14E1",
        "ParentEventID": [
          "8648788A24E77462",
          "1E433B812B186582"
        ],
        "Label": "Merged current baggage with other baggage",
        "Title": "X-Trace Task",
        "Host": "pinky19.mpi-sws.org",
        "HRT": 25489141457350750,
        "Operation": "join",
        "Timestamp": "1556272781397.712891",
        "TenantClass": 0,
        "Source": "PacketHeader.java:168",
        "ThreadID": 1,
        "ThreadName": "",
        "EventID": "C9D6A5DD1CB4F80A",
        "ProcessID": 6356
      },
      {
        "Cycles": 0,
        "Agent": "Execution-Sleep",
        "ProcessName": "Data",
        "TaskID": "09C8D97802DE14E1",
        "ParentEventID": [
          "68672265ED4AA27A"
        ],
        "Label": "waited",
        "Title": "X-Trace Task",
        "Host": "pinky19.mpi-sws.org",
        "Duration": "3053",
        "HRT": 25489141457297185,
        "Operation": "waited",
        "Timestamp": "1556272781397.669189",
        "TenantClass": 0,
        "Source": "SocketIOWithTimeout.java:335",
        "ThreadID": 9119,
        "ThreadName": "",
        "EventID": "01C4F6826B3273F7",
        "BaggageBytes": "[[248 5] [240 0] [0 9 200 217 120 2 222 20 225] [240 1] [0 104 103 34 101 237 74 162 122] [240 3] [0 2]]",
        "ProcessID": 2319
      },
      {
        "Cycles": 0,
        "Agent": "edu.brown.cs.systems.xtrace.logging.BaggageWrappers",
        "ProcessName": "Data",
        "TaskID": "09C8D97802DE14E1",
        "ParentEventID": [
          "01C4F6826B3273F7"
        ],
        "Label": "Forking current baggage with Baggage.fork()",
        "Title": "X-Trace Task",
        "Host": "pinky19.mpi-sws.org",
        "HRT": 25489141457356315,
        "Operation": "fork",
        "Timestamp": "1556272781397.728271",
        "TenantClass": 0,
        "Source": "PacketHeader.java:95",
        "ThreadID": 9119,
        "ThreadName": "",
        "EventID": "E384C5DF514CFFD5",
        "BaggageBytes": "[[248 5] [240 0] [0 9 200 217 120 2 222 20 225] [240 1] [0 1 196 246 130 107 50 115 247] [240 3] [0 2]]",
        "ProcessID": 2319
      },
      {
        "Cycles": 0,
        "Agent": "Execution-Sleep",
        "ProcessName": "Data",
        "TaskID": "09C8D97802DE14E1",
        "ParentEventID": [
          "E384C5DF514CFFD5"
        ],
        "Label": "waited",
        "Title": "X-Trace Task",
        "Host": "pinky19.mpi-sws.org",
        "Duration": "3151",
        "HRT": 25489141457414785,
        "Operation": "waited",
        "Timestamp": "1556272781397.786865",
        "TenantClass": 0,
        "Source": "SocketIOWithTimeout.java:335",
        "ThreadID": 9119,
        "ThreadName": "",
        "EventID": "7A4D52202A19F8BB",
        "BaggageBytes": "[[248 5] [240 0] [0 9 200 217 120 2 222 20 225] [240 1] [0 227 132 197 223 81 76 255 213] [240 3] [0 2]]",
        "ProcessID": 2319
      },
      {
        "Cycles": 0,
        "Agent": "edu.brown.cs.systems.xtrace.logging.BaggageWrappers",
        "ProcessName": "Read",
        "TaskID": "09C8D97802DE14E1",
        "ParentEventID": [
          "C9D6A5DD1CB4F80A",
          "68672265ED4AA27A"
        ],
        "Label": "Merged current baggage with other baggage",
        "Title": "X-Trace Task",
        "Host": "pinky19.mpi-sws.org",
        "HRT": 25489141457467896,
        "Operation": "join",
        "Timestamp": "1556272781397.830078",
        "TenantClass": 0,
        "Source": "PacketHeader.java:168",
        "ThreadID": 1,
        "ThreadName": "",
        "EventID": "03BA014DFB34D9BE",
        "ProcessID": 6356
      },
      {
        "Cycles": 0,
        "Agent": "Execution-Sleep",
        "ProcessName": "Data",
        "TaskID": "09C8D97802DE14E1",
        "ParentEventID": [
          "56DFD469EA32D676"
        ],
        "Label": "waited",
        "Title": "X-Trace Task",
        "Host": "pinky19.mpi-sws.org",
        "Duration": "3075",
        "HRT": 25489141457524799,
        "Operation": "waited",
        "Timestamp": "1556272781397.896729",
        "TenantClass": 0,
        "Source": "SocketIOWithTimeout.java:335",
        "ThreadID": 9119,
        "ThreadName": "",
        "EventID": "86891D0F40CDEA38",
        "BaggageBytes": "[[248 5] [240 0] [0 9 200 217 120 2 222 20 225] [240 1] [0 86 223 212 105 234 50 214 118] [240 3] [0 2]]",
        "ProcessID": 2319
      },
      {
        "Cycles": 0,
        "Agent": "edu.brown.cs.systems.xtrace.logging.BaggageWrappers",
        "ProcessName": "Data",
        "TaskID": "09C8D97802DE14E1",
        "ParentEventID": [
          "7A4D52202A19F8BB"
        ],
        "Label": "Forking current baggage with Baggage.fork()",
        "Title": "X-Trace Task",
        "Host": "pinky19.mpi-sws.org",
        "HRT": 25489141457474126,
        "Operation": "fork",
        "Timestamp": "1556272781397.846191",
        "TenantClass": 0,
        "Source": "PacketHeader.java:95",
        "ThreadID": 9119,
        "ThreadName": "",
        "EventID": "56DFD469EA32D676",
        "BaggageBytes": "[[248 5] [240 0] [0 9 200 217 120 2 222 20 225] [240 1] [0 122 77 82 32 42 25 248 187] [240 3] [0 2]]",
        "ProcessID": 2319
      },
      {
        "Cycles": 0,
        "Agent": "Execution-CPU",
        "ProcessName": "Data",
        "TaskID": "09C8D97802DE14E1",
        "ParentEventID": [
          "86891D0F40CDEA38"
        ],
        "Label": "unset",
        "Title": "X-Trace Task",
        "Host": "pinky19.mpi-sws.org",
        "Duration": "2102991",
        "HRT": 25489141457647037,
        "Operation": "unset",
        "Timestamp": "1556272781398.019043",
        "TenantClass": 0,
        "Source": "DataXceiver.java:261",
        "ThreadID": 9119,
        "ThreadName": "",
        "EventID": "86004FA06AD82E28",
        "BaggageBytes": "[[248 5] [240 0] [0 9 200 217 120 2 222 20 225] [240 1] [0 134 137 29 15 64 205 234 56] [240 3] [0 2]]",
        "ProcessID": 2319
      }
    ]
  }
]