[
  {
    "id": "2DADA97879B44D5E",
    "reports": [
      {
        "Cycles": 0,
        "Agent": "Execution-CPU",
        "ProcessName": "Read",
        "TaskID": "2DADA97879B44D5E",
        "ParentEventID": [
          "9C8E6606D330C3F4"
        ],
        "Label": "unset",
        "Title": "X-Trace Task",
        "Host": "pinky19.mpi-sws.org",
        "Duration": "22119247",
        "HRT": 26962605244278963,
        "Operation": "unset",
        "Timestamp": "1557746245184.792236",
        "TenantClass": 0,
        "Source": "Client.java:1027",
        "ThreadID": 1,
        "ThreadName": "",
        "EventID": "C391179B6CA540C1",
        "ProcessID": 36430
      },
      {
        "Cycles": 0,
        "Agent": "org.apache.hadoop.ipc.ProtobufRpcEngine",
        "ProcessName": "Read",
        "TaskID": "2DADA97879B44D5E",
        "ParentEventID": [
          "151948626D2741AB"
        ],
        "Label": "Invoking org.apache.hadoop.hdfs.protocol.ClientProtocol.getBlockLocations",
        "Title": "X-Trace Task",
        "Host": "pinky19.mpi-sws.org",
        "HRT": 26962605244263848,
        "Timestamp": "1557746245184.777100",
        "TenantClass": 0,
        "Source": "ProtobufRpcEngine.java:228",
        "ThreadID": 1,
        "ThreadName": "",
        "EventID": "9C8E6606D330C3F4",
        "ProcessID": 36430
      },
      {
        "Cycles": 0,
        "Agent": "edu.brown.cs.systems.retro.benchmarks.hdfs_client.Reader",
        "ProcessName": "Read",
        "TaskID": "2DADA97879B44D5E",
        "ParentEventID": [
          "C04DE1C7DAC9A2C2"
        ],
        "Label": "Reading file",
        "Title": "X-Trace Task",
        "Host": "pinky19.mpi-sws.org",
        "HRT": 26962605244237067,
        "Timestamp": "1557746245184.750488",
        "TenantClass": 0,
        "ThreadID": 1,
        "ThreadName": "",
        "EventID": "151948626D2741AB",
        "ProcessID": 36430
      },
      {
        "Cycles": 0,
        "Agent": "Execution-CPU",
        "ProcessName": "Read",
        "TaskID": "2DADA97879B44D5E",
        "ParentEventID": [
          "C391179B6CA540C1"
        ],
        "Label": "set",
        "Title": "X-Trace Task",
        "Host": "pinky19.mpi-sws.org",
        "HRT": 26962605244321735,
        "Operation": "set",
        "Timestamp": "1557746245184.835205",
        "TenantClass": 0,
        "Source": "Client.java:1032",
        "ThreadID": 41,
        "ThreadName": "",
        "EventID": "8B4192130B0C8332",
        "ProcessID": 36430
      },
      {
        "Cycles": 0,
        "Agent": "Execution-CPU",
        "ProcessName": "Read",
        "TaskID": "2DADA97879B44D5E",
        "ParentEventID": [
          "69C041F423A19D91"
        ],
        "Label": "unset",
        "Title": "X-Trace Task",
        "Host": "pinky19.mpi-sws.org",
        "Duration": "72251",
        "HRT": 26962605244412725,
        "Operation": "unset",
        "Timestamp": "1557746245184.926025",
        "TenantClass": 0,
        "Source": "Client.java:1062",
        "ThreadID": 41,
        "ThreadName": "",
        "EventID": "708B8CF37DA4D0CB",
        "ProcessID": 36430
      },
      {
        "Cycles": 0,
        "Agent": "Execution-CPU",
        "ProcessName": "Read",
        "TaskID": "2DADA97879B44D5E",
        "ParentEventID": [
          "708B8CF37DA4D0CB"
        ],
        "Label": "set",
        "Title": "X-Trace Task",
        "Host": "pinky19.mpi-sws.org",
        "HRT": 26962605244436122,
        "Operation": "set",
        "Timestamp": "1557746245184.949463",
        "TenantClass": 0,
        "Source": "Client.java:1104",
        "ThreadID": 1,
        "ThreadName": "",
        "EventID": "30B0737B25BA867A",
        "ProcessID": 36430
      },
      {
        "Cycles": 0,
        "Agent": "Execution-CPU",
        "ProcessName": "Name",
        "TaskID": "2DADA97879B44D5E",
        "ParentEventID": [
          "69C041F423A19D91"
        ],
        "Label": "set",
        "Title": "X-Trace Task",
        "Host": "pinky19.mpi-sws.org",
        "HRT": 26962605244460352,
        "Operation": "set",
        "Timestamp": "1557746245185.001953",
        "TenantClass": 0,
        "Source": "Server.java:1840",
        "ThreadID": 48,
        "ThreadName": "",
        "EventID": "E4B6BBCE1950B5E4",
        "BaggageBytes": "[[248 5] [240 0] [0 45 173 169 120 121 180 77 94] [240 1] [0 105 192 65 244 35 161 157 145] [240 3] [0 2]]",
        "ProcessID": 2171
      },
      {
        "Cycles": 0,
        "Agent": "edu.brown.cs.systems.xtrace.logging.BaggageWrappers",
        "ProcessName": "Name",
        "TaskID": "2DADA97879B44D5E",
        "ParentEventID": [
          "E4B6BBCE1950B5E4"
        ],
        "Label": "Forking current baggage with Baggage.fork()",
        "Title": "X-Trace Task",
        "Host": "pinky19.mpi-sws.org",
        "HRT": 26962605244490656,
        "Operation": "fork",
        "Timestamp": "1557746245185.032227",
        "TenantClass": 0,
        "Source": "Server.java:550",
        "ThreadID": 48,
        "ThreadName": "",
        "EventID": "8B0947E66AF4B9E0",
        "BaggageBytes": "[[248 5] [240 0] [0 45 173 169 120 121 180 77 94] [240 1] [0 228 182 187 206 25 80 181 228] [240 3] [0 2]]",
        "ProcessID": 2171
      },
      {
        "Cycles": 0,
        "Agent": "Execution-CPU",
        "ProcessName": "Name",
        "TaskID": "2DADA97879B44D5E",
        "ParentEventID": [
          "8B0947E66AF4B9E0"
        ],
        "Label": "unset",
        "Title": "X-Trace Task",
        "Host": "pinky19.mpi-sws.org",
        "Duration": "23907",
        "HRT": 26962605244510710,
        "Operation": "unset",
        "Timestamp": "1557746245185.052246",
        "TenantClass": 0,
        "Source": "Server.java:1828",
        "ThreadID": 48,
        "ThreadName": "",
        "EventID": "B8BFE89D35B0FEBA",
        "BaggageBytes": "[[248 5] [240 0] [0 45 173 169 120 121 180 77 94] [240 1] [0 139 9 71 230 106 244 185 224] [240 3] [0 2]]",
        "ProcessID": 2171
      },
      {
        "Cycles": 0,
        "Agent": "edu.brown.cs.systems.xtrace.logging.BaggageWrappers",
        "ProcessName": "Read",
        "TaskID": "2DADA97879B44D5E",
        "ParentEventID": [
          "8B4192130B0C8332"
        ],
        "Label": "Forking current baggage with Baggage.fork()",
        "Title": "X-Trace Task",
        "Host": "pinky19.mpi-sws.org",
        "HRT": 26962605244339831,
        "Operation": "fork",
        "Timestamp": "1557746245184.853271",
        "TenantClass": 0,
        "Source": "Client.java:1043",
        "ThreadID": 41,
        "ThreadName": "",
        "EventID": "69C041F423A19D91",
        "ProcessID": 36430
      },
      {
        "Cycles": 0,
        "Agent": "Execution-CPU",
        "ProcessName": "Name",
        "TaskID": "2DADA97879B44D5E",
        "ParentEventID": [
          "8B0947E66AF4B9E0"
        ],
        "Label": "set",
        "Title": "X-Trace Task",
        "Host": "pinky19.mpi-sws.org",
        "HRT": 26962605244520564,
        "Operation": "set",
        "Timestamp": "1557746245185.062012",
        "TenantClass": 0,
        "Source": "Server.java:2071",
        "ThreadID": 60,
        "ThreadName": "",
        "EventID": "DDA3CFE549D66CB7",
        "BaggageBytes": "[[248 5] [240 0] [0 45 173 169 120 121 180 77 94] [240 1] [0 139 9 71 230 106 244 185 224] [240 3] [0 2]]",
        "ProcessID": 2171
      },
      {
        "Cycles": 0,
        "Agent": "org.apache.hadoop.ipc.Server",
        "ProcessName": "Name",
        "TaskID": "2DADA97879B44D5E",
        "ParentEventID": [
          "DDA3CFE549D66CB7"
        ],
        "Label": "getBlockLocations in org.apache.hadoop.hdfs.protocol.ClientProtocol",
        "Title": "X-Trace Task",
        "Host": "pinky19.mpi-sws.org",
        "HRT": 26962605244555455,
        "Timestamp": "1557746245185.096924",
        "TenantClass": 0,
        "Source": "ProtobufRpcEngine.java:601",
        "ThreadID": 60,
        "ThreadName": "",
        "EventID": "BA96D456A4F51E72",
        "BaggageBytes": "[[248 5] [240 0] [0 45 173 169 120 121 180 77 94] [240 1] [0 221 163 207 229 73 214 108 183] [240 3] [0 2]]",
        "ProcessID": 2171
      },
      {
        "Cycles": 0,
        "Agent": "edu.brown.cs.systems.xtrace.logging.BaggageWrappers",
        "ProcessName": "Name",
        "TaskID": "2DADA97879B44D5E",
        "ParentEventID": [
          "06066AD2B123C6BD"
        ],
        "Label": "Forking current baggage with Baggage.fork()",
        "Title": "X-Trace Task",
        "Host": "pinky19.mpi-sws.org",
        "HRT": 26962605244645115,
        "Operation": "fork",
        "Timestamp": "1557746245185.186523",
        "TenantClass": 0,
        "Source": "Server.java:2398",
        "ThreadID": 60,
        "ThreadName": "",
        "EventID": "CC703064B0AF1B90",
        "BaggageBytes": "[[248 5] [240 0] [0 45 173 169 120 121 180 77 94] [240 1] [0 6 6 106 210 177 35 198 189] [240 3] [0 2]]",
        "ProcessID": 2171
      },
      {
        "Cycles": 0,
        "Agent": "org.apache.hadoop.hdfs.server.namenode.FSNamesystem.audit",
        "ProcessName": "Name",
        "TaskID": "2DADA97879B44D5E",
        "ParentEventID": [
          "BA96D456A4F51E72"
        ],
        "Label": "allowed=true\tugi=plascas (auth:SIMPLE)\tip=/139.19.171.63\tcmd=open\tsrc=/ds/lcRU6J1Op7z2SvG4\tdst=null\tperm=null\tproto=rpc",
        "Title": "X-Trace Task",
        "Host": "pinky19.mpi-sws.org",
        "HRT": 26962605244603711,
        "Timestamp": "1557746245185.145264",
        "TenantClass": 0,
        "Source": "FSNamesystem.java:8313",
        "ThreadID": 60,
        "ThreadName": "",
        "EventID": "06066AD2B123C6BD",
        "BaggageBytes": "[[248 5] [240 0] [0 45 173 169 120 121 180 77 94] [240 1] [0 186 150 212 86 164 245 30 114] [240 3] [0 2]]",
        "ProcessID": 2171
      },
      {
        "Cycles": 0,
        "Agent": "Execution-CPU",
        "ProcessName": "Name",
        "TaskID": "2DADA97879B44D5E",
        "ParentEventID": [
          "CC703064B0AF1B90"
        ],
        "Label": "unset",
        "Title": "X-Trace Task",
        "Host": "pinky19.mpi-sws.org",
        "Duration": "209340",
        "HRT": 26962605244752339,
        "Operation": "unset",
        "Timestamp": "1557746245185.293945",
        "TenantClass": 0,
        "Source": "Server.java:1058",
        "ThreadID": 60,
        "ThreadName": "",
        "EventID": "131D7C1F1C86289B",
        "BaggageBytes": "[[248 5] [240 0] [0 45 173 169 120 121 180 77 94] [240 1] [0 204 112 48 100 176 175 27 144] [240 3] [0 2]]",
        "ProcessID": 2171
      },
      {
        "Cycles": 0,
        "Agent": "Execution-CPU",
        "ProcessName": "Read",
        "TaskID": "2DADA97879B44D5E",
        "ParentEventID": [
          "B117F91ADABFEBC8"
        ],
        "Label": "unset",
        "Title": "X-Trace Task",
        "Host": "pinky19.mpi-sws.org",
        "Duration": "5069",
        "HRT": 26962605244842967,
        "Operation": "unset",
        "Timestamp": "1557746245185.356445",
        "TenantClass": 0,
        "Source": "Client.java:1168",
        "ThreadID": 37,
        "ThreadName": "",
        "EventID": "2F4766300F87A5EF",
        "ProcessID": 36430
      },
      {
        "Cycles": 0,
        "Agent": "Execution-CPU",
        "ProcessName": "Read",
        "TaskID": "2DADA97879B44D5E",
        "ParentEventID": [
          "CC703064B0AF1B90"
        ],
        "Label": "set",
        "Title": "X-Trace Task",
        "Host": "pinky19.mpi-sws.org",
        "HRT": 26962605244821655,
        "Operation": "set",
        "Timestamp": "1557746245185.334961",
        "TenantClass": 0,
        "Source": "Client.java:302",
        "ThreadID": 37,
        "ThreadName": "",
        "EventID": "B117F91ADABFEBC8",
        "ProcessID": 36430
      },
      {
        "Cycles": 0,
        "Agent": "Execution-Sleep",
        "ProcessName": "Read",
        "TaskID": "2DADA97879B44D5E",
        "ParentEventID": [
          "30B0737B25BA867A"
        ],
        "Label": "waited",
        "Title": "X-Trace Task",
        "Host": "pinky19.mpi-sws.org",
        "Duration": "416446",
        "HRT": 26962605244860294,
        "Operation": "waited",
        "Timestamp": "1557746245185.373535",
        "TenantClass": 0,
        "Source": "Client.java:1537",
        "ThreadID": 1,
        "ThreadName": "",
        "EventID": "1D97B2459B28AD2C",
        "ProcessID": 36430
      },
      {
        "Cycles": 0,
        "Agent": "edu.brown.cs.systems.xtrace.logging.BaggageWrappers",
        "ProcessName": "Read",
        "TaskID": "2DADA97879B44D5E",
        "ParentEventID": [
          "2F4766300F87A5EF",
          "1D97B2459B28AD2C"
        ],
        "Label": "Merged current baggage with other baggage",
        "Title": "X-Trace Task",
        "Host": "pinky19.mpi-sws.org",
        "HRT": 26962605244870961,
        "Operation": "join",
        "Timestamp": "1557746245185.384277",
        "TenantClass": 0,
        "Source": "Client.java:1545",
        "ThreadID": 1,
        "ThreadName": "",
        "EventID": "29C405FE3A1FA956",
        "ProcessID": 36430
      },
      {
        "Cycles": 0,
        "Agent": "edu.brown.cs.systems.xtrace.logging.BaggageWrappers",
        "ProcessName": "Read",
        "TaskID": "2DADA97879B44D5E",
        "ParentEventID": [
          "6BFC1487BF37C37C"
        ],
        "Label": "Forking current baggage with Baggage.fork()",
        "Title": "X-Trace Task",
        "Host": "pinky19.mpi-sws.org",
        "HRT": 26962605244958262,
        "Operation": "fork",
        "Timestamp": "1557746245185.471680",
        "TenantClass": 0,
        "Source": "DataTransferProtoUtil.java:94",
        "ThreadID": 1,
        "ThreadName": "",
        "EventID": "53555FE95F34D233",
        "ProcessID": 36430
      },
      {
        "Cycles": 0,
        "Agent": "org.apache.hadoop.ipc.ProtobufRpcEngine",
        "ProcessName": "Read",
        "TaskID": "2DADA97879B44D5E",
        "ParentEventID": [
          "29C405FE3A1FA956"
        ],
        "Label": "org.apache.hadoop.hdfs.protocol.ClientProtocol.getBlockLocations completed",
        "Title": "X-Trace Task",
        "Host": "pinky19.mpi-sws.org",
        "HRT": 26962605244903956,
        "Timestamp": "1557746245185.417236",
        "TenantClass": 0,
        "Source": "ProtobufRpcEngine.java:275",
        "ThreadID": 1,
        "ThreadName": "",
        "EventID": "6BFC1487BF37C37C",
        "ProcessID": 36430
      },
      {
        "Cycles": 0,
        "Agent": "Execution-CPU",
        "ProcessName": "Data",
        "TaskID": "2DADA97879B44D5E",
        "ParentEventID": [
          "53555FE95F34D233"
        ],
        "Label": "set",
        "Title": "X-Trace Task",
        "Host": "pinky22.mpi-sws.org",
        "HRT": 47512577499802839,
        "Operation": "set",
        "Timestamp": "1557746245185.778320",
        "TenantClass": 0,
        "Source": "Receiver.java:117",
        "ThreadID": 15142,
        "ThreadName": "",
        "EventID": "D935E3A28CB8F538",
        "BaggageBytes": "[[248 5] [240 0] [0 45 173 169 120 121 180 77 94] [240 1] [0 83 85 95 233 95 52 210 51] [240 3] [0 2]]",
        "ProcessID": 28841
      },
      {
        "Cycles": 0,
        "Agent": "edu.brown.cs.systems.xtrace.logging.XTraceInit",
        "ProcessName": "Data",
        "TaskID": "2DADA97879B44D5E",
        "ParentEventID": [
          "D935E3A28CB8F538"
        ],
        "Label": "Thread.setName: DataXceiver for client DFSClient_NONMAPREDUCE_778905418_1 at /139.19.171.63:45362 [Sending block BP-1633380353-139.19.171.63-1554193446451:blk_1073770182_29358]",
        "Title": "X-Trace Task",
        "Host": "pinky22.mpi-sws.org",
        "HRT": 47512577499906599,
        "Timestamp": "1557746245185.882080",
        "TenantClass": 0,
        "Source": "DataXceiver.java:168",
        "ThreadID": 15142,
        "ThreadName": "",
        "EventID": "C6EC8C702E703974",
        "BaggageBytes": "[[248 5] [240 0] [0 45 173 169 120 121 180 77 94] [240 1] [0 217 53 227 162 140 184 245 56] [240 3] [0 2]]",
        "ProcessID": 28841
      },
      {
        "Cycles": 0,
        "Agent": "Execution-Sleep",
        "ProcessName": "Read",
        "TaskID": "2DADA97879B44D5E",
        "ParentEventID": [
          "53555FE95F34D233"
        ],
        "Label": "waited",
        "Title": "X-Trace Task",
        "Host": "pinky19.mpi-sws.org",
        "Duration": "676158",
        "HRT": 26962605245711497,
        "Operation": "waited",
        "Timestamp": "1557746245186.224854",
        "TenantClass": 0,
        "Source": "SocketIOWithTimeout.java:335",
        "ThreadID": 1,
        "ThreadName": "",
        "EventID": "C73720A2F9B6A281",
        "ProcessID": 36430
      },
      {
        "Cycles": 0,
        "Agent": "edu.brown.cs.systems.xtrace.logging.BaggageWrappers",
        "ProcessName": "Data",
        "TaskID": "2DADA97879B44D5E",
        "ParentEventID": [
          "C6EC8C702E703974"
        ],
        "Label": "Forking current baggage with Baggage.fork()",
        "Title": "X-Trace Task",
        "Host": "pinky22.mpi-sws.org",
        "HRT": 47512577500126996,
        "Operation": "fork",
        "Timestamp": "1557746245186.102295",
        "TenantClass": 0,
        "Source": "DataXceiver.java:1257",
        "ThreadID": 15142,
        "ThreadName": "",
        "EventID": "2879345C4E16EEB3",
        "BaggageBytes": "[[248 5] [240 0] [0 45 173 169 120 121 180 77 94] [240 1] [0 198 236 140 112 46 112 57 116] [240 3] [0 2]]",
        "ProcessID": 28841
      },
      {
        "Cycles": 0,
        "Agent": "edu.brown.cs.systems.xtrace.logging.BaggageWrappers",
        "ProcessName": "Data",
        "TaskID": "2DADA97879B44D5E",
        "ParentEventID": [
          "2879345C4E16EEB3"
        ],
        "Label": "Forking current baggage with Baggage.fork()",
        "Title": "X-Trace Task",
        "Host": "pinky22.mpi-sws.org",
        "HRT": 47512577500266096,
        "Operation": "fork",
        "Timestamp": "1557746245186.241455",
        "TenantClass": 0,
        "Source": "PacketHeader.java:95",
        "ThreadID": 15142,
        "ThreadName": "",
        "EventID": "CACBFF410A33EF03",
        "BaggageBytes": "[[248 5] [240 0] [0 45 173 169 120 121 180 77 94] [240 1] [0 40 121 52 92 78 22 238 179] [240 3] [0 2]]",
        "ProcessID": 28841
      },
      {
        "Cycles": 0,
        "Agent": "edu.brown.cs.systems.xtrace.logging.BaggageWrappers",
        "ProcessName": "Read",
        "TaskID": "2DADA97879B44D5E",
        "ParentEventID": [
          "2879345C4E16EEB3",
          "C73720A2F9B6A281"
        ],
        "Label": "Merged current baggage with other baggage",
        "Title": "X-Trace Task",
        "Host": "pinky19.mpi-sws.org",
        "HRT": 26962605245795182,
        "Operation": "join",
        "Timestamp": "1557746245186.308594",
        "TenantClass": 0,
        "Source": "RemoteBlockReader2.java:429",
        "ThreadID": 1,
        "ThreadName": "",
        "EventID": "74D4D082C706F585",
        "ProcessID": 36430
      },
      {
        "Cycles": 0,
        "Agent": "edu.brown.cs.systems.xtrace.logging.BaggageWrappers",
        "ProcessName": "Data",
        "TaskID": "2DADA97879B44D5E",
        "ParentEventID": [
          "8E4A8CAFB7EAD564"
        ],
        "Label": "Forking current baggage with Baggage.fork()",
        "Title": "X-Trace Task",
        "Host": "pinky22.mpi-sws.org",
        "HRT": 47512577500575697,
        "Operation": "fork",
        "Timestamp": "1557746245186.551025",
        "TenantClass": 0,
        "Source": "PacketHeader.java:95",
        "ThreadID": 15142,
        "ThreadName": "",
        "EventID": "9DECF15DE7737BF6",
        "BaggageBytes": "[[248 5] [240 0] [0 45 173 169 120 121 180 77 94] [240 1] [0 142 74 140 175 183 234 213 100] [240 3] [0 2]]",
        "ProcessID": 28841
      },
      {
        "Cycles": 0,
        "Agent": "Execution-Sleep",
        "ProcessName": "Data",
        "TaskID": "2DADA97879B44D5E",
        "ParentEventID": [
          "CACBFF410A33EF03"
        ],
        "Label": "waited",
        "Title": "X-Trace Task",
        "Host": "pinky22.mpi-sws.org",
        "Duration": "9584",
        "HRT": 47512577500430070,
        "Operation": "waited",
        "Timestamp": "1557746245186.405518",
        "TenantClass": 0,
        "Source": "SocketIOWithTimeout.java:335",
        "ThreadID": 15142,
        "ThreadName": "",
        "EventID": "8E4A8CAFB7EAD564",
        "BaggageBytes": "[[248 5] [240 0] [0 45 173 169 120 121 180 77 94] [240 1] [0 202 203 255 65 10 51 239 3] [240 3] [0 2]]",
        "ProcessID": 28841
      },
      {
        "Cycles": 0,
        "Agent": "Execution-Sleep",
        "ProcessName": "Read",
        "TaskID": "2DADA97879B44D5E",
        "ParentEventID": [
          "74D4D082C706F585"
        ],
        "Label": "waited",
        "Title": "X-Trace Task",
        "Host": "pinky19.mpi-sws.org",
        "Duration": "237778",
        "HRT": 26962605246147379,
        "Operation": "waited",
        "Timestamp": "1557746245186.660645",
        "TenantClass": 0,
        "Source": "SocketIOWithTimeout.java:335",
        "ThreadID": 1,
        "ThreadName": "",
        "EventID": "F2E91198119B2B4B",
        "ProcessID": 36430
      },
      {
        "Cycles": 0,
        "Agent": "edu.brown.cs.systems.xtrace.logging.BaggageWrappers",
        "ProcessName": "Read",
        "TaskID": "2DADA97879B44D5E",
        "ParentEventID": [
          "CACBFF410A33EF03",
          "F2E91198119B2B4B"
        ],
        "Label": "Merged current baggage with other baggage",
        "Title": "X-Trace Task",
        "Host": "pinky19.mpi-sws.org",
        "HRT": 26962605246197080,
        "Operation": "join",
        "Timestamp": "1557746245186.710449",
        "TenantClass": 0,
        "Source": "PacketHeader.java:168",
        "ThreadID": 1,
        "ThreadName": "",
        "EventID": "7E5025A3846B8D70",
        "ProcessID": 36430
      },
      {
        "Cycles": 0,
        "Agent": "edu.brown.cs.systems.xtrace.logging.BaggageWrappers",
        "ProcessName": "Read",
        "TaskID": "2DADA97879B44D5E",
        "ParentEventID": [
          "95D93780BF875079"
        ],
        "Label": "Forking current baggage with Baggage.fork()",
        "Title": "X-Trace Task",
        "Host": "pinky19.mpi-sws.org",
        "HRT": 26962605246270469,
        "Operation": "fork",
        "Timestamp": "1557746245186.783936",
        "TenantClass": 0,
        "Source": "RemoteBlockReader2.java:361",
        "ThreadID": 1,
        "ThreadName": "",
        "EventID": "EAA7A758B412C11B",
        "ProcessID": 36430
      },
      {
        "Cycles": 0,
        "Agent": "Execution-Sleep",
        "ProcessName": "Data",
        "TaskID": "2DADA97879B44D5E",
        "ParentEventID": [
          "9DECF15DE7737BF6"
        ],
        "Label": "waited",
        "Title": "X-Trace Task",
        "Host": "pinky22.mpi-sws.org",
        "Duration": "118827",
        "HRT": 47512577500905271,
        "Operation": "waited",
        "Timestamp": "1557746245186.880615",
        "TenantClass": 0,
        "Source": "SocketIOWithTimeout.java:335",
        "ThreadID": 15142,
        "ThreadName": "",
        "EventID": "AC5A2E1F00D636D5",
        "BaggageBytes": "[[248 5] [240 0] [0 45 173 169 120 121 180 77 94] [240 1] [0 157 236 241 93 231 115 123 246] [240 3] [0 2]]",
        "ProcessID": 28841
      },
      {
        "Cycles": 0,
        "Agent": "edu.brown.cs.systems.xtrace.logging.BaggageWrappers",
        "ProcessName": "Data",
        "TaskID": "2DADA97879B44D5E",
        "ParentEventID": [
          "AC5A2E1F00D636D5",
          "EAA7A758B412C11B"
        ],
        "Label": "Merged current baggage with other baggage",
        "Title": "X-Trace Task",
        "Host": "pinky22.mpi-sws.org",
        "HRT": 47512577501015048,
        "Operation": "join",
        "Timestamp": "1557746245186.990479",
        "TenantClass": 0,
        "Source": "DataXceiver.java:574",
        "ThreadID": 15142,
        "ThreadName": "",
        "EventID": "AC16D15BAF18DA86",
        "BaggageBytes": "[[248 5] [240 0] [0 45 173 169 120 121 180 77 94] [240 1] [0 172 90 46 31 0 214 54 213] [0 234 167 167 88 180 18 193 27] [240 3] [0 2]]",
        "ProcessID": 28841
      },
      {
        "Cycles": 0,
        "Agent": "Execution-CPU",
        "ProcessName": "Data",
        "TaskID": "2DADA97879B44D5E",
        "ParentEventID": [
          "AC16D15BAF18DA86"
        ],
        "Label": "unset",
        "Title": "X-Trace Task",
        "Host": "pinky22.mpi-sws.org",
        "Duration": "1178443",
        "HRT": 47512577501062195,
        "Operation": "unset",
        "Timestamp": "1557746245187.037598",
        "TenantClass": 0,
        "Source": "DataXceiver.java:261",
        "ThreadID": 15142,
        "ThreadName": "",
        "EventID": "B92FBE2335826DEA",
        "BaggageBytes": "[[248 5] [240 0] [0 45 173 169 120 121 180 77 94] [240 1] [0 172 22 209 91 175 24 218 134] [240 3] [0 2]]",
        "ProcessID": 28841
      },
      {
        "Cycles": 0,
        "Agent": "edu.brown.cs.systems.xtrace.logging.BaggageWrappers",
        "ProcessName": "Read",
        "TaskID": "2DADA97879B44D5E",
        "ParentEventID": [
          "7E5025A3846B8D70",
          "9DECF15DE7737BF6"
        ],
        "Label": "Merged current baggage with other baggage",
        "Title": "X-Trace Task",
        "Host": "pinky19.mpi-sws.org",
        "HRT": 26962605246260827,
        "Operation": "join",
        "Timestamp": "1557746245186.774170",
        "TenantClass": 0,
        "Source": "PacketHeader.java:168",
        "ThreadID": 1,
        "ThreadName": "",
        "EventID": "95D93780BF875079",
        "ProcessID": 36430
      },
      {
        "Cycles": 0,
        "Agent": "edu.brown.cs.systems.retro.benchmarks.hdfs_client.Reader",
        "ProcessName": "Read",
        "TaskID": "2DADA97879B44D5E",
        "ParentEventID": [
          "0"
        ],
        "Label": "Reading file",
        "Title": "X-Trace Task",
        "Host": "pinky19.mpi-sws.org",
        "HRT": 26962605244221906,
        "Timestamp": "1557746245184.735352",
        "TenantClass": 0,
        "ThreadID": 1,
        "ThreadName": "",
        "EventID": "C04DE1C7DAC9A2C2",
        "ProcessID": 36430,
        "Tag": [
          "reader_10kb",
          "Read Size: 10240"
        ]
      }
    ]
  }
]