[
  {
    "id": "0FD0DA5BCE89CA28",
    "reports": [
      {
        "Cycles": 0,
        "Agent": "org.apache.hadoop.ipc.ProtobufRpcEngine",
        "ProcessName": "Read",
        "TaskID": "0FD0DA5BCE89CA28",
        "ParentEventID": [
          "DFCCC89114CDE93A"
        ],
        "Label": "Invoking org.apache.hadoop.hdfs.protocol.ClientProtocol.getBlockLocations",
        "Title": "X-Trace Task",
        "Host": "pinky19.mpi-sws.org",
        "HRT": 26966595288773583,
        "Timestamp": "1557750235228.988281",
        "TenantClass": 0,
        "Source": "ProtobufRpcEngine.java:228",
        "ThreadID": 1,
        "ThreadName": "",
        "EventID": "A7FB3C8A6BB8AF79",
        "ProcessID": 2801
      },
      {
        "Cycles": 0,
        "Agent": "Execution-CPU",
        "ProcessName": "Read",
        "TaskID": "0FD0DA5BCE89CA28",
        "ParentEventID": [
          "30FDBECF242691C0"
        ],
        "Label": "set",
        "Title": "X-Trace Task",
        "Host": "pinky19.mpi-sws.org",
        "HRT": 26966595288854678,
        "Operation": "set",
        "Timestamp": "1557750235229.069336",
        "TenantClass": 0,
        "Source": "Client.java:1032",
        "ThreadID": 41,
        "ThreadName": "",
        "EventID": "FA2A10FE03FFF6F3",
        "ProcessID": 2801
      },
      {
        "Cycles": 0,
        "Agent": "edu.brown.cs.systems.xtrace.logging.BaggageWrappers",
        "ProcessName": "Read",
        "TaskID": "0FD0DA5BCE89CA28",
        "ParentEventID": [
          "FA2A10FE03FFF6F3"
        ],
        "Label": "Forking current baggage with Baggage.fork()",
        "Title": "X-Trace Task",
        "Host": "pinky19.mpi-sws.org",
        "HRT": 26966595288877387,
        "Operation": "fork",
        "Timestamp": "1557750235229.092041",
        "TenantClass": 0,
        "Source": "Client.java:1043",
        "ThreadID": 41,
        "ThreadName": "",
        "EventID": "623CAE41EC353BDA",
        "ProcessID": 2801
      },
      {
        "Cycles": 0,
        "Agent": "edu.brown.cs.systems.retro.benchmarks.hdfs_client.Reader",
        "ProcessName": "Read",
        "TaskID": "0FD0DA5BCE89CA28",
        "ParentEventID": [
          "0398A59F80AC11FB"
        ],
        "Label": "Reading file",
        "Title": "X-Trace Task",
        "Host": "pinky19.mpi-sws.org",
        "HRT": 26966595288707836,
        "Timestamp": "1557750235228.922363",
        "TenantClass": 0,
        "ThreadID": 1,
        "ThreadName": "",
        "EventID": "DFCCC89114CDE93A",
        "ProcessID": 2801
      },
      {
        "Cycles": 0,
        "Agent": "Execution-CPU",
        "ProcessName": "Read",
        "TaskID": "0FD0DA5BCE89CA28",
        "ParentEventID": [
          "623CAE41EC353BDA"
        ],
        "Label": "unset",
        "Title": "X-Trace Task",
        "Host": "pinky19.mpi-sws.org",
        "Duration": "72677",
        "HRT": 26966595288948722,
        "Operation": "unset",
        "Timestamp": "1557750235229.163330",
        "TenantClass": 0,
        "Source": "Client.java:1062",
        "ThreadID": 41,
        "ThreadName": "",
        "EventID": "E3AD40FD5DB0E53C",
        "ProcessID": 2801
      },
      {
        "Cycles": 0,
        "Agent": "Execution-CPU",
        "ProcessName": "Read",
        "TaskID": "0FD0DA5BCE89CA28",
        "ParentEventID": [
          "A7FB3C8A6BB8AF79"
        ],
        "Label": "unset",
        "Title": "X-Trace Task",
        "Host": "pinky19.mpi-sws.org",
        "Duration": "22736839",
        "HRT": 26966595288803601,
        "Operation": "unset",
        "Timestamp": "1557750235229.018311",
        "TenantClass": 0,
        "Source": "Client.java:1027",
        "ThreadID": 1,
        "ThreadName": "",
        "EventID": "30FDBECF242691C0",
        "ProcessID": 2801
      },
      {
        "Cycles": 0,
        "Agent": "Execution-CPU",
        "ProcessName": "Name",
        "TaskID": "0FD0DA5BCE89CA28",
        "ParentEventID": [
          "623CAE41EC353BDA"
        ],
        "Label": "set",
        "Title": "X-Trace Task",
        "Host": "pinky19.mpi-sws.org",
        "HRT": 26966595289015363,
        "Operation": "set",
        "Timestamp": "1557750235229.252686",
        "TenantClass": 0,
        "Source": "Server.java:1840",
        "ThreadID": 48,
        "ThreadName": "",
        "EventID": "B77EC69BFAA43CD5",
        "BaggageBytes": "[[248 5] [240 0] [0 15 208 218 91 206 137 202 40] [240 1] [0 98 60 174 65 236 53 59 218] [240 3] [0 2]]",
        "ProcessID": 2171
      },
      {
        "Cycles": 0,
        "Agent": "Execution-CPU",
        "ProcessName": "Read",
        "TaskID": "0FD0DA5BCE89CA28",
        "ParentEventID": [
          "E3AD40FD5DB0E53C"
        ],
        "Label": "set",
        "Title": "X-Trace Task",
        "Host": "pinky19.mpi-sws.org",
        "HRT": 26966595288982431,
        "Operation": "set",
        "Timestamp": "1557750235229.197021",
        "TenantClass": 0,
        "Source": "Client.java:1104",
        "ThreadID": 1,
        "ThreadName": "",
        "EventID": "1B4770C824CF65E7",
        "ProcessID": 2801
      },
      {
        "Cycles": 0,
        "Agent": "Execution-CPU",
        "ProcessName": "Name",
        "TaskID": "0FD0DA5BCE89CA28",
        "ParentEventID": [
          "0AB33DAEF09CEAFD"
        ],
        "Label": "unset",
        "Title": "X-Trace Task",
        "Host": "pinky19.mpi-sws.org",
        "Duration": "24392",
        "HRT": 26966595289065053,
        "Operation": "unset",
        "Timestamp": "1557750235229.302490",
        "TenantClass": 0,
        "Source": "Server.java:1828",
        "ThreadID": 48,
        "ThreadName": "",
        "EventID": "9F8BE6430A0CF4EF",
        "BaggageBytes": "[[248 5] [240 0] [0 15 208 218 91 206 137 202 40] [240 1] [0 10 179 61 174 240 156 234 253] [240 3] [0 2]]",
        "ProcessID": 2171
      },
      {
        "Cycles": 0,
        "Agent": "edu.brown.cs.systems.xtrace.logging.BaggageWrappers",
        "ProcessName": "Name",
        "TaskID": "0FD0DA5BCE89CA28",
        "ParentEventID": [
          "B77EC69BFAA43CD5"
        ],
        "Label": "Forking current baggage with Baggage.fork()",
        "Title": "X-Trace Task",
        "Host": "pinky19.mpi-sws.org",
        "HRT": 26966595289044395,
        "Operation": "fork",
        "Timestamp": "1557750235229.281738",
        "TenantClass": 0,
        "Source": "Server.java:550",
        "ThreadID": 48,
        "ThreadName": "",
        "EventID": "0AB33DAEF09CEAFD",
        "BaggageBytes": "[[248 5] [240 0] [0 15 208 218 91 206 137 202 40] [240 1] [0 183 126 198 155 250 164 60 213] [240 3] [0 2]]",
        "ProcessID": 2171
      },
      {
        "Cycles": 0,
        "Agent": "org.apache.hadoop.ipc.Server",
        "ProcessName": "Name",
        "TaskID": "0FD0DA5BCE89CA28",
        "ParentEventID": [
          "13ACA09919D90D60"
        ],
        "Label": "getBlockLocations in org.apache.hadoop.hdfs.protocol.ClientProtocol",
        "Title": "X-Trace Task",
        "Host": "pinky19.mpi-sws.org",
        "HRT": 26966595289112448,
        "Timestamp": "1557750235229.349854",
        "TenantClass": 0,
        "Source": "ProtobufRpcEngine.java:601",
        "ThreadID": 59,
        "ThreadName": "",
        "EventID": "6574D75E52D0B2A0",
        "BaggageBytes": "[[248 5] [240 0] [0 15 208 218 91 206 137 202 40] [240 1] [0 19 172 160 153 25 217 13 96] [240 3] [0 2]]",
        "ProcessID": 2171
      },
      {
        "Cycles": 0,
        "Agent": "Execution-CPU",
        "ProcessName": "Name",
        "TaskID": "0FD0DA5BCE89CA28",
        "ParentEventID": [
          "0AB33DAEF09CEAFD"
        ],
        "Label": "set",
        "Title": "X-Trace Task",
        "Host": "pinky19.mpi-sws.org",
        "HRT": 26966595289074555,
        "Operation": "set",
        "Timestamp": "1557750235229.312012",
        "TenantClass": 0,
        "Source": "Server.java:2071",
        "ThreadID": 59,
        "ThreadName": "",
        "EventID": "13ACA09919D90D60",
        "BaggageBytes": "[[248 5] [240 0] [0 15 208 218 91 206 137 202 40] [240 1] [0 10 179 61 174 240 156 234 253] [240 3] [0 2]]",
        "ProcessID": 2171
      },
      {
        "Cycles": 0,
        "Agent": "org.apache.hadoop.hdfs.server.namenode.FSNamesystem.audit",
        "ProcessName": "Name",
        "TaskID": "0FD0DA5BCE89CA28",
        "ParentEventID": [
          "6574D75E52D0B2A0"
        ],
        "Label": "allowed=true\tugi=plascas (auth:SIMPLE)\tip=/139.19.171.63\tcmd=open\tsrc=/ds/nSI6oDCXGKqxCgEh\tdst=null\tperm=null\tproto=rpc",
        "Title": "X-Trace Task",
        "Host": "pinky19.mpi-sws.org",
        "HRT": 26966595289160446,
        "Timestamp": "1557750235229.397949",
        "TenantClass": 0,
        "Source": "FSNamesystem.java:8313",
        "ThreadID": 59,
        "ThreadName": "",
        "EventID": "D06180B855D09252",
        "BaggageBytes": "[[248 5] [240 0] [0 15 208 218 91 206 137 202 40] [240 1] [0 101 116 215 94 82 208 178 160] [240 3] [0 2]]",
        "ProcessID": 2171
      },
      {
        "Cycles": 0,
        "Agent": "Execution-CPU",
        "ProcessName": "Name",
        "TaskID": "0FD0DA5BCE89CA28",
        "ParentEventID": [
          "96260049AB6E6D22"
        ],
        "Label": "unset",
        "Title": "X-Trace Task",
        "Host": "pinky19.mpi-sws.org",
        "Duration": "216713",
        "HRT": 26966595289316432,
        "Operation": "unset",
        "Timestamp": "1557750235229.553955",
        "TenantClass": 0,
        "Source": "Server.java:1058",
        "ThreadID": 59,
        "ThreadName": "",
        "EventID": "74F1095C3DEAAE89",
        "BaggageBytes": "[[248 5] [240 0] [0 15 208 218 91 206 137 202 40] [240 1] [0 150 38 0 73 171 110 109 34] [240 3] [0 2]]",
        "ProcessID": 2171
      },
      {
        "Cycles": 0,
        "Agent": "Execution-CPU",
        "ProcessName": "Read",
        "TaskID": "0FD0DA5BCE89CA28",
        "ParentEventID": [
          "96260049AB6E6D22"
        ],
        "Label": "set",
        "Title": "X-Trace Task",
        "Host": "pinky19.mpi-sws.org",
        "HRT": 26966595289397312,
        "Operation": "set",
        "Timestamp": "1557750235229.612061",
        "TenantClass": 0,
        "Source": "Client.java:302",
        "ThreadID": 40,
        "ThreadName": "",
        "EventID": "259F66F583477F9B",
        "ProcessID": 2801
      },
      {
        "Cycles": 0,
        "Agent": "edu.brown.cs.systems.xtrace.logging.BaggageWrappers",
        "ProcessName": "Name",
        "TaskID": "0FD0DA5BCE89CA28",
        "ParentEventID": [
          "D06180B855D09252"
        ],
        "Label": "Forking current baggage with Baggage.fork()",
        "Title": "X-Trace Task",
        "Host": "pinky19.mpi-sws.org",
        "HRT": 26966595289214182,
        "Operation": "fork",
        "Timestamp": "1557750235229.451660",
        "TenantClass": 0,
        "Source": "Server.java:2398",
        "ThreadID": 59,
        "ThreadName": "",
        "EventID": "96260049AB6E6D22",
        "BaggageBytes": "[[248 5] [240 0] [0 15 208 218 91 206 137 202 40] [240 1] [0 208 97 128 184 85 208 146 82] [240 3] [0 2]]",
        "ProcessID": 2171
      },
      {
        "Cycles": 0,
        "Agent": "Execution-CPU",
        "ProcessName": "Read",
        "TaskID": "0FD0DA5BCE89CA28",
        "ParentEventID": [
          "259F66F583477F9B"
        ],
        "Label": "unset",
        "Title": "X-Trace Task",
        "Host": "pinky19.mpi-sws.org",
        "Duration": "11536",
        "HRT": 26966595289427594,
        "Operation": "unset",
        "Timestamp": "1557750235229.642334",
        "TenantClass": 0,
        "Source": "Client.java:1168",
        "ThreadID": 40,
        "ThreadName": "",
        "EventID": "562537FB592F7138",
        "ProcessID": 2801
      },
      {
        "Cycles": 0,
        "Agent": "edu.brown.cs.systems.xtrace.logging.BaggageWrappers",
        "ProcessName": "Read",
        "TaskID": "0FD0DA5BCE89CA28",
        "ParentEventID": [
          "562537FB592F7138",
          "90B54A6C48B6619A"
        ],
        "Label": "Merged current baggage with other baggage",
        "Title": "X-Trace Task",
        "Host": "pinky19.mpi-sws.org",
        "HRT": 26966595289470915,
        "Operation": "join",
        "Timestamp": "1557750235229.685547",
        "TenantClass": 0,
        "Source": "Client.java:1545",
        "ThreadID": 1,
        "ThreadName": "",
        "EventID": "34B4686F630A1606",
        "ProcessID": 2801
      },
      {
        "Cycles": 0,
        "Agent": "Execution-Sleep",
        "ProcessName": "Read",
        "TaskID": "0FD0DA5BCE89CA28",
        "ParentEventID": [
          "1B4770C824CF65E7"
        ],
        "Label": "waited",
        "Title": "X-Trace Task",
        "Host": "pinky19.mpi-sws.org",
        "Duration": "447299",
        "HRT": 26966595289450686,
        "Operation": "waited",
        "Timestamp": "1557750235229.665283",
        "TenantClass": 0,
        "Source": "Client.java:1537",
        "ThreadID": 1,
        "ThreadName": "",
        "EventID": "90B54A6C48B6619A",
        "ProcessID": 2801
      },
      {
        "Cycles": 0,
        "Agent": "org.apache.hadoop.ipc.ProtobufRpcEngine",
        "ProcessName": "Read",
        "TaskID": "0FD0DA5BCE89CA28",
        "ParentEventID": [
          "34B4686F630A1606"
        ],
        "Label": "org.apache.hadoop.hdfs.protocol.ClientProtocol.getBlockLocations completed",
        "Title": "X-Trace Task",
        "Host": "pinky19.mpi-sws.org",
        "HRT": 26966595289520437,
        "Timestamp": "1557750235229.735107",
        "TenantClass": 0,
        "Source": "ProtobufRpcEngine.java:275",
        "ThreadID": 1,
        "ThreadName": "",
        "EventID": "307D76D4A93AD41D",
        "ProcessID": 2801
      },
      {
        "Cycles": 0,
        "Agent": "edu.brown.cs.systems.xtrace.logging.BaggageWrappers",
        "ProcessName": "Read",
        "TaskID": "0FD0DA5BCE89CA28",
        "ParentEventID": [
          "1F246537E6F2A2A6"
        ],
        "Label": "Forking current baggage with Baggage.fork()",
        "Title": "X-Trace Task",
        "Host": "pinky19.mpi-sws.org",
        "HRT": 26966595289793699,
        "Operation": "fork",
        "Timestamp": "1557750235230.008301",
        "TenantClass": 0,
        "Source": "DataTransferProtoUtil.java:94",
        "ThreadID": 1,
        "ThreadName": "",
        "EventID": "AEC7DCC4FA72C1B5",
        "ProcessID": 2801
      },
      {
        "Cycles": 0,
        "Agent": "Execution-Sleep",
        "ProcessName": "Read",
        "TaskID": "0FD0DA5BCE89CA28",
        "ParentEventID": [
          "307D76D4A93AD41D"
        ],
        "Label": "waited",
        "Title": "X-Trace Task",
        "Host": "pinky19.mpi-sws.org",
        "Duration": "99836",
        "HRT": 26966595289728958,
        "Operation": "waited",
        "Timestamp": "1557750235229.943604",
        "TenantClass": 0,
        "Source": "SocketIOWithTimeout.java:335",
        "ThreadID": 1,
        "ThreadName": "",
        "EventID": "1F246537E6F2A2A6",
        "ProcessID": 2801
      },
      {
        "Cycles": 0,
        "Agent": "Execution-CPU",
        "ProcessName": "Data",
        "TaskID": "0FD0DA5BCE89CA28",
        "ParentEventID": [
          "AEC7DCC4FA72C1B5"
        ],
        "Label": "set",
        "Title": "X-Trace Task",
        "Host": "pinky26.mpi-sws.org",
        "HRT": 47516252019893488,
        "Operation": "set",
        "Timestamp": "1557750235230.629395",
        "TenantClass": 0,
        "Source": "Receiver.java:117",
        "ThreadID": 8451,
        "ThreadName": "",
        "EventID": "A3F2E8759C24304C",
        "BaggageBytes": "[[248 5] [240 0] [0 15 208 218 91 206 137 202 40] [240 1] [0 174 199 220 196 250 114 193 181] [240 3] [0 2]]",
        "ProcessID": 17069
      },
      {
        "Cycles": 0,
        "Agent": "edu.brown.cs.systems.xtrace.logging.BaggageWrappers",
        "ProcessName": "Data",
        "TaskID": "0FD0DA5BCE89CA28",
        "ParentEventID": [
          "2BC03C028C6315AA"
        ],
        "Label": "Forking current baggage with Baggage.fork()",
        "Title": "X-Trace Task",
        "Host": "pinky26.mpi-sws.org",
        "HRT": 47516252020285790,
        "Operation": "fork",
        "Timestamp": "1557750235231.021729",
        "TenantClass": 0,
        "Source": "DataXceiver.java:1257",
        "ThreadID": 8451,
        "ThreadName": "",
        "EventID": "BBBBD2FB32D6E6BF",
        "BaggageBytes": "[[248 5] [240 0] [0 15 208 218 91 206 137 202 40] [240 1] [0 43 192 60 2 140 99 21 170] [240 3] [0 2]]",
        "ProcessID": 17069
      },
      {
        "Cycles": 0,
        "Agent": "edu.brown.cs.systems.xtrace.logging.XTraceInit",
        "ProcessName": "Data",
        "TaskID": "0FD0DA5BCE89CA28",
        "ParentEventID": [
          "A3F2E8759C24304C"
        ],
        "Label": "Thread.setName: DataXceiver for client DFSClient_NONMAPREDUCE_310321604_1 at /139.19.171.63:41122 [Sending block BP-1633380353-139.19.171.63-1554193446451:blk_1073765140_24316]",
        "Title": "X-Trace Task",
        "Host": "pinky26.mpi-sws.org",
        "HRT": 47516252020011533,
        "Timestamp": "1557750235230.747314",
        "TenantClass": 0,
        "Source": "DataXceiver.java:168",
        "ThreadID": 8451,
        "ThreadName": "",
        "EventID": "2BC03C028C6315AA",
        "BaggageBytes": "[[248 5] [240 0] [0 15 208 218 91 206 137 202 40] [240 1] [0 163 242 232 117 156 36 48 76] [240 3] [0 2]]",
        "ProcessID": 17069
      },
      {
        "Cycles": 0,
        "Agent": "Execution-Sleep",
        "ProcessName": "Read",
        "TaskID": "0FD0DA5BCE89CA28",
        "ParentEventID": [
          "AEC7DCC4FA72C1B5"
        ],
        "Label": "waited",
        "Title": "X-Trace Task",
        "Host": "pinky19.mpi-sws.org",
        "Duration": "1182948",
        "HRT": 26966595291062875,
        "Operation": "waited",
        "Timestamp": "1557750235231.277588",
        "TenantClass": 0,
        "Source": "SocketIOWithTimeout.java:335",
        "ThreadID": 1,
        "ThreadName": "",
        "EventID": "53420FADD36779FA",
        "ProcessID": 2801
      },
      {
        "Cycles": 0,
        "Agent": "edu.brown.cs.systems.xtrace.logging.BaggageWrappers",
        "ProcessName": "Data",
        "TaskID": "0FD0DA5BCE89CA28",
        "ParentEventID": [
          "BBBBD2FB32D6E6BF"
        ],
        "Label": "Forking current baggage with Baggage.fork()",
        "Title": "X-Trace Task",
        "Host": "pinky26.mpi-sws.org",
        "HRT": 47516252020442958,
        "Operation": "fork",
        "Timestamp": "1557750235231.178955",
        "TenantClass": 0,
        "Source": "PacketHeader.java:95",
        "ThreadID": 8451,
        "ThreadName": "",
        "EventID": "31B0561EC39AF25B",
        "BaggageBytes": "[[248 5] [240 0] [0 15 208 218 91 206 137 202 40] [240 1] [0 187 187 210 251 50 214 230 191] [240 3] [0 2]]",
        "ProcessID": 17069
      },
      {
        "Cycles": 0,
        "Agent": "edu.brown.cs.systems.xtrace.logging.BaggageWrappers",
        "ProcessName": "Read",
        "TaskID": "0FD0DA5BCE89CA28",
        "ParentEventID": [
          "53420FADD36779FA",
          "BBBBD2FB32D6E6BF"
        ],
        "Label": "Merged current baggage with other baggage",
        "Title": "X-Trace Task",
        "Host": "pinky19.mpi-sws.org",
        "HRT": 26966595291167524,
        "Operation": "join",
        "Timestamp": "1557750235231.382080",
        "TenantClass": 0,
        "Source": "RemoteBlockReader2.java:429",
        "ThreadID": 1,
        "ThreadName": "",
        "EventID": "D083E14A80ED1C36",
        "ProcessID": 2801
      },
      {
        "Cycles": 0,
        "Agent": "Execution-Sleep",
        "ProcessName": "Data",
        "TaskID": "0FD0DA5BCE89CA28",
        "ParentEventID": [
          "31B0561EC39AF25B"
        ],
        "Label": "waited",
        "Title": "X-Trace Task",
        "Host": "pinky26.mpi-sws.org",
        "Duration": "14928",
        "HRT": 47516252020560911,
        "Operation": "waited",
        "Timestamp": "1557750235231.296875",
        "TenantClass": 0,
        "Source": "SocketIOWithTimeout.java:335",
        "ThreadID": 8451,
        "ThreadName": "",
        "EventID": "D90170D6E038D93A",
        "BaggageBytes": "[[248 5] [240 0] [0 15 208 218 91 206 137 202 40] [240 1] [0 49 176 86 30 195 154 242 91] [240 3] [0 2]]",
        "ProcessID": 17069
      },
      {
        "Cycles": 0,
        "Agent": "edu.brown.cs.systems.retro.benchmarks.hdfs_client.Reader",
        "ProcessName": "Read",
        "TaskID": "0FD0DA5BCE89CA28",
        "ParentEventID": [
          "0"
        ],
        "Label": "Reading file",
        "Title": "X-Trace Task",
        "Host": "pinky19.mpi-sws.org",
        "HRT": 26966595288688191,
        "Timestamp": "1557750235228.902832",
        "TenantClass": 0,
        "ThreadID": 1,
        "ThreadName": "",
        "EventID": "0398A59F80AC11FB",
        "ProcessID": 2801,
        "Tag": [
          "reader_100kb",
          "Read Size: 102400"
        ]
      },
      {
        "Cycles": 0,
        "Agent": "edu.brown.cs.systems.xtrace.logging.BaggageWrappers",
        "ProcessName": "Data",
        "TaskID": "0FD0DA5BCE89CA28",
        "ParentEventID": [
          "D90170D6E038D93A"
        ],
        "Label": "Forking current baggage with Baggage.fork()",
        "Title": "X-Trace Task",
        "Host": "pinky26.mpi-sws.org",
        "HRT": 47516252041359457,
        "Operation": "fork",
        "Timestamp": "1557750235252.095459",
        "TenantClass": 0,
        "Source": "PacketHeader.java:95",
        "ThreadID": 8451,
        "ThreadName": "",
        "EventID": "3290F066F4708597",
        "BaggageBytes": "[[248 5] [240 0] [0 15 208 218 91 206 137 202 40] [240 1] [0 217 1 112 214 224 56 217 58] [240 3] [0 2]]",
        "ProcessID": 17069
      },
      {
        "Cycles": 0,
        "Agent": "Execution-Sleep",
        "ProcessName": "Read",
        "TaskID": "0FD0DA5BCE89CA28",
        "ParentEventID": [
          "D083E14A80ED1C36"
        ],
        "Label": "waited",
        "Title": "X-Trace Task",
        "Host": "pinky19.mpi-sws.org",
        "Duration": "20901681",
        "HRT": 26966595312159442,
        "Operation": "waited",
        "Timestamp": "1557750235252.374023",
        "TenantClass": 0,
        "Source": "SocketIOWithTimeout.java:335",
        "ThreadID": 1,
        "ThreadName": "",
        "EventID": "DDA5FF731B83852A",
        "ProcessID": 2801
      },
      {
        "Cycles": 0,
        "Agent": "Execution-Sleep",
        "ProcessName": "Read",
        "TaskID": "0FD0DA5BCE89CA28",
        "ParentEventID": [
          "DDA5FF731B83852A"
        ],
        "Label": "waited",
        "Title": "X-Trace Task",
        "Host": "pinky19.mpi-sws.org",
        "Duration": "235687",
        "HRT": 26966595312457099,
        "Operation": "waited",
        "Timestamp": "1557750235252.671631",
        "TenantClass": 0,
        "Source": "SocketIOWithTimeout.java:335",
        "ThreadID": 1,
        "ThreadName": "",
        "EventID": "49657F9B24E28786",
        "ProcessID": 2801
      },
      {
        "Cycles": 0,
        "Agent": "Execution-Sleep",
        "ProcessName": "Read",
        "TaskID": "0FD0DA5BCE89CA28",
        "ParentEventID": [
          "49657F9B24E28786"
        ],
        "Label": "waited",
        "Title": "X-Trace Task",
        "Host": "pinky19.mpi-sws.org",
        "Duration": "228655",
        "HRT": 26966595312754222,
        "Operation": "waited",
        "Timestamp": "1557750235252.968750",
        "TenantClass": 0,
        "Source": "SocketIOWithTimeout.java:335",
        "ThreadID": 1,
        "ThreadName": "",
        "EventID": "C93FB6B52CE88C94",
        "ProcessID": 2801
      },
      {
        "Cycles": 0,
        "Agent": "edu.brown.cs.systems.xtrace.logging.BaggageWrappers",
        "ProcessName": "Read",
        "TaskID": "0FD0DA5BCE89CA28",
        "ParentEventID": [
          "C93FB6B52CE88C94",
          "31B0561EC39AF25B"
        ],
        "Label": "Merged current baggage with other baggage",
        "Title": "X-Trace Task",
        "Host": "pinky19.mpi-sws.org",
        "HRT": 26966595312797158,
        "Operation": "join",
        "Timestamp": "1557750235253.011719",
        "TenantClass": 0,
        "Source": "PacketHeader.java:168",
        "ThreadID": 1,
        "ThreadName": "",
        "EventID": "158860ECE24D5DB7",
        "ProcessID": 2801
      },
      {
        "Cycles": 0,
        "Agent": "edu.brown.cs.systems.xtrace.logging.BaggageWrappers",
        "ProcessName": "Read",
        "TaskID": "0FD0DA5BCE89CA28",
        "ParentEventID": [
          "87A956B07141AC00"
        ],
        "Label": "Forking current baggage with Baggage.fork()",
        "Title": "X-Trace Task",
        "Host": "pinky19.mpi-sws.org",
        "HRT": 26966595312911475,
        "Operation": "fork",
        "Timestamp": "1557750235253.126221",
        "TenantClass": 0,
        "Source": "RemoteBlockReader2.java:361",
        "ThreadID": 1,
        "ThreadName": "",
        "EventID": "0A520EA323756058",
        "ProcessID": 2801
      },
      {
        "Cycles": 0,
        "Agent": "edu.brown.cs.systems.xtrace.logging.BaggageWrappers",
        "ProcessName": "Read",
        "TaskID": "0FD0DA5BCE89CA28",
        "ParentEventID": [
          "3290F066F4708597",
          "158860ECE24D5DB7"
        ],
        "Label": "Merged current baggage with other baggage",
        "Title": "X-Trace Task",
        "Host": "pinky19.mpi-sws.org",
        "HRT": 26966595312899533,
        "Operation": "join",
        "Timestamp": "1557750235253.114258",
        "TenantClass": 0,
        "Source": "PacketHeader.java:168",
        "ThreadID": 1,
        "ThreadName": "",
        "EventID": "87A956B07141AC00",
        "ProcessID": 2801
      },
      {
        "Cycles": 0,
        "Agent": "edu.brown.cs.systems.xtrace.logging.BaggageWrappers",
        "ProcessName": "Read",
        "TaskID": "0FD0DA5BCE89CA28",
        "ParentEventID": [
          "0A520EA323756058"
        ],
        "Label": "Forking current baggage with Baggage.fork()",
        "Title": "X-Trace Task",
        "Host": "pinky19.mpi-sws.org",
        "HRT": 26966595312988096,
        "Operation": "fork",
        "Timestamp": "1557750235253.202637",
        "TenantClass": 0,
        "Source": "DataTransferProtoUtil.java:94",
        "ThreadID": 1,
        "ThreadName": "",
        "EventID": "5163987675FC5618",
        "ProcessID": 2801
      },
      {
        "Cycles": 0,
        "Agent": "Execution-Sleep",
        "ProcessName": "Data",
        "TaskID": "0FD0DA5BCE89CA28",
        "ParentEventID": [
          "3290F066F4708597"
        ],
        "Label": "waited",
        "Title": "X-Trace Task",
        "Host": "pinky26.mpi-sws.org",
        "Duration": "860510",
        "HRT": 47516252042418119,
        "Operation": "waited",
        "Timestamp": "1557750235253.154053",
        "TenantClass": 0,
        "Source": "SocketIOWithTimeout.java:335",
        "ThreadID": 8451,
        "ThreadName": "",
        "EventID": "4D8CA92FC6548A97",
        "BaggageBytes": "[[248 5] [240 0] [0 15 208 218 91 206 137 202 40] [240 1] [0 50 144 240 102 244 112 133 151] [240 3] [0 2]]",
        "ProcessID": 17069
      },
      {
        "Cycles": 0,
        "Agent": "edu.brown.cs.systems.xtrace.logging.BaggageWrappers",
        "ProcessName": "Data",
        "TaskID": "0FD0DA5BCE89CA28",
        "ParentEventID": [
          "4D8CA92FC6548A97",
          "0A520EA323756058"
        ],
        "Label": "Merged current baggage with other baggage",
        "Title": "X-Trace Task",
        "Host": "pinky26.mpi-sws.org",
        "HRT": 47516252042655758,
        "Operation": "join",
        "Timestamp": "1557750235253.391602",
        "TenantClass": 0,
        "Source": "DataXceiver.java:574",
        "ThreadID": 8451,
        "ThreadName": "",
        "EventID": "3ED1EFA013F36C12",
        "BaggageBytes": "[[248 5] [240 0] [0 15 208 218 91 206 137 202 40] [240 1] [0 10 82 14 163 35 117 96 88] [0 77 140 169 47 198 84 138 151] [240 3] [0 2]]",
        "ProcessID": 17069
      },
      {
        "Cycles": 0,
        "Agent": "Execution-CPU",
        "ProcessName": "Data",
        "TaskID": "0FD0DA5BCE89CA28",
        "ParentEventID": [
          "3ED1EFA013F36C12"
        ],
        "Label": "unset",
        "Title": "X-Trace Task",
        "Host": "pinky26.mpi-sws.org",
        "Duration": "22762875",
        "HRT": 47516252042710142,
        "Operation": "unset",
        "Timestamp": "1557750235253.446045",
        "TenantClass": 0,
        "Source": "DataXceiver.java:261",
        "ThreadID": 8451,
        "ThreadName": "",
        "EventID": "D1CF8EB4C7BFD67E",
        "BaggageBytes": "[[248 5] [240 0] [0 15 208 218 91 206 137 202 40] [240 1] [0 62 209 239 160 19 243 108 18] [240 3] [0 2]]",
        "ProcessID": 17069
      },
      {
        "Cycles": 0,
        "Agent": "Execution-CPU",
        "ProcessName": "Data",
        "TaskID": "0FD0DA5BCE89CA28",
        "ParentEventID": [
          "5163987675FC5618"
        ],
        "Label": "set",
        "Title": "X-Trace Task",
        "Host": "pinky26.mpi-sws.org",
        "HRT": 47516252042804615,
        "Operation": "set",
        "Timestamp": "1557750235253.540527",
        "TenantClass": 0,
        "Source": "Receiver.java:117",
        "ThreadID": 8451,
        "ThreadName": "",
        "EventID": "6C913C4E888AC804",
        "BaggageBytes": "[[248 5] [240 0] [0 15 208 218 91 206 137 202 40] [240 1] [0 81 99 152 118 117 252 86 24] [240 3] [0 2]]",
        "ProcessID": 17069
      },
      {
        "Cycles": 0,
        "Agent": "edu.brown.cs.systems.xtrace.logging.XTraceInit",
        "ProcessName": "Data",
        "TaskID": "0FD0DA5BCE89CA28",
        "ParentEventID": [
          "6C913C4E888AC804"
        ],
        "Label": "Thread.setName: DataXceiver for client DFSClient_NONMAPREDUCE_310321604_1 at /139.19.171.63:41122 [Sending block BP-1633380353-139.19.171.63-1554193446451:blk_1073765140_24316]",
        "Title": "X-Trace Task",
        "Host": "pinky26.mpi-sws.org",
        "HRT": 47516252042906193,
        "Timestamp": "1557750235253.642090",
        "TenantClass": 0,
        "Source": "DataXceiver.java:168",
        "ThreadID": 8451,
        "ThreadName": "",
        "EventID": "6B192B99A0A56718",
        "BaggageBytes": "[[248 5] [240 0] [0 15 208 218 91 206 137 202 40] [240 1] [0 108 145 60 78 136 138 200 4] [240 3] [0 2]]",
        "ProcessID": 17069
      },
      {
        "Cycles": 0,
        "Agent": "edu.brown.cs.systems.xtrace.logging.BaggageWrappers",
        "ProcessName": "Data",
        "TaskID": "0FD0DA5BCE89CA28",
        "ParentEventID": [
          "6B192B99A0A56718"
        ],
        "Label": "Forking current baggage with Baggage.fork()",
        "Title": "X-Trace Task",
        "Host": "pinky26.mpi-sws.org",
        "HRT": 47516252043146049,
        "Operation": "fork",
        "Timestamp": "1557750235253.881836",
        "TenantClass": 0,
        "Source": "DataXceiver.java:1257",
        "ThreadID": 8451,
        "ThreadName": "",
        "EventID": "9A51985980EF8FF8",
        "BaggageBytes": "[[248 5] [240 0] [0 15 208 218 91 206 137 202 40] [240 1] [0 107 25 43 153 160 165 103 24] [240 3] [0 2]]",
        "ProcessID": 17069
      },
      {
        "Cycles": 0,
        "Agent": "edu.brown.cs.systems.xtrace.logging.BaggageWrappers",
        "ProcessName": "Data",
        "TaskID": "0FD0DA5BCE89CA28",
        "ParentEventID": [
          "9A51985980EF8FF8"
        ],
        "Label": "Forking current baggage with Baggage.fork()",
        "Title": "X-Trace Task",
        "Host": "pinky26.mpi-sws.org",
        "HRT": 47516252043246187,
        "Operation": "fork",
        "Timestamp": "1557750235253.982178",
        "TenantClass": 0,
        "Source": "PacketHeader.java:95",
        "ThreadID": 8451,
        "ThreadName": "",
        "EventID": "DA6B89DFFA035208",
        "BaggageBytes": "[[248 5] [240 0] [0 15 208 218 91 206 137 202 40] [240 1] [0 154 81 152 89 128 239 143 248] [240 3] [0 2]]",
        "ProcessID": 17069
      },
      {
        "Cycles": 0,
        "Agent": "Execution-Sleep",
        "ProcessName": "Read",
        "TaskID": "0FD0DA5BCE89CA28",
        "ParentEventID": [
          "5163987675FC5618"
        ],
        "Label": "waited",
        "Title": "X-Trace Task",
        "Host": "pinky19.mpi-sws.org",
        "Duration": "786189",
        "HRT": 26966595313851146,
        "Operation": "waited",
        "Timestamp": "1557750235254.065674",
        "TenantClass": 0,
        "Source": "SocketIOWithTimeout.java:335",
        "ThreadID": 1,
        "ThreadName": "",
        "EventID": "C042A2B12174AB08",
        "ProcessID": 2801
      },
      {
        "Cycles": 0,
        "Agent": "edu.brown.cs.systems.xtrace.logging.BaggageWrappers",
        "ProcessName": "Read",
        "TaskID": "0FD0DA5BCE89CA28",
        "ParentEventID": [
          "C042A2B12174AB08",
          "9A51985980EF8FF8"
        ],
        "Label": "Merged current baggage with other baggage",
        "Title": "X-Trace Task",
        "Host": "pinky19.mpi-sws.org",
        "HRT": 26966595313932658,
        "Operation": "join",
        "Timestamp": "1557750235254.147217",
        "TenantClass": 0,
        "Source": "RemoteBlockReader2.java:429",
        "ThreadID": 1,
        "ThreadName": "",
        "EventID": "A8D20DF1BBC99B16",
        "ProcessID": 2801
      },
      {
        "Cycles": 0,
        "Agent": "Execution-Sleep",
        "ProcessName": "Data",
        "TaskID": "0FD0DA5BCE89CA28",
        "ParentEventID": [
          "DA6B89DFFA035208"
        ],
        "Label": "waited",
        "Title": "X-Trace Task",
        "Host": "pinky26.mpi-sws.org",
        "Duration": "5816",
        "HRT": 47516252043349871,
        "Operation": "waited",
        "Timestamp": "1557750235254.085693",
        "TenantClass": 0,
        "Source": "SocketIOWithTimeout.java:335",
        "ThreadID": 8451,
        "ThreadName": "",
        "EventID": "2A96AAEDB67C76E4",
        "BaggageBytes": "[[248 5] [240 0] [0 15 208 218 91 206 137 202 40] [240 1] [0 218 107 137 223 250 3 82 8] [240 3] [0 2]]",
        "ProcessID": 17069
      },
      {
        "Cycles": 0,
        "Agent": "Execution-Sleep",
        "ProcessName": "Read",
        "TaskID": "0FD0DA5BCE89CA28",
        "ParentEventID": [
          "A8D20DF1BBC99B16"
        ],
        "Label": "waited",
        "Title": "X-Trace Task",
        "Host": "pinky19.mpi-sws.org",
        "Duration": "238007",
        "HRT": 26966595314252138,
        "Operation": "waited",
        "Timestamp": "1557750235254.466797",
        "TenantClass": 0,
        "Source": "SocketIOWithTimeout.java:335",
        "ThreadID": 1,
        "ThreadName": "",
        "EventID": "58759A392080BB4B",
        "ProcessID": 2801
      },
      {
        "Cycles": 0,
        "Agent": "edu.brown.cs.systems.xtrace.logging.BaggageWrappers",
        "ProcessName": "Data",
        "TaskID": "0FD0DA5BCE89CA28",
        "ParentEventID": [
          "2A96AAEDB67C76E4"
        ],
        "Label": "Forking current baggage with Baggage.fork()",
        "Title": "X-Trace Task",
        "Host": "pinky26.mpi-sws.org",
        "HRT": 47516252043431127,
        "Operation": "fork",
        "Timestamp": "1557750235254.166992",
        "TenantClass": 0,
        "Source": "PacketHeader.java:95",
        "ThreadID": 8451,
        "ThreadName": "",
        "EventID": "6D737BD95302109A",
        "BaggageBytes": "[[248 5] [240 0] [0 15 208 218 91 206 137 202 40] [240 1] [0 42 150 170 237 182 124 118 228] [240 3] [0 2]]",
        "ProcessID": 17069
      },
      {
        "Cycles": 0,
        "Agent": "Execution-Sleep",
        "ProcessName": "Read",
        "TaskID": "0FD0DA5BCE89CA28",
        "ParentEventID": [
          "58759A392080BB4B"
        ],
        "Label": "waited",
        "Title": "X-Trace Task",
        "Host": "pinky19.mpi-sws.org",
        "Duration": "161683",
        "HRT": 26966595314464065,
        "Operation": "waited",
        "Timestamp": "1557750235254.678711",
        "TenantClass": 0,
        "Source": "SocketIOWithTimeout.java:335",
        "ThreadID": 1,
        "ThreadName": "",
        "EventID": "B1CBEF294A60A6BE",
        "ProcessID": 2801
      },
      {
        "Cycles": 0,
        "Agent": "Execution-Sleep",
        "ProcessName": "Data",
        "TaskID": "0FD0DA5BCE89CA28",
        "ParentEventID": [
          "6D737BD95302109A"
        ],
        "Label": "waited",
        "Title": "X-Trace Task",
        "Host": "pinky26.mpi-sws.org",
        "Duration": "194493",
        "HRT": 47516252043701538,
        "Operation": "waited",
        "Timestamp": "1557750235254.437500",
        "TenantClass": 0,
        "Source": "SocketIOWithTimeout.java:335",
        "ThreadID": 8451,
        "ThreadName": "",
        "EventID": "68DB66A32B0BC178",
        "BaggageBytes": "[[248 5] [240 0] [0 15 208 218 91 206 137 202 40] [240 1] [0 109 115 123 217 83 2 16 154] [240 3] [0 2]]",
        "ProcessID": 17069
      },
      {
        "Cycles": 0,
        "Agent": "Execution-Sleep",
        "ProcessName": "Read",
        "TaskID": "0FD0DA5BCE89CA28",
        "ParentEventID": [
          "B1CBEF294A60A6BE"
        ],
        "Label": "waited",
        "Title": "X-Trace Task",
        "Host": "pinky19.mpi-sws.org",
        "Duration": "108154",
        "HRT": 26966595314619624,
        "Operation": "waited",
        "Timestamp": "1557750235254.834229",
        "TenantClass": 0,
        "Source": "SocketIOWithTimeout.java:335",
        "ThreadID": 1,
        "ThreadName": "",
        "EventID": "D88AAE746F1BA1A0",
        "ProcessID": 2801
      },
      {
        "Cycles": 0,
        "Agent": "edu.brown.cs.systems.xtrace.logging.BaggageWrappers",
        "ProcessName": "Read",
        "TaskID": "0FD0DA5BCE89CA28",
        "ParentEventID": [
          "DA6B89DFFA035208",
          "D88AAE746F1BA1A0"
        ],
        "Label": "Merged current baggage with other baggage",
        "Title": "X-Trace Task",
        "Host": "pinky19.mpi-sws.org",
        "HRT": 26966595314660192,
        "Operation": "join",
        "Timestamp": "1557750235254.874756",
        "TenantClass": 0,
        "Source": "PacketHeader.java:168",
        "ThreadID": 1,
        "ThreadName": "",
        "EventID": "A215F7C2BF16A98F",
        "ProcessID": 2801
      },
      {
        "Cycles": 0,
        "Agent": "edu.brown.cs.systems.xtrace.logging.BaggageWrappers",
        "ProcessName": "Data",
        "TaskID": "0FD0DA5BCE89CA28",
        "ParentEventID": [
          "68DB66A32B0BC178"
        ],
        "Label": "Forking current baggage with Baggage.fork()",
        "Title": "X-Trace Task",
        "Host": "pinky26.mpi-sws.org",
        "HRT": 47516252043783839,
        "Operation": "fork",
        "Timestamp": "1557750235254.519775",
        "TenantClass": 0,
        "Source": "PacketHeader.java:95",
        "ThreadID": 8451,
        "ThreadName": "",
        "EventID": "A515E8EA9AC6473D",
        "BaggageBytes": "[[248 5] [240 0] [0 15 208 218 91 206 137 202 40] [240 1] [0 104 219 102 163 43 11 193 120] [240 3] [0 2]]",
        "ProcessID": 17069
      },
      {
        "Cycles": 0,
        "Agent": "edu.brown.cs.systems.xtrace.logging.BaggageWrappers",
        "ProcessName": "Data",
        "TaskID": "0FD0DA5BCE89CA28",
        "ParentEventID": [
          "F8062DDDCD4C9CBA"
        ],
        "Label": "Forking current baggage with Baggage.fork()",
        "Title": "X-Trace Task",
        "Host": "pinky26.mpi-sws.org",
        "HRT": 47516252044025159,
        "Operation": "fork",
        "Timestamp": "1557750235254.760986",
        "TenantClass": 0,
        "Source": "PacketHeader.java:95",
        "ThreadID": 8451,
        "ThreadName": "",
        "EventID": "01FEA2947453102E",
        "BaggageBytes": "[[248 5] [240 0] [0 15 208 218 91 206 137 202 40] [240 1] [0 248 6 45 221 205 76 156 186] [240 3] [0 2]]",
        "ProcessID": 17069
      },
      {
        "Cycles": 0,
        "Agent": "Execution-Sleep",
        "ProcessName": "Data",
        "TaskID": "0FD0DA5BCE89CA28",
        "ParentEventID": [
          "A515E8EA9AC6473D"
        ],
        "Label": "waited",
        "Title": "X-Trace Task",
        "Host": "pinky26.mpi-sws.org",
        "Duration": "3413",
        "HRT": 47516252043853742,
        "Operation": "waited",
        "Timestamp": "1557750235254.589600",
        "TenantClass": 0,
        "Source": "SocketIOWithTimeout.java:335",
        "ThreadID": 8451,
        "ThreadName": "",
        "EventID": "F8062DDDCD4C9CBA",
        "BaggageBytes": "[[248 5] [240 0] [0 15 208 218 91 206 137 202 40] [240 1] [0 165 21 232 234 154 198 71 61] [240 3] [0 2]]",
        "ProcessID": 17069
      },
      {
        "Cycles": 0,
        "Agent": "Execution-Sleep",
        "ProcessName": "Data",
        "TaskID": "0FD0DA5BCE89CA28",
        "ParentEventID": [
          "01FEA2947453102E"
        ],
        "Label": "waited",
        "Title": "X-Trace Task",
        "Host": "pinky26.mpi-sws.org",
        "Duration": "3627",
        "HRT": 47516252044105917,
        "Operation": "waited",
        "Timestamp": "1557750235254.841797",
        "TenantClass": 0,
        "Source": "SocketIOWithTimeout.java:335",
        "ThreadID": 8451,
        "ThreadName": "",
        "EventID": "FED05976BAFEC9D2",
        "BaggageBytes": "[[248 5] [240 0] [0 15 208 218 91 206 137 202 40] [240 1] [0 1 254 162 148 116 83 16 46] [240 3] [0 2]]",
        "ProcessID": 17069
      },
      {
        "Cycles": 0,
        "Agent": "edu.brown.cs.systems.xtrace.logging.BaggageWrappers",
        "ProcessName": "Data",
        "TaskID": "0FD0DA5BCE89CA28",
        "ParentEventID": [
          "FED05976BAFEC9D2"
        ],
        "Label": "Forking current baggage with Baggage.fork()",
        "Title": "X-Trace Task",
        "Host": "pinky26.mpi-sws.org",
        "HRT": 47516252044193102,
        "Operation": "fork",
        "Timestamp": "1557750235254.928955",
        "TenantClass": 0,
        "Source": "PacketHeader.java:95",
        "ThreadID": 8451,
        "ThreadName": "",
        "EventID": "13D905AD3539BD76",
        "BaggageBytes": "[[248 5] [240 0] [0 15 208 218 91 206 137 202 40] [240 1] [0 254 208 89 118 186 254 201 210] [240 3] [0 2]]",
        "ProcessID": 17069
      },
      {
        "Cycles": 0,
        "Agent": "Execution-CPU",
        "ProcessName": "Data",
        "TaskID": "0FD0DA5BCE89CA28",
        "ParentEventID": [
          "13D905AD3539BD76"
        ],
        "Label": "unset",
        "Title": "X-Trace Task",
        "Host": "pinky26.mpi-sws.org",
        "Duration": "1804367",
        "HRT": 47516252044665411,
        "Operation": "unset",
        "Timestamp": "1557750235255.401367",
        "TenantClass": 0,
        "Source": "DataXceiver.java:261",
        "ThreadID": 8451,
        "ThreadName": "",
        "EventID": "E5CD059AE01CB322",
        "BaggageBytes": "[[248 5] [240 0] [0 15 208 218 91 206 137 202 40] [240 1] [0 19 217 5 173 53 57 189 118] [240 3] [0 2]]",
        "ProcessID": 17069
      }
    ]
  }
]