[
  {
    "id": "A41092B81DE636DD",
    "reports": [
      {
        "Cycles": 0,
        "Agent": "org.apache.hadoop.ipc.ProtobufRpcEngine",
        "ProcessName": "Read",
        "TaskID": "A41092B81DE636DD",
        "ParentEventID": [
          "F223500C58752A07"
        ],
        "Label": "Invoking org.apache.hadoop.hdfs.protocol.ClientProtocol.getBlockLocations",
        "Title": "X-Trace Task",
        "Host": "pinky19.mpi-sws.org",
        "HRT": 25491789107648351,
        "Timestamp": "1556275429047.977783",
        "TenantClass": 0,
        "Source": "ProtobufRpcEngine.java:228",
        "ThreadID": 1,
        "ThreadName": "",
        "EventID": "C5BB39B220831792",
        "ProcessID": 21035
      },
      {
        "Cycles": 0,
        "Agent": "Execution-CPU",
        "ProcessName": "Read",
        "TaskID": "A41092B81DE636DD",
        "ParentEventID": [
          "C5BB39B220831792"
        ],
        "Label": "unset",
        "Title": "X-Trace Task",
        "Host": "pinky19.mpi-sws.org",
        "Duration": "22511030",
        "HRT": 25491789107689071,
        "Operation": "unset",
        "Timestamp": "1556275429048.018555",
        "TenantClass": 0,
        "Source": "Client.java:1027",
        "ThreadID": 1,
        "ThreadName": "",
        "EventID": "248D6080C46D4B49",
        "ProcessID": 21035
      },
      {
        "Cycles": 0,
        "Agent": "Execution-CPU",
        "ProcessName": "Read",
        "TaskID": "A41092B81DE636DD",
        "ParentEventID": [
          "248D6080C46D4B49"
        ],
        "Label": "set",
        "Title": "X-Trace Task",
        "Host": "pinky19.mpi-sws.org",
        "HRT": 25491789107724898,
        "Operation": "set",
        "Timestamp": "1556275429048.054199",
        "TenantClass": 0,
        "Source": "Client.java:1032",
        "ThreadID": 41,
        "ThreadName": "",
        "EventID": "413B613CA4133144",
        "ProcessID": 21035
      },
      {
        "Cycles": 0,
        "Agent": "edu.brown.cs.systems.retro.benchmarks.hdfs_client.Reader",
        "ProcessName": "Read",
        "TaskID": "A41092B81DE636DD",
        "ParentEventID": [
          "A7E5D27865AB4402"
        ],
        "Label": "Reading file",
        "Title": "X-Trace Task",
        "Host": "pinky19.mpi-sws.org",
        "HRT": 25491789107583150,
        "Timestamp": "1556275429047.912598",
        "TenantClass": 0,
        "ThreadID": 1,
        "ThreadName": "",
        "EventID": "F223500C58752A07",
        "ProcessID": 21035
      },
      {
        "Cycles": 0,
        "Agent": "Execution-CPU",
        "ProcessName": "Read",
        "TaskID": "A41092B81DE636DD",
        "ParentEventID": [
          "E0419CFA7B37C279"
        ],
        "Label": "unset",
        "Title": "X-Trace Task",
        "Host": "pinky19.mpi-sws.org",
        "Duration": "79502",
        "HRT": 25491789107825876,
        "Operation": "unset",
        "Timestamp": "1556275429048.155273",
        "TenantClass": 0,
        "Source": "Client.java:1062",
        "ThreadID": 41,
        "ThreadName": "",
        "EventID": "6EC79877AA0AD6E7",
        "ProcessID": 21035
      },
      {
        "Cycles": 0,
        "Agent": "edu.brown.cs.systems.xtrace.logging.BaggageWrappers",
        "ProcessName": "Read",
        "TaskID": "A41092B81DE636DD",
        "ParentEventID": [
          "413B613CA4133144"
        ],
        "Label": "Forking current baggage with Baggage.fork()",
        "Title": "X-Trace Task",
        "Host": "pinky19.mpi-sws.org",
        "HRT": 25491789107747636,
        "Operation": "fork",
        "Timestamp": "1556275429048.077148",
        "TenantClass": 0,
        "Source": "Client.java:1043",
        "ThreadID": 41,
        "ThreadName": "",
        "EventID": "E0419CFA7B37C279",
        "ProcessID": 21035
      },
      {
        "Cycles": 0,
        "Agent": "Execution-CPU",
        "ProcessName": "Read",
        "TaskID": "A41092B81DE636DD",
        "ParentEventID": [
          "6EC79877AA0AD6E7"
        ],
        "Label": "set",
        "Title": "X-Trace Task",
        "Host": "pinky19.mpi-sws.org",
        "HRT": 25491789107866934,
        "Operation": "set",
        "Timestamp": "1556275429048.196289",
        "TenantClass": 0,
        "Source": "Client.java:1104",
        "ThreadID": 1,
        "ThreadName": "",
        "EventID": "650CB75FFB3DBC99",
        "ProcessID": 21035
      },
      {
        "Cycles": 0,
        "Agent": "edu.brown.cs.systems.xtrace.logging.BaggageWrappers",
        "ProcessName": "Name",
        "TaskID": "A41092B81DE636DD",
        "ParentEventID": [
          "CFC5FA6BADFE4779"
        ],
        "Label": "Forking current baggage with Baggage.fork()",
        "Title": "X-Trace Task",
        "Host": "pinky19.mpi-sws.org",
        "HRT": 25491789107930170,
        "Operation": "fork",
        "Timestamp": "1556275429048.282715",
        "TenantClass": 0,
        "Source": "Server.java:550",
        "ThreadID": 48,
        "ThreadName": "",
        "EventID": "F311648F7634C59A",
        "BaggageBytes": "[[248 5] [240 0] [0 164 16 146 184 29 230 54 221] [240 1] [0 207 197 250 107 173 254 71 121] [240 3] [0 2]]",
        "ProcessID": 2171
      },
      {
        "Cycles": 0,
        "Agent": "Execution-CPU",
        "ProcessName": "Name",
        "TaskID": "A41092B81DE636DD",
        "ParentEventID": [
          "F311648F7634C59A"
        ],
        "Label": "unset",
        "Title": "X-Trace Task",
        "Host": "pinky19.mpi-sws.org",
        "Duration": "25171",
        "HRT": 25491789107951608,
        "Operation": "unset",
        "Timestamp": "1556275429048.303955",
        "TenantClass": 0,
        "Source": "Server.java:1828",
        "ThreadID": 48,
        "ThreadName": "",
        "EventID": "AABBBC8B45898C1E",
        "BaggageBytes": "[[248 5] [240 0] [0 164 16 146 184 29 230 54 221] [240 1] [0 243 17 100 143 118 52 197 154] [240 3] [0 2]]",
        "ProcessID": 2171
      },
      {
        "Cycles": 0,
        "Agent": "Execution-CPU",
        "ProcessName": "Name",
        "TaskID": "A41092B81DE636DD",
        "ParentEventID": [
          "E0419CFA7B37C279"
        ],
        "Label": "set",
        "Title": "X-Trace Task",
        "Host": "pinky19.mpi-sws.org",
        "HRT": 25491789107900045,
        "Operation": "set",
        "Timestamp": "1556275429048.252441",
        "TenantClass": 0,
        "Source": "Server.java:1840",
        "ThreadID": 48,
        "ThreadName": "",
        "EventID": "CFC5FA6BADFE4779",
        "BaggageBytes": "[[248 5] [240 0] [0 164 16 146 184 29 230 54 221] [240 1] [0 224 65 156 250 123 55 194 121] [240 3] [0 2]]",
        "ProcessID": 2171
      },
      {
        "Cycles": 0,
        "Agent": "Execution-CPU",
        "ProcessName": "Name",
        "TaskID": "A41092B81DE636DD",
        "ParentEventID": [
          "F311648F7634C59A"
        ],
        "Label": "set",
        "Title": "X-Trace Task",
        "Host": "pinky19.mpi-sws.org",
        "HRT": 25491789107958538,
        "Operation": "set",
        "Timestamp": "1556275429048.311035",
        "TenantClass": 0,
        "Source": "Server.java:2071",
        "ThreadID": 55,
        "ThreadName": "",
        "EventID": "F0449F31868EFEBB",
        "BaggageBytes": "[[248 5] [240 0] [0 164 16 146 184 29 230 54 221] [240 1] [0 243 17 100 143 118 52 197 154] [240 3] [0 2]]",
        "ProcessID": 2171
      },
      {
        "Cycles": 0,
        "Agent": "org.apache.hadoop.ipc.Server",
        "ProcessName": "Name",
        "TaskID": "A41092B81DE636DD",
        "ParentEventID": [
          "F0449F31868EFEBB"
        ],
        "Label": "getBlockLocations in org.apache.hadoop.hdfs.protocol.ClientProtocol",
        "Title": "X-Trace Task",
        "Host": "pinky19.mpi-sws.org",
        "HRT": 25491789107990969,
        "Timestamp": "1556275429048.343506",
        "TenantClass": 0,
        "Source": "ProtobufRpcEngine.java:601",
        "ThreadID": 55,
        "ThreadName": "",
        "EventID": "CD361094D7AEAE14",
        "BaggageBytes": "[[248 5] [240 0] [0 164 16 146 184 29 230 54 221] [240 1] [0 240 68 159 49 134 142 254 187] [240 3] [0 2]]",
        "ProcessID": 2171
      },
      {
        "Cycles": 0,
        "Agent": "edu.brown.cs.systems.xtrace.logging.BaggageWrappers",
        "ProcessName": "Name",
        "TaskID": "A41092B81DE636DD",
        "ParentEventID": [
          "C74445D5F4A49BE7"
        ],
        "Label": "Forking current baggage with Baggage.fork()",
        "Title": "X-Trace Task",
        "Host": "pinky19.mpi-sws.org",
        "HRT": 25491789108080120,
        "Operation": "fork",
        "Timestamp": "1556275429048.432617",
        "TenantClass": 0,
        "Source": "Server.java:2398",
        "ThreadID": 55,
        "ThreadName": "",
        "EventID": "1035D070D6038243",
        "BaggageBytes": "[[248 5] [240 0] [0 164 16 146 184 29 230 54 221] [240 1] [0 199 68 69 213 244 164 155 231] [240 3] [0 2]]",
        "ProcessID": 2171
      },
      {
        "Cycles": 0,
        "Agent": "org.apache.hadoop.hdfs.server.namenode.FSNamesystem.audit",
        "ProcessName": "Name",
        "TaskID": "A41092B81DE636DD",
        "ParentEventID": [
          "CD361094D7AEAE14"
        ],
        "Label": "allowed=true\tugi=plascas (auth:SIMPLE)\tip=/139.19.171.63\tcmd=open\tsrc=/ds/U9W1YZxU6SsbrPbe\tdst=null\tperm=null\tproto=rpc",
        "Title": "X-Trace Task",
        "Host": "pinky19.mpi-sws.org",
        "HRT": 25491789108038081,
        "Timestamp": "1556275429048.390625",
        "TenantClass": 0,
        "Source": "FSNamesystem.java:8313",
        "ThreadID": 55,
        "ThreadName": "",
        "EventID": "C74445D5F4A49BE7",
        "BaggageBytes": "[[248 5] [240 0] [0 164 16 146 184 29 230 54 221] [240 1] [0 205 54 16 148 215 174 174 20] [240 3] [0 2]]",
        "ProcessID": 2171
      },
      {
        "Cycles": 0,
        "Agent": "Execution-CPU",
        "ProcessName": "Name",
        "TaskID": "A41092B81DE636DD",
        "ParentEventID": [
          "1035D070D6038243"
        ],
        "Label": "unset",
        "Title": "X-Trace Task",
        "Host": "pinky19.mpi-sws.org",
        "Duration": "200183",
        "HRT": 25491789108180537,
        "Operation": "unset",
        "Timestamp": "1556275429048.532959",
        "TenantClass": 0,
        "Source": "Server.java:1058",
        "ThreadID": 55,
        "ThreadName": "",
        "EventID": "D52A2ADDE36A83B1",
        "BaggageBytes": "[[248 5] [240 0] [0 164 16 146 184 29 230 54 221] [240 1] [0 16 53 208 112 214 3 130 67] [240 3] [0 2]]",
        "ProcessID": 2171
      },
      {
        "Cycles": 0,
        "Agent": "Execution-CPU",
        "ProcessName": "Read",
        "TaskID": "A41092B81DE636DD",
        "ParentEventID": [
          "6FED70CF49C708B4"
        ],
        "Label": "unset",
        "Title": "X-Trace Task",
        "Host": "pinky19.mpi-sws.org",
        "Duration": "15184",
        "HRT": 25491789108263053,
        "Operation": "unset",
        "Timestamp": "1556275429048.592529",
        "TenantClass": 0,
        "Source": "Client.java:1168",
        "ThreadID": 37,
        "ThreadName": "",
        "EventID": "078F1CC749AA0D28",
        "ProcessID": 21035
      },
      {
        "Cycles": 0,
        "Agent": "Execution-CPU",
        "ProcessName": "Read",
        "TaskID": "A41092B81DE636DD",
        "ParentEventID": [
          "1035D070D6038243"
        ],
        "Label": "set",
        "Title": "X-Trace Task",
        "Host": "pinky19.mpi-sws.org",
        "HRT": 25491789108233237,
        "Operation": "set",
        "Timestamp": "1556275429048.562744",
        "TenantClass": 0,
        "Source": "Client.java:302",
        "ThreadID": 37,
        "ThreadName": "",
        "EventID": "6FED70CF49C708B4",
        "ProcessID": 21035
      },
      {
        "Cycles": 0,
        "Agent": "Execution-Sleep",
        "ProcessName": "Read",
        "TaskID": "A41092B81DE636DD",
        "ParentEventID": [
          "650CB75FFB3DBC99"
        ],
        "Label": "waited",
        "Title": "X-Trace Task",
        "Host": "pinky19.mpi-sws.org",
        "Duration": "403432",
        "HRT": 25491789108285006,
        "Operation": "waited",
        "Timestamp": "1556275429048.614502",
        "TenantClass": 0,
        "Source": "Client.java:1537",
        "ThreadID": 1,
        "ThreadName": "",
        "EventID": "1B39E683F08AF4C3",
        "ProcessID": 21035
      },
      {
        "Cycles": 0,
        "Agent": "edu.brown.cs.systems.xtrace.logging.BaggageWrappers",
        "ProcessName": "Read",
        "TaskID": "A41092B81DE636DD",
        "ParentEventID": [
          "078F1CC749AA0D28",
          "1B39E683F08AF4C3"
        ],
        "Label": "Merged current baggage with other baggage",
        "Title": "X-Trace Task",
        "Host": "pinky19.mpi-sws.org",
        "HRT": 25491789108307712,
        "Operation": "join",
        "Timestamp": "1556275429048.637207",
        "TenantClass": 0,
        "Source": "Client.java:1545",
        "ThreadID": 1,
        "ThreadName": "",
        "EventID": "9FF055CED19310B4",
        "ProcessID": 21035
      },
      {
        "Cycles": 0,
        "Agent": "org.apache.hadoop.ipc.ProtobufRpcEngine",
        "ProcessName": "Read",
        "TaskID": "A41092B81DE636DD",
        "ParentEventID": [
          "9FF055CED19310B4"
        ],
        "Label": "org.apache.hadoop.hdfs.protocol.ClientProtocol.getBlockLocations completed",
        "Title": "X-Trace Task",
        "Host": "pinky19.mpi-sws.org",
        "HRT": 25491789108384318,
        "Timestamp": "1556275429048.713623",
        "TenantClass": 0,
        "Source": "ProtobufRpcEngine.java:275",
        "ThreadID": 1,
        "ThreadName": "",
        "EventID": "DB0FD1B19407ADC0",
        "ProcessID": 21035
      },
      {
        "Cycles": 0,
        "Agent": "Execution-CPU",
        "ProcessName": "Data",
        "TaskID": "A41092B81DE636DD",
        "ParentEventID": [
          "81BD894C7E47A4B4"
        ],
        "Label": "set",
        "Title": "X-Trace Task",
        "Host": "pinky20.mpi-sws.org",
        "HRT": 5094993468370141,
        "Operation": "set",
        "Timestamp": "1556275429049.380371",
        "TenantClass": 0,
        "Source": "Receiver.java:117",
        "ThreadID": 5400,
        "ThreadName": "",
        "EventID": "9033BB07CEE9C84B",
        "BaggageBytes": "[[248 5] [240 0] [0 164 16 146 184 29 230 54 221] [240 1] [0 129 189 137 76 126 71 164 180] [240 3] [0 2]]",
        "ProcessID": 13111
      },
      {
        "Cycles": 0,
        "Agent": "edu.brown.cs.systems.xtrace.logging.XTraceInit",
        "ProcessName": "Data",
        "TaskID": "A41092B81DE636DD",
        "ParentEventID": [
          "9033BB07CEE9C84B"
        ],
        "Label": "Thread.setName: DataXceiver for client DFSClient_NONMAPREDUCE_1377588049_1 at /139.19.171.63:32854 [Sending block BP-1633380353-139.19.171.63-1554193446451:blk_1073767998_27174]",
        "Title": "X-Trace Task",
        "Host": "pinky20.mpi-sws.org",
        "HRT": 5094993468475158,
        "Timestamp": "1556275429049.485596",
        "TenantClass": 0,
        "Source": "DataXceiver.java:168",
        "ThreadID": 5400,
        "ThreadName": "",
        "EventID": "BFD88A995ADAF947",
        "BaggageBytes": "[[248 5] [240 0] [0 164 16 146 184 29 230 54 221] [240 1] [0 144 51 187 7 206 233 200 75] [240 3] [0 2]]",
        "ProcessID": 13111
      },
      {
        "Cycles": 0,
        "Agent": "edu.brown.cs.systems.xtrace.logging.BaggageWrappers",
        "ProcessName": "Read",
        "TaskID": "A41092B81DE636DD",
        "ParentEventID": [
          "DB0FD1B19407ADC0"
        ],
        "Label": "Forking current baggage with Baggage.fork()",
        "Title": "X-Trace Task",
        "Host": "pinky19.mpi-sws.org",
        "HRT": 25491789108490904,
        "Operation": "fork",
        "Timestamp": "1556275429048.820312",
        "TenantClass": 0,
        "Source": "DataTransferProtoUtil.java:94",
        "ThreadID": 1,
        "ThreadName": "",
        "EventID": "81BD894C7E47A4B4",
        "ProcessID": 21035
      },
      {
        "Cycles": 0,
        "Agent": "edu.brown.cs.systems.xtrace.logging.BaggageWrappers",
        "ProcessName": "Data",
        "TaskID": "A41092B81DE636DD",
        "ParentEventID": [
          "BFD88A995ADAF947"
        ],
        "Label": "Forking current baggage with Baggage.fork()",
        "Title": "X-Trace Task",
        "Host": "pinky20.mpi-sws.org",
        "HRT": 5094993468722838,
        "Operation": "fork",
        "Timestamp": "1556275429049.733154",
        "TenantClass": 0,
        "Source": "DataXceiver.java:1257",
        "ThreadID": 5400,
        "ThreadName": "",
        "EventID": "E182A61F94FEC221",
        "BaggageBytes": "[[248 5] [240 0] [0 164 16 146 184 29 230 54 221] [240 1] [0 191 216 138 153 90 218 249 71] [240 3] [0 2]]",
        "ProcessID": 13111
      },
      {
        "Cycles": 0,
        "Agent": "edu.brown.cs.systems.xtrace.logging.BaggageWrappers",
        "ProcessName": "Data",
        "TaskID": "A41092B81DE636DD",
        "ParentEventID": [
          "E182A61F94FEC221"
        ],
        "Label": "Forking current baggage with Baggage.fork()",
        "Title": "X-Trace Task",
        "Host": "pinky20.mpi-sws.org",
        "HRT": 5094993468904571,
        "Operation": "fork",
        "Timestamp": "1556275429049.914795",
        "TenantClass": 0,
        "Source": "PacketHeader.java:95",
        "ThreadID": 5400,
        "ThreadName": "",
        "EventID": "CD69B39063AAB1F4",
        "BaggageBytes": "[[248 5] [240 0] [0 164 16 146 184 29 230 54 221] [240 1] [0 225 130 166 31 148 254 194 33] [240 3] [0 2]]",
        "ProcessID": 13111
      },
      {
        "Cycles": 0,
        "Agent": "Execution-Sleep",
        "ProcessName": "Read",
        "TaskID": "A41092B81DE636DD",
        "ParentEventID": [
          "81BD894C7E47A4B4"
        ],
        "Label": "waited",
        "Title": "X-Trace Task",
        "Host": "pinky19.mpi-sws.org",
        "Duration": "739001",
        "HRT": 25491789109341797,
        "Operation": "waited",
        "Timestamp": "1556275429049.671143",
        "TenantClass": 0,
        "Source": "SocketIOWithTimeout.java:335",
        "ThreadID": 1,
        "ThreadName": "",
        "EventID": "5685E38F7D1C18DE",
        "ProcessID": 21035
      },
      {
        "Cycles": 0,
        "Agent": "edu.brown.cs.systems.xtrace.logging.BaggageWrappers",
        "ProcessName": "Read",
        "TaskID": "A41092B81DE636DD",
        "ParentEventID": [
          "E182A61F94FEC221",
          "5685E38F7D1C18DE"
        ],
        "Label": "Merged current baggage with other baggage",
        "Title": "X-Trace Task",
        "Host": "pinky19.mpi-sws.org",
        "HRT": 25491789109456964,
        "Operation": "join",
        "Timestamp": "1556275429049.786377",
        "TenantClass": 0,
        "Source": "RemoteBlockReader2.java:429",
        "ThreadID": 1,
        "ThreadName": "",
        "EventID": "345B05292ED34894",
        "ProcessID": 21035
      },
      {
        "Cycles": 0,
        "Agent": "Execution-Sleep",
        "ProcessName": "Data",
        "TaskID": "A41092B81DE636DD",
        "ParentEventID": [
          "CD69B39063AAB1F4"
        ],
        "Label": "waited",
        "Title": "X-Trace Task",
        "Host": "pinky20.mpi-sws.org",
        "Duration": "11490",
        "HRT": 5094993469061135,
        "Operation": "waited",
        "Timestamp": "1556275429050.071533",
        "TenantClass": 0,
        "Source": "SocketIOWithTimeout.java:335",
        "ThreadID": 5400,
        "ThreadName": "",
        "EventID": "8C8FAE4383943BF1",
        "BaggageBytes": "[[248 5] [240 0] [0 164 16 146 184 29 230 54 221] [240 1] [0 205 105 179 144 99 170 177 244] [240 3] [0 2]]",
        "ProcessID": 13111
      },
      {
        "Cycles": 0,
        "Agent": "Execution-Sleep",
        "ProcessName": "Read",
        "TaskID": "A41092B81DE636DD",
        "ParentEventID": [
          "345B05292ED34894"
        ],
        "Label": "waited",
        "Title": "X-Trace Task",
        "Host": "pinky19.mpi-sws.org",
        "Duration": "111040",
        "HRT": 25491789109680607,
        "Operation": "waited",
        "Timestamp": "1556275429050.010010",
        "TenantClass": 0,
        "Source": "SocketIOWithTimeout.java:335",
        "ThreadID": 1,
        "ThreadName": "",
        "EventID": "2CD0B3F149D1470A",
        "ProcessID": 21035
      },
      {
        "Cycles": 0,
        "Agent": "edu.brown.cs.systems.xtrace.logging.BaggageWrappers",
        "ProcessName": "Data",
        "TaskID": "A41092B81DE636DD",
        "ParentEventID": [
          "8C8FAE4383943BF1"
        ],
        "Label": "Forking current baggage with Baggage.fork()",
        "Title": "X-Trace Task",
        "Host": "pinky20.mpi-sws.org",
        "HRT": 5094993469241482,
        "Operation": "fork",
        "Timestamp": "1556275429050.251709",
        "TenantClass": 0,
        "Source": "PacketHeader.java:95",
        "ThreadID": 5400,
        "ThreadName": "",
        "EventID": "A58F281B8345A84A",
        "BaggageBytes": "[[248 5] [240 0] [0 164 16 146 184 29 230 54 221] [240 1] [0 140 143 174 67 131 148 59 241] [240 3] [0 2]]",
        "ProcessID": 13111
      },
      {
        "Cycles": 0,
        "Agent": "edu.brown.cs.systems.xtrace.logging.BaggageWrappers",
        "ProcessName": "Read",
        "TaskID": "A41092B81DE636DD",
        "ParentEventID": [
          "A58F281B8345A84A",
          "578AF189657ABC10"
        ],
        "Label": "Merged current baggage with other baggage",
        "Title": "X-Trace Task",
        "Host": "pinky19.mpi-sws.org",
        "HRT": 25491789109829779,
        "Operation": "join",
        "Timestamp": "1556275429050.159180",
        "TenantClass": 0,
        "Source": "PacketHeader.java:168",
        "ThreadID": 1,
        "ThreadName": "",
        "EventID": "7101A3133526AD64",
        "ProcessID": 21035
      },
      {
        "Cycles": 0,
        "Agent": "edu.brown.cs.systems.xtrace.logging.BaggageWrappers",
        "ProcessName": "Read",
        "TaskID": "A41092B81DE636DD",
        "ParentEventID": [
          "2CD0B3F149D1470A",
          "CD69B39063AAB1F4"
        ],
        "Label": "Merged current baggage with other baggage",
        "Title": "X-Trace Task",
        "Host": "pinky19.mpi-sws.org",
        "HRT": 25491789109734591,
        "Operation": "join",
        "Timestamp": "1556275429050.063965",
        "TenantClass": 0,
        "Source": "PacketHeader.java:168",
        "ThreadID": 1,
        "ThreadName": "",
        "EventID": "578AF189657ABC10",
        "ProcessID": 21035
      },
      {
        "Cycles": 0,
        "Agent": "edu.brown.cs.systems.xtrace.logging.BaggageWrappers",
        "ProcessName": "Read",
        "TaskID": "A41092B81DE636DD",
        "ParentEventID": [
          "7101A3133526AD64"
        ],
        "Label": "Forking current baggage with Baggage.fork()",
        "Title": "X-Trace Task",
        "Host": "pinky19.mpi-sws.org",
        "HRT": 25491789109842458,
        "Operation": "fork",
        "Timestamp": "1556275429050.171875",
        "TenantClass": 0,
        "Source": "RemoteBlockReader2.java:361",
        "ThreadID": 1,
        "ThreadName": "",
        "EventID": "5309922E7033AEC4",
        "ProcessID": 21035
      },
      {
        "Cycles": 0,
        "Agent": "edu.brown.cs.systems.xtrace.logging.BaggageWrappers",
        "ProcessName": "Data",
        "TaskID": "A41092B81DE636DD",
        "ParentEventID": [
          "5309922E7033AEC4",
          "36FB1C77A80A47F4"
        ],
        "Label": "Merged current baggage with other baggage",
        "Title": "X-Trace Task",
        "Host": "pinky20.mpi-sws.org",
        "HRT": 5094993469657852,
        "Operation": "join",
        "Timestamp": "1556275429050.668213",
        "TenantClass": 0,
        "Source": "DataXceiver.java:574",
        "ThreadID": 5400,
        "ThreadName": "",
        "EventID": "FA8662826E411079",
        "BaggageBytes": "[[248 5] [240 0] [0 164 16 146 184 29 230 54 221] [240 1] [0 54 251 28 119 168 10 71 244] [0 83 9 146 46 112 51 174 196] [240 3] [0 2]]",
        "ProcessID": 13111
      },
      {
        "Cycles": 0,
        "Agent": "Execution-Sleep",
        "ProcessName": "Data",
        "TaskID": "A41092B81DE636DD",
        "ParentEventID": [
          "A58F281B8345A84A"
        ],
        "Label": "waited",
        "Title": "X-Trace Task",
        "Host": "pinky20.mpi-sws.org",
        "Duration": "58244",
        "HRT": 5094993469525279,
        "Operation": "waited",
        "Timestamp": "1556275429050.535645",
        "TenantClass": 0,
        "Source": "SocketIOWithTimeout.java:335",
        "ThreadID": 5400,
        "ThreadName": "",
        "EventID": "36FB1C77A80A47F4",
        "BaggageBytes": "[[248 5] [240 0] [0 164 16 146 184 29 230 54 221] [240 1] [0 165 143 40 27 131 69 168 74] [240 3] [0 2]]",
        "ProcessID": 13111
      },
      {
        "Cycles": 0,
        "Agent": "Execution-CPU",
        "ProcessName": "Data",
        "TaskID": "A41092B81DE636DD",
        "ParentEventID": [
          "FA8662826E411079"
        ],
        "Label": "unset",
        "Title": "X-Trace Task",
        "Host": "pinky20.mpi-sws.org",
        "Duration": "1286242",
        "HRT": 5094993469735139,
        "Operation": "unset",
        "Timestamp": "1556275429050.745361",
        "TenantClass": 0,
        "Source": "DataXceiver.java:261",
        "ThreadID": 5400,
        "ThreadName": "",
        "EventID": "9DA44E6492A0BA62",
        "BaggageBytes": "[[248 5] [240 0] [0 164 16 146 184 29 230 54 221] [240 1] [0 250 134 98 130 110 65 16 121] [240 3] [0 2]]",
        "ProcessID": 13111
      },
      {
        "Cycles": 0,
        "Agent": "edu.brown.cs.systems.retro.benchmarks.hdfs_client.Reader",
        "ProcessName": "Read",
        "TaskID": "A41092B81DE636DD",
        "ParentEventID": [
          "0"
        ],
        "Label": "Reading file",
        "Title": "X-Trace Task",
        "Host": "pinky19.mpi-sws.org",
        "HRT": 25491789107486205,
        "Timestamp": "1556275429047.815674",
        "TenantClass": 0,
        "ThreadID": 1,
        "ThreadName": "",
        "EventID": "A7E5D27865AB4402",
        "ProcessID": 21035,
        "Tag": [
          "reader_1kb",
          "Read Size: 1024"
        ]
      }
    ]
  }
]