[
  {
    "id": "A3E9380FCA2A049B",
    "reports": [
      {
        "Cycles": 0,
        "Agent": "edu.brown.cs.systems.retro.benchmarks.hdfs_client.Reader",
        "ProcessName": "Read",
        "TaskID": "A3E9380FCA2A049B",
        "ParentEventID": [
          "34A81639C957B386"
        ],
        "Label": "Reading file",
        "Title": "X-Trace Task",
        "Host": "pinky19.mpi-sws.org",
        "HRT": 26962635458119004,
        "Timestamp": "1557746275398.339355",
        "TenantClass": 0,
        "ThreadID": 1,
        "ThreadName": "",
        "EventID": "5F2EAEE8AAB207BF",
        "ProcessID": 36430
      },
      {
        "Cycles": 0,
        "Agent": "org.apache.hadoop.ipc.ProtobufRpcEngine",
        "ProcessName": "Read",
        "TaskID": "A3E9380FCA2A049B",
        "ParentEventID": [
          "5F2EAEE8AAB207BF"
        ],
        "Label": "Invoking org.apache.hadoop.hdfs.protocol.ClientProtocol.getBlockLocations",
        "Title": "X-Trace Task",
        "Host": "pinky19.mpi-sws.org",
        "HRT": 26962635458151062,
        "Timestamp": "1557746275398.371338",
        "TenantClass": 0,
        "Source": "ProtobufRpcEngine.java:228",
        "ThreadID": 1,
        "ThreadName": "",
        "EventID": "E27E44078C0A5E60",
        "ProcessID": 36430
      },
      {
        "Cycles": 0,
        "Agent": "Execution-CPU",
        "ProcessName": "Read",
        "TaskID": "A3E9380FCA2A049B",
        "ParentEventID": [
          "E27E44078C0A5E60"
        ],
        "Label": "unset",
        "Title": "X-Trace Task",
        "Host": "pinky19.mpi-sws.org",
        "Duration": "21906556",
        "HRT": 26962635458166491,
        "Operation": "unset",
        "Timestamp": "1557746275398.386719",
        "TenantClass": 0,
        "Source": "Client.java:1027",
        "ThreadID": 1,
        "ThreadName": "",
        "EventID": "29F9BD28313CEF06",
        "ProcessID": 36430
      },
      {
        "Cycles": 0,
        "Agent": "Execution-CPU",
        "ProcessName": "Read",
        "TaskID": "A3E9380FCA2A049B",
        "ParentEventID": [
          "29F9BD28313CEF06"
        ],
        "Label": "set",
        "Title": "X-Trace Task",
        "Host": "pinky19.mpi-sws.org",
        "HRT": 26962635458208213,
        "Operation": "set",
        "Timestamp": "1557746275398.428467",
        "TenantClass": 0,
        "Source": "Client.java:1032",
        "ThreadID": 41,
        "ThreadName": "",
        "EventID": "1128F78F850C1291",
        "ProcessID": 36430
      },
      {
        "Cycles": 0,
        "Agent": "edu.brown.cs.systems.xtrace.logging.BaggageWrappers",
        "ProcessName": "Read",
        "TaskID": "A3E9380FCA2A049B",
        "ParentEventID": [
          "1128F78F850C1291"
        ],
        "Label": "Forking current baggage with Baggage.fork()",
        "Title": "X-Trace Task",
        "Host": "pinky19.mpi-sws.org",
        "HRT": 26962635458227506,
        "Operation": "fork",
        "Timestamp": "1557746275398.447754",
        "TenantClass": 0,
        "Source": "Client.java:1043",
        "ThreadID": 41,
        "ThreadName": "",
        "EventID": "C3C1294819AFEDA1",
        "ProcessID": 36430
      },
      {
        "Cycles": 0,
        "Agent": "Execution-CPU",
        "ProcessName": "Read",
        "TaskID": "A3E9380FCA2A049B",
        "ParentEventID": [
          "C3C1294819AFEDA1"
        ],
        "Label": "unset",
        "Title": "X-Trace Task",
        "Host": "pinky19.mpi-sws.org",
        "Duration": "80788",
        "HRT": 26962635458308309,
        "Operation": "unset",
        "Timestamp": "1557746275398.528564",
        "TenantClass": 0,
        "Source": "Client.java:1062",
        "ThreadID": 41,
        "ThreadName": "",
        "EventID": "EB9FEFE60FA83BF6",
        "ProcessID": 36430
      },
      {
        "Cycles": 0,
        "Agent": "Execution-CPU",
        "ProcessName": "Name",
        "TaskID": "A3E9380FCA2A049B",
        "ParentEventID": [
          "C3C1294819AFEDA1"
        ],
        "Label": "set",
        "Title": "X-Trace Task",
        "Host": "pinky19.mpi-sws.org",
        "HRT": 26962635458383200,
        "Operation": "set",
        "Timestamp": "1557746275398.604736",
        "TenantClass": 0,
        "Source": "Server.java:1840",
        "ThreadID": 48,
        "ThreadName": "",
        "EventID": "D1728FFFDAF76928",
        "BaggageBytes": "[[248 5] [240 0] [0 163 233 56 15 202 42 4 155] [240 1] [0 195 193 41 72 25 175 237 161] [240 3] [0 2]]",
        "ProcessID": 2171
      },
      {
        "Cycles": 0,
        "Agent": "edu.brown.cs.systems.xtrace.logging.BaggageWrappers",
        "ProcessName": "Name",
        "TaskID": "A3E9380FCA2A049B",
        "ParentEventID": [
          "D1728FFFDAF76928"
        ],
        "Label": "Forking current baggage with Baggage.fork()",
        "Title": "X-Trace Task",
        "Host": "pinky19.mpi-sws.org",
        "HRT": 26962635458413068,
        "Operation": "fork",
        "Timestamp": "1557746275398.634521",
        "TenantClass": 0,
        "Source": "Server.java:550",
        "ThreadID": 48,
        "ThreadName": "",
        "EventID": "B53D60C5530F4E36",
        "BaggageBytes": "[[248 5] [240 0] [0 163 233 56 15 202 42 4 155] [240 1] [0 209 114 143 255 218 247 105 40] [240 3] [0 2]]",
        "ProcessID": 2171
      },
      {
        "Cycles": 0,
        "Agent": "Execution-CPU",
        "ProcessName": "Name",
        "TaskID": "A3E9380FCA2A049B",
        "ParentEventID": [
          "B53D60C5530F4E36"
        ],
        "Label": "unset",
        "Title": "X-Trace Task",
        "Host": "pinky19.mpi-sws.org",
        "Duration": "28246",
        "HRT": 26962635458437639,
        "Operation": "unset",
        "Timestamp": "1557746275398.659180",
        "TenantClass": 0,
        "Source": "Server.java:1828",
        "ThreadID": 48,
        "ThreadName": "",
        "EventID": "483EB9B6E5F774E5",
        "BaggageBytes": "[[248 5] [240 0] [0 163 233 56 15 202 42 4 155] [240 1] [0 181 61 96 197 83 15 78 54] [240 3] [0 2]]",
        "ProcessID": 2171
      },
      {
        "Cycles": 0,
        "Agent": "Execution-CPU",
        "ProcessName": "Read",
        "TaskID": "A3E9380FCA2A049B",
        "ParentEventID": [
          "EB9FEFE60FA83BF6"
        ],
        "Label": "set",
        "Title": "X-Trace Task",
        "Host": "pinky19.mpi-sws.org",
        "HRT": 26962635458332909,
        "Operation": "set",
        "Timestamp": "1557746275398.553223",
        "TenantClass": 0,
        "Source": "Client.java:1104",
        "ThreadID": 1,
        "ThreadName": "",
        "EventID": "3FE4852E0B566212",
        "ProcessID": 36430
      },
      {
        "Cycles": 0,
        "Agent": "Execution-CPU",
        "ProcessName": "Name",
        "TaskID": "A3E9380FCA2A049B",
        "ParentEventID": [
          "B53D60C5530F4E36"
        ],
        "Label": "set",
        "Title": "X-Trace Task",
        "Host": "pinky19.mpi-sws.org",
        "HRT": 26962635458444769,
        "Operation": "set",
        "Timestamp": "1557746275398.666260",
        "TenantClass": 0,
        "Source": "Server.java:2071",
        "ThreadID": 57,
        "ThreadName": "",
        "EventID": "2B652A5899E20FCE",
        "BaggageBytes": "[[248 5] [240 0] [0 163 233 56 15 202 42 4 155] [240 1] [0 181 61 96 197 83 15 78 54] [240 3] [0 2]]",
        "ProcessID": 2171
      },
      {
        "Cycles": 0,
        "Agent": "org.apache.hadoop.hdfs.server.namenode.FSNamesystem.audit",
        "ProcessName": "Name",
        "TaskID": "A3E9380FCA2A049B",
        "ParentEventID": [
          "A078917512BD0A0B"
        ],
        "Label": "allowed=true\tugi=plascas (auth:SIMPLE)\tip=/139.19.171.63\tcmd=open\tsrc=/ds/wxeZpEysZ80BMt3R\tdst=null\tperm=null\tproto=rpc",
        "Title": "X-Trace Task",
        "Host": "pinky19.mpi-sws.org",
        "HRT": 26962635458522940,
        "Timestamp": "1557746275398.744385",
        "TenantClass": 0,
        "Source": "FSNamesystem.java:8313",
        "ThreadID": 57,
        "ThreadName": "",
        "EventID": "78F4B4C0FD657FED",
        "BaggageBytes": "[[248 5] [240 0] [0 163 233 56 15 202 42 4 155] [240 1] [0 160 120 145 117 18 189 10 11] [240 3] [0 2]]",
        "ProcessID": 2171
      },
      {
        "Cycles": 0,
        "Agent": "org.apache.hadoop.ipc.Server",
        "ProcessName": "Name",
        "TaskID": "A3E9380FCA2A049B",
        "ParentEventID": [
          "2B652A5899E20FCE"
        ],
        "Label": "getBlockLocations in org.apache.hadoop.hdfs.protocol.ClientProtocol",
        "Title": "X-Trace Task",
        "Host": "pinky19.mpi-sws.org",
        "HRT": 26962635458477825,
        "Timestamp": "1557746275398.699219",
        "TenantClass": 0,
        "Source": "ProtobufRpcEngine.java:601",
        "ThreadID": 57,
        "ThreadName": "",
        "EventID": "A078917512BD0A0B",
        "BaggageBytes": "[[248 5] [240 0] [0 163 233 56 15 202 42 4 155] [240 1] [0 43 101 42 88 153 226 15 206] [240 3] [0 2]]",
        "ProcessID": 2171
      },
      {
        "Cycles": 0,
        "Agent": "edu.brown.cs.systems.xtrace.logging.BaggageWrappers",
        "ProcessName": "Name",
        "TaskID": "A3E9380FCA2A049B",
        "ParentEventID": [
          "78F4B4C0FD657FED"
        ],
        "Label": "Forking current baggage with Baggage.fork()",
        "Title": "X-Trace Task",
        "Host": "pinky19.mpi-sws.org",
        "HRT": 26962635458564820,
        "Operation": "fork",
        "Timestamp": "1557746275398.786377",
        "TenantClass": 0,
        "Source": "Server.java:2398",
        "ThreadID": 57,
        "ThreadName": "",
        "EventID": "AFF9AD9511A76958",
        "BaggageBytes": "[[248 5] [240 0] [0 163 233 56 15 202 42 4 155] [240 1] [0 120 244 180 192 253 101 127 237] [240 3] [0 2]]",
        "ProcessID": 2171
      },
      {
        "Cycles": 0,
        "Agent": "Execution-CPU",
        "ProcessName": "Read",
        "TaskID": "A3E9380FCA2A049B",
        "ParentEventID": [
          "AFF9AD9511A76958"
        ],
        "Label": "set",
        "Title": "X-Trace Task",
        "Host": "pinky19.mpi-sws.org",
        "HRT": 26962635458722971,
        "Operation": "set",
        "Timestamp": "1557746275398.943359",
        "TenantClass": 0,
        "Source": "Client.java:302",
        "ThreadID": 37,
        "ThreadName": "",
        "EventID": "67C076C4BCDB2CD7",
        "ProcessID": 36430
      },
      {
        "Cycles": 0,
        "Agent": "Execution-CPU",
        "ProcessName": "Name",
        "TaskID": "A3E9380FCA2A049B",
        "ParentEventID": [
          "AFF9AD9511A76958"
        ],
        "Label": "unset",
        "Title": "X-Trace Task",
        "Host": "pinky19.mpi-sws.org",
        "Duration": "206082",
        "HRT": 26962635458673251,
        "Operation": "unset",
        "Timestamp": "1557746275398.894775",
        "TenantClass": 0,
        "Source": "Server.java:1058",
        "ThreadID": 57,
        "ThreadName": "",
        "EventID": "87E3B6E189CE12CE",
        "BaggageBytes": "[[248 5] [240 0] [0 163 233 56 15 202 42 4 155] [240 1] [0 175 249 173 149 17 167 105 88] [240 3] [0 2]]",
        "ProcessID": 2171
      },
      {
        "Cycles": 0,
        "Agent": "Execution-CPU",
        "ProcessName": "Read",
        "TaskID": "A3E9380FCA2A049B",
        "ParentEventID": [
          "67C076C4BCDB2CD7"
        ],
        "Label": "unset",
        "Title": "X-Trace Task",
        "Host": "pinky19.mpi-sws.org",
        "Duration": "5348",
        "HRT": 26962635458740120,
        "Operation": "unset",
        "Timestamp": "1557746275398.960449",
        "TenantClass": 0,
        "Source": "Client.java:1168",
        "ThreadID": 37,
        "ThreadName": "",
        "EventID": "4A8BF37CB8E252EF",
        "ProcessID": 36430
      },
      {
        "Cycles": 0,
        "Agent": "edu.brown.cs.systems.xtrace.logging.BaggageWrappers",
        "ProcessName": "Read",
        "TaskID": "A3E9380FCA2A049B",
        "ParentEventID": [
          "4A8BF37CB8E252EF",
          "534A980B11E4F248"
        ],
        "Label": "Merged current baggage with other baggage",
        "Title": "X-Trace Task",
        "Host": "pinky19.mpi-sws.org",
        "HRT": 26962635458773339,
        "Operation": "join",
        "Timestamp": "1557746275398.993652",
        "TenantClass": 0,
        "Source": "Client.java:1545",
        "ThreadID": 1,
        "ThreadName": "",
        "EventID": "BC2E6E27BC7173E6",
        "ProcessID": 36430
      },
      {
        "Cycles": 0,
        "Agent": "org.apache.hadoop.ipc.ProtobufRpcEngine",
        "ProcessName": "Read",
        "TaskID": "A3E9380FCA2A049B",
        "ParentEventID": [
          "BC2E6E27BC7173E6"
        ],
        "Label": "org.apache.hadoop.hdfs.protocol.ClientProtocol.getBlockLocations completed",
        "Title": "X-Trace Task",
        "Host": "pinky19.mpi-sws.org",
        "HRT": 26962635458813034,
        "Timestamp": "1557746275399.033447",
        "TenantClass": 0,
        "Source": "ProtobufRpcEngine.java:275",
        "ThreadID": 1,
        "ThreadName": "",
        "EventID": "9C35DC66AA0A8AD2",
        "ProcessID": 36430
      },
      {
        "Cycles": 0,
        "Agent": "edu.brown.cs.systems.xtrace.logging.BaggageWrappers",
        "ProcessName": "Read",
        "TaskID": "A3E9380FCA2A049B",
        "ParentEventID": [
          "9C35DC66AA0A8AD2"
        ],
        "Label": "Forking current baggage with Baggage.fork()",
        "Title": "X-Trace Task",
        "Host": "pinky19.mpi-sws.org",
        "HRT": 26962635458868482,
        "Operation": "fork",
        "Timestamp": "1557746275399.088867",
        "TenantClass": 0,
        "Source": "DataTransferProtoUtil.java:94",
        "ThreadID": 1,
        "ThreadName": "",
        "EventID": "271D6247C96EF700",
        "ProcessID": 36430
      },
      {
        "Cycles": 0,
        "Agent": "Execution-Sleep",
        "ProcessName": "Read",
        "TaskID": "A3E9380FCA2A049B",
        "ParentEventID": [
          "3FE4852E0B566212"
        ],
        "Label": "waited",
        "Title": "X-Trace Task",
        "Host": "pinky19.mpi-sws.org",
        "Duration": "415740",
        "HRT": 26962635458757892,
        "Operation": "waited",
        "Timestamp": "1557746275398.978271",
        "TenantClass": 0,
        "Source": "Client.java:1537",
        "ThreadID": 1,
        "ThreadName": "",
        "EventID": "534A980B11E4F248",
        "ProcessID": 36430
      },
      {
        "Cycles": 0,
        "Agent": "Execution-CPU",
        "ProcessName": "Data",
        "TaskID": "A3E9380FCA2A049B",
        "ParentEventID": [
          "271D6247C96EF700"
        ],
        "Label": "set",
        "Title": "X-Trace Task",
        "Host": "pinky23.mpi-sws.org",
        "HRT": 12364131433182181,
        "Operation": "set",
        "Timestamp": "1557746275399.426270",
        "TenantClass": 0,
        "Source": "Receiver.java:117",
        "ThreadID": 15254,
        "ThreadName": "",
        "EventID": "2705F0018309524D",
        "BaggageBytes": "[[248 5] [240 0] [0 163 233 56 15 202 42 4 155] [240 1] [0 39 29 98 71 201 110 247 0] [240 3] [0 2]]",
        "ProcessID": 24612
      },
      {
        "Cycles": 0,
        "Agent": "edu.brown.cs.systems.xtrace.logging.BaggageWrappers",
        "ProcessName": "Data",
        "TaskID": "A3E9380FCA2A049B",
        "ParentEventID": [
          "9FBC4D99DFFC0BD3"
        ],
        "Label": "Forking current baggage with Baggage.fork()",
        "Title": "X-Trace Task",
        "Host": "pinky23.mpi-sws.org",
        "HRT": 12364131433518102,
        "Operation": "fork",
        "Timestamp": "1557746275399.762207",
        "TenantClass": 0,
        "Source": "DataXceiver.java:1257",
        "ThreadID": 15254,
        "ThreadName": "",
        "EventID": "4E9100F8F4A581BB",
        "BaggageBytes": "[[248 5] [240 0] [0 163 233 56 15 202 42 4 155] [240 1] [0 159 188 77 153 223 252 11 211] [240 3] [0 2]]",
        "ProcessID": 24612
      },
      {
        "Cycles": 0,
        "Agent": "edu.brown.cs.systems.xtrace.logging.XTraceInit",
        "ProcessName": "Data",
        "TaskID": "A3E9380FCA2A049B",
        "ParentEventID": [
          "2705F0018309524D"
        ],
        "Label": "Thread.setName: DataXceiver for client DFSClient_NONMAPREDUCE_778905418_1 at /139.19.171.63:36804 [Sending block BP-1633380353-139.19.171.63-1554193446451:blk_1073757211_16387]",
        "Title": "X-Trace Task",
        "Host": "pinky23.mpi-sws.org",
        "HRT": 12364131433280498,
        "Timestamp": "1557746275399.524658",
        "TenantClass": 0,
        "Source": "DataXceiver.java:168",
        "ThreadID": 15254,
        "ThreadName": "",
        "EventID": "9FBC4D99DFFC0BD3",
        "BaggageBytes": "[[248 5] [240 0] [0 163 233 56 15 202 42 4 155] [240 1] [0 39 5 240 1 131 9 82 77] [240 3] [0 2]]",
        "ProcessID": 24612
      },
      {
        "Cycles": 0,
        "Agent": "Execution-Sleep",
        "ProcessName": "Read",
        "TaskID": "A3E9380FCA2A049B",
        "ParentEventID": [
          "271D6247C96EF700"
        ],
        "Label": "waited",
        "Title": "X-Trace Task",
        "Host": "pinky19.mpi-sws.org",
        "Duration": "789230",
        "HRT": 26962635459736595,
        "Operation": "waited",
        "Timestamp": "1557746275399.956787",
        "TenantClass": 0,
        "Source": "SocketIOWithTimeout.java:335",
        "ThreadID": 1,
        "ThreadName": "",
        "EventID": "528A7B4FC7E16353",
        "ProcessID": 36430
      },
      {
        "Cycles": 0,
        "Agent": "edu.brown.cs.systems.xtrace.logging.BaggageWrappers",
        "ProcessName": "Data",
        "TaskID": "A3E9380FCA2A049B",
        "ParentEventID": [
          "4E9100F8F4A581BB"
        ],
        "Label": "Forking current baggage with Baggage.fork()",
        "Title": "X-Trace Task",
        "Host": "pinky23.mpi-sws.org",
        "HRT": 12364131433729268,
        "Operation": "fork",
        "Timestamp": "1557746275399.973389",
        "TenantClass": 0,
        "Source": "PacketHeader.java:95",
        "ThreadID": 15254,
        "ThreadName": "",
        "EventID": "D229DCCA293E09E6",
        "BaggageBytes": "[[248 5] [240 0] [0 163 233 56 15 202 42 4 155] [240 1] [0 78 145 0 248 244 165 129 187] [240 3] [0 2]]",
        "ProcessID": 24612
      },
      {
        "Cycles": 0,
        "Agent": "edu.brown.cs.systems.xtrace.logging.BaggageWrappers",
        "ProcessName": "Read",
        "TaskID": "A3E9380FCA2A049B",
        "ParentEventID": [
          "528A7B4FC7E16353",
          "4E9100F8F4A581BB"
        ],
        "Label": "Merged current baggage with other baggage",
        "Title": "X-Trace Task",
        "Host": "pinky19.mpi-sws.org",
        "HRT": 26962635459806637,
        "Operation": "join",
        "Timestamp": "1557746275400.026855",
        "TenantClass": 0,
        "Source": "RemoteBlockReader2.java:429",
        "ThreadID": 1,
        "ThreadName": "",
        "EventID": "610DB52E5CEAAE29",
        "ProcessID": 36430
      },
      {
        "Cycles": 0,
        "Agent": "Execution-Sleep",
        "ProcessName": "Read",
        "TaskID": "A3E9380FCA2A049B",
        "ParentEventID": [
          "610DB52E5CEAAE29"
        ],
        "Label": "waited",
        "Title": "X-Trace Task",
        "Host": "pinky19.mpi-sws.org",
        "Duration": "29350",
        "HRT": 26962635459903984,
        "Operation": "waited",
        "Timestamp": "1557746275400.124268",
        "TenantClass": 0,
        "Source": "SocketIOWithTimeout.java:335",
        "ThreadID": 1,
        "ThreadName": "",
        "EventID": "6347383871DB3E22",
        "ProcessID": 36430
      },
      {
        "Cycles": 0,
        "Agent": "Execution-Sleep",
        "ProcessName": "Data",
        "TaskID": "A3E9380FCA2A049B",
        "ParentEventID": [
          "D229DCCA293E09E6"
        ],
        "Label": "waited",
        "Title": "X-Trace Task",
        "Host": "pinky23.mpi-sws.org",
        "Duration": "11544",
        "HRT": 12364131433907579,
        "Operation": "waited",
        "Timestamp": "1557746275400.151611",
        "TenantClass": 0,
        "Source": "SocketIOWithTimeout.java:335",
        "ThreadID": 15254,
        "ThreadName": "",
        "EventID": "681EF0BA0126E06C",
        "BaggageBytes": "[[248 5] [240 0] [0 163 233 56 15 202 42 4 155] [240 1] [0 210 41 220 202 41 62 9 230] [240 3] [0 2]]",
        "ProcessID": 24612
      },
      {
        "Cycles": 0,
        "Agent": "edu.brown.cs.systems.xtrace.logging.BaggageWrappers",
        "ProcessName": "Data",
        "TaskID": "A3E9380FCA2A049B",
        "ParentEventID": [
          "681EF0BA0126E06C"
        ],
        "Label": "Forking current baggage with Baggage.fork()",
        "Title": "X-Trace Task",
        "Host": "pinky23.mpi-sws.org",
        "HRT": 12364131434103539,
        "Operation": "fork",
        "Timestamp": "1557746275400.347656",
        "TenantClass": 0,
        "Source": "PacketHeader.java:95",
        "ThreadID": 15254,
        "ThreadName": "",
        "EventID": "85AED438CBF13EA3",
        "BaggageBytes": "[[248 5] [240 0] [0 163 233 56 15 202 42 4 155] [240 1] [0 104 30 240 186 1 38 224 108] [240 3] [0 2]]",
        "ProcessID": 24612
      },
      {
        "Cycles": 0,
        "Agent": "edu.brown.cs.systems.xtrace.logging.BaggageWrappers",
        "ProcessName": "Read",
        "TaskID": "A3E9380FCA2A049B",
        "ParentEventID": [
          "D229DCCA293E09E6",
          "A98386BBE78240EF"
        ],
        "Label": "Merged current baggage with other baggage",
        "Title": "X-Trace Task",
        "Host": "pinky19.mpi-sws.org",
        "HRT": 26962635460298485,
        "Operation": "join",
        "Timestamp": "1557746275400.518799",
        "TenantClass": 0,
        "Source": "PacketHeader.java:168",
        "ThreadID": 1,
        "ThreadName": "",
        "EventID": "7FAB5F00B886E876",
        "ProcessID": 36430
      },
      {
        "Cycles": 0,
        "Agent": "Execution-Sleep",
        "ProcessName": "Read",
        "TaskID": "A3E9380FCA2A049B",
        "ParentEventID": [
          "6347383871DB3E22"
        ],
        "Label": "waited",
        "Title": "X-Trace Task",
        "Host": "pinky19.mpi-sws.org",
        "Duration": "251257",
        "HRT": 26962635460241571,
        "Operation": "waited",
        "Timestamp": "1557746275400.461914",
        "TenantClass": 0,
        "Source": "SocketIOWithTimeout.java:335",
        "ThreadID": 1,
        "ThreadName": "",
        "EventID": "A98386BBE78240EF",
        "ProcessID": 36430
      },
      {
        "Cycles": 0,
        "Agent": "edu.brown.cs.systems.xtrace.logging.BaggageWrappers",
        "ProcessName": "Read",
        "TaskID": "A3E9380FCA2A049B",
        "ParentEventID": [
          "85AED438CBF13EA3",
          "7FAB5F00B886E876"
        ],
        "Label": "Merged current baggage with other baggage",
        "Title": "X-Trace Task",
        "Host": "pinky19.mpi-sws.org",
        "HRT": 26962635460346841,
        "Operation": "join",
        "Timestamp": "1557746275400.567139",
        "TenantClass": 0,
        "Source": "PacketHeader.java:168",
        "ThreadID": 1,
        "ThreadName": "",
        "EventID": "A68744F07A817A8A",
        "ProcessID": 36430
      },
      {
        "Cycles": 0,
        "Agent": "Execution-Sleep",
        "ProcessName": "Data",
        "TaskID": "A3E9380FCA2A049B",
        "ParentEventID": [
          "85AED438CBF13EA3"
        ],
        "Label": "waited",
        "Title": "X-Trace Task",
        "Host": "pinky23.mpi-sws.org",
        "Duration": "75017",
        "HRT": 12364131434421086,
        "Operation": "waited",
        "Timestamp": "1557746275400.665283",
        "TenantClass": 0,
        "Source": "SocketIOWithTimeout.java:335",
        "ThreadID": 15254,
        "ThreadName": "",
        "EventID": "1A78F4F7FED93DF2",
        "BaggageBytes": "[[248 5] [240 0] [0 163 233 56 15 202 42 4 155] [240 1] [0 133 174 212 56 203 241 62 163] [240 3] [0 2]]",
        "ProcessID": 24612
      },
      {
        "Cycles": 0,
        "Agent": "edu.brown.cs.systems.xtrace.logging.BaggageWrappers",
        "ProcessName": "Read",
        "TaskID": "A3E9380FCA2A049B",
        "ParentEventID": [
          "A68744F07A817A8A"
        ],
        "Label": "Forking current baggage with Baggage.fork()",
        "Title": "X-Trace Task",
        "Host": "pinky19.mpi-sws.org",
        "HRT": 26962635460355752,
        "Operation": "fork",
        "Timestamp": "1557746275400.576172",
        "TenantClass": 0,
        "Source": "RemoteBlockReader2.java:361",
        "ThreadID": 1,
        "ThreadName": "",
        "EventID": "3DBF93AF0D5C6207",
        "ProcessID": 36430
      },
      {
        "Cycles": 0,
        "Agent": "edu.brown.cs.systems.xtrace.logging.BaggageWrappers",
        "ProcessName": "Data",
        "TaskID": "A3E9380FCA2A049B",
        "ParentEventID": [
          "1A78F4F7FED93DF2",
          "3DBF93AF0D5C6207"
        ],
        "Label": "Merged current baggage with other baggage",
        "Title": "X-Trace Task",
        "Host": "pinky23.mpi-sws.org",
        "HRT": 12364131434551893,
        "Operation": "join",
        "Timestamp": "1557746275400.795898",
        "TenantClass": 0,
        "Source": "DataXceiver.java:574",
        "ThreadID": 15254,
        "ThreadName": "",
        "EventID": "4534A6451995006D",
        "BaggageBytes": "[[248 5] [240 0] [0 163 233 56 15 202 42 4 155] [240 1] [0 26 120 244 247 254 217 61 242] [0 61 191 147 175 13 92 98 7] [240 3] [0 2]]",
        "ProcessID": 24612
      },
      {
        "Cycles": 0,
        "Agent": "Execution-CPU",
        "ProcessName": "Data",
        "TaskID": "A3E9380FCA2A049B",
        "ParentEventID": [
          "4534A6451995006D"
        ],
        "Label": "unset",
        "Title": "X-Trace Task",
        "Host": "pinky23.mpi-sws.org",
        "Duration": "1355145",
        "HRT": 12364131434607676,
        "Operation": "unset",
        "Timestamp": "1557746275400.851807",
        "TenantClass": 0,
        "Source": "DataXceiver.java:261",
        "ThreadID": 15254,
        "ThreadName": "",
        "EventID": "30FC16B44C4E7C8A",
        "BaggageBytes": "[[248 5] [240 0] [0 163 233 56 15 202 42 4 155] [240 1] [0 69 52 166 69 25 149 0 109] [240 3] [0 2]]",
        "ProcessID": 24612
      },
      {
        "Cycles": 0,
        "Agent": "edu.brown.cs.systems.retro.benchmarks.hdfs_client.Reader",
        "ProcessName": "Read",
        "TaskID": "A3E9380FCA2A049B",
        "ParentEventID": [
          "0"
        ],
        "Label": "Reading file",
        "Title": "X-Trace Task",
        "Host": "pinky19.mpi-sws.org",
        "HRT": 26962635458103583,
        "Timestamp": "1557746275398.323975",
        "TenantClass": 0,
        "ThreadID": 1,
        "ThreadName": "",
        "EventID": "34A81639C957B386",
        "ProcessID": 36430,
        "Tag": [
          "reader_10kb",
          "Read Size: 10240"
        ]
      }
    ]
  }
]