[
  {
    "id": "5717B2AADADB6539",
    "reports": [
      {
        "Cycles": 0,
        "Agent": "edu.brown.cs.systems.retro.benchmarks.hdfs_client.Reader",
        "ProcessName": "Read",
        "TaskID": "5717B2AADADB6539",
        "ParentEventID": [
          "0"
        ],
        "Label": "Reading file",
        "Title": "X-Trace Task",
        "Host": "pinky19.mpi-sws.org",
        "HRT": 26966548825887526,
        "Timestamp": "1557750188765.810059",
        "TenantClass": 0,
        "ThreadID": 1,
        "ThreadName": "",
        "EventID": "F90EA802A5ABDE2C",
        "ProcessID": 2801,
        "Tag": [
          "reader_100kb",
          "Read Size: 102400"
        ]
      },
      {
        "Cycles": 0,
        "Agent": "edu.brown.cs.systems.retro.benchmarks.hdfs_client.Reader",
        "ProcessName": "Read",
        "TaskID": "5717B2AADADB6539",
        "ParentEventID": [
          "F90EA802A5ABDE2C"
        ],
        "Label": "Reading file",
        "Title": "X-Trace Task",
        "Host": "pinky19.mpi-sws.org",
        "HRT": 26966548825903975,
        "Timestamp": "1557750188765.826660",
        "TenantClass": 0,
        "ThreadID": 1,
        "ThreadName": "",
        "EventID": "937A5DAF2D7A31DF",
        "ProcessID": 2801
      },
      {
        "Cycles": 0,
        "Agent": "Execution-CPU",
        "ProcessName": "Read",
        "TaskID": "5717B2AADADB6539",
        "ParentEventID": [
          "2A6C3AC71FF94B0E"
        ],
        "Label": "unset",
        "Title": "X-Trace Task",
        "Host": "pinky19.mpi-sws.org",
        "Duration": "46537613",
        "HRT": 26966548825995088,
        "Operation": "unset",
        "Timestamp": "1557750188765.917725",
        "TenantClass": 0,
        "Source": "Client.java:1027",
        "ThreadID": 1,
        "ThreadName": "",
        "EventID": "AC4D01C89CEC7327",
        "ProcessID": 2801
      },
      {
        "Cycles": 0,
        "Agent": "Execution-CPU",
        "ProcessName": "Read",
        "TaskID": "5717B2AADADB6539",
        "ParentEventID": [
          "AC4D01C89CEC7327"
        ],
        "Label": "set",
        "Title": "X-Trace Task",
        "Host": "pinky19.mpi-sws.org",
        "HRT": 26966548826026123,
        "Operation": "set",
        "Timestamp": "1557750188765.948730",
        "TenantClass": 0,
        "Source": "Client.java:1032",
        "ThreadID": 41,
        "ThreadName": "",
        "EventID": "A0A93B6FFF3056DA",
        "ProcessID": 2801
      },
      {
        "Cycles": 0,
        "Agent": "edu.brown.cs.systems.xtrace.logging.BaggageWrappers",
        "ProcessName": "Read",
        "TaskID": "5717B2AADADB6539",
        "ParentEventID": [
          "A0A93B6FFF3056DA"
        ],
        "Label": "Forking current baggage with Baggage.fork()",
        "Title": "X-Trace Task",
        "Host": "pinky19.mpi-sws.org",
        "HRT": 26966548826044573,
        "Operation": "fork",
        "Timestamp": "1557750188765.967041",
        "TenantClass": 0,
        "Source": "Client.java:1043",
        "ThreadID": 41,
        "ThreadName": "",
        "EventID": "7231BE467DE747FA",
        "ProcessID": 2801
      },
      {
        "Cycles": 0,
        "Agent": "Execution-CPU",
        "ProcessName": "Read",
        "TaskID": "5717B2AADADB6539",
        "ParentEventID": [
          "A09AE4CE3B5F4C8D"
        ],
        "Label": "set",
        "Title": "X-Trace Task",
        "Host": "pinky19.mpi-sws.org",
        "HRT": 26966548826160133,
        "Operation": "set",
        "Timestamp": "1557750188766.082764",
        "TenantClass": 0,
        "Source": "Client.java:1104",
        "ThreadID": 1,
        "ThreadName": "",
        "EventID": "CD035A6B8910C402",
        "ProcessID": 2801
      },
      {
        "Cycles": 0,
        "Agent": "Execution-CPU",
        "ProcessName": "Read",
        "TaskID": "5717B2AADADB6539",
        "ParentEventID": [
          "7231BE467DE747FA"
        ],
        "Label": "unset",
        "Title": "X-Trace Task",
        "Host": "pinky19.mpi-sws.org",
        "Duration": "85315",
        "HRT": 26966548826128906,
        "Operation": "unset",
        "Timestamp": "1557750188766.051514",
        "TenantClass": 0,
        "Source": "Client.java:1062",
        "ThreadID": 41,
        "ThreadName": "",
        "EventID": "A09AE4CE3B5F4C8D",
        "ProcessID": 2801
      },
      {
        "Cycles": 0,
        "Agent": "org.apache.hadoop.ipc.ProtobufRpcEngine",
        "ProcessName": "Read",
        "TaskID": "5717B2AADADB6539",
        "ParentEventID": [
          "937A5DAF2D7A31DF"
        ],
        "Label": "Invoking org.apache.hadoop.hdfs.protocol.ClientProtocol.getBlockLocations",
        "Title": "X-Trace Task",
        "Host": "pinky19.mpi-sws.org",
        "HRT": 26966548825960096,
        "Timestamp": "1557750188765.882568",
        "TenantClass": 0,
        "Source": "ProtobufRpcEngine.java:228",
        "ThreadID": 1,
        "ThreadName": "",
        "EventID": "2A6C3AC71FF94B0E",
        "ProcessID": 2801
      },
      {
        "Cycles": 0,
        "Agent": "Execution-CPU",
        "ProcessName": "Name",
        "TaskID": "5717B2AADADB6539",
        "ParentEventID": [
          "7231BE467DE747FA"
        ],
        "Label": "set",
        "Title": "X-Trace Task",
        "Host": "pinky19.mpi-sws.org",
        "HRT": 26966548826184373,
        "Operation": "set",
        "Timestamp": "1557750188766.135010",
        "TenantClass": 0,
        "Source": "Server.java:1840",
        "ThreadID": 48,
        "ThreadName": "",
        "EventID": "8A66A2D85C342013",
        "BaggageBytes": "[[248 5] [240 0] [0 87 23 178 170 218 219 101 57] [240 1] [0 114 49 190 70 125 231 71 250] [240 3] [0 2]]",
        "ProcessID": 2171
      },
      {
        "Cycles": 0,
        "Agent": "Execution-CPU",
        "ProcessName": "Name",
        "TaskID": "5717B2AADADB6539",
        "ParentEventID": [
          "6E0A57F67E1810F6"
        ],
        "Label": "set",
        "Title": "X-Trace Task",
        "Host": "pinky19.mpi-sws.org",
        "HRT": 26966548826245193,
        "Operation": "set",
        "Timestamp": "1557750188766.195801",
        "TenantClass": 0,
        "Source": "Server.java:2071",
        "ThreadID": 63,
        "ThreadName": "",
        "EventID": "6B5E09D8212D9A96",
        "BaggageBytes": "[[248 5] [240 0] [0 87 23 178 170 218 219 101 57] [240 1] [0 110 10 87 246 126 24 16 246] [240 3] [0 2]]",
        "ProcessID": 2171
      },
      {
        "Cycles": 0,
        "Agent": "Execution-CPU",
        "ProcessName": "Name",
        "TaskID": "5717B2AADADB6539",
        "ParentEventID": [
          "6E0A57F67E1810F6"
        ],
        "Label": "unset",
        "Title": "X-Trace Task",
        "Host": "pinky19.mpi-sws.org",
        "Duration": "24461",
        "HRT": 26966548826234889,
        "Operation": "unset",
        "Timestamp": "1557750188766.185547",
        "TenantClass": 0,
        "Source": "Server.java:1828",
        "ThreadID": 48,
        "ThreadName": "",
        "EventID": "9D74537E820C0720",
        "BaggageBytes": "[[248 5] [240 0] [0 87 23 178 170 218 219 101 57] [240 1] [0 110 10 87 246 126 24 16 246] [240 3] [0 2]]",
        "ProcessID": 2171
      },
      {
        "Cycles": 0,
        "Agent": "org.apache.hadoop.ipc.Server",
        "ProcessName": "Name",
        "TaskID": "5717B2AADADB6539",
        "ParentEventID": [
          "6B5E09D8212D9A96"
        ],
        "Label": "getBlockLocations in org.apache.hadoop.hdfs.protocol.ClientProtocol",
        "Title": "X-Trace Task",
        "Host": "pinky19.mpi-sws.org",
        "HRT": 26966548826294308,
        "Timestamp": "1557750188766.244873",
        "TenantClass": 0,
        "Source": "ProtobufRpcEngine.java:601",
        "ThreadID": 63,
        "ThreadName": "",
        "EventID": "27038DFFAD131105",
        "BaggageBytes": "[[248 5] [240 0] [0 87 23 178 170 218 219 101 57] [240 1] [0 107 94 9 216 33 45 154 150] [240 3] [0 2]]",
        "ProcessID": 2171
      },
      {
        "Cycles": 0,
        "Agent": "edu.brown.cs.systems.xtrace.logging.BaggageWrappers",
        "ProcessName": "Name",
        "TaskID": "5717B2AADADB6539",
        "ParentEventID": [
          "168BA23B6791DB93"
        ],
        "Label": "Forking current baggage with Baggage.fork()",
        "Title": "X-Trace Task",
        "Host": "pinky19.mpi-sws.org",
        "HRT": 26966548826398524,
        "Operation": "fork",
        "Timestamp": "1557750188766.349121",
        "TenantClass": 0,
        "Source": "Server.java:2398",
        "ThreadID": 63,
        "ThreadName": "",
        "EventID": "3A98F9D16B9EA5CC",
        "BaggageBytes": "[[248 5] [240 0] [0 87 23 178 170 218 219 101 57] [240 1] [0 22 139 162 59 103 145 219 147] [240 3] [0 2]]",
        "ProcessID": 2171
      },
      {
        "Cycles": 0,
        "Agent": "edu.brown.cs.systems.xtrace.logging.BaggageWrappers",
        "ProcessName": "Name",
        "TaskID": "5717B2AADADB6539",
        "ParentEventID": [
          "8A66A2D85C342013"
        ],
        "Label": "Forking current baggage with Baggage.fork()",
        "Title": "X-Trace Task",
        "Host": "pinky19.mpi-sws.org",
        "HRT": 26966548826214204,
        "Operation": "fork",
        "Timestamp": "1557750188766.164795",
        "TenantClass": 0,
        "Source": "Server.java:550",
        "ThreadID": 48,
        "ThreadName": "",
        "EventID": "6E0A57F67E1810F6",
        "BaggageBytes": "[[248 5] [240 0] [0 87 23 178 170 218 219 101 57] [240 1] [0 138 102 162 216 92 52 32 19] [240 3] [0 2]]",
        "ProcessID": 2171
      },
      {
        "Cycles": 0,
        "Agent": "Execution-CPU",
        "ProcessName": "Name",
        "TaskID": "5717B2AADADB6539",
        "ParentEventID": [
          "3A98F9D16B9EA5CC"
        ],
        "Label": "unset",
        "Title": "X-Trace Task",
        "Host": "pinky19.mpi-sws.org",
        "Duration": "246341",
        "HRT": 26966548826524115,
        "Operation": "unset",
        "Timestamp": "1557750188766.474854",
        "TenantClass": 0,
        "Source": "Server.java:1058",
        "ThreadID": 63,
        "ThreadName": "",
        "EventID": "D00BEB61A23464D7",
        "BaggageBytes": "[[248 5] [240 0] [0 87 23 178 170 218 219 101 57] [240 1] [0 58 152 249 209 107 158 165 204] [240 3] [0 2]]",
        "ProcessID": 2171
      },
      {
        "Cycles": 0,
        "Agent": "org.apache.hadoop.hdfs.server.namenode.FSNamesystem.audit",
        "ProcessName": "Name",
        "TaskID": "5717B2AADADB6539",
        "ParentEventID": [
          "27038DFFAD131105"
        ],
        "Label": "allowed=true\tugi=plascas (auth:SIMPLE)\tip=/139.19.171.63\tcmd=open\tsrc=/ds/Dvs0XBSnFVVMIBH7\tdst=null\tperm=null\tproto=rpc",
        "Title": "X-Trace Task",
        "Host": "pinky19.mpi-sws.org",
        "HRT": 26966548826348211,
        "Timestamp": "1557750188766.298828",
        "TenantClass": 0,
        "Source": "FSNamesystem.java:8313",
        "ThreadID": 63,
        "ThreadName": "",
        "EventID": "168BA23B6791DB93",
        "BaggageBytes": "[[248 5] [240 0] [0 87 23 178 170 218 219 101 57] [240 1] [0 39 3 141 255 173 19 17 5] [240 3] [0 2]]",
        "ProcessID": 2171
      },
      {
        "Cycles": 0,
        "Agent": "Execution-Sleep",
        "ProcessName": "Read",
        "TaskID": "5717B2AADADB6539",
        "ParentEventID": [
          "CD035A6B8910C402"
        ],
        "Label": "waited",
        "Title": "X-Trace Task",
        "Host": "pinky19.mpi-sws.org",
        "Duration": "481897",
        "HRT": 26966548826656414,
        "Operation": "waited",
        "Timestamp": "1557750188766.579102",
        "TenantClass": 0,
        "Source": "Client.java:1537",
        "ThreadID": 1,
        "ThreadName": "",
        "EventID": "2876F61A63314157",
        "ProcessID": 2801
      },
      {
        "Cycles": 0,
        "Agent": "edu.brown.cs.systems.xtrace.logging.BaggageWrappers",
        "ProcessName": "Read",
        "TaskID": "5717B2AADADB6539",
        "ParentEventID": [
          "2876F61A63314157",
          "052A1F282AD9F280"
        ],
        "Label": "Merged current baggage with other baggage",
        "Title": "X-Trace Task",
        "Host": "pinky19.mpi-sws.org",
        "HRT": 26966548826685968,
        "Operation": "join",
        "Timestamp": "1557750188766.608643",
        "TenantClass": 0,
        "Source": "Client.java:1545",
        "ThreadID": 1,
        "ThreadName": "",
        "EventID": "C33226E7C075B25C",
        "ProcessID": 2801
      },
      {
        "Cycles": 0,
        "Agent": "org.apache.hadoop.ipc.ProtobufRpcEngine",
        "ProcessName": "Read",
        "TaskID": "5717B2AADADB6539",
        "ParentEventID": [
          "C33226E7C075B25C"
        ],
        "Label": "org.apache.hadoop.hdfs.protocol.ClientProtocol.getBlockLocations completed",
        "Title": "X-Trace Task",
        "Host": "pinky19.mpi-sws.org",
        "HRT": 26966548826746492,
        "Timestamp": "1557750188766.669189",
        "TenantClass": 0,
        "Source": "ProtobufRpcEngine.java:275",
        "ThreadID": 1,
        "ThreadName": "",
        "EventID": "AE72B1E2FCABE446",
        "ProcessID": 2801
      },
      {
        "Cycles": 0,
        "Agent": "Execution-Sleep",
        "ProcessName": "Read",
        "TaskID": "5717B2AADADB6539",
        "ParentEventID": [
          "AE72B1E2FCABE446"
        ],
        "Label": "waited",
        "Title": "X-Trace Task",
        "Host": "pinky19.mpi-sws.org",
        "Duration": "164576",
        "HRT": 26966548827048767,
        "Operation": "waited",
        "Timestamp": "1557750188766.971436",
        "TenantClass": 0,
        "Source": "SocketIOWithTimeout.java:335",
        "ThreadID": 1,
        "ThreadName": "",
        "EventID": "879C47CA5F58BF7D",
        "ProcessID": 2801
      },
      {
        "Cycles": 0,
        "Agent": "edu.brown.cs.systems.xtrace.logging.BaggageWrappers",
        "ProcessName": "Read",
        "TaskID": "5717B2AADADB6539",
        "ParentEventID": [
          "879C47CA5F58BF7D"
        ],
        "Label": "Forking current baggage with Baggage.fork()",
        "Title": "X-Trace Task",
        "Host": "pinky19.mpi-sws.org",
        "HRT": 26966548827116204,
        "Operation": "fork",
        "Timestamp": "1557750188767.038818",
        "TenantClass": 0,
        "Source": "DataTransferProtoUtil.java:94",
        "ThreadID": 1,
        "ThreadName": "",
        "EventID": "1EE0DB5EEF87E072",
        "ProcessID": 2801
      },
      {
        "Cycles": 0,
        "Agent": "Execution-CPU",
        "ProcessName": "Data",
        "TaskID": "5717B2AADADB6539",
        "ParentEventID": [
          "1EE0DB5EEF87E072"
        ],
        "Label": "set",
        "Title": "X-Trace Task",
        "Host": "pinky23.mpi-sws.org",
        "HRT": 12368044801131852,
        "Operation": "set",
        "Timestamp": "1557750188767.431885",
        "TenantClass": 0,
        "Source": "Receiver.java:117",
        "ThreadID": 15332,
        "ThreadName": "",
        "EventID": "45CB86835B1D000D",
        "BaggageBytes": "[[248 5] [240 0] [0 87 23 178 170 218 219 101 57] [240 1] [0 30 224 219 94 239 135 224 114] [240 3] [0 2]]",
        "ProcessID": 24612
      },
      {
        "Cycles": 0,
        "Agent": "edu.brown.cs.systems.xtrace.logging.XTraceInit",
        "ProcessName": "Data",
        "TaskID": "5717B2AADADB6539",
        "ParentEventID": [
          "45CB86835B1D000D"
        ],
        "Label": "Thread.setName: DataXceiver for client DFSClient_NONMAPREDUCE_310321604_1 at /139.19.171.63:37824 [Sending block BP-1633380353-139.19.171.63-1554193446451:blk_1073766622_25798]",
        "Title": "X-Trace Task",
        "Host": "pinky23.mpi-sws.org",
        "HRT": 12368044801235909,
        "Timestamp": "1557750188767.536133",
        "TenantClass": 0,
        "Source": "DataXceiver.java:168",
        "ThreadID": 15332,
        "ThreadName": "",
        "EventID": "B6C85F8C6406AFB1",
        "BaggageBytes": "[[248 5] [240 0] [0 87 23 178 170 218 219 101 57] [240 1] [0 69 203 134 131 91 29 0 13] [240 3] [0 2]]",
        "ProcessID": 24612
      },
      {
        "Cycles": 0,
        "Agent": "Execution-CPU",
        "ProcessName": "Read",
        "TaskID": "5717B2AADADB6539",
        "ParentEventID": [
          "3A98F9D16B9EA5CC"
        ],
        "Label": "set",
        "Title": "X-Trace Task",
        "Host": "pinky19.mpi-sws.org",
        "HRT": 26966548826594629,
        "Operation": "set",
        "Timestamp": "1557750188766.517334",
        "TenantClass": 0,
        "Source": "Client.java:302",
        "ThreadID": 40,
        "ThreadName": "",
        "EventID": "F03B4779DD7066E4",
        "ProcessID": 2801
      },
      {
        "Cycles": 0,
        "Agent": "edu.brown.cs.systems.xtrace.logging.BaggageWrappers",
        "ProcessName": "Data",
        "TaskID": "5717B2AADADB6539",
        "ParentEventID": [
          "B6C85F8C6406AFB1"
        ],
        "Label": "Forking current baggage with Baggage.fork()",
        "Title": "X-Trace Task",
        "Host": "pinky23.mpi-sws.org",
        "HRT": 12368044801456439,
        "Operation": "fork",
        "Timestamp": "1557750188767.756592",
        "TenantClass": 0,
        "Source": "DataXceiver.java:1257",
        "ThreadID": 15332,
        "ThreadName": "",
        "EventID": "1B936671B61F9D9C",
        "BaggageBytes": "[[248 5] [240 0] [0 87 23 178 170 218 219 101 57] [240 1] [0 182 200 95 140 100 6 175 177] [240 3] [0 2]]",
        "ProcessID": 24612
      },
      {
        "Cycles": 0,
        "Agent": "edu.brown.cs.systems.xtrace.logging.BaggageWrappers",
        "ProcessName": "Data",
        "TaskID": "5717B2AADADB6539",
        "ParentEventID": [
          "1B936671B61F9D9C"
        ],
        "Label": "Forking current baggage with Baggage.fork()",
        "Title": "X-Trace Task",
        "Host": "pinky23.mpi-sws.org",
        "HRT": 12368044801620026,
        "Operation": "fork",
        "Timestamp": "1557750188767.920166",
        "TenantClass": 0,
        "Source": "PacketHeader.java:95",
        "ThreadID": 15332,
        "ThreadName": "",
        "EventID": "E9C1FE67A03D3A56",
        "BaggageBytes": "[[248 5] [240 0] [0 87 23 178 170 218 219 101 57] [240 1] [0 27 147 102 113 182 31 157 156] [240 3] [0 2]]",
        "ProcessID": 24612
      },
      {
        "Cycles": 0,
        "Agent": "edu.brown.cs.systems.xtrace.logging.BaggageWrappers",
        "ProcessName": "Read",
        "TaskID": "5717B2AADADB6539",
        "ParentEventID": [
          "1B936671B61F9D9C",
          "20D0FBF63EA07D5B"
        ],
        "Label": "Merged current baggage with other baggage",
        "Title": "X-Trace Task",
        "Host": "pinky19.mpi-sws.org",
        "HRT": 26966548828173897,
        "Operation": "join",
        "Timestamp": "1557750188768.096436",
        "TenantClass": 0,
        "Source": "RemoteBlockReader2.java:429",
        "ThreadID": 1,
        "ThreadName": "",
        "EventID": "A136AB6FDD9D2DAE",
        "ProcessID": 2801
      },
      {
        "Cycles": 0,
        "Agent": "Execution-CPU",
        "ProcessName": "Read",
        "TaskID": "5717B2AADADB6539",
        "ParentEventID": [
          "F03B4779DD7066E4"
        ],
        "Label": "unset",
        "Title": "X-Trace Task",
        "Host": "pinky19.mpi-sws.org",
        "Duration": "18028",
        "HRT": 26966548826631891,
        "Operation": "unset",
        "Timestamp": "1557750188766.554443",
        "TenantClass": 0,
        "Source": "Client.java:1168",
        "ThreadID": 40,
        "ThreadName": "",
        "EventID": "052A1F282AD9F280",
        "ProcessID": 2801
      },
      {
        "Cycles": 0,
        "Agent": "Execution-Sleep",
        "ProcessName": "Read",
        "TaskID": "5717B2AADADB6539",
        "ParentEventID": [
          "1EE0DB5EEF87E072"
        ],
        "Label": "waited",
        "Title": "X-Trace Task",
        "Host": "pinky19.mpi-sws.org",
        "Duration": "870922",
        "HRT": 26966548828080329,
        "Operation": "waited",
        "Timestamp": "1557750188768.002930",
        "TenantClass": 0,
        "Source": "SocketIOWithTimeout.java:335",
        "ThreadID": 1,
        "ThreadName": "",
        "EventID": "20D0FBF63EA07D5B",
        "ProcessID": 2801
      },
      {
        "Cycles": 0,
        "Agent": "edu.brown.cs.systems.xtrace.logging.BaggageWrappers",
        "ProcessName": "Data",
        "TaskID": "5717B2AADADB6539",
        "ParentEventID": [
          "259EB7C931AA2DAD"
        ],
        "Label": "Forking current baggage with Baggage.fork()",
        "Title": "X-Trace Task",
        "Host": "pinky23.mpi-sws.org",
        "HRT": 12368044801959070,
        "Operation": "fork",
        "Timestamp": "1557750188768.259277",
        "TenantClass": 0,
        "Source": "PacketHeader.java:95",
        "ThreadID": 15332,
        "ThreadName": "",
        "EventID": "0FE8C81EE070FED7",
        "BaggageBytes": "[[248 5] [240 0] [0 87 23 178 170 218 219 101 57] [240 1] [0 37 158 183 201 49 170 45 173] [240 3] [0 2]]",
        "ProcessID": 24612
      },
      {
        "Cycles": 0,
        "Agent": "Execution-Sleep",
        "ProcessName": "Read",
        "TaskID": "5717B2AADADB6539",
        "ParentEventID": [
          "A136AB6FDD9D2DAE"
        ],
        "Label": "waited",
        "Title": "X-Trace Task",
        "Host": "pinky19.mpi-sws.org",
        "Duration": "362912",
        "HRT": 26966548828642956,
        "Operation": "waited",
        "Timestamp": "1557750188768.565430",
        "TenantClass": 0,
        "Source": "SocketIOWithTimeout.java:335",
        "ThreadID": 1,
        "ThreadName": "",
        "EventID": "11AEEC47798356D1",
        "ProcessID": 2801
      },
      {
        "Cycles": 0,
        "Agent": "Execution-Sleep",
        "ProcessName": "Read",
        "TaskID": "5717B2AADADB6539",
        "ParentEventID": [
          "11AEEC47798356D1"
        ],
        "Label": "waited",
        "Title": "X-Trace Task",
        "Host": "pinky19.mpi-sws.org",
        "Duration": "214372",
        "HRT": 26966548828926008,
        "Operation": "waited",
        "Timestamp": "1557750188768.848633",
        "TenantClass": 0,
        "Source": "SocketIOWithTimeout.java:335",
        "ThreadID": 1,
        "ThreadName": "",
        "EventID": "D70D7893E849C0D5",
        "ProcessID": 2801
      },
      {
        "Cycles": 0,
        "Agent": "Execution-Sleep",
        "ProcessName": "Data",
        "TaskID": "5717B2AADADB6539",
        "ParentEventID": [
          "E9C1FE67A03D3A56"
        ],
        "Label": "waited",
        "Title": "X-Trace Task",
        "Host": "pinky23.mpi-sws.org",
        "Duration": "15273",
        "HRT": 12368044801774237,
        "Operation": "waited",
        "Timestamp": "1557750188768.074463",
        "TenantClass": 0,
        "Source": "SocketIOWithTimeout.java:335",
        "ThreadID": 15332,
        "ThreadName": "",
        "EventID": "259EB7C931AA2DAD",
        "BaggageBytes": "[[248 5] [240 0] [0 87 23 178 170 218 219 101 57] [240 1] [0 233 193 254 103 160 61 58 86] [240 3] [0 2]]",
        "ProcessID": 24612
      },
      {
        "Cycles": 0,
        "Agent": "Execution-Sleep",
        "ProcessName": "Read",
        "TaskID": "5717B2AADADB6539",
        "ParentEventID": [
          "D70D7893E849C0D5"
        ],
        "Label": "waited",
        "Title": "X-Trace Task",
        "Host": "pinky19.mpi-sws.org",
        "Duration": "135467",
        "HRT": 26966548829147008,
        "Operation": "waited",
        "Timestamp": "1557750188769.069580",
        "TenantClass": 0,
        "Source": "SocketIOWithTimeout.java:335",
        "ThreadID": 1,
        "ThreadName": "",
        "EventID": "56A5012FB0C6C737",
        "ProcessID": 2801
      },
      {
        "Cycles": 0,
        "Agent": "edu.brown.cs.systems.xtrace.logging.BaggageWrappers",
        "ProcessName": "Read",
        "TaskID": "5717B2AADADB6539",
        "ParentEventID": [
          "56A5012FB0C6C737",
          "E9C1FE67A03D3A56"
        ],
        "Label": "Merged current baggage with other baggage",
        "Title": "X-Trace Task",
        "Host": "pinky19.mpi-sws.org",
        "HRT": 26966548829213656,
        "Operation": "join",
        "Timestamp": "1557750188769.136230",
        "TenantClass": 0,
        "Source": "PacketHeader.java:168",
        "ThreadID": 1,
        "ThreadName": "",
        "EventID": "5DFC8C68FDB60CFE",
        "ProcessID": 2801
      },
      {
        "Cycles": 0,
        "Agent": "edu.brown.cs.systems.xtrace.logging.BaggageWrappers",
        "ProcessName": "Read",
        "TaskID": "5717B2AADADB6539",
        "ParentEventID": [
          "0BE21DDD6C6460B0"
        ],
        "Label": "Forking current baggage with Baggage.fork()",
        "Title": "X-Trace Task",
        "Host": "pinky19.mpi-sws.org",
        "HRT": 26966548829339667,
        "Operation": "fork",
        "Timestamp": "1557750188769.262207",
        "TenantClass": 0,
        "Source": "RemoteBlockReader2.java:361",
        "ThreadID": 1,
        "ThreadName": "",
        "EventID": "53FC4D72C743E3EE",
        "ProcessID": 2801
      },
      {
        "Cycles": 0,
        "Agent": "edu.brown.cs.systems.xtrace.logging.BaggageWrappers",
        "ProcessName": "Read",
        "TaskID": "5717B2AADADB6539",
        "ParentEventID": [
          "0FE8C81EE070FED7",
          "5DFC8C68FDB60CFE"
        ],
        "Label": "Merged current baggage with other baggage",
        "Title": "X-Trace Task",
        "Host": "pinky19.mpi-sws.org",
        "HRT": 26966548829326068,
        "Operation": "join",
        "Timestamp": "1557750188769.248535",
        "TenantClass": 0,
        "Source": "PacketHeader.java:168",
        "ThreadID": 1,
        "ThreadName": "",
        "EventID": "0BE21DDD6C6460B0",
        "ProcessID": 2801
      },
      {
        "Cycles": 0,
        "Agent": "edu.brown.cs.systems.xtrace.logging.BaggageWrappers",
        "ProcessName": "Data",
        "TaskID": "5717B2AADADB6539",
        "ParentEventID": [
          "DAA87CB1D0F87EF0",
          "53FC4D72C743E3EE"
        ],
        "Label": "Merged current baggage with other baggage",
        "Title": "X-Trace Task",
        "Host": "pinky23.mpi-sws.org",
        "HRT": 12368044803289176,
        "Operation": "join",
        "Timestamp": "1557750188769.589355",
        "TenantClass": 0,
        "Source": "DataXceiver.java:574",
        "ThreadID": 15332,
        "ThreadName": "",
        "EventID": "5EC7C9481DA03A51",
        "BaggageBytes": "[[248 5] [240 0] [0 87 23 178 170 218 219 101 57] [240 1] [0 218 168 124 177 208 248 126 240] [0 83 252 77 114 199 67 227 238] [240 3] [0 2]]",
        "ProcessID": 24612
      },
      {
        "Cycles": 0,
        "Agent": "Execution-CPU",
        "ProcessName": "Data",
        "TaskID": "5717B2AADADB6539",
        "ParentEventID": [
          "5EC7C9481DA03A51"
        ],
        "Label": "unset",
        "Title": "X-Trace Task",
        "Host": "pinky23.mpi-sws.org",
        "Duration": "2152224",
        "HRT": 12368044803356519,
        "Operation": "unset",
        "Timestamp": "1557750188769.656738",
        "TenantClass": 0,
        "Source": "DataXceiver.java:261",
        "ThreadID": 15332,
        "ThreadName": "",
        "EventID": "D19450FC15845C88",
        "BaggageBytes": "[[248 5] [240 0] [0 87 23 178 170 218 219 101 57] [240 1] [0 94 199 201 72 29 160 58 81] [240 3] [0 2]]",
        "ProcessID": 24612
      },
      {
        "Cycles": 0,
        "Agent": "Execution-CPU",
        "ProcessName": "Data",
        "TaskID": "5717B2AADADB6539",
        "ParentEventID": [
          "1322E997F74863BF"
        ],
        "Label": "set",
        "Title": "X-Trace Task",
        "Host": "pinky23.mpi-sws.org",
        "HRT": 12368044803432839,
        "Operation": "set",
        "Timestamp": "1557750188769.732910",
        "TenantClass": 0,
        "Source": "Receiver.java:117",
        "ThreadID": 15332,
        "ThreadName": "",
        "EventID": "ED297D5A66CA0C06",
        "BaggageBytes": "[[248 5] [240 0] [0 87 23 178 170 218 219 101 57] [240 1] [0 19 34 233 151 247 72 99 191] [240 3] [0 2]]",
        "ProcessID": 24612
      },
      {
        "Cycles": 0,
        "Agent": "Execution-Sleep",
        "ProcessName": "Data",
        "TaskID": "5717B2AADADB6539",
        "ParentEventID": [
          "0FE8C81EE070FED7"
        ],
        "Label": "waited",
        "Title": "X-Trace Task",
        "Host": "pinky23.mpi-sws.org",
        "Duration": "865014",
        "HRT": 12368044803003339,
        "Operation": "waited",
        "Timestamp": "1557750188769.303467",
        "TenantClass": 0,
        "Source": "SocketIOWithTimeout.java:335",
        "ThreadID": 15332,
        "ThreadName": "",
        "EventID": "DAA87CB1D0F87EF0",
        "BaggageBytes": "[[248 5] [240 0] [0 87 23 178 170 218 219 101 57] [240 1] [0 15 232 200 30 224 112 254 215] [240 3] [0 2]]",
        "ProcessID": 24612
      },
      {
        "Cycles": 0,
        "Agent": "edu.brown.cs.systems.xtrace.logging.XTraceInit",
        "ProcessName": "Data",
        "TaskID": "5717B2AADADB6539",
        "ParentEventID": [
          "ED297D5A66CA0C06"
        ],
        "Label": "Thread.setName: DataXceiver for client DFSClient_NONMAPREDUCE_310321604_1 at /139.19.171.63:37824 [Sending block BP-1633380353-139.19.171.63-1554193446451:blk_1073766622_25798]",
        "Title": "X-Trace Task",
        "Host": "pinky23.mpi-sws.org",
        "HRT": 12368044803526706,
        "Timestamp": "1557750188769.826904",
        "TenantClass": 0,
        "Source": "DataXceiver.java:168",
        "ThreadID": 15332,
        "ThreadName": "",
        "EventID": "56F6F81EBD719DBA",
        "BaggageBytes": "[[248 5] [240 0] [0 87 23 178 170 218 219 101 57] [240 1] [0 237 41 125 90 102 202 12 6] [240 3] [0 2]]",
        "ProcessID": 24612
      },
      {
        "Cycles": 0,
        "Agent": "Execution-Sleep",
        "ProcessName": "Read",
        "TaskID": "5717B2AADADB6539",
        "ParentEventID": [
          "1322E997F74863BF"
        ],
        "Label": "waited",
        "Title": "X-Trace Task",
        "Host": "pinky19.mpi-sws.org",
        "Duration": "866868",
        "HRT": 26966548830396129,
        "Operation": "waited",
        "Timestamp": "1557750188770.318604",
        "TenantClass": 0,
        "Source": "SocketIOWithTimeout.java:335",
        "ThreadID": 1,
        "ThreadName": "",
        "EventID": "382BC11D242669CE",
        "ProcessID": 2801
      },
      {
        "Cycles": 0,
        "Agent": "edu.brown.cs.systems.xtrace.logging.BaggageWrappers",
        "ProcessName": "Read",
        "TaskID": "5717B2AADADB6539",
        "ParentEventID": [
          "53FC4D72C743E3EE"
        ],
        "Label": "Forking current baggage with Baggage.fork()",
        "Title": "X-Trace Task",
        "Host": "pinky19.mpi-sws.org",
        "HRT": 26966548829442790,
        "Operation": "fork",
        "Timestamp": "1557750188769.365479",
        "TenantClass": 0,
        "Source": "DataTransferProtoUtil.java:94",
        "ThreadID": 1,
        "ThreadName": "",
        "EventID": "1322E997F74863BF",
        "ProcessID": 2801
      },
      {
        "Cycles": 0,
        "Agent": "edu.brown.cs.systems.xtrace.logging.BaggageWrappers",
        "ProcessName": "Data",
        "TaskID": "5717B2AADADB6539",
        "ParentEventID": [
          "6F26364DA75DEE2D"
        ],
        "Label": "Forking current baggage with Baggage.fork()",
        "Title": "X-Trace Task",
        "Host": "pinky23.mpi-sws.org",
        "HRT": 12368044803946807,
        "Operation": "fork",
        "Timestamp": "1557750188770.246826",
        "TenantClass": 0,
        "Source": "PacketHeader.java:95",
        "ThreadID": 15332,
        "ThreadName": "",
        "EventID": "4C8B477CE17EFCE1",
        "BaggageBytes": "[[248 5] [240 0] [0 87 23 178 170 218 219 101 57] [240 1] [0 111 38 54 77 167 93 238 45] [240 3] [0 2]]",
        "ProcessID": 24612
      },
      {
        "Cycles": 0,
        "Agent": "Execution-Sleep",
        "ProcessName": "Read",
        "TaskID": "5717B2AADADB6539",
        "ParentEventID": [
          "8D484B6D8AA9BC20"
        ],
        "Label": "waited",
        "Title": "X-Trace Task",
        "Host": "pinky19.mpi-sws.org",
        "Duration": "4243",
        "HRT": 26966548830552755,
        "Operation": "waited",
        "Timestamp": "1557750188770.475342",
        "TenantClass": 0,
        "Source": "SocketIOWithTimeout.java:335",
        "ThreadID": 1,
        "ThreadName": "",
        "EventID": "57DDA9FD3FD9101D",
        "ProcessID": 2801
      },
      {
        "Cycles": 0,
        "Agent": "edu.brown.cs.systems.xtrace.logging.BaggageWrappers",
        "ProcessName": "Read",
        "TaskID": "5717B2AADADB6539",
        "ParentEventID": [
          "382BC11D242669CE",
          "6F26364DA75DEE2D"
        ],
        "Label": "Merged current baggage with other baggage",
        "Title": "X-Trace Task",
        "Host": "pinky19.mpi-sws.org",
        "HRT": 26966548830471077,
        "Operation": "join",
        "Timestamp": "1557750188770.393555",
        "TenantClass": 0,
        "Source": "RemoteBlockReader2.java:429",
        "ThreadID": 1,
        "ThreadName": "",
        "EventID": "8D484B6D8AA9BC20",
        "ProcessID": 2801
      },
      {
        "Cycles": 0,
        "Agent": "edu.brown.cs.systems.xtrace.logging.BaggageWrappers",
        "ProcessName": "Data",
        "TaskID": "5717B2AADADB6539",
        "ParentEventID": [
          "56F6F81EBD719DBA"
        ],
        "Label": "Forking current baggage with Baggage.fork()",
        "Title": "X-Trace Task",
        "Host": "pinky23.mpi-sws.org",
        "HRT": 12368044803766173,
        "Operation": "fork",
        "Timestamp": "1557750188770.066406",
        "TenantClass": 0,
        "Source": "DataXceiver.java:1257",
        "ThreadID": 15332,
        "ThreadName": "",
        "EventID": "6F26364DA75DEE2D",
        "BaggageBytes": "[[248 5] [240 0] [0 87 23 178 170 218 219 101 57] [240 1] [0 86 246 248 30 189 113 157 186] [240 3] [0 2]]",
        "ProcessID": 24612
      },
      {
        "Cycles": 0,
        "Agent": "Execution-Sleep",
        "ProcessName": "Data",
        "TaskID": "5717B2AADADB6539",
        "ParentEventID": [
          "4C8B477CE17EFCE1"
        ],
        "Label": "waited",
        "Title": "X-Trace Task",
        "Host": "pinky23.mpi-sws.org",
        "Duration": "30877",
        "HRT": 12368044804117484,
        "Operation": "waited",
        "Timestamp": "1557750188770.417480",
        "TenantClass": 0,
        "Source": "SocketIOWithTimeout.java:335",
        "ThreadID": 15332,
        "ThreadName": "",
        "EventID": "17BEDA8182E96803",
        "BaggageBytes": "[[248 5] [240 0] [0 87 23 178 170 218 219 101 57] [240 1] [0 76 139 71 124 225 126 252 225] [240 3] [0 2]]",
        "ProcessID": 24612
      },
      {
        "Cycles": 0,
        "Agent": "Execution-Sleep",
        "ProcessName": "Read",
        "TaskID": "5717B2AADADB6539",
        "ParentEventID": [
          "57DDA9FD3FD9101D"
        ],
        "Label": "waited",
        "Title": "X-Trace Task",
        "Host": "pinky19.mpi-sws.org",
        "Duration": "390515",
        "HRT": 26966548831012242,
        "Operation": "waited",
        "Timestamp": "1557750188770.934814",
        "TenantClass": 0,
        "Source": "SocketIOWithTimeout.java:335",
        "ThreadID": 1,
        "ThreadName": "",
        "EventID": "41677C11D62476D5",
        "ProcessID": 2801
      },
      {
        "Cycles": 0,
        "Agent": "edu.brown.cs.systems.xtrace.logging.BaggageWrappers",
        "ProcessName": "Data",
        "TaskID": "5717B2AADADB6539",
        "ParentEventID": [
          "17BEDA8182E96803"
        ],
        "Label": "Forking current baggage with Baggage.fork()",
        "Title": "X-Trace Task",
        "Host": "pinky23.mpi-sws.org",
        "HRT": 12368044804336874,
        "Operation": "fork",
        "Timestamp": "1557750188770.636963",
        "TenantClass": 0,
        "Source": "PacketHeader.java:95",
        "ThreadID": 15332,
        "ThreadName": "",
        "EventID": "4294F0E9AFB8E9A5",
        "BaggageBytes": "[[248 5] [240 0] [0 87 23 178 170 218 219 101 57] [240 1] [0 23 190 218 129 130 233 104 3] [240 3] [0 2]]",
        "ProcessID": 24612
      },
      {
        "Cycles": 0,
        "Agent": "Execution-Sleep",
        "ProcessName": "Read",
        "TaskID": "5717B2AADADB6539",
        "ParentEventID": [
          "41677C11D62476D5"
        ],
        "Label": "waited",
        "Title": "X-Trace Task",
        "Host": "pinky19.mpi-sws.org",
        "Duration": "130997",
        "HRT": 26966548831221562,
        "Operation": "waited",
        "Timestamp": "1557750188771.144043",
        "TenantClass": 0,
        "Source": "SocketIOWithTimeout.java:335",
        "ThreadID": 1,
        "ThreadName": "",
        "EventID": "BA62C65BC516CBE7",
        "ProcessID": 2801
      },
      {
        "Cycles": 0,
        "Agent": "Execution-Sleep",
        "ProcessName": "Data",
        "TaskID": "5717B2AADADB6539",
        "ParentEventID": [
          "4294F0E9AFB8E9A5"
        ],
        "Label": "waited",
        "Title": "X-Trace Task",
        "Host": "pinky23.mpi-sws.org",
        "Duration": "182731",
        "HRT": 12368044804645628,
        "Operation": "waited",
        "Timestamp": "1557750188770.945801",
        "TenantClass": 0,
        "Source": "SocketIOWithTimeout.java:335",
        "ThreadID": 15332,
        "ThreadName": "",
        "EventID": "9FCB1CE048264D25",
        "BaggageBytes": "[[248 5] [240 0] [0 87 23 178 170 218 219 101 57] [240 1] [0 66 148 240 233 175 184 233 165] [240 3] [0 2]]",
        "ProcessID": 24612
      },
      {
        "Cycles": 0,
        "Agent": "Execution-Sleep",
        "ProcessName": "Read",
        "TaskID": "5717B2AADADB6539",
        "ParentEventID": [
          "BA62C65BC516CBE7"
        ],
        "Label": "waited",
        "Title": "X-Trace Task",
        "Host": "pinky19.mpi-sws.org",
        "Duration": "135499",
        "HRT": 26966548831424829,
        "Operation": "waited",
        "Timestamp": "1557750188771.347412",
        "TenantClass": 0,
        "Source": "SocketIOWithTimeout.java:335",
        "ThreadID": 1,
        "ThreadName": "",
        "EventID": "7AAED20072BD057E",
        "ProcessID": 2801
      },
      {
        "Cycles": 0,
        "Agent": "edu.brown.cs.systems.xtrace.logging.BaggageWrappers",
        "ProcessName": "Data",
        "TaskID": "5717B2AADADB6539",
        "ParentEventID": [
          "9FCB1CE048264D25"
        ],
        "Label": "Forking current baggage with Baggage.fork()",
        "Title": "X-Trace Task",
        "Host": "pinky23.mpi-sws.org",
        "HRT": 12368044804843542,
        "Operation": "fork",
        "Timestamp": "1557750188771.143555",
        "TenantClass": 0,
        "Source": "PacketHeader.java:95",
        "ThreadID": 15332,
        "ThreadName": "",
        "EventID": "FB46F16E7A4ACA6C",
        "BaggageBytes": "[[248 5] [240 0] [0 87 23 178 170 218 219 101 57] [240 1] [0 159 203 28 224 72 38 77 37] [240 3] [0 2]]",
        "ProcessID": 24612
      },
      {
        "Cycles": 0,
        "Agent": "Execution-Sleep",
        "ProcessName": "Read",
        "TaskID": "5717B2AADADB6539",
        "ParentEventID": [
          "7AAED20072BD057E"
        ],
        "Label": "waited",
        "Title": "X-Trace Task",
        "Host": "pinky19.mpi-sws.org",
        "Duration": "153479",
        "HRT": 26966548831627180,
        "Operation": "waited",
        "Timestamp": "1557750188771.549805",
        "TenantClass": 0,
        "Source": "SocketIOWithTimeout.java:335",
        "ThreadID": 1,
        "ThreadName": "",
        "EventID": "F15AF2F47A51FB36",
        "ProcessID": 2801
      },
      {
        "Cycles": 0,
        "Agent": "Execution-Sleep",
        "ProcessName": "Data",
        "TaskID": "5717B2AADADB6539",
        "ParentEventID": [
          "FB46F16E7A4ACA6C"
        ],
        "Label": "waited",
        "Title": "X-Trace Task",
        "Host": "pinky23.mpi-sws.org",
        "Duration": "42043",
        "HRT": 12368044805024332,
        "Operation": "waited",
        "Timestamp": "1557750188771.324463",
        "TenantClass": 0,
        "Source": "SocketIOWithTimeout.java:335",
        "ThreadID": 15332,
        "ThreadName": "",
        "EventID": "84D0933F4CDD1E21",
        "BaggageBytes": "[[248 5] [240 0] [0 87 23 178 170 218 219 101 57] [240 1] [0 251 70 241 110 122 74 202 108] [240 3] [0 2]]",
        "ProcessID": 24612
      },
      {
        "Cycles": 0,
        "Agent": "edu.brown.cs.systems.xtrace.logging.BaggageWrappers",
        "ProcessName": "Read",
        "TaskID": "5717B2AADADB6539",
        "ParentEventID": [
          "F15AF2F47A51FB36",
          "4C8B477CE17EFCE1"
        ],
        "Label": "Merged current baggage with other baggage",
        "Title": "X-Trace Task",
        "Host": "pinky19.mpi-sws.org",
        "HRT": 26966548831681380,
        "Operation": "join",
        "Timestamp": "1557750188771.604004",
        "TenantClass": 0,
        "Source": "PacketHeader.java:168",
        "ThreadID": 1,
        "ThreadName": "",
        "EventID": "7E88ABE55A83E2ED",
        "ProcessID": 2801
      },
      {
        "Cycles": 0,
        "Agent": "edu.brown.cs.systems.xtrace.logging.BaggageWrappers",
        "ProcessName": "Data",
        "TaskID": "5717B2AADADB6539",
        "ParentEventID": [
          "84D0933F4CDD1E21"
        ],
        "Label": "Forking current baggage with Baggage.fork()",
        "Title": "X-Trace Task",
        "Host": "pinky23.mpi-sws.org",
        "HRT": 12368044805215106,
        "Operation": "fork",
        "Timestamp": "1557750188771.515137",
        "TenantClass": 0,
        "Source": "PacketHeader.java:95",
        "ThreadID": 15332,
        "ThreadName": "",
        "EventID": "4D5BA848869E610F",
        "BaggageBytes": "[[248 5] [240 0] [0 87 23 178 170 218 219 101 57] [240 1] [0 132 208 147 63 76 221 30 33] [240 3] [0 2]]",
        "ProcessID": 24612
      },
      {
        "Cycles": 0,
        "Agent": "Execution-Sleep",
        "ProcessName": "Data",
        "TaskID": "5717B2AADADB6539",
        "ParentEventID": [
          "4D5BA848869E610F"
        ],
        "Label": "waited",
        "Title": "X-Trace Task",
        "Host": "pinky23.mpi-sws.org",
        "Duration": "30057",
        "HRT": 12368044805375129,
        "Operation": "waited",
        "Timestamp": "1557750188771.675293",
        "TenantClass": 0,
        "Source": "SocketIOWithTimeout.java:335",
        "ThreadID": 15332,
        "ThreadName": "",
        "EventID": "5BCA4F086F345E49",
        "BaggageBytes": "[[248 5] [240 0] [0 87 23 178 170 218 219 101 57] [240 1] [0 77 91 168 72 134 158 97 15] [240 3] [0 2]]",
        "ProcessID": 24612
      },
      {
        "Cycles": 0,
        "Agent": "Execution-CPU",
        "ProcessName": "Data",
        "TaskID": "5717B2AADADB6539",
        "ParentEventID": [
          "5BCA4F086F345E49"
        ],
        "Label": "unset",
        "Title": "X-Trace Task",
        "Host": "pinky23.mpi-sws.org",
        "Duration": "2263784",
        "HRT": 12368044805764716,
        "Operation": "unset",
        "Timestamp": "1557750188772.064941",
        "TenantClass": 0,
        "Source": "DataXceiver.java:261",
        "ThreadID": 15332,
        "ThreadName": "",
        "EventID": "7168DA366FC046D1",
        "BaggageBytes": "[[248 5] [240 0] [0 87 23 178 170 218 219 101 57] [240 1] [0 91 202 79 8 111 52 94 73] [240 3] [0 2]]",
        "ProcessID": 24612
      }
    ]
  }
]