[
  {
    "id": "0900A33A023FED74",
    "reports": [
      {
        "Cycles": 0,
        "Agent": "org.apache.hadoop.ipc.ProtobufRpcEngine",
        "ProcessName": "Read",
        "TaskID": "0900A33A023FED74",
        "ParentEventID": [
          "076FFF17E2558BEE"
        ],
        "Label": "Invoking org.apache.hadoop.hdfs.protocol.ClientProtocol.getBlockLocations",
        "Title": "X-Trace Task",
        "Host": "pinky19.mpi-sws.org",
        "HRT": 26966589282562902,
        "Timestamp": "1557750229223.049561",
        "TenantClass": 0,
        "Source": "ProtobufRpcEngine.java:228",
        "ThreadID": 1,
        "ThreadName": "",
        "EventID": "6977590C8D20D49B",
        "ProcessID": 2801
      },
      {
        "Cycles": 0,
        "Agent": "Execution-CPU",
        "ProcessName": "Read",
        "TaskID": "0900A33A023FED74",
        "ParentEventID": [
          "8714022BAF11159E"
        ],
        "Label": "set",
        "Title": "X-Trace Task",
        "Host": "pinky19.mpi-sws.org",
        "HRT": 26966589282643676,
        "Operation": "set",
        "Timestamp": "1557750229223.130371",
        "TenantClass": 0,
        "Source": "Client.java:1032",
        "ThreadID": 41,
        "ThreadName": "",
        "EventID": "86937BD562B9091C",
        "ProcessID": 2801
      },
      {
        "Cycles": 0,
        "Agent": "Execution-CPU",
        "ProcessName": "Read",
        "TaskID": "0900A33A023FED74",
        "ParentEventID": [
          "6977590C8D20D49B"
        ],
        "Label": "unset",
        "Title": "X-Trace Task",
        "Host": "pinky19.mpi-sws.org",
        "Duration": "46638747",
        "HRT": 26966589282592661,
        "Operation": "unset",
        "Timestamp": "1557750229223.079346",
        "TenantClass": 0,
        "Source": "Client.java:1027",
        "ThreadID": 1,
        "ThreadName": "",
        "EventID": "8714022BAF11159E",
        "ProcessID": 2801
      },
      {
        "Cycles": 0,
        "Agent": "edu.brown.cs.systems.xtrace.logging.BaggageWrappers",
        "ProcessName": "Read",
        "TaskID": "0900A33A023FED74",
        "ParentEventID": [
          "86937BD562B9091C"
        ],
        "Label": "Forking current baggage with Baggage.fork()",
        "Title": "X-Trace Task",
        "Host": "pinky19.mpi-sws.org",
        "HRT": 26966589282662127,
        "Operation": "fork",
        "Timestamp": "1557750229223.148682",
        "TenantClass": 0,
        "Source": "Client.java:1043",
        "ThreadID": 41,
        "ThreadName": "",
        "EventID": "877B8EA4D33BAC8E",
        "ProcessID": 2801
      },
      {
        "Cycles": 0,
        "Agent": "edu.brown.cs.systems.retro.benchmarks.hdfs_client.Reader",
        "ProcessName": "Read",
        "TaskID": "0900A33A023FED74",
        "ParentEventID": [
          "23A27CFD21C4EDDF"
        ],
        "Label": "Reading file",
        "Title": "X-Trace Task",
        "Host": "pinky19.mpi-sws.org",
        "HRT": 26966589282494547,
        "Timestamp": "1557750229222.981201",
        "TenantClass": 0,
        "ThreadID": 1,
        "ThreadName": "",
        "EventID": "076FFF17E2558BEE",
        "ProcessID": 2801
      },
      {
        "Cycles": 0,
        "Agent": "Execution-CPU",
        "ProcessName": "Read",
        "TaskID": "0900A33A023FED74",
        "ParentEventID": [
          "877B8EA4D33BAC8E"
        ],
        "Label": "unset",
        "Title": "X-Trace Task",
        "Host": "pinky19.mpi-sws.org",
        "Duration": "76817",
        "HRT": 26966589282738580,
        "Operation": "unset",
        "Timestamp": "1557750229223.225098",
        "TenantClass": 0,
        "Source": "Client.java:1062",
        "ThreadID": 41,
        "ThreadName": "",
        "EventID": "F6390B2F60946264",
        "ProcessID": 2801
      },
      {
        "Cycles": 0,
        "Agent": "Execution-CPU",
        "ProcessName": "Read",
        "TaskID": "0900A33A023FED74",
        "ParentEventID": [
          "F6390B2F60946264"
        ],
        "Label": "set",
        "Title": "X-Trace Task",
        "Host": "pinky19.mpi-sws.org",
        "HRT": 26966589282759097,
        "Operation": "set",
        "Timestamp": "1557750229223.245605",
        "TenantClass": 0,
        "Source": "Client.java:1104",
        "ThreadID": 1,
        "ThreadName": "",
        "EventID": "E5302B30A2291D2E",
        "ProcessID": 2801
      },
      {
        "Cycles": 0,
        "Agent": "Execution-CPU",
        "ProcessName": "Name",
        "TaskID": "0900A33A023FED74",
        "ParentEventID": [
          "877B8EA4D33BAC8E"
        ],
        "Label": "set",
        "Title": "X-Trace Task",
        "Host": "pinky19.mpi-sws.org",
        "HRT": 26966589282794320,
        "Operation": "set",
        "Timestamp": "1557750229223.296631",
        "TenantClass": 0,
        "Source": "Server.java:1840",
        "ThreadID": 48,
        "ThreadName": "",
        "EventID": "1225282D643972D6",
        "BaggageBytes": "[[248 5] [240 0] [0 9 0 163 58 2 63 237 116] [240 1] [0 135 123 142 164 211 59 172 142] [240 3] [0 2]]",
        "ProcessID": 2171
      },
      {
        "Cycles": 0,
        "Agent": "Execution-CPU",
        "ProcessName": "Name",
        "TaskID": "0900A33A023FED74",
        "ParentEventID": [
          "1CE729DF7BD52099"
        ],
        "Label": "unset",
        "Title": "X-Trace Task",
        "Host": "pinky19.mpi-sws.org",
        "Duration": "23158",
        "HRT": 26966589282843261,
        "Operation": "unset",
        "Timestamp": "1557750229223.345459",
        "TenantClass": 0,
        "Source": "Server.java:1828",
        "ThreadID": 48,
        "ThreadName": "",
        "EventID": "67E6D096D00518EF",
        "BaggageBytes": "[[248 5] [240 0] [0 9 0 163 58 2 63 237 116] [240 1] [0 28 231 41 223 123 213 32 153] [240 3] [0 2]]",
        "ProcessID": 2171
      },
      {
        "Cycles": 0,
        "Agent": "Execution-CPU",
        "ProcessName": "Name",
        "TaskID": "0900A33A023FED74",
        "ParentEventID": [
          "1CE729DF7BD52099"
        ],
        "Label": "set",
        "Title": "X-Trace Task",
        "Host": "pinky19.mpi-sws.org",
        "HRT": 26966589282851473,
        "Operation": "set",
        "Timestamp": "1557750229223.353760",
        "TenantClass": 0,
        "Source": "Server.java:2071",
        "ThreadID": 61,
        "ThreadName": "",
        "EventID": "E2286E6341D2F538",
        "BaggageBytes": "[[248 5] [240 0] [0 9 0 163 58 2 63 237 116] [240 1] [0 28 231 41 223 123 213 32 153] [240 3] [0 2]]",
        "ProcessID": 2171
      },
      {
        "Cycles": 0,
        "Agent": "edu.brown.cs.systems.xtrace.logging.BaggageWrappers",
        "ProcessName": "Name",
        "TaskID": "0900A33A023FED74",
        "ParentEventID": [
          "1225282D643972D6"
        ],
        "Label": "Forking current baggage with Baggage.fork()",
        "Title": "X-Trace Task",
        "Host": "pinky19.mpi-sws.org",
        "HRT": 26966589282824143,
        "Operation": "fork",
        "Timestamp": "1557750229223.326416",
        "TenantClass": 0,
        "Source": "Server.java:550",
        "ThreadID": 48,
        "ThreadName": "",
        "EventID": "1CE729DF7BD52099",
        "BaggageBytes": "[[248 5] [240 0] [0 9 0 163 58 2 63 237 116] [240 1] [0 18 37 40 45 100 57 114 214] [240 3] [0 2]]",
        "ProcessID": 2171
      },
      {
        "Cycles": 0,
        "Agent": "org.apache.hadoop.ipc.Server",
        "ProcessName": "Name",
        "TaskID": "0900A33A023FED74",
        "ParentEventID": [
          "E2286E6341D2F538"
        ],
        "Label": "getBlockLocations in org.apache.hadoop.hdfs.protocol.ClientProtocol",
        "Title": "X-Trace Task",
        "Host": "pinky19.mpi-sws.org",
        "HRT": 26966589282885642,
        "Timestamp": "1557750229223.387939",
        "TenantClass": 0,
        "Source": "ProtobufRpcEngine.java:601",
        "ThreadID": 61,
        "ThreadName": "",
        "EventID": "C4BC9999115A152D",
        "BaggageBytes": "[[248 5] [240 0] [0 9 0 163 58 2 63 237 116] [240 1] [0 226 40 110 99 65 210 245 56] [240 3] [0 2]]",
        "ProcessID": 2171
      },
      {
        "Cycles": 0,
        "Agent": "edu.brown.cs.systems.xtrace.logging.BaggageWrappers",
        "ProcessName": "Name",
        "TaskID": "0900A33A023FED74",
        "ParentEventID": [
          "13E45ACCC22F1134"
        ],
        "Label": "Forking current baggage with Baggage.fork()",
        "Title": "X-Trace Task",
        "Host": "pinky19.mpi-sws.org",
        "HRT": 26966589282983921,
        "Operation": "fork",
        "Timestamp": "1557750229223.486328",
        "TenantClass": 0,
        "Source": "Server.java:2398",
        "ThreadID": 61,
        "ThreadName": "",
        "EventID": "02AF55E81491269C",
        "BaggageBytes": "[[248 5] [240 0] [0 9 0 163 58 2 63 237 116] [240 1] [0 19 228 90 204 194 47 17 52] [240 3] [0 2]]",
        "ProcessID": 2171
      },
      {
        "Cycles": 0,
        "Agent": "org.apache.hadoop.hdfs.server.namenode.FSNamesystem.audit",
        "ProcessName": "Name",
        "TaskID": "0900A33A023FED74",
        "ParentEventID": [
          "C4BC9999115A152D"
        ],
        "Label": "allowed=true\tugi=plascas (auth:SIMPLE)\tip=/139.19.171.63\tcmd=open\tsrc=/ds/rSuplqBubqNG8t9R\tdst=null\tperm=null\tproto=rpc",
        "Title": "X-Trace Task",
        "Host": "pinky19.mpi-sws.org",
        "HRT": 26966589282932381,
        "Timestamp": "1557750229223.434570",
        "TenantClass": 0,
        "Source": "FSNamesystem.java:8313",
        "ThreadID": 61,
        "ThreadName": "",
        "EventID": "13E45ACCC22F1134",
        "BaggageBytes": "[[248 5] [240 0] [0 9 0 163 58 2 63 237 116] [240 1] [0 196 188 153 153 17 90 21 45] [240 3] [0 2]]",
        "ProcessID": 2171
      },
      {
        "Cycles": 0,
        "Agent": "Execution-CPU",
        "ProcessName": "Name",
        "TaskID": "0900A33A023FED74",
        "ParentEventID": [
          "02AF55E81491269C"
        ],
        "Label": "unset",
        "Title": "X-Trace Task",
        "Host": "pinky19.mpi-sws.org",
        "Duration": "215492",
        "HRT": 26966589283089199,
        "Operation": "unset",
        "Timestamp": "1557750229223.591553",
        "TenantClass": 0,
        "Source": "Server.java:1058",
        "ThreadID": 61,
        "ThreadName": "",
        "EventID": "A4D1E4668015C179",
        "BaggageBytes": "[[248 5] [240 0] [0 9 0 163 58 2 63 237 116] [240 1] [0 2 175 85 232 20 145 38 156] [240 3] [0 2]]",
        "ProcessID": 2171
      },
      {
        "Cycles": 0,
        "Agent": "Execution-CPU",
        "ProcessName": "Read",
        "TaskID": "0900A33A023FED74",
        "ParentEventID": [
          "AC7C7E6A8FF9A450"
        ],
        "Label": "unset",
        "Title": "X-Trace Task",
        "Host": "pinky19.mpi-sws.org",
        "Duration": "10907",
        "HRT": 26966589283174447,
        "Operation": "unset",
        "Timestamp": "1557750229223.661133",
        "TenantClass": 0,
        "Source": "Client.java:1168",
        "ThreadID": 40,
        "ThreadName": "",
        "EventID": "F385667B5E1DD58B",
        "ProcessID": 2801
      },
      {
        "Cycles": 0,
        "Agent": "Execution-Sleep",
        "ProcessName": "Read",
        "TaskID": "0900A33A023FED74",
        "ParentEventID": [
          "E5302B30A2291D2E"
        ],
        "Label": "waited",
        "Title": "X-Trace Task",
        "Host": "pinky19.mpi-sws.org",
        "Duration": "425956",
        "HRT": 26966589283193503,
        "Operation": "waited",
        "Timestamp": "1557750229223.680176",
        "TenantClass": 0,
        "Source": "Client.java:1537",
        "ThreadID": 1,
        "ThreadName": "",
        "EventID": "67B797722469EBE9",
        "ProcessID": 2801
      },
      {
        "Cycles": 0,
        "Agent": "Execution-CPU",
        "ProcessName": "Read",
        "TaskID": "0900A33A023FED74",
        "ParentEventID": [
          "02AF55E81491269C"
        ],
        "Label": "set",
        "Title": "X-Trace Task",
        "Host": "pinky19.mpi-sws.org",
        "HRT": 26966589283147402,
        "Operation": "set",
        "Timestamp": "1557750229223.634033",
        "TenantClass": 0,
        "Source": "Client.java:302",
        "ThreadID": 40,
        "ThreadName": "",
        "EventID": "AC7C7E6A8FF9A450",
        "ProcessID": 2801
      },
      {
        "Cycles": 0,
        "Agent": "edu.brown.cs.systems.xtrace.logging.BaggageWrappers",
        "ProcessName": "Read",
        "TaskID": "0900A33A023FED74",
        "ParentEventID": [
          "F385667B5E1DD58B",
          "67B797722469EBE9"
        ],
        "Label": "Merged current baggage with other baggage",
        "Title": "X-Trace Task",
        "Host": "pinky19.mpi-sws.org",
        "HRT": 26966589283208789,
        "Operation": "join",
        "Timestamp": "1557750229223.695312",
        "TenantClass": 0,
        "Source": "Client.java:1545",
        "ThreadID": 1,
        "ThreadName": "",
        "EventID": "1FFC6EF524C09BC1",
        "ProcessID": 2801
      },
      {
        "Cycles": 0,
        "Agent": "org.apache.hadoop.ipc.ProtobufRpcEngine",
        "ProcessName": "Read",
        "TaskID": "0900A33A023FED74",
        "ParentEventID": [
          "1FFC6EF524C09BC1"
        ],
        "Label": "org.apache.hadoop.hdfs.protocol.ClientProtocol.getBlockLocations completed",
        "Title": "X-Trace Task",
        "Host": "pinky19.mpi-sws.org",
        "HRT": 26966589283248786,
        "Timestamp": "1557750229223.735352",
        "TenantClass": 0,
        "Source": "ProtobufRpcEngine.java:275",
        "ThreadID": 1,
        "ThreadName": "",
        "EventID": "51D04A2CE2E50CF9",
        "ProcessID": 2801
      },
      {
        "Cycles": 0,
        "Agent": "Execution-Sleep",
        "ProcessName": "Read",
        "TaskID": "0900A33A023FED74",
        "ParentEventID": [
          "51D04A2CE2E50CF9"
        ],
        "Label": "waited",
        "Title": "X-Trace Task",
        "Host": "pinky19.mpi-sws.org",
        "Duration": "175339",
        "HRT": 26966589283513950,
        "Operation": "waited",
        "Timestamp": "1557750229224.000488",
        "TenantClass": 0,
        "Source": "SocketIOWithTimeout.java:335",
        "ThreadID": 1,
        "ThreadName": "",
        "EventID": "F2E2E2D71D4CB7AE",
        "ProcessID": 2801
      },
      {
        "Cycles": 0,
        "Agent": "Execution-CPU",
        "ProcessName": "Data",
        "TaskID": "0900A33A023FED74",
        "ParentEventID": [
          "46FC36273D9DB4E1"
        ],
        "Label": "set",
        "Title": "X-Trace Task",
        "Host": "pinky20.mpi-sws.org",
        "HRT": 6569793643210712,
        "Operation": "set",
        "Timestamp": "1557750229224.506592",
        "TenantClass": 0,
        "Source": "Receiver.java:117",
        "ThreadID": 14554,
        "ThreadName": "",
        "EventID": "16D876713A1B7D28",
        "BaggageBytes": "[[248 5] [240 0] [0 9 0 163 58 2 63 237 116] [240 1] [0 70 252 54 39 61 157 180 225] [240 3] [0 2]]",
        "ProcessID": 13111
      },
      {
        "Cycles": 0,
        "Agent": "edu.brown.cs.systems.xtrace.logging.BaggageWrappers",
        "ProcessName": "Read",
        "TaskID": "0900A33A023FED74",
        "ParentEventID": [
          "F2E2E2D71D4CB7AE"
        ],
        "Label": "Forking current baggage with Baggage.fork()",
        "Title": "X-Trace Task",
        "Host": "pinky19.mpi-sws.org",
        "HRT": 26966589283560817,
        "Operation": "fork",
        "Timestamp": "1557750229224.047363",
        "TenantClass": 0,
        "Source": "DataTransferProtoUtil.java:94",
        "ThreadID": 1,
        "ThreadName": "",
        "EventID": "46FC36273D9DB4E1",
        "ProcessID": 2801
      },
      {
        "Cycles": 0,
        "Agent": "edu.brown.cs.systems.xtrace.logging.XTraceInit",
        "ProcessName": "Data",
        "TaskID": "0900A33A023FED74",
        "ParentEventID": [
          "16D876713A1B7D28"
        ],
        "Label": "Thread.setName: DataXceiver for client DFSClient_NONMAPREDUCE_310321604_1 at /139.19.171.63:43722 [Sending block BP-1633380353-139.19.171.63-1554193446451:blk_1073756747_15923]",
        "Title": "X-Trace Task",
        "Host": "pinky20.mpi-sws.org",
        "HRT": 6569793643318228,
        "Timestamp": "1557750229224.614014",
        "TenantClass": 0,
        "Source": "DataXceiver.java:168",
        "ThreadID": 14554,
        "ThreadName": "",
        "EventID": "2E411921A9F3AB06",
        "BaggageBytes": "[[248 5] [240 0] [0 9 0 163 58 2 63 237 116] [240 1] [0 22 216 118 113 58 27 125 40] [240 3] [0 2]]",
        "ProcessID": 13111
      },
      {
        "Cycles": 0,
        "Agent": "Execution-Sleep",
        "ProcessName": "Read",
        "TaskID": "0900A33A023FED74",
        "ParentEventID": [
          "46FC36273D9DB4E1"
        ],
        "Label": "waited",
        "Title": "X-Trace Task",
        "Host": "pinky19.mpi-sws.org",
        "Duration": "940555",
        "HRT": 26966589284578792,
        "Operation": "waited",
        "Timestamp": "1557750229225.065430",
        "TenantClass": 0,
        "Source": "SocketIOWithTimeout.java:335",
        "ThreadID": 1,
        "ThreadName": "",
        "EventID": "A5C01C65FE5083E8",
        "ProcessID": 2801
      },
      {
        "Cycles": 0,
        "Agent": "edu.brown.cs.systems.xtrace.logging.BaggageWrappers",
        "ProcessName": "Read",
        "TaskID": "0900A33A023FED74",
        "ParentEventID": [
          "BB9D0023C75C31E5",
          "A5C01C65FE5083E8"
        ],
        "Label": "Merged current baggage with other baggage",
        "Title": "X-Trace Task",
        "Host": "pinky19.mpi-sws.org",
        "HRT": 26966589284645302,
        "Operation": "join",
        "Timestamp": "1557750229225.131836",
        "TenantClass": 0,
        "Source": "RemoteBlockReader2.java:429",
        "ThreadID": 1,
        "ThreadName": "",
        "EventID": "370F966F8C4C66A9",
        "ProcessID": 2801
      },
      {
        "Cycles": 0,
        "Agent": "edu.brown.cs.systems.xtrace.logging.BaggageWrappers",
        "ProcessName": "Data",
        "TaskID": "0900A33A023FED74",
        "ParentEventID": [
          "2E411921A9F3AB06"
        ],
        "Label": "Forking current baggage with Baggage.fork()",
        "Title": "X-Trace Task",
        "Host": "pinky20.mpi-sws.org",
        "HRT": 6569793643534185,
        "Operation": "fork",
        "Timestamp": "1557750229224.830078",
        "TenantClass": 0,
        "Source": "DataXceiver.java:1257",
        "ThreadID": 14554,
        "ThreadName": "",
        "EventID": "BB9D0023C75C31E5",
        "BaggageBytes": "[[248 5] [240 0] [0 9 0 163 58 2 63 237 116] [240 1] [0 46 65 25 33 169 243 171 6] [240 3] [0 2]]",
        "ProcessID": 13111
      },
      {
        "Cycles": 0,
        "Agent": "edu.brown.cs.systems.xtrace.logging.BaggageWrappers",
        "ProcessName": "Data",
        "TaskID": "0900A33A023FED74",
        "ParentEventID": [
          "BB9D0023C75C31E5"
        ],
        "Label": "Forking current baggage with Baggage.fork()",
        "Title": "X-Trace Task",
        "Host": "pinky20.mpi-sws.org",
        "HRT": 6569793643696389,
        "Operation": "fork",
        "Timestamp": "1557750229224.992188",
        "TenantClass": 0,
        "Source": "PacketHeader.java:95",
        "ThreadID": 14554,
        "ThreadName": "",
        "EventID": "C245BF56D9AFECCC",
        "BaggageBytes": "[[248 5] [240 0] [0 9 0 163 58 2 63 237 116] [240 1] [0 187 157 0 35 199 92 49 229] [240 3] [0 2]]",
        "ProcessID": 13111
      },
      {
        "Cycles": 0,
        "Agent": "Execution-Sleep",
        "ProcessName": "Read",
        "TaskID": "0900A33A023FED74",
        "ParentEventID": [
          "370F966F8C4C66A9"
        ],
        "Label": "waited",
        "Title": "X-Trace Task",
        "Host": "pinky19.mpi-sws.org",
        "Duration": "42307",
        "HRT": 26966589284736025,
        "Operation": "waited",
        "Timestamp": "1557750229225.222656",
        "TenantClass": 0,
        "Source": "SocketIOWithTimeout.java:335",
        "ThreadID": 1,
        "ThreadName": "",
        "EventID": "67947E78FD0F99F0",
        "ProcessID": 2801
      },
      {
        "Cycles": 0,
        "Agent": "Execution-Sleep",
        "ProcessName": "Data",
        "TaskID": "0900A33A023FED74",
        "ParentEventID": [
          "C245BF56D9AFECCC"
        ],
        "Label": "waited",
        "Title": "X-Trace Task",
        "Host": "pinky20.mpi-sws.org",
        "Duration": "13757",
        "HRT": 6569793643852812,
        "Operation": "waited",
        "Timestamp": "1557750229225.148682",
        "TenantClass": 0,
        "Source": "SocketIOWithTimeout.java:335",
        "ThreadID": 14554,
        "ThreadName": "",
        "EventID": "9D0F30CCD133B66D",
        "BaggageBytes": "[[248 5] [240 0] [0 9 0 163 58 2 63 237 116] [240 1] [0 194 69 191 86 217 175 236 204] [240 3] [0 2]]",
        "ProcessID": 13111
      },
      {
        "Cycles": 0,
        "Agent": "Execution-Sleep",
        "ProcessName": "Read",
        "TaskID": "0900A33A023FED74",
        "ParentEventID": [
          "67947E78FD0F99F0"
        ],
        "Label": "waited",
        "Title": "X-Trace Task",
        "Host": "pinky19.mpi-sws.org",
        "Duration": "333971",
        "HRT": 26966589285131326,
        "Operation": "waited",
        "Timestamp": "1557750229225.617920",
        "TenantClass": 0,
        "Source": "SocketIOWithTimeout.java:335",
        "ThreadID": 1,
        "ThreadName": "",
        "EventID": "1DF0CBC434ADA458",
        "ProcessID": 2801
      },
      {
        "Cycles": 0,
        "Agent": "edu.brown.cs.systems.xtrace.logging.BaggageWrappers",
        "ProcessName": "Data",
        "TaskID": "0900A33A023FED74",
        "ParentEventID": [
          "9D0F30CCD133B66D"
        ],
        "Label": "Forking current baggage with Baggage.fork()",
        "Title": "X-Trace Task",
        "Host": "pinky20.mpi-sws.org",
        "HRT": 6569793644032296,
        "Operation": "fork",
        "Timestamp": "1557750229225.328125",
        "TenantClass": 0,
        "Source": "PacketHeader.java:95",
        "ThreadID": 14554,
        "ThreadName": "",
        "EventID": "8157618D4B9A609C",
        "BaggageBytes": "[[248 5] [240 0] [0 9 0 163 58 2 63 237 116] [240 1] [0 157 15 48 204 209 51 182 109] [240 3] [0 2]]",
        "ProcessID": 13111
      },
      {
        "Cycles": 0,
        "Agent": "Execution-Sleep",
        "ProcessName": "Read",
        "TaskID": "0900A33A023FED74",
        "ParentEventID": [
          "1DF0CBC434ADA458"
        ],
        "Label": "waited",
        "Title": "X-Trace Task",
        "Host": "pinky19.mpi-sws.org",
        "Duration": "243120",
        "HRT": 26966589285425032,
        "Operation": "waited",
        "Timestamp": "1557750229225.911621",
        "TenantClass": 0,
        "Source": "SocketIOWithTimeout.java:335",
        "ThreadID": 1,
        "ThreadName": "",
        "EventID": "E5228537E65F0DA7",
        "ProcessID": 2801
      },
      {
        "Cycles": 0,
        "Agent": "Execution-Sleep",
        "ProcessName": "Read",
        "TaskID": "0900A33A023FED74",
        "ParentEventID": [
          "DDB7E4ED52A8D986"
        ],
        "Label": "waited",
        "Title": "X-Trace Task",
        "Host": "pinky19.mpi-sws.org",
        "Duration": "17965",
        "HRT": 26966589285690796,
        "Operation": "waited",
        "Timestamp": "1557750229226.177490",
        "TenantClass": 0,
        "Source": "SocketIOWithTimeout.java:335",
        "ThreadID": 1,
        "ThreadName": "",
        "EventID": "70B19F26A3456C00",
        "ProcessID": 2801
      },
      {
        "Cycles": 0,
        "Agent": "Execution-Sleep",
        "ProcessName": "Read",
        "TaskID": "0900A33A023FED74",
        "ParentEventID": [
          "E5228537E65F0DA7"
        ],
        "Label": "waited",
        "Title": "X-Trace Task",
        "Host": "pinky19.mpi-sws.org",
        "Duration": "147204",
        "HRT": 26966589285629165,
        "Operation": "waited",
        "Timestamp": "1557750229226.115723",
        "TenantClass": 0,
        "Source": "SocketIOWithTimeout.java:335",
        "ThreadID": 1,
        "ThreadName": "",
        "EventID": "DDB7E4ED52A8D986",
        "ProcessID": 2801
      },
      {
        "Cycles": 0,
        "Agent": "edu.brown.cs.systems.xtrace.logging.BaggageWrappers",
        "ProcessName": "Read",
        "TaskID": "0900A33A023FED74",
        "ParentEventID": [
          "C245BF56D9AFECCC",
          "70B19F26A3456C00"
        ],
        "Label": "Merged current baggage with other baggage",
        "Title": "X-Trace Task",
        "Host": "pinky19.mpi-sws.org",
        "HRT": 26966589285726850,
        "Operation": "join",
        "Timestamp": "1557750229226.213379",
        "TenantClass": 0,
        "Source": "PacketHeader.java:168",
        "ThreadID": 1,
        "ThreadName": "",
        "EventID": "5B93C9657162DB2F",
        "ProcessID": 2801
      },
      {
        "Cycles": 0,
        "Agent": "edu.brown.cs.systems.xtrace.logging.BaggageWrappers",
        "ProcessName": "Read",
        "TaskID": "0900A33A023FED74",
        "ParentEventID": [
          "8157618D4B9A609C",
          "5B93C9657162DB2F"
        ],
        "Label": "Merged current baggage with other baggage",
        "Title": "X-Trace Task",
        "Host": "pinky19.mpi-sws.org",
        "HRT": 26966589285821704,
        "Operation": "join",
        "Timestamp": "1557750229226.308350",
        "TenantClass": 0,
        "Source": "PacketHeader.java:168",
        "ThreadID": 1,
        "ThreadName": "",
        "EventID": "1D371261DA0F70F6",
        "ProcessID": 2801
      },
      {
        "Cycles": 0,
        "Agent": "edu.brown.cs.systems.xtrace.logging.BaggageWrappers",
        "ProcessName": "Read",
        "TaskID": "0900A33A023FED74",
        "ParentEventID": [
          "1D371261DA0F70F6"
        ],
        "Label": "Forking current baggage with Baggage.fork()",
        "Title": "X-Trace Task",
        "Host": "pinky19.mpi-sws.org",
        "HRT": 26966589285830353,
        "Operation": "fork",
        "Timestamp": "1557750229226.316895",
        "TenantClass": 0,
        "Source": "RemoteBlockReader2.java:361",
        "ThreadID": 1,
        "ThreadName": "",
        "EventID": "0604EA3E375810C9",
        "ProcessID": 2801
      },
      {
        "Cycles": 0,
        "Agent": "Execution-Sleep",
        "ProcessName": "Data",
        "TaskID": "0900A33A023FED74",
        "ParentEventID": [
          "8157618D4B9A609C"
        ],
        "Label": "waited",
        "Title": "X-Trace Task",
        "Host": "pinky20.mpi-sws.org",
        "Duration": "828014",
        "HRT": 6569793645050314,
        "Operation": "waited",
        "Timestamp": "1557750229226.346191",
        "TenantClass": 0,
        "Source": "SocketIOWithTimeout.java:335",
        "ThreadID": 14554,
        "ThreadName": "",
        "EventID": "EA0A5C77D95BE5D1",
        "BaggageBytes": "[[248 5] [240 0] [0 9 0 163 58 2 63 237 116] [240 1] [0 129 87 97 141 75 154 96 156] [240 3] [0 2]]",
        "ProcessID": 13111
      },
      {
        "Cycles": 0,
        "Agent": "edu.brown.cs.systems.xtrace.logging.BaggageWrappers",
        "ProcessName": "Read",
        "TaskID": "0900A33A023FED74",
        "ParentEventID": [
          "0604EA3E375810C9"
        ],
        "Label": "Forking current baggage with Baggage.fork()",
        "Title": "X-Trace Task",
        "Host": "pinky19.mpi-sws.org",
        "HRT": 26966589285892166,
        "Operation": "fork",
        "Timestamp": "1557750229226.378662",
        "TenantClass": 0,
        "Source": "DataTransferProtoUtil.java:94",
        "ThreadID": 1,
        "ThreadName": "",
        "EventID": "BCD1722A0225A8C0",
        "ProcessID": 2801
      },
      {
        "Cycles": 0,
        "Agent": "edu.brown.cs.systems.xtrace.logging.BaggageWrappers",
        "ProcessName": "Data",
        "TaskID": "0900A33A023FED74",
        "ParentEventID": [
          "EA0A5C77D95BE5D1",
          "0604EA3E375810C9"
        ],
        "Label": "Merged current baggage with other baggage",
        "Title": "X-Trace Task",
        "Host": "pinky20.mpi-sws.org",
        "HRT": 6569793645312951,
        "Operation": "join",
        "Timestamp": "1557750229226.608643",
        "TenantClass": 0,
        "Source": "DataXceiver.java:574",
        "ThreadID": 14554,
        "ThreadName": "",
        "EventID": "2CB95ABA02D3EC06",
        "BaggageBytes": "[[248 5] [240 0] [0 9 0 163 58 2 63 237 116] [240 1] [0 234 10 92 119 217 91 229 209] [0 6 4 234 62 55 88 16 201] [240 3] [0 2]]",
        "ProcessID": 13111
      },
      {
        "Cycles": 0,
        "Agent": "Execution-CPU",
        "ProcessName": "Data",
        "TaskID": "0900A33A023FED74",
        "ParentEventID": [
          "2CB95ABA02D3EC06"
        ],
        "Label": "unset",
        "Title": "X-Trace Task",
        "Host": "pinky20.mpi-sws.org",
        "Duration": "2091233",
        "HRT": 6569793645375655,
        "Operation": "unset",
        "Timestamp": "1557750229226.671387",
        "TenantClass": 0,
        "Source": "DataXceiver.java:261",
        "ThreadID": 14554,
        "ThreadName": "",
        "EventID": "79FDF368032DF56B",
        "BaggageBytes": "[[248 5] [240 0] [0 9 0 163 58 2 63 237 116] [240 1] [0 44 185 90 186 2 211 236 6] [240 3] [0 2]]",
        "ProcessID": 13111
      },
      {
        "Cycles": 0,
        "Agent": "edu.brown.cs.systems.xtrace.logging.XTraceInit",
        "ProcessName": "Data",
        "TaskID": "0900A33A023FED74",
        "ParentEventID": [
          "FE60E038B45882C5"
        ],
        "Label": "Thread.setName: DataXceiver for client DFSClient_NONMAPREDUCE_310321604_1 at /139.19.171.63:43722 [Sending block BP-1633380353-139.19.171.63-1554193446451:blk_1073756747_15923]",
        "Title": "X-Trace Task",
        "Host": "pinky20.mpi-sws.org",
        "HRT": 6569793645522425,
        "Timestamp": "1557750229226.818115",
        "TenantClass": 0,
        "Source": "DataXceiver.java:168",
        "ThreadID": 14554,
        "ThreadName": "",
        "EventID": "FA6BE3807E21C477",
        "BaggageBytes": "[[248 5] [240 0] [0 9 0 163 58 2 63 237 116] [240 1] [0 254 96 224 56 180 88 130 197] [240 3] [0 2]]",
        "ProcessID": 13111
      },
      {
        "Cycles": 0,
        "Agent": "Execution-CPU",
        "ProcessName": "Data",
        "TaskID": "0900A33A023FED74",
        "ParentEventID": [
          "BCD1722A0225A8C0"
        ],
        "Label": "set",
        "Title": "X-Trace Task",
        "Host": "pinky20.mpi-sws.org",
        "HRT": 6569793645445528,
        "Operation": "set",
        "Timestamp": "1557750229226.741211",
        "TenantClass": 0,
        "Source": "Receiver.java:117",
        "ThreadID": 14554,
        "ThreadName": "",
        "EventID": "FE60E038B45882C5",
        "BaggageBytes": "[[248 5] [240 0] [0 9 0 163 58 2 63 237 116] [240 1] [0 188 209 114 42 2 37 168 192] [240 3] [0 2]]",
        "ProcessID": 13111
      },
      {
        "Cycles": 0,
        "Agent": "edu.brown.cs.systems.xtrace.logging.BaggageWrappers",
        "ProcessName": "Data",
        "TaskID": "0900A33A023FED74",
        "ParentEventID": [
          "FA6BE3807E21C477"
        ],
        "Label": "Forking current baggage with Baggage.fork()",
        "Title": "X-Trace Task",
        "Host": "pinky20.mpi-sws.org",
        "HRT": 6569793645775735,
        "Operation": "fork",
        "Timestamp": "1557750229227.071533",
        "TenantClass": 0,
        "Source": "DataXceiver.java:1257",
        "ThreadID": 14554,
        "ThreadName": "",
        "EventID": "1718DBCD55D2927C",
        "BaggageBytes": "[[248 5] [240 0] [0 9 0 163 58 2 63 237 116] [240 1] [0 250 107 227 128 126 33 196 119] [240 3] [0 2]]",
        "ProcessID": 13111
      },
      {
        "Cycles": 0,
        "Agent": "Execution-Sleep",
        "ProcessName": "Read",
        "TaskID": "0900A33A023FED74",
        "ParentEventID": [
          "BCD1722A0225A8C0"
        ],
        "Label": "waited",
        "Title": "X-Trace Task",
        "Host": "pinky19.mpi-sws.org",
        "Duration": "856647",
        "HRT": 26966589286818934,
        "Operation": "waited",
        "Timestamp": "1557750229227.305420",
        "TenantClass": 0,
        "Source": "SocketIOWithTimeout.java:335",
        "ThreadID": 1,
        "ThreadName": "",
        "EventID": "E9979D45E4C79A97",
        "ProcessID": 2801
      },
      {
        "Cycles": 0,
        "Agent": "edu.brown.cs.systems.xtrace.logging.BaggageWrappers",
        "ProcessName": "Read",
        "TaskID": "0900A33A023FED74",
        "ParentEventID": [
          "1718DBCD55D2927C",
          "E9979D45E4C79A97"
        ],
        "Label": "Merged current baggage with other baggage",
        "Title": "X-Trace Task",
        "Host": "pinky19.mpi-sws.org",
        "HRT": 26966589286876667,
        "Operation": "join",
        "Timestamp": "1557750229227.363281",
        "TenantClass": 0,
        "Source": "RemoteBlockReader2.java:429",
        "ThreadID": 1,
        "ThreadName": "",
        "EventID": "2647689EDCFE7043",
        "ProcessID": 2801
      },
      {
        "Cycles": 0,
        "Agent": "Execution-Sleep",
        "ProcessName": "Read",
        "TaskID": "0900A33A023FED74",
        "ParentEventID": [
          "2647689EDCFE7043"
        ],
        "Label": "waited",
        "Title": "X-Trace Task",
        "Host": "pinky19.mpi-sws.org",
        "Duration": "83278",
        "HRT": 26966589287003138,
        "Operation": "waited",
        "Timestamp": "1557750229227.489746",
        "TenantClass": 0,
        "Source": "SocketIOWithTimeout.java:335",
        "ThreadID": 1,
        "ThreadName": "",
        "EventID": "9F4686661E7A093F",
        "ProcessID": 2801
      },
      {
        "Cycles": 0,
        "Agent": "edu.brown.cs.systems.xtrace.logging.BaggageWrappers",
        "ProcessName": "Data",
        "TaskID": "0900A33A023FED74",
        "ParentEventID": [
          "1718DBCD55D2927C"
        ],
        "Label": "Forking current baggage with Baggage.fork()",
        "Title": "X-Trace Task",
        "Host": "pinky20.mpi-sws.org",
        "HRT": 6569793645958615,
        "Operation": "fork",
        "Timestamp": "1557750229227.254395",
        "TenantClass": 0,
        "Source": "PacketHeader.java:95",
        "ThreadID": 14554,
        "ThreadName": "",
        "EventID": "13A12BE3503A10E8",
        "BaggageBytes": "[[248 5] [240 0] [0 9 0 163 58 2 63 237 116] [240 1] [0 23 24 219 205 85 210 146 124] [240 3] [0 2]]",
        "ProcessID": 13111
      },
      {
        "Cycles": 0,
        "Agent": "Execution-Sleep",
        "ProcessName": "Data",
        "TaskID": "0900A33A023FED74",
        "ParentEventID": [
          "13A12BE3503A10E8"
        ],
        "Label": "waited",
        "Title": "X-Trace Task",
        "Host": "pinky20.mpi-sws.org",
        "Duration": "11834",
        "HRT": 6569793646115889,
        "Operation": "waited",
        "Timestamp": "1557750229227.411621",
        "TenantClass": 0,
        "Source": "SocketIOWithTimeout.java:335",
        "ThreadID": 14554,
        "ThreadName": "",
        "EventID": "717AE1E53D8CF5A3",
        "BaggageBytes": "[[248 5] [240 0] [0 9 0 163 58 2 63 237 116] [240 1] [0 19 161 43 227 80 58 16 232] [240 3] [0 2]]",
        "ProcessID": 13111
      },
      {
        "Cycles": 0,
        "Agent": "Execution-Sleep",
        "ProcessName": "Read",
        "TaskID": "0900A33A023FED74",
        "ParentEventID": [
          "A902D8CF4C4B08C8"
        ],
        "Label": "waited",
        "Title": "X-Trace Task",
        "Host": "pinky19.mpi-sws.org",
        "Duration": "159699",
        "HRT": 26966589287631057,
        "Operation": "waited",
        "Timestamp": "1557750229228.117676",
        "TenantClass": 0,
        "Source": "SocketIOWithTimeout.java:335",
        "ThreadID": 1,
        "ThreadName": "",
        "EventID": "3F4FB34A7C837A9A",
        "ProcessID": 2801
      },
      {
        "Cycles": 0,
        "Agent": "Execution-Sleep",
        "ProcessName": "Read",
        "TaskID": "0900A33A023FED74",
        "ParentEventID": [
          "9F4686661E7A093F"
        ],
        "Label": "waited",
        "Title": "X-Trace Task",
        "Host": "pinky19.mpi-sws.org",
        "Duration": "363429",
        "HRT": 26966589287425932,
        "Operation": "waited",
        "Timestamp": "1557750229227.912598",
        "TenantClass": 0,
        "Source": "SocketIOWithTimeout.java:335",
        "ThreadID": 1,
        "ThreadName": "",
        "EventID": "A902D8CF4C4B08C8",
        "ProcessID": 2801
      },
      {
        "Cycles": 0,
        "Agent": "edu.brown.cs.systems.xtrace.logging.BaggageWrappers",
        "ProcessName": "Data",
        "TaskID": "0900A33A023FED74",
        "ParentEventID": [
          "717AE1E53D8CF5A3"
        ],
        "Label": "Forking current baggage with Baggage.fork()",
        "Title": "X-Trace Task",
        "Host": "pinky20.mpi-sws.org",
        "HRT": 6569793646315663,
        "Operation": "fork",
        "Timestamp": "1557750229227.611328",
        "TenantClass": 0,
        "Source": "PacketHeader.java:95",
        "ThreadID": 14554,
        "ThreadName": "",
        "EventID": "F3F186DE8F3EA579",
        "BaggageBytes": "[[248 5] [240 0] [0 9 0 163 58 2 63 237 116] [240 1] [0 113 122 225 229 61 140 245 163] [240 3] [0 2]]",
        "ProcessID": 13111
      },
      {
        "Cycles": 0,
        "Agent": "edu.brown.cs.systems.xtrace.logging.BaggageWrappers",
        "ProcessName": "Read",
        "TaskID": "0900A33A023FED74",
        "ParentEventID": [
          "A70D9CEF5435B2EF",
          "13A12BE3503A10E8"
        ],
        "Label": "Merged current baggage with other baggage",
        "Title": "X-Trace Task",
        "Host": "pinky19.mpi-sws.org",
        "HRT": 26966589287816703,
        "Operation": "join",
        "Timestamp": "1557750229228.303223",
        "TenantClass": 0,
        "Source": "PacketHeader.java:168",
        "ThreadID": 1,
        "ThreadName": "",
        "EventID": "92CD4D458E4A2FCB",
        "ProcessID": 2801
      },
      {
        "Cycles": 0,
        "Agent": "Execution-Sleep",
        "ProcessName": "Read",
        "TaskID": "0900A33A023FED74",
        "ParentEventID": [
          "3F4FB34A7C837A9A"
        ],
        "Label": "waited",
        "Title": "X-Trace Task",
        "Host": "pinky19.mpi-sws.org",
        "Duration": "98552",
        "HRT": 26966589287781757,
        "Operation": "waited",
        "Timestamp": "1557750229228.268311",
        "TenantClass": 0,
        "Source": "SocketIOWithTimeout.java:335",
        "ThreadID": 1,
        "ThreadName": "",
        "EventID": "A70D9CEF5435B2EF",
        "ProcessID": 2801
      },
      {
        "Cycles": 0,
        "Agent": "Execution-Sleep",
        "ProcessName": "Data",
        "TaskID": "0900A33A023FED74",
        "ParentEventID": [
          "F3F186DE8F3EA579"
        ],
        "Label": "waited",
        "Title": "X-Trace Task",
        "Host": "pinky20.mpi-sws.org",
        "Duration": "165217",
        "HRT": 6569793646629456,
        "Operation": "waited",
        "Timestamp": "1557750229227.925293",
        "TenantClass": 0,
        "Source": "SocketIOWithTimeout.java:335",
        "ThreadID": 14554,
        "ThreadName": "",
        "EventID": "578AC821389CA1BB",
        "BaggageBytes": "[[248 5] [240 0] [0 9 0 163 58 2 63 237 116] [240 1] [0 243 241 134 222 143 62 165 121] [240 3] [0 2]]",
        "ProcessID": 13111
      },
      {
        "Cycles": 0,
        "Agent": "edu.brown.cs.systems.xtrace.logging.BaggageWrappers",
        "ProcessName": "Data",
        "TaskID": "0900A33A023FED74",
        "ParentEventID": [
          "578AC821389CA1BB"
        ],
        "Label": "Forking current baggage with Baggage.fork()",
        "Title": "X-Trace Task",
        "Host": "pinky20.mpi-sws.org",
        "HRT": 6569793646815510,
        "Operation": "fork",
        "Timestamp": "1557750229228.111328",
        "TenantClass": 0,
        "Source": "PacketHeader.java:95",
        "ThreadID": 14554,
        "ThreadName": "",
        "EventID": "E1E94E05FC22D501",
        "BaggageBytes": "[[248 5] [240 0] [0 9 0 163 58 2 63 237 116] [240 1] [0 87 138 200 33 56 156 161 187] [240 3] [0 2]]",
        "ProcessID": 13111
      },
      {
        "Cycles": 0,
        "Agent": "Execution-Sleep",
        "ProcessName": "Data",
        "TaskID": "0900A33A023FED74",
        "ParentEventID": [
          "E1E94E05FC22D501"
        ],
        "Label": "waited",
        "Title": "X-Trace Task",
        "Host": "pinky20.mpi-sws.org",
        "Duration": "10037",
        "HRT": 6569793646983310,
        "Operation": "waited",
        "Timestamp": "1557750229228.279053",
        "TenantClass": 0,
        "Source": "SocketIOWithTimeout.java:335",
        "ThreadID": 14554,
        "ThreadName": "",
        "EventID": "2996A013983A84C9",
        "BaggageBytes": "[[248 5] [240 0] [0 9 0 163 58 2 63 237 116] [240 1] [0 225 233 78 5 252 34 213 1] [240 3] [0 2]]",
        "ProcessID": 13111
      },
      {
        "Cycles": 0,
        "Agent": "Execution-CPU",
        "ProcessName": "Data",
        "TaskID": "0900A33A023FED74",
        "ParentEventID": [
          "2996A013983A84C9"
        ],
        "Label": "unset",
        "Title": "X-Trace Task",
        "Host": "pinky20.mpi-sws.org",
        "Duration": "1906679",
        "HRT": 6569793647404894,
        "Operation": "unset",
        "Timestamp": "1557750229228.700684",
        "TenantClass": 0,
        "Source": "DataXceiver.java:261",
        "ThreadID": 14554,
        "ThreadName": "",
        "EventID": "6776FC9C9B07D70B",
        "BaggageBytes": "[[248 5] [240 0] [0 9 0 163 58 2 63 237 116] [240 1] [0 41 150 160 19 152 58 132 201] [240 3] [0 2]]",
        "ProcessID": 13111
      },
      {
        "Cycles": 0,
        "Agent": "edu.brown.cs.systems.retro.benchmarks.hdfs_client.Reader",
        "ProcessName": "Read",
        "TaskID": "0900A33A023FED74",
        "ParentEventID": [
          "0"
        ],
        "Label": "Reading file",
        "Title": "X-Trace Task",
        "Host": "pinky19.mpi-sws.org",
        "HRT": 26966589282457811,
        "Timestamp": "1557750229222.944336",
        "TenantClass": 0,
        "ThreadID": 1,
        "ThreadName": "",
        "EventID": "23A27CFD21C4EDDF",
        "ProcessID": 2801,
        "Tag": [
          "reader_100kb",
          "Read Size: 102400"
        ]
      }
    ]
  }
]