[
  {
    "id": "CE4E5204B4452CA0",
    "reports": [
      {
        "Cycles": 0,
        "Agent": "Execution-CPU",
        "ProcessName": "Read",
        "TaskID": "CE4E5204B4452CA0",
        "ParentEventID": [
          "3695CB8FF9375659"
        ],
        "Label": "unset",
        "Title": "X-Trace Task",
        "Host": "pinky19.mpi-sws.org",
        "Duration": "24509151",
        "HRT": 26966661770014089,
        "Operation": "unset",
        "Timestamp": "1557750301710.400146",
        "TenantClass": 0,
        "Source": "Client.java:1027",
        "ThreadID": 1,
        "ThreadName": "",
        "EventID": "FF010367142E8D3E",
        "ProcessID": 2801
      },
      {
        "Cycles": 0,
        "Agent": "org.apache.hadoop.ipc.ProtobufRpcEngine",
        "ProcessName": "Read",
        "TaskID": "CE4E5204B4452CA0",
        "ParentEventID": [
          "0CDA53EDE60C6C2E"
        ],
        "Label": "Invoking org.apache.hadoop.hdfs.protocol.ClientProtocol.getBlockLocations",
        "Title": "X-Trace Task",
        "Host": "pinky19.mpi-sws.org",
        "HRT": 26966661769969541,
        "Timestamp": "1557750301710.355469",
        "TenantClass": 0,
        "Source": "ProtobufRpcEngine.java:228",
        "ThreadID": 1,
        "ThreadName": "",
        "EventID": "3695CB8FF9375659",
        "ProcessID": 2801
      },
      {
        "Cycles": 0,
        "Agent": "edu.brown.cs.systems.retro.benchmarks.hdfs_client.Reader",
        "ProcessName": "Read",
        "TaskID": "CE4E5204B4452CA0",
        "ParentEventID": [
          "3ED4F6B41E964BC7"
        ],
        "Label": "Reading file",
        "Title": "X-Trace Task",
        "Host": "pinky19.mpi-sws.org",
        "HRT": 26966661769919582,
        "Timestamp": "1557750301710.305664",
        "TenantClass": 0,
        "ThreadID": 1,
        "ThreadName": "",
        "EventID": "0CDA53EDE60C6C2E",
        "ProcessID": 2801
      },
      {
        "Cycles": 0,
        "Agent": "Execution-CPU",
        "ProcessName": "Read",
        "TaskID": "CE4E5204B4452CA0",
        "ParentEventID": [
          "FF010367142E8D3E"
        ],
        "Label": "set",
        "Title": "X-Trace Task",
        "Host": "pinky19.mpi-sws.org",
        "HRT": 26966661770049773,
        "Operation": "set",
        "Timestamp": "1557750301710.435791",
        "TenantClass": 0,
        "Source": "Client.java:1032",
        "ThreadID": 41,
        "ThreadName": "",
        "EventID": "20447B7B8E992489",
        "ProcessID": 2801
      },
      {
        "Cycles": 0,
        "Agent": "edu.brown.cs.systems.xtrace.logging.BaggageWrappers",
        "ProcessName": "Read",
        "TaskID": "CE4E5204B4452CA0",
        "ParentEventID": [
          "20447B7B8E992489"
        ],
        "Label": "Forking current baggage with Baggage.fork()",
        "Title": "X-Trace Task",
        "Host": "pinky19.mpi-sws.org",
        "HRT": 26966661770069417,
        "Operation": "fork",
        "Timestamp": "1557750301710.455322",
        "TenantClass": 0,
        "Source": "Client.java:1043",
        "ThreadID": 41,
        "ThreadName": "",
        "EventID": "6F7BFDB1E56F17C1",
        "ProcessID": 2801
      },
      {
        "Cycles": 0,
        "Agent": "Execution-CPU",
        "ProcessName": "Read",
        "TaskID": "CE4E5204B4452CA0",
        "ParentEventID": [
          "6F7BFDB1E56F17C1"
        ],
        "Label": "unset",
        "Title": "X-Trace Task",
        "Host": "pinky19.mpi-sws.org",
        "Duration": "73123",
        "HRT": 26966661770142199,
        "Operation": "unset",
        "Timestamp": "1557750301710.528320",
        "TenantClass": 0,
        "Source": "Client.java:1062",
        "ThreadID": 41,
        "ThreadName": "",
        "EventID": "8160ACE9DCB97153",
        "ProcessID": 2801
      },
      {
        "Cycles": 0,
        "Agent": "Execution-CPU",
        "ProcessName": "Name",
        "TaskID": "CE4E5204B4452CA0",
        "ParentEventID": [
          "6F7BFDB1E56F17C1"
        ],
        "Label": "set",
        "Title": "X-Trace Task",
        "Host": "pinky19.mpi-sws.org",
        "HRT": 26966661770200726,
        "Operation": "set",
        "Timestamp": "1557750301710.619873",
        "TenantClass": 0,
        "Source": "Server.java:1840",
        "ThreadID": 48,
        "ThreadName": "",
        "EventID": "65453DA65488F4AD",
        "BaggageBytes": "[[248 5] [240 0] [0 206 78 82 4 180 69 44 160] [240 1] [0 111 123 253 177 229 111 23 193] [240 3] [0 2]]",
        "ProcessID": 2171
      },
      {
        "Cycles": 0,
        "Agent": "Execution-CPU",
        "ProcessName": "Read",
        "TaskID": "CE4E5204B4452CA0",
        "ParentEventID": [
          "8160ACE9DCB97153"
        ],
        "Label": "set",
        "Title": "X-Trace Task",
        "Host": "pinky19.mpi-sws.org",
        "HRT": 26966661770170939,
        "Operation": "set",
        "Timestamp": "1557750301710.556885",
        "TenantClass": 0,
        "Source": "Client.java:1104",
        "ThreadID": 1,
        "ThreadName": "",
        "EventID": "29BC8A0B89D4FBDE",
        "ProcessID": 2801
      },
      {
        "Cycles": 0,
        "Agent": "edu.brown.cs.systems.xtrace.logging.BaggageWrappers",
        "ProcessName": "Name",
        "TaskID": "CE4E5204B4452CA0",
        "ParentEventID": [
          "65453DA65488F4AD"
        ],
        "Label": "Forking current baggage with Baggage.fork()",
        "Title": "X-Trace Task",
        "Host": "pinky19.mpi-sws.org",
        "HRT": 26966661770231105,
        "Operation": "fork",
        "Timestamp": "1557750301710.650391",
        "TenantClass": 0,
        "Source": "Server.java:550",
        "ThreadID": 48,
        "ThreadName": "",
        "EventID": "683CAF664DBB7AB8",
        "BaggageBytes": "[[248 5] [240 0] [0 206 78 82 4 180 69 44 160] [240 1] [0 101 69 61 166 84 136 244 173] [240 3] [0 2]]",
        "ProcessID": 2171
      },
      {
        "Cycles": 0,
        "Agent": "Execution-CPU",
        "ProcessName": "Name",
        "TaskID": "CE4E5204B4452CA0",
        "ParentEventID": [
          "683CAF664DBB7AB8"
        ],
        "Label": "set",
        "Title": "X-Trace Task",
        "Host": "pinky19.mpi-sws.org",
        "HRT": 26966661770260178,
        "Operation": "set",
        "Timestamp": "1557750301710.679443",
        "TenantClass": 0,
        "Source": "Server.java:2071",
        "ThreadID": 56,
        "ThreadName": "",
        "EventID": "DAC9A1DF7DA61C13",
        "BaggageBytes": "[[248 5] [240 0] [0 206 78 82 4 180 69 44 160] [240 1] [0 104 60 175 102 77 187 122 184] [240 3] [0 2]]",
        "ProcessID": 2171
      },
      {
        "Cycles": 0,
        "Agent": "org.apache.hadoop.ipc.Server",
        "ProcessName": "Name",
        "TaskID": "CE4E5204B4452CA0",
        "ParentEventID": [
          "DAC9A1DF7DA61C13"
        ],
        "Label": "getBlockLocations in org.apache.hadoop.hdfs.protocol.ClientProtocol",
        "Title": "X-Trace Task",
        "Host": "pinky19.mpi-sws.org",
        "HRT": 26966661770291055,
        "Timestamp": "1557750301710.710205",
        "TenantClass": 0,
        "Source": "ProtobufRpcEngine.java:601",
        "ThreadID": 56,
        "ThreadName": "",
        "EventID": "01237B85B113A407",
        "BaggageBytes": "[[248 5] [240 0] [0 206 78 82 4 180 69 44 160] [240 1] [0 218 201 161 223 125 166 28 19] [240 3] [0 2]]",
        "ProcessID": 2171
      },
      {
        "Cycles": 0,
        "Agent": "Execution-CPU",
        "ProcessName": "Name",
        "TaskID": "CE4E5204B4452CA0",
        "ParentEventID": [
          "683CAF664DBB7AB8"
        ],
        "Label": "unset",
        "Title": "X-Trace Task",
        "Host": "pinky19.mpi-sws.org",
        "Duration": "24365",
        "HRT": 26966661770251442,
        "Operation": "unset",
        "Timestamp": "1557750301710.670654",
        "TenantClass": 0,
        "Source": "Server.java:1828",
        "ThreadID": 48,
        "ThreadName": "",
        "EventID": "E6A1804740E61A02",
        "BaggageBytes": "[[248 5] [240 0] [0 206 78 82 4 180 69 44 160] [240 1] [0 104 60 175 102 77 187 122 184] [240 3] [0 2]]",
        "ProcessID": 2171
      },
      {
        "Cycles": 0,
        "Agent": "org.apache.hadoop.hdfs.server.namenode.FSNamesystem.audit",
        "ProcessName": "Name",
        "TaskID": "CE4E5204B4452CA0",
        "ParentEventID": [
          "01237B85B113A407"
        ],
        "Label": "allowed=true\tugi=plascas (auth:SIMPLE)\tip=/139.19.171.63\tcmd=open\tsrc=/ds/Aqqs2VitwinjEuJo\tdst=null\tperm=null\tproto=rpc",
        "Title": "X-Trace Task",
        "Host": "pinky19.mpi-sws.org",
        "HRT": 26966661770350028,
        "Timestamp": "1557750301710.769287",
        "TenantClass": 0,
        "Source": "FSNamesystem.java:8313",
        "ThreadID": 56,
        "ThreadName": "",
        "EventID": "1C7CCC330ED95E17",
        "BaggageBytes": "[[248 5] [240 0] [0 206 78 82 4 180 69 44 160] [240 1] [0 1 35 123 133 177 19 164 7] [240 3] [0 2]]",
        "ProcessID": 2171
      },
      {
        "Cycles": 0,
        "Agent": "Execution-CPU",
        "ProcessName": "Name",
        "TaskID": "CE4E5204B4452CA0",
        "ParentEventID": [
          "F7E4010D0B12E484"
        ],
        "Label": "unset",
        "Title": "X-Trace Task",
        "Host": "pinky19.mpi-sws.org",
        "Duration": "271745",
        "HRT": 26966661770551581,
        "Operation": "unset",
        "Timestamp": "1557750301710.970703",
        "TenantClass": 0,
        "Source": "Server.java:1058",
        "ThreadID": 56,
        "ThreadName": "",
        "EventID": "6BD252929FA129A0",
        "BaggageBytes": "[[248 5] [240 0] [0 206 78 82 4 180 69 44 160] [240 1] [0 247 228 1 13 11 18 228 132] [240 3] [0 2]]",
        "ProcessID": 2171
      },
      {
        "Cycles": 0,
        "Agent": "edu.brown.cs.systems.xtrace.logging.BaggageWrappers",
        "ProcessName": "Name",
        "TaskID": "CE4E5204B4452CA0",
        "ParentEventID": [
          "1C7CCC330ED95E17"
        ],
        "Label": "Forking current baggage with Baggage.fork()",
        "Title": "X-Trace Task",
        "Host": "pinky19.mpi-sws.org",
        "HRT": 26966661770400650,
        "Operation": "fork",
        "Timestamp": "1557750301710.819824",
        "TenantClass": 0,
        "Source": "Server.java:2398",
        "ThreadID": 56,
        "ThreadName": "",
        "EventID": "F7E4010D0B12E484",
        "BaggageBytes": "[[248 5] [240 0] [0 206 78 82 4 180 69 44 160] [240 1] [0 28 124 204 51 14 217 94 23] [240 3] [0 2]]",
        "ProcessID": 2171
      },
      {
        "Cycles": 0,
        "Agent": "Execution-CPU",
        "ProcessName": "Read",
        "TaskID": "CE4E5204B4452CA0",
        "ParentEventID": [
          "F7E4010D0B12E484"
        ],
        "Label": "set",
        "Title": "X-Trace Task",
        "Host": "pinky19.mpi-sws.org",
        "HRT": 26966661770598304,
        "Operation": "set",
        "Timestamp": "1557750301710.984375",
        "TenantClass": 0,
        "Source": "Client.java:302",
        "ThreadID": 40,
        "ThreadName": "",
        "EventID": "A17A6FA0EC85B534",
        "ProcessID": 2801
      },
      {
        "Cycles": 0,
        "Agent": "Execution-Sleep",
        "ProcessName": "Read",
        "TaskID": "CE4E5204B4452CA0",
        "ParentEventID": [
          "29BC8A0B89D4FBDE"
        ],
        "Label": "waited",
        "Title": "X-Trace Task",
        "Host": "pinky19.mpi-sws.org",
        "Duration": "463364",
        "HRT": 26966661770645413,
        "Operation": "waited",
        "Timestamp": "1557750301711.031494",
        "TenantClass": 0,
        "Source": "Client.java:1537",
        "ThreadID": 1,
        "ThreadName": "",
        "EventID": "D831579BBBD27144",
        "ProcessID": 2801
      },
      {
        "Cycles": 0,
        "Agent": "edu.brown.cs.systems.xtrace.logging.BaggageWrappers",
        "ProcessName": "Read",
        "TaskID": "CE4E5204B4452CA0",
        "ParentEventID": [
          "89E458EBCE1B19E1",
          "D831579BBBD27144"
        ],
        "Label": "Merged current baggage with other baggage",
        "Title": "X-Trace Task",
        "Host": "pinky19.mpi-sws.org",
        "HRT": 26966661770658129,
        "Operation": "join",
        "Timestamp": "1557750301711.044189",
        "TenantClass": 0,
        "Source": "Client.java:1545",
        "ThreadID": 1,
        "ThreadName": "",
        "EventID": "D6F4738BF28CD573",
        "ProcessID": 2801
      },
      {
        "Cycles": 0,
        "Agent": "org.apache.hadoop.ipc.ProtobufRpcEngine",
        "ProcessName": "Read",
        "TaskID": "CE4E5204B4452CA0",
        "ParentEventID": [
          "D6F4738BF28CD573"
        ],
        "Label": "org.apache.hadoop.hdfs.protocol.ClientProtocol.getBlockLocations completed",
        "Title": "X-Trace Task",
        "Host": "pinky19.mpi-sws.org",
        "HRT": 26966661770722533,
        "Timestamp": "1557750301711.108643",
        "TenantClass": 0,
        "Source": "ProtobufRpcEngine.java:275",
        "ThreadID": 1,
        "ThreadName": "",
        "EventID": "014FE231BF139789",
        "ProcessID": 2801
      },
      {
        "Cycles": 0,
        "Agent": "Execution-CPU",
        "ProcessName": "Read",
        "TaskID": "CE4E5204B4452CA0",
        "ParentEventID": [
          "A17A6FA0EC85B534"
        ],
        "Label": "unset",
        "Title": "X-Trace Task",
        "Host": "pinky19.mpi-sws.org",
        "Duration": "11820",
        "HRT": 26966661770624172,
        "Operation": "unset",
        "Timestamp": "1557750301711.010254",
        "TenantClass": 0,
        "Source": "Client.java:1168",
        "ThreadID": 40,
        "ThreadName": "",
        "EventID": "89E458EBCE1B19E1",
        "ProcessID": 2801
      },
      {
        "Cycles": 0,
        "Agent": "Execution-Sleep",
        "ProcessName": "Read",
        "TaskID": "CE4E5204B4452CA0",
        "ParentEventID": [
          "014FE231BF139789"
        ],
        "Label": "waited",
        "Title": "X-Trace Task",
        "Host": "pinky19.mpi-sws.org",
        "Duration": "123505",
        "HRT": 26966661770963636,
        "Operation": "waited",
        "Timestamp": "1557750301711.349609",
        "TenantClass": 0,
        "Source": "SocketIOWithTimeout.java:335",
        "ThreadID": 1,
        "ThreadName": "",
        "EventID": "317D1FA8433C280B",
        "ProcessID": 2801
      },
      {
        "Cycles": 0,
        "Agent": "edu.brown.cs.systems.xtrace.logging.BaggageWrappers",
        "ProcessName": "Read",
        "TaskID": "CE4E5204B4452CA0",
        "ParentEventID": [
          "317D1FA8433C280B"
        ],
        "Label": "Forking current baggage with Baggage.fork()",
        "Title": "X-Trace Task",
        "Host": "pinky19.mpi-sws.org",
        "HRT": 26966661771007256,
        "Operation": "fork",
        "Timestamp": "1557750301711.393311",
        "TenantClass": 0,
        "Source": "DataTransferProtoUtil.java:94",
        "ThreadID": 1,
        "ThreadName": "",
        "EventID": "7B558975E7C2A489",
        "ProcessID": 2801
      },
      {
        "Cycles": 0,
        "Agent": "edu.brown.cs.systems.xtrace.logging.XTraceInit",
        "ProcessName": "Data",
        "TaskID": "CE4E5204B4452CA0",
        "ParentEventID": [
          "E407BDF82F1C32BE"
        ],
        "Label": "Thread.setName: DataXceiver for client DFSClient_NONMAPREDUCE_310321604_1 at /139.19.171.63:50228 [Sending block BP-1633380353-139.19.171.63-1554193446451:blk_1073755843_15019]",
        "Title": "X-Trace Task",
        "Host": "pinky25.mpi-sws.org",
        "HRT": 47515767012941127,
        "Timestamp": "1557750301711.994629",
        "TenantClass": 0,
        "Source": "DataXceiver.java:168",
        "ThreadID": 14527,
        "ThreadName": "",
        "EventID": "38ED921926E7D909",
        "BaggageBytes": "[[248 5] [240 0] [0 206 78 82 4 180 69 44 160] [240 1] [0 228 7 189 248 47 28 50 190] [240 3] [0 2]]",
        "ProcessID": 28198
      },
      {
        "Cycles": 0,
        "Agent": "Execution-CPU",
        "ProcessName": "Data",
        "TaskID": "CE4E5204B4452CA0",
        "ParentEventID": [
          "7B558975E7C2A489"
        ],
        "Label": "set",
        "Title": "X-Trace Task",
        "Host": "pinky25.mpi-sws.org",
        "HRT": 47515767012797199,
        "Operation": "set",
        "Timestamp": "1557750301711.850586",
        "TenantClass": 0,
        "Source": "Receiver.java:117",
        "ThreadID": 14527,
        "ThreadName": "",
        "EventID": "E407BDF82F1C32BE",
        "BaggageBytes": "[[248 5] [240 0] [0 206 78 82 4 180 69 44 160] [240 1] [0 123 85 137 117 231 194 164 137] [240 3] [0 2]]",
        "ProcessID": 28198
      },
      {
        "Cycles": 0,
        "Agent": "edu.brown.cs.systems.xtrace.logging.BaggageWrappers",
        "ProcessName": "Data",
        "TaskID": "CE4E5204B4452CA0",
        "ParentEventID": [
          "38ED921926E7D909"
        ],
        "Label": "Forking current baggage with Baggage.fork()",
        "Title": "X-Trace Task",
        "Host": "pinky25.mpi-sws.org",
        "HRT": 47515767013158725,
        "Operation": "fork",
        "Timestamp": "1557750301712.212158",
        "TenantClass": 0,
        "Source": "DataXceiver.java:1257",
        "ThreadID": 14527,
        "ThreadName": "",
        "EventID": "EE3096FD47CA0622",
        "BaggageBytes": "[[248 5] [240 0] [0 206 78 82 4 180 69 44 160] [240 1] [0 56 237 146 25 38 231 217 9] [240 3] [0 2]]",
        "ProcessID": 28198
      },
      {
        "Cycles": 0,
        "Agent": "Execution-Sleep",
        "ProcessName": "Read",
        "TaskID": "CE4E5204B4452CA0",
        "ParentEventID": [
          "7B558975E7C2A489"
        ],
        "Label": "waited",
        "Title": "X-Trace Task",
        "Host": "pinky19.mpi-sws.org",
        "Duration": "878639",
        "HRT": 26966661771964848,
        "Operation": "waited",
        "Timestamp": "1557750301712.350830",
        "TenantClass": 0,
        "Source": "SocketIOWithTimeout.java:335",
        "ThreadID": 1,
        "ThreadName": "",
        "EventID": "F481BB855C61E6A4",
        "ProcessID": 2801
      },
      {
        "Cycles": 0,
        "Agent": "edu.brown.cs.systems.xtrace.logging.BaggageWrappers",
        "ProcessName": "Data",
        "TaskID": "CE4E5204B4452CA0",
        "ParentEventID": [
          "EE3096FD47CA0622"
        ],
        "Label": "Forking current baggage with Baggage.fork()",
        "Title": "X-Trace Task",
        "Host": "pinky25.mpi-sws.org",
        "HRT": 47515767013284682,
        "Operation": "fork",
        "Timestamp": "1557750301712.338135",
        "TenantClass": 0,
        "Source": "PacketHeader.java:95",
        "ThreadID": 14527,
        "ThreadName": "",
        "EventID": "D86AB41105E896F1",
        "BaggageBytes": "[[248 5] [240 0] [0 206 78 82 4 180 69 44 160] [240 1] [0 238 48 150 253 71 202 6 34] [240 3] [0 2]]",
        "ProcessID": 28198
      },
      {
        "Cycles": 0,
        "Agent": "edu.brown.cs.systems.xtrace.logging.BaggageWrappers",
        "ProcessName": "Read",
        "TaskID": "CE4E5204B4452CA0",
        "ParentEventID": [
          "F481BB855C61E6A4",
          "EE3096FD47CA0622"
        ],
        "Label": "Merged current baggage with other baggage",
        "Title": "X-Trace Task",
        "Host": "pinky19.mpi-sws.org",
        "HRT": 26966661772053746,
        "Operation": "join",
        "Timestamp": "1557750301712.439697",
        "TenantClass": 0,
        "Source": "RemoteBlockReader2.java:429",
        "ThreadID": 1,
        "ThreadName": "",
        "EventID": "1D0429E026143E20",
        "ProcessID": 2801
      },
      {
        "Cycles": 0,
        "Agent": "Execution-Sleep",
        "ProcessName": "Data",
        "TaskID": "CE4E5204B4452CA0",
        "ParentEventID": [
          "D86AB41105E896F1"
        ],
        "Label": "waited",
        "Title": "X-Trace Task",
        "Host": "pinky25.mpi-sws.org",
        "Duration": "11192",
        "HRT": 47515767013400650,
        "Operation": "waited",
        "Timestamp": "1557750301712.454102",
        "TenantClass": 0,
        "Source": "SocketIOWithTimeout.java:335",
        "ThreadID": 14527,
        "ThreadName": "",
        "EventID": "36289A2CC1F5EA0F",
        "BaggageBytes": "[[248 5] [240 0] [0 206 78 82 4 180 69 44 160] [240 1] [0 216 106 180 17 5 232 150 241] [240 3] [0 2]]",
        "ProcessID": 28198
      },
      {
        "Cycles": 0,
        "Agent": "Execution-Sleep",
        "ProcessName": "Read",
        "TaskID": "CE4E5204B4452CA0",
        "ParentEventID": [
          "1D0429E026143E20"
        ],
        "Label": "waited",
        "Title": "X-Trace Task",
        "Host": "pinky19.mpi-sws.org",
        "Duration": "284807",
        "HRT": 26966661772456727,
        "Operation": "waited",
        "Timestamp": "1557750301712.842773",
        "TenantClass": 0,
        "Source": "SocketIOWithTimeout.java:335",
        "ThreadID": 1,
        "ThreadName": "",
        "EventID": "5FEFD63415902EB0",
        "ProcessID": 2801
      },
      {
        "Cycles": 0,
        "Agent": "Execution-Sleep",
        "ProcessName": "Read",
        "TaskID": "CE4E5204B4452CA0",
        "ParentEventID": [
          "5FEFD63415902EB0"
        ],
        "Label": "waited",
        "Title": "X-Trace Task",
        "Host": "pinky19.mpi-sws.org",
        "Duration": "227109",
        "HRT": 26966661772736333,
        "Operation": "waited",
        "Timestamp": "1557750301713.122314",
        "TenantClass": 0,
        "Source": "SocketIOWithTimeout.java:335",
        "ThreadID": 1,
        "ThreadName": "",
        "EventID": "B0AB9E2C44686B94",
        "ProcessID": 2801
      },
      {
        "Cycles": 0,
        "Agent": "Execution-Sleep",
        "ProcessName": "Read",
        "TaskID": "CE4E5204B4452CA0",
        "ParentEventID": [
          "B0AB9E2C44686B94"
        ],
        "Label": "waited",
        "Title": "X-Trace Task",
        "Host": "pinky19.mpi-sws.org",
        "Duration": "149494",
        "HRT": 26966661772944773,
        "Operation": "waited",
        "Timestamp": "1557750301713.330811",
        "TenantClass": 0,
        "Source": "SocketIOWithTimeout.java:335",
        "ThreadID": 1,
        "ThreadName": "",
        "EventID": "E4390816FC6A2E4C",
        "ProcessID": 2801
      },
      {
        "Cycles": 0,
        "Agent": "edu.brown.cs.systems.xtrace.logging.BaggageWrappers",
        "ProcessName": "Data",
        "TaskID": "CE4E5204B4452CA0",
        "ParentEventID": [
          "36289A2CC1F5EA0F"
        ],
        "Label": "Forking current baggage with Baggage.fork()",
        "Title": "X-Trace Task",
        "Host": "pinky25.mpi-sws.org",
        "HRT": 47515767013548005,
        "Operation": "fork",
        "Timestamp": "1557750301712.601562",
        "TenantClass": 0,
        "Source": "PacketHeader.java:95",
        "ThreadID": 14527,
        "ThreadName": "",
        "EventID": "76C72745C825E843",
        "BaggageBytes": "[[248 5] [240 0] [0 206 78 82 4 180 69 44 160] [240 1] [0 54 40 154 44 193 245 234 15] [240 3] [0 2]]",
        "ProcessID": 28198
      },
      {
        "Cycles": 0,
        "Agent": "edu.brown.cs.systems.xtrace.logging.BaggageWrappers",
        "ProcessName": "Read",
        "TaskID": "CE4E5204B4452CA0",
        "ParentEventID": [
          "D86AB41105E896F1",
          "E4390816FC6A2E4C"
        ],
        "Label": "Merged current baggage with other baggage",
        "Title": "X-Trace Task",
        "Host": "pinky19.mpi-sws.org",
        "HRT": 26966661773002561,
        "Operation": "join",
        "Timestamp": "1557750301713.388672",
        "TenantClass": 0,
        "Source": "PacketHeader.java:168",
        "ThreadID": 1,
        "ThreadName": "",
        "EventID": "FA38B5820DFDBAE6",
        "ProcessID": 2801
      },
      {
        "Cycles": 0,
        "Agent": "edu.brown.cs.systems.xtrace.logging.BaggageWrappers",
        "ProcessName": "Read",
        "TaskID": "CE4E5204B4452CA0",
        "ParentEventID": [
          "D1934FA44313BBB4"
        ],
        "Label": "Forking current baggage with Baggage.fork()",
        "Title": "X-Trace Task",
        "Host": "pinky19.mpi-sws.org",
        "HRT": 26966661773134759,
        "Operation": "fork",
        "Timestamp": "1557750301713.520752",
        "TenantClass": 0,
        "Source": "RemoteBlockReader2.java:361",
        "ThreadID": 1,
        "ThreadName": "",
        "EventID": "B5BAE7D5D220E76A",
        "ProcessID": 2801
      },
      {
        "Cycles": 0,
        "Agent": "edu.brown.cs.systems.xtrace.logging.BaggageWrappers",
        "ProcessName": "Read",
        "TaskID": "CE4E5204B4452CA0",
        "ParentEventID": [
          "FA38B5820DFDBAE6",
          "76C72745C825E843"
        ],
        "Label": "Merged current baggage with other baggage",
        "Title": "X-Trace Task",
        "Host": "pinky19.mpi-sws.org",
        "HRT": 26966661773122112,
        "Operation": "join",
        "Timestamp": "1557750301713.508057",
        "TenantClass": 0,
        "Source": "PacketHeader.java:168",
        "ThreadID": 1,
        "ThreadName": "",
        "EventID": "D1934FA44313BBB4",
        "ProcessID": 2801
      },
      {
        "Cycles": 0,
        "Agent": "Execution-Sleep",
        "ProcessName": "Data",
        "TaskID": "CE4E5204B4452CA0",
        "ParentEventID": [
          "76C72745C825E843"
        ],
        "Label": "waited",
        "Title": "X-Trace Task",
        "Host": "pinky25.mpi-sws.org",
        "Duration": "833997",
        "HRT": 47515767014522816,
        "Operation": "waited",
        "Timestamp": "1557750301713.576416",
        "TenantClass": 0,
        "Source": "SocketIOWithTimeout.java:335",
        "ThreadID": 14527,
        "ThreadName": "",
        "EventID": "3E226E99244F9728",
        "BaggageBytes": "[[248 5] [240 0] [0 206 78 82 4 180 69 44 160] [240 1] [0 118 199 39 69 200 37 232 67] [240 3] [0 2]]",
        "ProcessID": 28198
      },
      {
        "Cycles": 0,
        "Agent": "edu.brown.cs.systems.xtrace.logging.BaggageWrappers",
        "ProcessName": "Data",
        "TaskID": "CE4E5204B4452CA0",
        "ParentEventID": [
          "3E226E99244F9728",
          "B5BAE7D5D220E76A"
        ],
        "Label": "Merged current baggage with other baggage",
        "Title": "X-Trace Task",
        "Host": "pinky25.mpi-sws.org",
        "HRT": 47515767014653327,
        "Operation": "join",
        "Timestamp": "1557750301713.706787",
        "TenantClass": 0,
        "Source": "DataXceiver.java:574",
        "ThreadID": 14527,
        "ThreadName": "",
        "EventID": "A90D9D27D19873AC",
        "BaggageBytes": "[[248 5] [240 0] [0 206 78 82 4 180 69 44 160] [240 1] [0 181 186 231 213 210 32 231 106] [0 62 34 110 153 36 79 151 40] [240 3] [0 2]]",
        "ProcessID": 28198
      },
      {
        "Cycles": 0,
        "Agent": "Execution-CPU",
        "ProcessName": "Data",
        "TaskID": "CE4E5204B4452CA0",
        "ParentEventID": [
          "A90D9D27D19873AC"
        ],
        "Label": "unset",
        "Title": "X-Trace Task",
        "Host": "pinky25.mpi-sws.org",
        "Duration": "1830120",
        "HRT": 47515767014702982,
        "Operation": "unset",
        "Timestamp": "1557750301713.756348",
        "TenantClass": 0,
        "Source": "DataXceiver.java:261",
        "ThreadID": 14527,
        "ThreadName": "",
        "EventID": "3228B8BFD151BB83",
        "BaggageBytes": "[[248 5] [240 0] [0 206 78 82 4 180 69 44 160] [240 1] [0 169 13 157 39 209 152 115 172] [240 3] [0 2]]",
        "ProcessID": 28198
      },
      {
        "Cycles": 0,
        "Agent": "Execution-CPU",
        "ProcessName": "Data",
        "TaskID": "CE4E5204B4452CA0",
        "ParentEventID": [
          "EB5BF667F2BE6FF8"
        ],
        "Label": "set",
        "Title": "X-Trace Task",
        "Host": "pinky25.mpi-sws.org",
        "HRT": 47515767014773569,
        "Operation": "set",
        "Timestamp": "1557750301713.827148",
        "TenantClass": 0,
        "Source": "Receiver.java:117",
        "ThreadID": 14527,
        "ThreadName": "",
        "EventID": "AC1E07E04585F7CE",
        "BaggageBytes": "[[248 5] [240 0] [0 206 78 82 4 180 69 44 160] [240 1] [0 235 91 246 103 242 190 111 248] [240 3] [0 2]]",
        "ProcessID": 28198
      },
      {
        "Cycles": 0,
        "Agent": "edu.brown.cs.systems.xtrace.logging.BaggageWrappers",
        "ProcessName": "Read",
        "TaskID": "CE4E5204B4452CA0",
        "ParentEventID": [
          "B5BAE7D5D220E76A"
        ],
        "Label": "Forking current baggage with Baggage.fork()",
        "Title": "X-Trace Task",
        "Host": "pinky19.mpi-sws.org",
        "HRT": 26966661773194338,
        "Operation": "fork",
        "Timestamp": "1557750301713.580322",
        "TenantClass": 0,
        "Source": "DataTransferProtoUtil.java:94",
        "ThreadID": 1,
        "ThreadName": "",
        "EventID": "EB5BF667F2BE6FF8",
        "ProcessID": 2801
      },
      {
        "Cycles": 0,
        "Agent": "edu.brown.cs.systems.xtrace.logging.XTraceInit",
        "ProcessName": "Data",
        "TaskID": "CE4E5204B4452CA0",
        "ParentEventID": [
          "AC1E07E04585F7CE"
        ],
        "Label": "Thread.setName: DataXceiver for client DFSClient_NONMAPREDUCE_310321604_1 at /139.19.171.63:50228 [Sending block BP-1633380353-139.19.171.63-1554193446451:blk_1073755843_15019]",
        "Title": "X-Trace Task",
        "Host": "pinky25.mpi-sws.org",
        "HRT": 47515767014840251,
        "Timestamp": "1557750301713.893799",
        "TenantClass": 0,
        "Source": "DataXceiver.java:168",
        "ThreadID": 14527,
        "ThreadName": "",
        "EventID": "3B5CDB34A93D587C",
        "BaggageBytes": "[[248 5] [240 0] [0 206 78 82 4 180 69 44 160] [240 1] [0 172 30 7 224 69 133 247 206] [240 3] [0 2]]",
        "ProcessID": 28198
      },
      {
        "Cycles": 0,
        "Agent": "edu.brown.cs.systems.xtrace.logging.BaggageWrappers",
        "ProcessName": "Data",
        "TaskID": "CE4E5204B4452CA0",
        "ParentEventID": [
          "3B5CDB34A93D587C"
        ],
        "Label": "Forking current baggage with Baggage.fork()",
        "Title": "X-Trace Task",
        "Host": "pinky25.mpi-sws.org",
        "HRT": 47515767014994632,
        "Operation": "fork",
        "Timestamp": "1557750301714.048096",
        "TenantClass": 0,
        "Source": "DataXceiver.java:1257",
        "ThreadID": 14527,
        "ThreadName": "",
        "EventID": "8A71059087C50F33",
        "BaggageBytes": "[[248 5] [240 0] [0 206 78 82 4 180 69 44 160] [240 1] [0 59 92 219 52 169 61 88 124] [240 3] [0 2]]",
        "ProcessID": 28198
      },
      {
        "Cycles": 0,
        "Agent": "edu.brown.cs.systems.xtrace.logging.BaggageWrappers",
        "ProcessName": "Read",
        "TaskID": "CE4E5204B4452CA0",
        "ParentEventID": [
          "99666C913697D599",
          "8A71059087C50F33"
        ],
        "Label": "Merged current baggage with other baggage",
        "Title": "X-Trace Task",
        "Host": "pinky19.mpi-sws.org",
        "HRT": 26966661773847923,
        "Operation": "join",
        "Timestamp": "1557750301714.233887",
        "TenantClass": 0,
        "Source": "RemoteBlockReader2.java:429",
        "ThreadID": 1,
        "ThreadName": "",
        "EventID": "1D55424EE6E138EF",
        "ProcessID": 2801
      },
      {
        "Cycles": 0,
        "Agent": "Execution-Sleep",
        "ProcessName": "Read",
        "TaskID": "CE4E5204B4452CA0",
        "ParentEventID": [
          "EB5BF667F2BE6FF8"
        ],
        "Label": "waited",
        "Title": "X-Trace Task",
        "Host": "pinky19.mpi-sws.org",
        "Duration": "509905",
        "HRT": 26966661773776800,
        "Operation": "waited",
        "Timestamp": "1557750301714.162842",
        "TenantClass": 0,
        "Source": "SocketIOWithTimeout.java:335",
        "ThreadID": 1,
        "ThreadName": "",
        "EventID": "99666C913697D599",
        "ProcessID": 2801
      },
      {
        "Cycles": 0,
        "Agent": "edu.brown.cs.systems.xtrace.logging.BaggageWrappers",
        "ProcessName": "Data",
        "TaskID": "CE4E5204B4452CA0",
        "ParentEventID": [
          "8A71059087C50F33"
        ],
        "Label": "Forking current baggage with Baggage.fork()",
        "Title": "X-Trace Task",
        "Host": "pinky25.mpi-sws.org",
        "HRT": 47515767015084592,
        "Operation": "fork",
        "Timestamp": "1557750301714.138184",
        "TenantClass": 0,
        "Source": "PacketHeader.java:95",
        "ThreadID": 14527,
        "ThreadName": "",
        "EventID": "A8CE9D7DC00CA9C6",
        "BaggageBytes": "[[248 5] [240 0] [0 206 78 82 4 180 69 44 160] [240 1] [0 138 113 5 144 135 197 15 51] [240 3] [0 2]]",
        "ProcessID": 28198
      },
      {
        "Cycles": 0,
        "Agent": "Execution-Sleep",
        "ProcessName": "Data",
        "TaskID": "CE4E5204B4452CA0",
        "ParentEventID": [
          "A8CE9D7DC00CA9C6"
        ],
        "Label": "waited",
        "Title": "X-Trace Task",
        "Host": "pinky25.mpi-sws.org",
        "Duration": "6619",
        "HRT": 47515767015218010,
        "Operation": "waited",
        "Timestamp": "1557750301714.271484",
        "TenantClass": 0,
        "Source": "SocketIOWithTimeout.java:335",
        "ThreadID": 14527,
        "ThreadName": "",
        "EventID": "2E903BE011E4BF7E",
        "BaggageBytes": "[[248 5] [240 0] [0 206 78 82 4 180 69 44 160] [240 1] [0 168 206 157 125 192 12 169 198] [240 3] [0 2]]",
        "ProcessID": 28198
      },
      {
        "Cycles": 0,
        "Agent": "Execution-Sleep",
        "ProcessName": "Read",
        "TaskID": "CE4E5204B4452CA0",
        "ParentEventID": [
          "1D55424EE6E138EF"
        ],
        "Label": "waited",
        "Title": "X-Trace Task",
        "Host": "pinky19.mpi-sws.org",
        "Duration": "32159",
        "HRT": 26966661773925380,
        "Operation": "waited",
        "Timestamp": "1557750301714.311279",
        "TenantClass": 0,
        "Source": "SocketIOWithTimeout.java:335",
        "ThreadID": 1,
        "ThreadName": "",
        "EventID": "5E4E976FB89FF826",
        "ProcessID": 2801
      },
      {
        "Cycles": 0,
        "Agent": "Execution-Sleep",
        "ProcessName": "Read",
        "TaskID": "CE4E5204B4452CA0",
        "ParentEventID": [
          "5E4E976FB89FF826"
        ],
        "Label": "waited",
        "Title": "X-Trace Task",
        "Host": "pinky19.mpi-sws.org",
        "Duration": "235211",
        "HRT": 26966661774252615,
        "Operation": "waited",
        "Timestamp": "1557750301714.638672",
        "TenantClass": 0,
        "Source": "SocketIOWithTimeout.java:335",
        "ThreadID": 1,
        "ThreadName": "",
        "EventID": "7D3777219D02966C",
        "ProcessID": 2801
      },
      {
        "Cycles": 0,
        "Agent": "Execution-Sleep",
        "ProcessName": "Read",
        "TaskID": "CE4E5204B4452CA0",
        "ParentEventID": [
          "7D3777219D02966C"
        ],
        "Label": "waited",
        "Title": "X-Trace Task",
        "Host": "pinky19.mpi-sws.org",
        "Duration": "110460",
        "HRT": 26966661774431311,
        "Operation": "waited",
        "Timestamp": "1557750301714.817383",
        "TenantClass": 0,
        "Source": "SocketIOWithTimeout.java:335",
        "ThreadID": 1,
        "ThreadName": "",
        "EventID": "706E9FAC50C5724E",
        "ProcessID": 2801
      },
      {
        "Cycles": 0,
        "Agent": "edu.brown.cs.systems.xtrace.logging.BaggageWrappers",
        "ProcessName": "Data",
        "TaskID": "CE4E5204B4452CA0",
        "ParentEventID": [
          "2E903BE011E4BF7E"
        ],
        "Label": "Forking current baggage with Baggage.fork()",
        "Title": "X-Trace Task",
        "Host": "pinky25.mpi-sws.org",
        "HRT": 47515767015306271,
        "Operation": "fork",
        "Timestamp": "1557750301714.359863",
        "TenantClass": 0,
        "Source": "PacketHeader.java:95",
        "ThreadID": 14527,
        "ThreadName": "",
        "EventID": "57ECDD3E99C4E9C2",
        "BaggageBytes": "[[248 5] [240 0] [0 206 78 82 4 180 69 44 160] [240 1] [0 46 144 59 224 17 228 191 126] [240 3] [0 2]]",
        "ProcessID": 28198
      },
      {
        "Cycles": 0,
        "Agent": "Execution-Sleep",
        "ProcessName": "Read",
        "TaskID": "CE4E5204B4452CA0",
        "ParentEventID": [
          "706E9FAC50C5724E"
        ],
        "Label": "waited",
        "Title": "X-Trace Task",
        "Host": "pinky19.mpi-sws.org",
        "Duration": "111363",
        "HRT": 26966661774590111,
        "Operation": "waited",
        "Timestamp": "1557750301714.976074",
        "TenantClass": 0,
        "Source": "SocketIOWithTimeout.java:335",
        "ThreadID": 1,
        "ThreadName": "",
        "EventID": "D391EC4FBECCF6AF",
        "ProcessID": 2801
      },
      {
        "Cycles": 0,
        "Agent": "edu.brown.cs.systems.xtrace.logging.BaggageWrappers",
        "ProcessName": "Read",
        "TaskID": "CE4E5204B4452CA0",
        "ParentEventID": [
          "D391EC4FBECCF6AF",
          "A8CE9D7DC00CA9C6"
        ],
        "Label": "Merged current baggage with other baggage",
        "Title": "X-Trace Task",
        "Host": "pinky19.mpi-sws.org",
        "HRT": 26966661774631184,
        "Operation": "join",
        "Timestamp": "1557750301715.017090",
        "TenantClass": 0,
        "Source": "PacketHeader.java:168",
        "ThreadID": 1,
        "ThreadName": "",
        "EventID": "D755355B1C598B74",
        "ProcessID": 2801
      },
      {
        "Cycles": 0,
        "Agent": "Execution-Sleep",
        "ProcessName": "Data",
        "TaskID": "CE4E5204B4452CA0",
        "ParentEventID": [
          "57ECDD3E99C4E9C2"
        ],
        "Label": "waited",
        "Title": "X-Trace Task",
        "Host": "pinky25.mpi-sws.org",
        "Duration": "329442",
        "HRT": 47515767015741684,
        "Operation": "waited",
        "Timestamp": "1557750301714.795166",
        "TenantClass": 0,
        "Source": "SocketIOWithTimeout.java:335",
        "ThreadID": 14527,
        "ThreadName": "",
        "EventID": "5DBA67B611E147E3",
        "BaggageBytes": "[[248 5] [240 0] [0 206 78 82 4 180 69 44 160] [240 1] [0 87 236 221 62 153 196 233 194] [240 3] [0 2]]",
        "ProcessID": 28198
      },
      {
        "Cycles": 0,
        "Agent": "edu.brown.cs.systems.xtrace.logging.BaggageWrappers",
        "ProcessName": "Data",
        "TaskID": "CE4E5204B4452CA0",
        "ParentEventID": [
          "5DBA67B611E147E3"
        ],
        "Label": "Forking current baggage with Baggage.fork()",
        "Title": "X-Trace Task",
        "Host": "pinky25.mpi-sws.org",
        "HRT": 47515767015872702,
        "Operation": "fork",
        "Timestamp": "1557750301714.926270",
        "TenantClass": 0,
        "Source": "PacketHeader.java:95",
        "ThreadID": 14527,
        "ThreadName": "",
        "EventID": "A3EDAD984E2F8713",
        "BaggageBytes": "[[248 5] [240 0] [0 206 78 82 4 180 69 44 160] [240 1] [0 93 186 103 182 17 225 71 227] [240 3] [0 2]]",
        "ProcessID": 28198
      },
      {
        "Cycles": 0,
        "Agent": "Execution-Sleep",
        "ProcessName": "Data",
        "TaskID": "CE4E5204B4452CA0",
        "ParentEventID": [
          "A3EDAD984E2F8713"
        ],
        "Label": "waited",
        "Title": "X-Trace Task",
        "Host": "pinky25.mpi-sws.org",
        "Duration": "4753",
        "HRT": 47515767015950762,
        "Operation": "waited",
        "Timestamp": "1557750301715.004150",
        "TenantClass": 0,
        "Source": "SocketIOWithTimeout.java:335",
        "ThreadID": 14527,
        "ThreadName": "",
        "EventID": "1052254474B2E2D8",
        "BaggageBytes": "[[248 5] [240 0] [0 206 78 82 4 180 69 44 160] [240 1] [0 163 237 173 152 78 47 135 19] [240 3] [0 2]]",
        "ProcessID": 28198
      },
      {
        "Cycles": 0,
        "Agent": "Execution-CPU",
        "ProcessName": "Data",
        "TaskID": "CE4E5204B4452CA0",
        "ParentEventID": [
          "D08E88C9A4789F72"
        ],
        "Label": "unset",
        "Title": "X-Trace Task",
        "Host": "pinky25.mpi-sws.org",
        "Duration": "1429254",
        "HRT": 47515767016253891,
        "Operation": "unset",
        "Timestamp": "1557750301715.307373",
        "TenantClass": 0,
        "Source": "DataXceiver.java:261",
        "ThreadID": 14527,
        "ThreadName": "",
        "EventID": "AA22B4468A9A6F0C",
        "BaggageBytes": "[[248 5] [240 0] [0 206 78 82 4 180 69 44 160] [240 1] [0 208 142 136 201 164 120 159 114] [240 3] [0 2]]",
        "ProcessID": 28198
      },
      {
        "Cycles": 0,
        "Agent": "edu.brown.cs.systems.xtrace.logging.BaggageWrappers",
        "ProcessName": "Data",
        "TaskID": "CE4E5204B4452CA0",
        "ParentEventID": [
          "1052254474B2E2D8"
        ],
        "Label": "Forking current baggage with Baggage.fork()",
        "Title": "X-Trace Task",
        "Host": "pinky25.mpi-sws.org",
        "HRT": 47515767016025058,
        "Operation": "fork",
        "Timestamp": "1557750301715.078613",
        "TenantClass": 0,
        "Source": "PacketHeader.java:95",
        "ThreadID": 14527,
        "ThreadName": "",
        "EventID": "D08E88C9A4789F72",
        "BaggageBytes": "[[248 5] [240 0] [0 206 78 82 4 180 69 44 160] [240 1] [0 16 82 37 68 116 178 226 216] [240 3] [0 2]]",
        "ProcessID": 28198
      },
      {
        "Cycles": 0,
        "Agent": "edu.brown.cs.systems.retro.benchmarks.hdfs_client.Reader",
        "ProcessName": "Read",
        "TaskID": "CE4E5204B4452CA0",
        "ParentEventID": [
          "0"
        ],
        "Label": "Reading file",
        "Title": "X-Trace Task",
        "Host": "pinky19.mpi-sws.org",
        "HRT": 26966661769904002,
        "Timestamp": "1557750301710.290039",
        "TenantClass": 0,
        "ThreadID": 1,
        "ThreadName": "",
        "EventID": "3ED4F6B41E964BC7",
        "ProcessID": 2801,
        "Tag": [
          "reader_100kb",
          "Read Size: 102400"
        ]
      }
    ]
  }
]