[
  {
    "id": "C57E694B9CAD04CC",
    "reports": [
      {
        "Cycles": 0,
        "Agent": "org.apache.hadoop.ipc.ProtobufRpcEngine",
        "ProcessName": "Read",
        "TaskID": "C57E694B9CAD04CC",
        "ParentEventID": [
          "50BE9B016163690C"
        ],
        "Label": "Invoking org.apache.hadoop.hdfs.protocol.ClientProtocol.getBlockLocations",
        "Title": "X-Trace Task",
        "Host": "pinky19.mpi-sws.org",
        "HRT": 26962602734172229,
        "Timestamp": "1557746242674.422363",
        "TenantClass": 0,
        "Source": "ProtobufRpcEngine.java:228",
        "ThreadID": 1,
        "ThreadName": "",
        "EventID": "D932FD7F04E2748F",
        "ProcessID": 36430
      },
      {
        "Cycles": 0,
        "Agent": "Execution-CPU",
        "ProcessName": "Read",
        "TaskID": "C57E694B9CAD04CC",
        "ParentEventID": [
          "D932FD7F04E2748F"
        ],
        "Label": "unset",
        "Title": "X-Trace Task",
        "Host": "pinky19.mpi-sws.org",
        "Duration": "21289324",
        "HRT": 26962602734185842,
        "Operation": "unset",
        "Timestamp": "1557746242674.436035",
        "TenantClass": 0,
        "Source": "Client.java:1027",
        "ThreadID": 1,
        "ThreadName": "",
        "EventID": "3B8EC3C552D58000",
        "ProcessID": 36430
      },
      {
        "Cycles": 0,
        "Agent": "Execution-CPU",
        "ProcessName": "Read",
        "TaskID": "C57E694B9CAD04CC",
        "ParentEventID": [
          "3B8EC3C552D58000"
        ],
        "Label": "set",
        "Title": "X-Trace Task",
        "Host": "pinky19.mpi-sws.org",
        "HRT": 26962602734209788,
        "Operation": "set",
        "Timestamp": "1557746242674.459961",
        "TenantClass": 0,
        "Source": "Client.java:1032",
        "ThreadID": 41,
        "ThreadName": "",
        "EventID": "10E7328A8D2B2A30",
        "ProcessID": 36430
      },
      {
        "Cycles": 0,
        "Agent": "edu.brown.cs.systems.retro.benchmarks.hdfs_client.Reader",
        "ProcessName": "Read",
        "TaskID": "C57E694B9CAD04CC",
        "ParentEventID": [
          "5AF828B8C9E22EAB"
        ],
        "Label": "Reading file",
        "Title": "X-Trace Task",
        "Host": "pinky19.mpi-sws.org",
        "HRT": 26962602734149178,
        "Timestamp": "1557746242674.399414",
        "TenantClass": 0,
        "ThreadID": 1,
        "ThreadName": "",
        "EventID": "50BE9B016163690C",
        "ProcessID": 36430
      },
      {
        "Cycles": 0,
        "Agent": "edu.brown.cs.systems.xtrace.logging.BaggageWrappers",
        "ProcessName": "Read",
        "TaskID": "C57E694B9CAD04CC",
        "ParentEventID": [
          "10E7328A8D2B2A30"
        ],
        "Label": "Forking current baggage with Baggage.fork()",
        "Title": "X-Trace Task",
        "Host": "pinky19.mpi-sws.org",
        "HRT": 26962602734230080,
        "Operation": "fork",
        "Timestamp": "1557746242674.480225",
        "TenantClass": 0,
        "Source": "Client.java:1043",
        "ThreadID": 41,
        "ThreadName": "",
        "EventID": "C80162414E8DAFA6",
        "ProcessID": 36430
      },
      {
        "Cycles": 0,
        "Agent": "Execution-CPU",
        "ProcessName": "Read",
        "TaskID": "C57E694B9CAD04CC",
        "ParentEventID": [
          "C80162414E8DAFA6"
        ],
        "Label": "unset",
        "Title": "X-Trace Task",
        "Host": "pinky19.mpi-sws.org",
        "Duration": "73792",
        "HRT": 26962602734303524,
        "Operation": "unset",
        "Timestamp": "1557746242674.553711",
        "TenantClass": 0,
        "Source": "Client.java:1062",
        "ThreadID": 41,
        "ThreadName": "",
        "EventID": "978CE301D5758E4E",
        "ProcessID": 36430
      },
      {
        "Cycles": 0,
        "Agent": "Execution-CPU",
        "ProcessName": "Name",
        "TaskID": "C57E694B9CAD04CC",
        "ParentEventID": [
          "C80162414E8DAFA6"
        ],
        "Label": "set",
        "Title": "X-Trace Task",
        "Host": "pinky19.mpi-sws.org",
        "HRT": 26962602734344964,
        "Operation": "set",
        "Timestamp": "1557746242674.626221",
        "TenantClass": 0,
        "Source": "Server.java:1840",
        "ThreadID": 48,
        "ThreadName": "",
        "EventID": "DED85523CE911D1E",
        "BaggageBytes": "[[248 5] [240 0] [0 197 126 105 75 156 173 4 204] [240 1] [0 200 1 98 65 78 141 175 166] [240 3] [0 2]]",
        "ProcessID": 2171
      },
      {
        "Cycles": 0,
        "Agent": "edu.brown.cs.systems.xtrace.logging.BaggageWrappers",
        "ProcessName": "Name",
        "TaskID": "C57E694B9CAD04CC",
        "ParentEventID": [
          "DED85523CE911D1E"
        ],
        "Label": "Forking current baggage with Baggage.fork()",
        "Title": "X-Trace Task",
        "Host": "pinky19.mpi-sws.org",
        "HRT": 26962602734365899,
        "Operation": "fork",
        "Timestamp": "1557746242674.646973",
        "TenantClass": 0,
        "Source": "Server.java:550",
        "ThreadID": 48,
        "ThreadName": "",
        "EventID": "B2F6128D2F05EE4A",
        "BaggageBytes": "[[248 5] [240 0] [0 197 126 105 75 156 173 4 204] [240 1] [0 222 216 85 35 206 145 29 30] [240 3] [0 2]]",
        "ProcessID": 2171
      },
      {
        "Cycles": 0,
        "Agent": "Execution-CPU",
        "ProcessName": "Read",
        "TaskID": "C57E694B9CAD04CC",
        "ParentEventID": [
          "978CE301D5758E4E"
        ],
        "Label": "set",
        "Title": "X-Trace Task",
        "Host": "pinky19.mpi-sws.org",
        "HRT": 26962602734328722,
        "Operation": "set",
        "Timestamp": "1557746242674.578857",
        "TenantClass": 0,
        "Source": "Client.java:1104",
        "ThreadID": 1,
        "ThreadName": "",
        "EventID": "44A484F2D04F9995",
        "ProcessID": 36430
      },
      {
        "Cycles": 0,
        "Agent": "Execution-CPU",
        "ProcessName": "Name",
        "TaskID": "C57E694B9CAD04CC",
        "ParentEventID": [
          "B2F6128D2F05EE4A"
        ],
        "Label": "set",
        "Title": "X-Trace Task",
        "Host": "pinky19.mpi-sws.org",
        "HRT": 26962602734393366,
        "Operation": "set",
        "Timestamp": "1557746242674.674561",
        "TenantClass": 0,
        "Source": "Server.java:2071",
        "ThreadID": 64,
        "ThreadName": "",
        "EventID": "612275808B203E74",
        "BaggageBytes": "[[248 5] [240 0] [0 197 126 105 75 156 173 4 204] [240 1] [0 178 246 18 141 47 5 238 74] [240 3] [0 2]]",
        "ProcessID": 2171
      },
      {
        "Cycles": 0,
        "Agent": "org.apache.hadoop.ipc.Server",
        "ProcessName": "Name",
        "TaskID": "C57E694B9CAD04CC",
        "ParentEventID": [
          "612275808B203E74"
        ],
        "Label": "getBlockLocations in org.apache.hadoop.hdfs.protocol.ClientProtocol",
        "Title": "X-Trace Task",
        "Host": "pinky19.mpi-sws.org",
        "HRT": 26962602734427351,
        "Timestamp": "1557746242674.708496",
        "TenantClass": 0,
        "Source": "ProtobufRpcEngine.java:601",
        "ThreadID": 64,
        "ThreadName": "",
        "EventID": "BACC064384773EC3",
        "BaggageBytes": "[[248 5] [240 0] [0 197 126 105 75 156 173 4 204] [240 1] [0 97 34 117 128 139 32 62 116] [240 3] [0 2]]",
        "ProcessID": 2171
      },
      {
        "Cycles": 0,
        "Agent": "Execution-CPU",
        "ProcessName": "Name",
        "TaskID": "C57E694B9CAD04CC",
        "ParentEventID": [
          "B2F6128D2F05EE4A"
        ],
        "Label": "unset",
        "Title": "X-Trace Task",
        "Host": "pinky19.mpi-sws.org",
        "Duration": "20104",
        "HRT": 26962602734383452,
        "Operation": "unset",
        "Timestamp": "1557746242674.664551",
        "TenantClass": 0,
        "Source": "Server.java:1828",
        "ThreadID": 48,
        "ThreadName": "",
        "EventID": "B479F80567F1A167",
        "BaggageBytes": "[[248 5] [240 0] [0 197 126 105 75 156 173 4 204] [240 1] [0 178 246 18 141 47 5 238 74] [240 3] [0 2]]",
        "ProcessID": 2171
      },
      {
        "Cycles": 0,
        "Agent": "org.apache.hadoop.hdfs.server.namenode.FSNamesystem.audit",
        "ProcessName": "Name",
        "TaskID": "C57E694B9CAD04CC",
        "ParentEventID": [
          "BACC064384773EC3"
        ],
        "Label": "allowed=true\tugi=plascas (auth:SIMPLE)\tip=/139.19.171.63\tcmd=open\tsrc=/ds/ccEteoPoMZsRD7EK\tdst=null\tperm=null\tproto=rpc",
        "Title": "X-Trace Task",
        "Host": "pinky19.mpi-sws.org",
        "HRT": 26962602734473013,
        "Timestamp": "1557746242674.754150",
        "TenantClass": 0,
        "Source": "FSNamesystem.java:8313",
        "ThreadID": 64,
        "ThreadName": "",
        "EventID": "40D830467E1C4C66",
        "BaggageBytes": "[[248 5] [240 0] [0 197 126 105 75 156 173 4 204] [240 1] [0 186 204 6 67 132 119 62 195] [240 3] [0 2]]",
        "ProcessID": 2171
      },
      {
        "Cycles": 0,
        "Agent": "edu.brown.cs.systems.xtrace.logging.BaggageWrappers",
        "ProcessName": "Name",
        "TaskID": "C57E694B9CAD04CC",
        "ParentEventID": [
          "40D830467E1C4C66"
        ],
        "Label": "Forking current baggage with Baggage.fork()",
        "Title": "X-Trace Task",
        "Host": "pinky19.mpi-sws.org",
        "HRT": 26962602734518151,
        "Operation": "fork",
        "Timestamp": "1557746242674.799316",
        "TenantClass": 0,
        "Source": "Server.java:2398",
        "ThreadID": 64,
        "ThreadName": "",
        "EventID": "1F02906DFB400931",
        "BaggageBytes": "[[248 5] [240 0] [0 197 126 105 75 156 173 4 204] [240 1] [0 64 216 48 70 126 28 76 102] [240 3] [0 2]]",
        "ProcessID": 2171
      },
      {
        "Cycles": 0,
        "Agent": "Execution-CPU",
        "ProcessName": "Name",
        "TaskID": "C57E694B9CAD04CC",
        "ParentEventID": [
          "1F02906DFB400931"
        ],
        "Label": "unset",
        "Title": "X-Trace Task",
        "Host": "pinky19.mpi-sws.org",
        "Duration": "206468",
        "HRT": 26962602734621705,
        "Operation": "unset",
        "Timestamp": "1557746242674.902832",
        "TenantClass": 0,
        "Source": "Server.java:1058",
        "ThreadID": 64,
        "ThreadName": "",
        "EventID": "B238FF3AE05BC3D7",
        "BaggageBytes": "[[248 5] [240 0] [0 197 126 105 75 156 173 4 204] [240 1] [0 31 2 144 109 251 64 9 49] [240 3] [0 2]]",
        "ProcessID": 2171
      },
      {
        "Cycles": 0,
        "Agent": "Execution-CPU",
        "ProcessName": "Read",
        "TaskID": "C57E694B9CAD04CC",
        "ParentEventID": [
          "0460535BD8604396"
        ],
        "Label": "unset",
        "Title": "X-Trace Task",
        "Host": "pinky19.mpi-sws.org",
        "Duration": "5150",
        "HRT": 26962602734716409,
        "Operation": "unset",
        "Timestamp": "1557746242674.966553",
        "TenantClass": 0,
        "Source": "Client.java:1168",
        "ThreadID": 37,
        "ThreadName": "",
        "EventID": "6B506DF9D6B4543E",
        "ProcessID": 36430
      },
      {
        "Cycles": 0,
        "Agent": "Execution-CPU",
        "ProcessName": "Read",
        "TaskID": "C57E694B9CAD04CC",
        "ParentEventID": [
          "1F02906DFB400931"
        ],
        "Label": "set",
        "Title": "X-Trace Task",
        "Host": "pinky19.mpi-sws.org",
        "HRT": 26962602734694944,
        "Operation": "set",
        "Timestamp": "1557746242674.945068",
        "TenantClass": 0,
        "Source": "Client.java:302",
        "ThreadID": 37,
        "ThreadName": "",
        "EventID": "0460535BD8604396",
        "ProcessID": 36430
      },
      {
        "Cycles": 0,
        "Agent": "Execution-Sleep",
        "ProcessName": "Read",
        "TaskID": "C57E694B9CAD04CC",
        "ParentEventID": [
          "44A484F2D04F9995"
        ],
        "Label": "waited",
        "Title": "X-Trace Task",
        "Host": "pinky19.mpi-sws.org",
        "Duration": "396064",
        "HRT": 26962602734732296,
        "Operation": "waited",
        "Timestamp": "1557746242674.982422",
        "TenantClass": 0,
        "Source": "Client.java:1537",
        "ThreadID": 1,
        "ThreadName": "",
        "EventID": "65096B57403F758F",
        "ProcessID": 36430
      },
      {
        "Cycles": 0,
        "Agent": "edu.brown.cs.systems.xtrace.logging.BaggageWrappers",
        "ProcessName": "Read",
        "TaskID": "C57E694B9CAD04CC",
        "ParentEventID": [
          "65096B57403F758F",
          "6B506DF9D6B4543E"
        ],
        "Label": "Merged current baggage with other baggage",
        "Title": "X-Trace Task",
        "Host": "pinky19.mpi-sws.org",
        "HRT": 26962602734740294,
        "Operation": "join",
        "Timestamp": "1557746242674.990479",
        "TenantClass": 0,
        "Source": "Client.java:1545",
        "ThreadID": 1,
        "ThreadName": "",
        "EventID": "101C20307E7A7473",
        "ProcessID": 36430
      },
      {
        "Cycles": 0,
        "Agent": "edu.brown.cs.systems.xtrace.logging.BaggageWrappers",
        "ProcessName": "Read",
        "TaskID": "C57E694B9CAD04CC",
        "ParentEventID": [
          "84EC5B2D9CCFE7B9"
        ],
        "Label": "Forking current baggage with Baggage.fork()",
        "Title": "X-Trace Task",
        "Host": "pinky19.mpi-sws.org",
        "HRT": 26962602734816476,
        "Operation": "fork",
        "Timestamp": "1557746242675.066650",
        "TenantClass": 0,
        "Source": "DataTransferProtoUtil.java:94",
        "ThreadID": 1,
        "ThreadName": "",
        "EventID": "0B65297D050EAB2D",
        "ProcessID": 36430
      },
      {
        "Cycles": 0,
        "Agent": "org.apache.hadoop.ipc.ProtobufRpcEngine",
        "ProcessName": "Read",
        "TaskID": "C57E694B9CAD04CC",
        "ParentEventID": [
          "101C20307E7A7473"
        ],
        "Label": "org.apache.hadoop.hdfs.protocol.ClientProtocol.getBlockLocations completed",
        "Title": "X-Trace Task",
        "Host": "pinky19.mpi-sws.org",
        "HRT": 26962602734770540,
        "Timestamp": "1557746242675.020752",
        "TenantClass": 0,
        "Source": "ProtobufRpcEngine.java:275",
        "ThreadID": 1,
        "ThreadName": "",
        "EventID": "84EC5B2D9CCFE7B9",
        "ProcessID": 36430
      },
      {
        "Cycles": 0,
        "Agent": "edu.brown.cs.systems.xtrace.logging.XTraceInit",
        "ProcessName": "Data",
        "TaskID": "C57E694B9CAD04CC",
        "ParentEventID": [
          "294AE9FAB648A33D"
        ],
        "Label": "Thread.setName: DataXceiver for client DFSClient_NONMAPREDUCE_778905418_1 at /139.19.171.63:43130 [Sending block BP-1633380353-139.19.171.63-1554193446451:blk_1073764252_23428]",
        "Title": "X-Trace Task",
        "Host": "pinky19.mpi-sws.org",
        "HRT": 26962602734961189,
        "Timestamp": "1557746242675.223145",
        "TenantClass": 0,
        "Source": "DataXceiver.java:168",
        "ThreadID": 36633,
        "ThreadName": "",
        "EventID": "83C68088C3CFA90D",
        "BaggageBytes": "[[248 5] [240 0] [0 197 126 105 75 156 173 4 204] [240 1] [0 41 74 233 250 182 72 163 61] [240 3] [0 2]]",
        "ProcessID": 2319
      },
      {
        "Cycles": 0,
        "Agent": "Execution-CPU",
        "ProcessName": "Data",
        "TaskID": "C57E694B9CAD04CC",
        "ParentEventID": [
          "0B65297D050EAB2D"
        ],
        "Label": "set",
        "Title": "X-Trace Task",
        "Host": "pinky19.mpi-sws.org",
        "HRT": 26962602734926365,
        "Operation": "set",
        "Timestamp": "1557746242675.188232",
        "TenantClass": 0,
        "Source": "Receiver.java:117",
        "ThreadID": 36633,
        "ThreadName": "",
        "EventID": "294AE9FAB648A33D",
        "BaggageBytes": "[[248 5] [240 0] [0 197 126 105 75 156 173 4 204] [240 1] [0 11 101 41 125 5 14 171 45] [240 3] [0 2]]",
        "ProcessID": 2319
      },
      {
        "Cycles": 0,
        "Agent": "edu.brown.cs.systems.xtrace.logging.BaggageWrappers",
        "ProcessName": "Data",
        "TaskID": "C57E694B9CAD04CC",
        "ParentEventID": [
          "83C68088C3CFA90D"
        ],
        "Label": "Forking current baggage with Baggage.fork()",
        "Title": "X-Trace Task",
        "Host": "pinky19.mpi-sws.org",
        "HRT": 26962602735039083,
        "Operation": "fork",
        "Timestamp": "1557746242675.301025",
        "TenantClass": 0,
        "Source": "DataXceiver.java:1257",
        "ThreadID": 36633,
        "ThreadName": "",
        "EventID": "B6877BF814FF6023",
        "BaggageBytes": "[[248 5] [240 0] [0 197 126 105 75 156 173 4 204] [240 1] [0 131 198 128 136 195 207 169 13] [240 3] [0 2]]",
        "ProcessID": 2319
      },
      {
        "Cycles": 0,
        "Agent": "Execution-Sleep",
        "ProcessName": "Read",
        "TaskID": "C57E694B9CAD04CC",
        "ParentEventID": [
          "0B65297D050EAB2D"
        ],
        "Label": "waited",
        "Title": "X-Trace Task",
        "Host": "pinky19.mpi-sws.org",
        "Duration": "205127",
        "HRT": 26962602735099037,
        "Operation": "waited",
        "Timestamp": "1557746242675.349121",
        "TenantClass": 0,
        "Source": "SocketIOWithTimeout.java:335",
        "ThreadID": 1,
        "ThreadName": "",
        "EventID": "27C2E009BCE952F3",
        "ProcessID": 36430
      },
      {
        "Cycles": 0,
        "Agent": "edu.brown.cs.systems.xtrace.logging.BaggageWrappers",
        "ProcessName": "Data",
        "TaskID": "C57E694B9CAD04CC",
        "ParentEventID": [
          "B6877BF814FF6023"
        ],
        "Label": "Forking current baggage with Baggage.fork()",
        "Title": "X-Trace Task",
        "Host": "pinky19.mpi-sws.org",
        "HRT": 26962602735100117,
        "Operation": "fork",
        "Timestamp": "1557746242675.362061",
        "TenantClass": 0,
        "Source": "PacketHeader.java:95",
        "ThreadID": 36633,
        "ThreadName": "",
        "EventID": "B1995C837B52FB07",
        "BaggageBytes": "[[248 5] [240 0] [0 197 126 105 75 156 173 4 204] [240 1] [0 182 135 123 248 20 255 96 35] [240 3] [0 2]]",
        "ProcessID": 2319
      },
      {
        "Cycles": 0,
        "Agent": "edu.brown.cs.systems.xtrace.logging.BaggageWrappers",
        "ProcessName": "Read",
        "TaskID": "C57E694B9CAD04CC",
        "ParentEventID": [
          "27C2E009BCE952F3",
          "B6877BF814FF6023"
        ],
        "Label": "Merged current baggage with other baggage",
        "Title": "X-Trace Task",
        "Host": "pinky19.mpi-sws.org",
        "HRT": 26962602735179752,
        "Operation": "join",
        "Timestamp": "1557746242675.429932",
        "TenantClass": 0,
        "Source": "RemoteBlockReader2.java:429",
        "ThreadID": 1,
        "ThreadName": "",
        "EventID": "7AD93E69DFD9FB89",
        "ProcessID": 36430
      },
      {
        "Cycles": 0,
        "Agent": "Execution-Sleep",
        "ProcessName": "Data",
        "TaskID": "C57E694B9CAD04CC",
        "ParentEventID": [
          "B1995C837B52FB07"
        ],
        "Label": "waited",
        "Title": "X-Trace Task",
        "Host": "pinky19.mpi-sws.org",
        "Duration": "4080",
        "HRT": 26962602735157377,
        "Operation": "waited",
        "Timestamp": "1557746242675.419189",
        "TenantClass": 0,
        "Source": "SocketIOWithTimeout.java:335",
        "ThreadID": 36633,
        "ThreadName": "",
        "EventID": "E4C3EBC565DACAA1",
        "BaggageBytes": "[[248 5] [240 0] [0 197 126 105 75 156 173 4 204] [240 1] [0 177 153 92 131 123 82 251 7] [240 3] [0 2]]",
        "ProcessID": 2319
      },
      {
        "Cycles": 0,
        "Agent": "edu.brown.cs.systems.xtrace.logging.BaggageWrappers",
        "ProcessName": "Data",
        "TaskID": "C57E694B9CAD04CC",
        "ParentEventID": [
          "E4C3EBC565DACAA1"
        ],
        "Label": "Forking current baggage with Baggage.fork()",
        "Title": "X-Trace Task",
        "Host": "pinky19.mpi-sws.org",
        "HRT": 26962602735217194,
        "Operation": "fork",
        "Timestamp": "1557746242675.479004",
        "TenantClass": 0,
        "Source": "PacketHeader.java:95",
        "ThreadID": 36633,
        "ThreadName": "",
        "EventID": "4FF06DBD430BAB15",
        "BaggageBytes": "[[248 5] [240 0] [0 197 126 105 75 156 173 4 204] [240 1] [0 228 195 235 197 101 218 202 161] [240 3] [0 2]]",
        "ProcessID": 2319
      },
      {
        "Cycles": 0,
        "Agent": "edu.brown.cs.systems.xtrace.logging.BaggageWrappers",
        "ProcessName": "Read",
        "TaskID": "C57E694B9CAD04CC",
        "ParentEventID": [
          "B1995C837B52FB07",
          "7AD93E69DFD9FB89"
        ],
        "Label": "Merged current baggage with other baggage",
        "Title": "X-Trace Task",
        "Host": "pinky19.mpi-sws.org",
        "HRT": 26962602735274808,
        "Operation": "join",
        "Timestamp": "1557746242675.524902",
        "TenantClass": 0,
        "Source": "PacketHeader.java:168",
        "ThreadID": 1,
        "ThreadName": "",
        "EventID": "7E20DBB95D2EB51D",
        "ProcessID": 36430
      },
      {
        "Cycles": 0,
        "Agent": "edu.brown.cs.systems.xtrace.logging.BaggageWrappers",
        "ProcessName": "Read",
        "TaskID": "C57E694B9CAD04CC",
        "ParentEventID": [
          "4FF06DBD430BAB15",
          "7E20DBB95D2EB51D"
        ],
        "Label": "Merged current baggage with other baggage",
        "Title": "X-Trace Task",
        "Host": "pinky19.mpi-sws.org",
        "HRT": 26962602735335016,
        "Operation": "join",
        "Timestamp": "1557746242675.585205",
        "TenantClass": 0,
        "Source": "PacketHeader.java:168",
        "ThreadID": 1,
        "ThreadName": "",
        "EventID": "2D457AF4732ECD14",
        "ProcessID": 36430
      },
      {
        "Cycles": 0,
        "Agent": "Execution-Sleep",
        "ProcessName": "Data",
        "TaskID": "C57E694B9CAD04CC",
        "ParentEventID": [
          "4FF06DBD430BAB15"
        ],
        "Label": "waited",
        "Title": "X-Trace Task",
        "Host": "pinky19.mpi-sws.org",
        "Duration": "90294",
        "HRT": 26962602735387091,
        "Operation": "waited",
        "Timestamp": "1557746242675.648926",
        "TenantClass": 0,
        "Source": "SocketIOWithTimeout.java:335",
        "ThreadID": 36633,
        "ThreadName": "",
        "EventID": "7B708C3740BF8C30",
        "BaggageBytes": "[[248 5] [240 0] [0 197 126 105 75 156 173 4 204] [240 1] [0 79 240 109 189 67 11 171 21] [240 3] [0 2]]",
        "ProcessID": 2319
      },
      {
        "Cycles": 0,
        "Agent": "edu.brown.cs.systems.xtrace.logging.BaggageWrappers",
        "ProcessName": "Read",
        "TaskID": "C57E694B9CAD04CC",
        "ParentEventID": [
          "2D457AF4732ECD14"
        ],
        "Label": "Forking current baggage with Baggage.fork()",
        "Title": "X-Trace Task",
        "Host": "pinky19.mpi-sws.org",
        "HRT": 26962602735343497,
        "Operation": "fork",
        "Timestamp": "1557746242675.593506",
        "TenantClass": 0,
        "Source": "RemoteBlockReader2.java:361",
        "ThreadID": 1,
        "ThreadName": "",
        "EventID": "D57E339D1B8176FD",
        "ProcessID": 36430
      },
      {
        "Cycles": 0,
        "Agent": "edu.brown.cs.systems.xtrace.logging.BaggageWrappers",
        "ProcessName": "Data",
        "TaskID": "C57E694B9CAD04CC",
        "ParentEventID": [
          "D57E339D1B8176FD",
          "7B708C3740BF8C30"
        ],
        "Label": "Merged current baggage with other baggage",
        "Title": "X-Trace Task",
        "Host": "pinky19.mpi-sws.org",
        "HRT": 26962602735437919,
        "Operation": "join",
        "Timestamp": "1557746242675.699707",
        "TenantClass": 0,
        "Source": "DataXceiver.java:574",
        "ThreadID": 36633,
        "ThreadName": "",
        "EventID": "5E8377EE6F4D755B",
        "BaggageBytes": "[[248 5] [240 0] [0 197 126 105 75 156 173 4 204] [240 1] [0 213 126 51 157 27 129 118 253] [0 123 112 140 55 64 191 140 48] [240 3] [0 2]]",
        "ProcessID": 2319
      },
      {
        "Cycles": 0,
        "Agent": "Execution-CPU",
        "ProcessName": "Data",
        "TaskID": "C57E694B9CAD04CC",
        "ParentEventID": [
          "5E8377EE6F4D755B"
        ],
        "Label": "unset",
        "Title": "X-Trace Task",
        "Host": "pinky19.mpi-sws.org",
        "Duration": "507082",
        "HRT": 26962602735457379,
        "Operation": "unset",
        "Timestamp": "1557746242675.719238",
        "TenantClass": 0,
        "Source": "DataXceiver.java:261",
        "ThreadID": 36633,
        "ThreadName": "",
        "EventID": "BBD752A1ECF6B865",
        "BaggageBytes": "[[248 5] [240 0] [0 197 126 105 75 156 173 4 204] [240 1] [0 94 131 119 238 111 77 117 91] [240 3] [0 2]]",
        "ProcessID": 2319
      },
      {
        "Cycles": 0,
        "Agent": "edu.brown.cs.systems.retro.benchmarks.hdfs_client.Reader",
        "ProcessName": "Read",
        "TaskID": "C57E694B9CAD04CC",
        "ParentEventID": [
          "0"
        ],
        "Label": "Reading file",
        "Title": "X-Trace Task",
        "Host": "pinky19.mpi-sws.org",
        "HRT": 26962602734137468,
        "Timestamp": "1557746242674.387695",
        "TenantClass": 0,
        "ThreadID": 1,
        "ThreadName": "",
        "EventID": "5AF828B8C9E22EAB",
        "ProcessID": 36430,
        "Tag": [
          "reader_10kb",
          "Read Size: 10240"
        ]
      }
    ]
  }
]