{
    "app_name": "socialnetwork",
    "src_dir" : "/local/vaastav/blueprint-systems/blueprint-dsb-socialnetwork/input_v2/input_go",
    "output_dir" : "/local/vaastav/blueprint-systems/blueprint-dsb-socialnetwork/output_go_sospae_fig8_repl",
    "wiring_file" : "/local/vaastav/blueprint-systems/blueprint-dsb-socialnetwork/wiring/instances_sospae_fig8_repl.py",
    "target": "go",
    "dependencies" : "examples/DSB/input/requirements.txt",
    "deploy_address" : "localhost",
    "addresses" : [
        {
            "name" : "socialGraphService",
            "address" : "socialGraphService",
            "port" : 9050
        },
        {
            "name" : "composePostService",
            "address" : "composePostService",
            "port" : 9051
        },
        {
            "name" : "homeTimelineService",
            "address" : "homeTimelineService",
            "port" : 9052
        },
        {
            "name" : "mediaService",
            "address" : "mediaService",
            "port" : 9053
        },
        {
            "name" : "postStorageService",
            "address" : "postStorageService",
            "port" : 9054
        },
        {
            "name" : "textService",
            "address" : "textService",
            "port" : 9055
        },
        {
            "name" : "uniqueIdService",
            "address" : "uniqueIdService",
            "port" : 9056
        },
        {
            "name" : "urlShortenService",
            "address" : "urlShortenService",
            "port" : 9057
        },
        {
            "name" : "userMentionService",
            "address" : "userMentionService",
            "port" : 9058
        },
        {
            "name" : "userService",
            "address" : "userService",
            "port" : 9059
        },
        {
            "name" : "userTimelineService",
            "address" : "userTimelineService",
            "port" : 9060
        },
        {
            "name" : "userTimelineService2",
            "address" : "userTimelineService2",
            "port" : 9062
        },
        {
            "name" : "writeHomeTimelineService",
            "address" : "writeHomeTimelineService",
            "port" : 9061
        },
        {
            "name" : "socialGraphDatabase",
            "address" : "socialGraphDatabase",
            "port" : 27017
        },
        {
            "name" : "postStorageDatabase",
            "address" : "postStorageDatabase",
            "port" : 27017
        },
        {
            "name" : "userTimelineDatabase",
            "address" : "userTimelineDatabase",
            "port" : 27017
        },
        {
            "name": "userTimelineDatabase2",
            "address": "userTimelineDatabase2",
            "port" : 27017
        },
        {
            "name" : "urlShortenDatabase",
            "address" : "urlShortenDatabase",
            "port" : 27017
        },
        {
            "name" : "userDatabase",
            "address" : "userDatabase",
            "port" : 27017
        },
        {
            "name" : "mediaDatabase",
            "address" : "mediaDatabase",
            "port" : 27017
        },
        {
            "name" : "postStorageCache",
            "address" : "postStorageCache",
            "port" : 11211
        },
        {
            "name" : "urlShortenCache",
            "address" : "urlShortenCache",
            "port" : 11211
        },
        {
            "name" : "userCache",
            "address" : "userCache",
            "port" : 11211
        },
        {
            "name" : "mediaCache",
            "address" : "mediaCache",
            "port" : 11211
        },
        {
            "name" : "socialGraphCache",
            "address" : "socialGraphCache",
            "port" : 6379
        },
        {
            "name" : "homeTimelineCache",
            "address" : "homeTimelineCache",
            "port" : 6379
        },
        {
            "name" : "composePostCache",
            "address" : "composePostCache",
            "port" : 6379
        },
        {
            "name" : "userTimelineCache",
            "address" : "userTimelineCache",
            "port" : 11211
        },
        {
            "name" : "writeHomeTimelineQueue",
            "address" : "writeHomeTimelineQueue",
            "port" : 5672
        },
        {
            "name" : "jaegerTracer",
            "address" : "jaegerTracer",
            "port" : 14268
        },
        {
            "name" : "wrk2apiService",
            "address" : "wrk2apiService",
            "port" : 9000
        }
    ]
}
