{
    "app_name": "DSB_hotel",
    "src_dir" : "/local/vaastav/blueprint-systems/blueprint-dsb-hotelreservation/input/input_go",
    "output_dir" : "/local/vaastav/blueprint-systems/blueprint-dsb-hotelreservation/output_go_sospae_fig6a",
    "wiring_file" : "/local/vaastav/blueprint-systems/blueprint-dsb-hotelreservation/wiring/instances_sospae_fig6a.py",
    "target": "go",
    "deploy_address" : "localhost",
    "addresses": [
        {
            "name" : "profileService",
            "address" : "profileService",
            "port": 9050
        },
        {
            "name" : "userService",
            "address" : "userService",
            "port": 9051
        },
        {
            "name" : "reservService",
            "address" : "reservService",
            "port": 9052
        },
        {
            "name" : "recomdService",
            "address" : "recomdService",
            "port": 9053
        },
        {
            "name" : "geoService",
            "address" : "geoService",
            "port": 9054
        },
        {
            "name" : "rateService",
            "address" : "rateService",
            "port": 9055
        },
        {
            "name" : "searchService",
            "address" : "searchService",
            "port": 9056
        },
        {
            "name" : "jaegerTracer",
            "address" : "jaegerTracer",
            "port": 14268
        },
        {
            "name" : "frontendService",
            "address" : "frontendService",
            "port": 9000
        },
        {
            "name" : "userDatabase",
            "address" : "userDatabase",
            "port": 27017
        },
        {
            "name" : "recomdDatabase",
            "address" : "recomdDatabase",
            "port": 27017
        },
        {
            "name" : "reservDatabase",
            "address" : "reservDatabase",
            "port": 27017
        },
        {
            "name" : "geoDatabase",
            "address" : "geoDatabase",
            "port": 27017
        },
        {
            "name" : "rateDatabase",
            "address" : "rateDatabase",
            "port": 27017
        },
        {
            "name" : "profileDatabase",
            "address" : "profileDatabase",
            "port": 27017
        },
        {
            "name" : "reservCache",
            "address" : "reservCache",
            "port": 11211
        },
        {
            "name" : "rateCache",
            "address" : "rateCache",
            "port": 11211
        },
        {
            "name" : "profileCache",
            "address" : "profileCache",
            "port": 11211
        }
    ]
}
