start_rel,start_rel,avg_lat,p99_lat
0,0,30.60818013479204,
1,1,5.109367624947977,
2,2,4.549909065300681,
3,3,4.050073830399601,
4,4,4.74254198982908,
5,5,4.874830830014178,
6,6,4.559038577009568,
7,7,4.057277535452731,
8,8,4.634238758910742,
9,9,4.297493252313857,
10,10,4.229838376575692,
11,11,4.396125141488995,
12,12,4.776862639583326,
13,13,4.961118217340666,
14,14,5.116088410926953,
15,15,4.258152344017989,
16,16,4.857715006749997,
17,17,4.325117629400958,
18,18,4.208836793307244,
19,19,4.260572028992772,
20,20,4.327801711205455,
21,21,4.682912580997668,
22,22,4.609912533993503,
23,23,4.116616168956585,
24,24,4.114189235965355,
25,25,4.584602228445026,
26,26,4.611400874479094,
27,27,5.032345100800407,
28,28,4.321668580795872,
29,29,4.97348423557812,
30,30,4.0456110928428695,
31,31,4.220392296200631,
32,32,4.471954025235265,
33,33,4.980637460058306,
34,34,4.29444963061938,
35,35,4.174565763921321,
36,36,4.329679939121764,
37,37,4.88278365799132,
38,38,3.908501606234907,
39,39,4.1097410072511895,
40,40,4.03791541193132,
41,41,4.44500413765217,
42,42,4.6371440172586205,
43,43,4.5483944285714175,
44,44,4.854715608195911,
45,45,4.08711225523221,
46,46,4.429751353691049,
47,47,4.345446415099026,
48,48,4.423363176142088,
49,49,4.1799460449766075,
50,50,4.803114979778673,
51,51,4.902845554934994,
52,52,4.36853888760206,
53,53,4.057292023809536,
54,54,4.568339660612682,
55,55,4.174194926471812,
56,56,431.3267974317932,
57,57,5123.652540466713,
58,58,8258.416330939897,
59,59,7953.783711870896,
60,60,7420.488877837504,
61,61,6850.023890908808,
62,62,6269.373287856549,
63,63,5664.443596796979,
64,64,5049.312391933386,
65,65,4472.441565572521,
66,66,3910.882401689739,
67,67,3355.112761123932,
68,68,2728.5495750231044,
69,69,2146.070233881949,
70,70,1480.7406063258302,
71,71,878.6332437365113,
72,72,170.63640672440985,
73,73,3.0971801046492313,
74,74,7.91293603034096,
75,75,3.620443807875212,
76,76,3.7193711680113046,
77,77,9.215345846012484,
78,78,3.4165328469872507,
79,79,4.4194432568853586,
80,80,6.84572237159288,
81,81,4.1134890443518275,
82,82,4.091769068735401,
83,83,9.788505495331801,
84,84,3.548347793322218,
85,85,3.4379338291503467,
86,86,5.4166272557984305,
87,87,4.2802379642619055,
88,88,3.5612217349236692,
89,89,6.069566199617268,
90,90,3.741769082916675,
91,91,3.266138502332558,
92,92,5.600116148518969,
93,93,3.537481803800638,
94,94,3.4410676982988715,
95,95,6.800676045182204,
96,96,3.7966889999166957,
97,97,7.058880815796091,
98,98,4.2497909742478805,
99,99,3.431537723250003,
100,100,7.833899513196202,
101,101,3.2126514060131743,
102,102,4.280944052477647,
103,103,7.017973418658909,
104,104,3.6224274492259254,
105,105,4.357774983240215,
106,106,6.2361844136436035,
107,107,3.268231250124728,
108,108,4.191538225798375,
109,109,5.965783111212839,
110,110,3.1656759604208418,
111,111,3.7668355542671303,
112,112,11.277665167360494,
113,113,3.4185553001166564,
114,114,3.3621974557879843,
115,115,7.221649712929829,
116,116,3.6447779117058503,
117,117,3.974641922448971,
118,118,7.3120782100174875,
119,119,3.262243376564838,
