start_rel,start_rel,avg_lat,p99_lat
0,0,28.86123687909161,
1,1,4.6638549387857084,
2,2,4.339927711940672,
3,3,4.404582981692018,
4,4,4.489922128552458,
5,5,4.602895498916303,
6,6,4.5849866779703525,
7,7,4.34799077103622,
8,8,4.000182975176995,
9,9,4.699927784214052,
10,10,4.448630423407647,
11,11,4.335608120906582,
12,12,4.072217389910924,
13,13,4.538616584374483,
14,14,4.033597974190324,
15,15,4.402576388305856,
16,16,4.184567743461625,
17,17,4.50635548147531,
18,18,4.218600433338898,
19,19,4.006324881146864,
20,20,3.947416440429601,
21,21,4.10232745330222,
22,22,4.097303849105295,
23,23,4.145591192791141,
24,24,3.947379535199536,
25,25,3.9405399024797374,
26,26,4.434612576512729,
27,27,4.344929449750005,
28,28,4.396603818523172,
29,29,4.256454333111274,
30,30,4.3336450452081055,
31,31,4.21834666136422,
32,32,4.197615691781965,
33,33,3.962666260134839,
34,34,4.313899138183608,
35,35,3.983208466788894,
36,36,4.049895555823622,
37,37,3.944756284987504,
38,38,4.1292906520180175,
39,39,4.771194957544415,
40,40,4.085372704662781,
41,41,4.184981859881634,
42,42,3.858149542430831,
43,43,4.125411784612816,
44,44,4.537634855024141,
45,45,4.471420673674477,
46,46,4.193275262920944,
47,47,4.634533896928538,
48,48,4.358976973871514,
49,49,4.1326538928005325,
50,50,3.92948997596949,
51,51,4.215670339503091,
52,52,4.097440503914724,
53,53,4.1556151897901605,
54,54,4.2434193838022205,
55,55,311.6324251515734,
56,56,4270.660308880082,
57,57,4079.625316814136,
58,58,3541.5849008000205,
59,59,2953.5799847647427,
60,60,2363.8689955190284,
61,61,1734.4572845786086,
62,62,1154.7743766593076,
63,63,395.1102446371687,
64,64,3.9466588512431415,
65,65,3.5505722298716424,
66,66,7.598158279466932,
67,67,3.453280650308266,
68,68,3.7477514983319473,
69,69,5.197101787686645,
70,70,3.6964188660937762,
71,71,4.025881073913407,
72,72,4.12255376629946,
73,73,3.617788954340946,
74,74,4.604025861643604,
75,75,3.8084025672090087,
76,76,3.7997362607755036,
77,77,3.8451119019182625,
78,78,4.818120497831538,
79,79,5.05807738162397,
80,80,3.8904311706544377,
81,81,5.232130740981436,
82,82,4.495823115850102,
83,83,3.299330905476359,
84,84,4.8032332448656065,
85,85,3.5431081441794547,
86,86,3.9292902592339884,
87,87,7.416037506398161,
88,88,3.4745817505629124,
89,89,7.1849720961218,
90,90,3.6202732665833324,
91,91,3.7460874403532154,
92,92,5.179356477255664,
93,93,3.7635757791850546,
94,94,5.506997066038536,
95,95,3.572804664641762,
96,96,3.8547833976335437,
97,97,3.46939905598134,
98,98,3.4993669606797684,
99,99,4.35751409779075,
100,100,3.579998201032211,
101,101,3.415155639097122,
102,102,5.733529944722782,
103,103,3.523953669501403,
104,104,3.506805428052977,
105,105,4.303186511346833,
106,106,3.162177512600144,
107,107,5.998652221464819,
108,108,3.7522724056194514,
109,109,3.6060195273196505,
110,110,5.23263072901018,
111,111,3.553014859633016,
112,112,3.84393027506664,
113,113,7.128876588901841,
114,114,3.806295894074508,
115,115,7.244432094984171,
116,116,3.885571342747653,
117,117,3.6557315976676414,
118,118,4.355537150166663,
119,119,3.4856426513646697,
