start_rel,start_rel,avg_lat,p99_lat
0,0,5.480677415114813,
1,1,6.831619079959987,
2,2,6.293606143190346,
3,3,6.298907326299103,
4,4,5.634978200999575,
5,5,5.754349473947488,
6,6,5.949491737815567,
7,7,6.340038590575441,
8,8,6.322263602144242,
9,9,5.856201046098687,
10,10,5.760018474563537,
11,11,6.024633634781883,
12,12,5.7072870430474705,
13,13,5.626646402681793,
14,14,6.139844839300598,
15,15,6.354946336469642,
16,16,6.89429264672059,
17,17,5.598099430740996,
18,18,5.572328162908719,
19,19,5.837825820029985,
20,20,5.076953784346382,
21,21,5.782972134364541,
22,22,5.80243215276047,
23,23,5.793489210675324,
24,24,5.597155049683226,
25,25,5.658763440116748,
26,26,5.386422995916677,
27,27,5.5689162180075265,
28,28,5.433014986316257,
29,29,5.179145463384173,
30,30,4.991644080346738,
31,31,5.714460810948205,
32,32,5.709165564254184,
33,33,5.767740713036216,
34,34,5.386951054033807,
35,35,5.538062189500018,
36,36,5.875837535003758,
37,37,5.300011033005483,
38,38,6.179341154981217,
39,39,6.03140898699353,
40,40,6.131778109186288,
41,41,5.553989782115469,
42,42,5.649624474500003,
43,43,5.315249976577494,
44,44,5.784382781518199,
45,45,6.035630968580713,
46,46,6.064159001749529,
47,47,5.4624774249916666,
48,48,5.788323366652793,
49,49,5.914697382195863,
50,50,6.167741778064632,
51,51,5.539863747813023,
52,52,5.943278407746767,
53,53,5.277662486968117,
54,54,5.974094337330358,
55,55,511.6062958428327,
56,56,4721.289835545228,
57,57,10216.704418202105,
58,58,14219.614927320514,
59,59,19776.66748697073,
60,60,24106.388194910876,
61,61,24716.06664841368,
62,62,24144.93551912086,
63,63,23641.67371632039,
64,64,23424.952557270928,
65,65,22910.050814161274,
66,66,22353.000979400764,
67,67,21757.470158417567,
68,68,21125.02287533417,
69,69,20481.86779238234,
70,70,19875.484843691764,
71,71,19246.83314842696,
72,72,18611.717082071966,
73,73,17981.19628948724,
74,74,17382.627778277514,
75,75,16724.320809341098,
76,76,16127.728150160241,
77,77,15521.765522290636,
78,78,14915.589759007862,
79,79,14295.02871296937,
80,80,13676.281030750699,
81,81,13062.347754397377,
82,82,12439.160015518642,
83,83,11868.762445327884,
84,84,11363.460057283184,
85,85,10790.571387816884,
86,86,10208.424673452857,
87,87,9420.798182686267,
88,88,8974.954093872193,
89,89,8363.524680335437,
90,90,7744.472252607001,
91,91,7127.358129276723,
92,92,6504.177960240605,
93,93,5873.35362339556,
94,94,5219.28890097683,
95,95,4432.993398370551,
96,96,3988.7735077753264,
97,97,3399.770422879041,
98,98,2857.7948865620806,
99,99,2291.384482134376,
100,100,1729.0070129094356,
101,101,1073.4752489563773,
102,102,453.4944066989385,
103,103,4.472970748644856,
104,104,3.8305875526973296,
105,105,3.70196831303116,
106,106,11.05030975564825,
107,107,8.347947904278294,
108,108,3.5639008390488014,
109,109,3.811098437115287,
110,110,3.623561375584509,
111,111,3.5198436580747496,
112,112,12.757272748792682,
113,113,3.5354464941656976,
114,114,3.5055489390101737,
115,115,3.7335723296145065,
116,116,3.616538117631016,
117,117,15.175553186600997,
118,118,4.4194866653061515,
119,119,3.5266800067595687,
