start_rel,start_rel,avg_lat,p99_lat
0,0,620.7733904910496,
1,1,667.517898770572,
2,2,574.022762150606,
3,3,569.119902855419,
4,4,514.5419943012795,
5,5,417.200487282815,
6,6,252.33863124621783,
7,7,76.02308924302494,
8,8,69.86870499856255,
9,9,47.89470828248576,
10,10,80.44413503379218,
11,11,66.13053413299743,
12,12,58.32908957000962,
13,13,52.87216894718795,
14,14,79.85044283446929,
15,15,75.5291868614061,
16,16,51.37070827980409,
17,17,50.7200875670991,
18,18,52.309454027396384,
19,19,46.52245907788479,
20,20,56.05722808455626,
21,21,48.44333378267539,
22,22,67.80329652327435,
23,23,79.43604981696836,
24,24,55.59337674671485,
25,25,43.114424258307565,
26,26,54.03649593638145,
27,27,44.41549215641983,
28,28,49.60481338920826,
29,29,68.7863981950535,
30,30,56.20927985058338,
31,31,59.37247187789442,
32,32,40.956503976869456,
33,33,59.756783895698796,
34,34,67.06930908118622,
35,35,51.701225335668354,
36,36,60.5251107162216,
37,37,58.743136520780006,
38,38,67.24826338694842,
39,39,47.06544645016545,
40,40,37.52176581275122,
41,41,52.745857254773945,
42,42,66.0021706663927,
43,43,72.88324836584212,
44,44,105.85805123510029,
45,45,43.06158727573661,
46,46,56.5321663386049,
47,47,56.88494931825814,
48,48,47.27693705772722,
49,49,54.02537642043246,
50,50,57.08141459809958,
51,51,52.99210242454986,
52,52,52.87446363540971,
53,53,40.20802115198043,
54,54,39.68623922821115,
55,55,63.17347748376045,
56,56,3267.716662918184,
57,57,4713.011191061681,
58,58,4708.599086490882,
59,59,4526.768887249102,
60,60,4563.340580902697,
61,61,4635.686786894599,
62,62,4500.137972367438,
63,63,4420.662037269505,
64,64,4345.245181606619,
65,65,4277.821745929446,
66,66,4214.756694904625,
67,67,4149.615912973919,
68,68,4035.712111039889,
69,69,4123.5028337641,
70,70,4038.8357052146034,
71,71,4035.892160260792,
72,72,4021.098270816147,
73,73,3974.2039822732254,
74,74,3870.5939561275227,
75,75,3694.8583822870464,
76,76,3735.3798033236794,
77,77,3661.1458589678186,
78,78,3492.6191561337746,
79,79,3337.496891350773,
80,80,3333.2715426250397,
81,81,3240.536577233431,
82,82,3090.143994773213,
83,83,3150.7384914766117,
84,84,3034.1784809426795,
85,85,2845.2245802783355,
86,86,2780.4982365211313,
87,87,2723.5835640958726,
88,88,2552.3944809069435,
89,89,2536.251399369818,
90,90,2490.5256371468995,
91,91,2381.431335820817,
92,92,2257.9881813955117,
93,93,2335.7836245479057,
94,94,2274.209956322803,
95,95,2175.634861415962,
96,96,2098.2677463785635,
97,97,2034.6247504805347,
98,98,1887.960414168629,
99,99,1843.8733402019286,
100,100,1763.4835307587398,
101,101,1732.4034726539992,
102,102,1647.8468797344751,
103,103,1530.5453826406447,
104,104,1383.1321402595713,
105,105,1261.3381374780936,
106,106,1156.0414183369633,
107,107,1006.3118809405915,
108,108,918.1447123655091,
109,109,847.1762270077472,
110,110,762.9722000159891,
111,111,649.3596057669058,
112,112,569.3240757672578,
113,113,450.4284253859849,
114,114,307.28504771722817,
115,115,238.93534651884434,
116,116,209.57635695033062,
117,117,141.17224435156257,
118,118,88.08174483695694,
119,119,121.42329120255876,
120,120,23.876710857142857,
