start_rel,start_rel,avg_lat,p99_lat
0,0,333.00078700563887,
1,1,148.21151341901634,
2,2,10.948790257125998,
3,3,44.52896106599106,
4,4,75.88490365977995,
5,5,22.81933987891892,
6,6,17.889483634571743,
7,7,11.913038678115441,
8,8,13.9852398571169,
9,9,19.163801770185582,
10,10,20.69601994194077,
11,11,22.42708189849537,
12,12,14.374780361316736,
13,13,14.789828066033053,
14,14,11.675860039294104,
15,15,11.957983991362438,
16,16,17.9430074721313,
17,17,12.430850575926927,
18,18,16.909179149114056,
19,19,11.330330870011364,
20,20,14.557981117708577,
21,21,12.17913558507875,
22,22,14.211097938707724,
23,23,12.152718927022208,
24,24,15.465264141312174,
25,25,13.149208135403038,
26,26,18.886522164408387,
27,27,14.848311467981576,
28,28,13.244651230507076,
29,29,9.567892709462855,
30,30,10.77548959819936,
31,31,15.970049866233174,
32,32,21.82851293883861,
33,33,13.632210995726728,
34,34,19.461191033748715,
35,35,16.742254854731573,
36,36,21.087116723310416,
37,37,13.847874772309648,
38,38,12.223505509823497,
39,39,16.97827092682477,
40,40,18.7774272559882,
41,41,16.171108434711577,
42,42,17.35248457382716,
43,43,20.378950571123063,
44,44,17.064831846871037,
45,45,12.210294508757622,
46,46,19.78344838222844,
47,47,19.439242328741546,
48,48,25.08477661018412,
49,49,12.124016542014905,
50,50,11.78455554890362,
51,51,15.706666022008102,
52,52,14.950324297125544,
53,53,13.850896293179453,
54,54,16.739757536665078,
55,55,17.10468217595408,
56,56,1320.8485004789372,
57,57,3815.06743032989,
58,58,6545.576694597704,
59,59,9120.55853842911,
60,60,10829.579764159793,
61,61,11081.678769880898,
62,62,11131.871407772784,
63,63,10889.356002816801,
64,64,10575.951322766898,
65,65,10292.658013588718,
66,66,9957.60111404669,
67,67,9685.1309384675,
68,68,9555.991499893858,
69,69,9489.243670178137,
70,70,9275.876599991976,
71,71,9004.64698380269,
72,72,8753.14854617947,
73,73,8243.024414309393,
74,74,8073.686190985431,
75,75,7753.2108118303095,
76,76,7514.101906318645,
77,77,7417.415870957749,
78,78,6931.094770749575,
79,79,6842.849090151888,
80,80,6499.840994906824,
81,81,6164.679373300568,
82,82,5828.942569277229,
83,83,5534.428097437594,
84,84,5225.9765271894585,
85,85,5158.094670173989,
86,86,4825.5060898640895,
87,87,4556.297510187002,
88,88,4216.707004175892,
89,89,3802.491094129286,
90,90,3699.47618072537,
91,91,3468.0256242331757,
92,92,3198.1255329454325,
93,93,2877.3230438444352,
94,94,2615.7540739280025,
95,95,2398.0778766117364,
96,96,2165.7155461264742,
97,97,1907.0866793829748,
98,98,1565.680619876531,
99,99,1222.292708628158,
100,100,893.9646520094173,
101,101,616.6563121806206,
102,102,277.0210323102871,
103,103,31.84625340503158,
104,104,20.416760179960093,
105,105,9.122866278934506,
106,106,20.704052499931723,
107,107,25.04815811855084,
108,108,9.537459278151427,
109,109,53.58293672791258,
110,110,10.981203227097089,
111,111,9.819558091181824,
112,112,40.60404717532664,
113,113,8.17174494875179,
114,114,65.22255640857,
115,115,23.45873762818288,
116,116,8.733244085411359,
117,117,26.455674454962658,
118,118,9.002982779898243,
119,119,23.975088275937292,
120,120,77.7385795,
