{
	"num_threads": 8,
	"url": "http://swsnetlab09:8080",
	"tput": 1000,
	"is_original": true,
	"apis": [
		{
			"name": "wrk2-api/home-timeline/read",
			"arg_gen_func_name": "sn_ReadHomeTimeline",
			"proportion": 60,
			"type": "GET"
		},
		{
			"name": "wrk2-api/user-timeline/read",
			"arg_gen_func_name": "sn_ReadUserTimeline",
			"proportion": 30,
			"type": "GET"
		},
		{
			"name": "wrk2-api/post/compose",
			"arg_gen_func_name": "sn_ComposePost",
			"proportion": 10,
			"type": "POST"
		}
	]	
}
