start_rel,start_rel,avg_lat,p99_lat
0,0,438.8282724448402,
1,1,453.5382645969925,
2,2,295.34640348482793,
3,3,146.7217278537877,
4,4,40.45702068469073,
5,5,84.43572292247627,
6,6,25.824071426088683,
7,7,31.412891249068057,
8,8,29.20585072365537,
9,9,30.22039044361932,
10,10,34.398657241433746,
11,11,31.674840790018436,
12,12,23.50277176740504,
13,13,31.145078817348843,
14,14,20.508183311644302,
15,15,24.01763901416499,
16,16,33.03937371407099,
17,17,35.44434966176565,
18,18,35.90732272816761,
19,19,22.649567329549512,
20,20,24.026092722856696,
21,21,32.428189375571996,
22,22,43.68676626972981,
23,23,26.831273062814894,
24,24,25.23242182372183,
25,25,40.069098014095914,
26,26,31.99793490293157,
27,27,27.05101692292589,
28,28,38.97289017080223,
29,29,32.80052963094304,
30,30,39.59651115065592,
31,31,32.88213805736366,
32,32,27.359739973913207,
33,33,27.47873014474154,
34,34,24.185573599992342,
35,35,29.40196515417731,
36,36,26.880970174854,
37,37,33.49231590655422,
38,38,80.06808644805928,
39,39,37.69840575263644,
40,40,30.47371883101917,
41,41,34.56352070224148,
42,42,41.19776975944351,
43,43,40.340726808622136,
44,44,38.69952318721895,
45,45,33.251931854890216,
46,46,29.010734852959295,
47,47,21.155832440884126,
48,48,30.538026097639634,
49,49,27.202772953893483,
50,50,30.959034929851352,
51,51,28.580647093099348,
52,52,76.25405250221098,
53,53,33.460606512211015,
54,54,33.35824489613778,
55,55,2031.080203617743,
56,56,12855.255391582714,
57,57,24454.760438407964,
58,58,27904.581268567206,
59,59,27767.491984374003,
60,60,27560.928525057254,
61,61,27414.58329307808,
62,62,27240.684896983625,
63,63,27071.1132486324,
64,64,26830.998871623717,
65,65,26711.46374698071,
66,66,26608.757300089343,
67,67,27435.20998130846,
68,68,27680.634564342403,
69,69,27590.68440768097,
70,70,27404.964788676163,
71,71,27017.747246533832,
72,72,27069.83666309042,
73,73,26905.531035216845,
74,74,26718.025595198975,
75,75,26562.251405526575,
76,76,26414.47906574958,
77,77,26263.034370204656,
78,78,26085.94021423056,
79,79,25903.166476999042,
80,80,25901.185633965164,
81,81,26361.45179550994,
82,82,26737.745105673832,
83,83,26675.455229396317,
84,84,26505.61658094141,
85,85,26310.496689449265,
86,86,26114.89715560144,
87,87,25926.73546380694,
88,88,25719.71730106586,
89,89,25528.36382982515,
90,90,25311.765812203346,
91,91,25088.50353737392,
92,92,24896.58216384952,
93,93,24480.240107057143,
94,94,23812.8128053918,
95,95,23765.35231885308,
96,96,25290.13220849069,
97,97,25358.784019408475,
98,98,25204.75322412362,
99,99,24995.77252166341,
100,100,24818.408155907582,
101,101,24655.166230217772,
102,102,24488.175862999044,
103,103,24309.935175211078,
104,104,24137.582059050594,
105,105,23947.337052147985,
106,106,23253.36257797003,
107,107,22267.32944238399,
108,108,22883.01394137154,
109,109,23184.6952371438,
110,110,23004.670286953,
111,111,22812.872507302513,
112,112,22611.010237598653,
113,113,22432.541670541323,
114,114,22267.944275642538,
115,115,22061.284654448336,
116,116,21931.34176223052,
117,117,21745.606658920275,
118,118,21551.802779525056,
119,119,21374.971832548625,
120,120,20871.784364,
