start_rel,start_rel,avg_lat,p99_lat
0,0,173.13609261267018,
1,1,18.95729478352219,
2,2,13.04449349052144,
3,3,15.273533728582526,
4,4,23.118232295140853,
5,5,25.322191472108457,
6,6,20.140085989644437,
7,7,22.056374053059507,
8,8,18.370118290914803,
9,9,15.118520994999061,
10,10,16.303827189124117,
11,11,15.312457232090987,
12,12,12.563787000090802,
13,13,14.205970565745124,
14,14,15.502922324113545,
15,15,14.488833583462167,
16,16,13.035547904391644,
17,17,14.09150966207743,
18,18,14.24749937342115,
19,19,14.471617823019365,
20,20,16.45309224469923,
21,21,13.987501611176684,
22,22,16.599492406311136,
23,23,16.129521949981772,
24,24,18.06096070269905,
25,25,12.098105139539102,
26,26,14.881613687792598,
27,27,17.057578818161044,
28,28,13.226927383895198,
29,29,14.636254435311693,
30,30,13.325376434186515,
31,31,20.198753853309142,
32,32,19.85420710699347,
33,33,13.534756303865302,
34,34,17.55254566522695,
35,35,12.647787501114658,
36,36,14.620027730685353,
37,37,13.522716528020398,
38,38,15.223092323070523,
39,39,11.862091872057123,
40,40,13.743508617562807,
41,41,10.70940883220508,
42,42,11.94357960628813,
43,43,14.93071363633052,
44,44,16.432913551982892,
45,45,21.698186760600546,
46,46,16.357470520586013,
47,47,12.553708494203246,
48,48,12.111340726210528,
49,49,13.635709416795367,
50,50,17.786572270473187,
51,51,11.077360885685728,
52,52,13.947297342445712,
53,53,17.34207738328702,
54,54,27.622514548519074,
55,55,15.932878137521556,
56,56,1438.789435019283,
57,57,4006.2987945208106,
58,58,6622.631250546535,
59,59,9143.693537548963,
60,60,11661.105190349967,
61,61,14220.742813514153,
62,62,16809.78827481329,
63,63,19404.963285444297,
64,64,21434.226419295715,
65,65,22393.931487563503,
66,66,22631.265853383913,
67,67,22354.06256496683,
68,68,21997.12432981455,
69,69,21607.29054075395,
70,70,21391.027571092945,
71,71,21071.041159767865,
72,72,20764.35298005987,
73,73,20436.40846296815,
74,74,20126.06816350939,
75,75,19823.226647887917,
76,76,19546.639573266802,
77,77,19048.88564568975,
78,78,19710.905800755492,
79,79,19583.938559019567,
80,80,19309.12984297503,
81,81,18998.850311392835,
82,82,18685.68066207923,
83,83,18386.462185538054,
84,84,18069.52917491104,
85,85,17747.82595534679,
86,86,17430.616072671382,
87,87,16944.568525929415,
88,88,16423.92693220726,
89,89,16445.85843697365,
90,90,16130.29076169087,
91,91,16012.74078978052,
92,92,16236.064045249032,
93,93,16044.053794134452,
94,94,15779.101712189036,
95,95,15442.265927588389,
96,96,15158.433393775964,
97,97,14631.074640330253,
98,98,14213.888271271522,
99,99,14165.867088723677,
100,100,13891.995477614484,
101,101,13524.514295687868,
102,102,13196.083993508933,
103,103,13161.903774720671,
104,104,13228.607951731106,
105,105,13004.359172677703,
106,106,12691.281893599493,
107,107,12532.916206195043,
108,108,11708.91144599332,
109,109,11704.652285203163,
110,110,11365.373664691038,
111,111,11048.767284761201,
112,112,10730.468940424134,
113,113,10410.565216770494,
114,114,10128.564801217186,
115,115,9807.825844650137,
116,116,9503.81925197417,
117,117,9006.5990059851,
118,118,8910.918579775343,
119,119,8539.533414052974,
120,120,8249.01530348387,
