start_rel,start_rel,avg_lat,p99_lat
0,0,89.29106882247366,
1,1,6.62778848053098,
2,2,7.619180486111137,
3,3,10.796443835409306,
4,4,9.388717620572839,
5,5,8.436788601809706,
6,6,15.944818611700589,
7,7,7.302714853353333,
8,8,7.300444943066413,
9,9,9.711142806876198,
10,10,9.699276353049028,
11,11,7.563541488215678,
12,12,8.978664262418848,
13,13,8.314754639478041,
14,14,7.30793663493388,
15,15,8.089113718224652,
16,16,6.558053069473785,
17,17,8.498394759559831,
18,18,7.900017993614301,
19,19,6.658397617004693,
20,20,7.186468679244239,
21,21,8.853069781227433,
22,22,7.657230357154764,
23,23,7.794442396345878,
24,24,7.716506261060267,
25,25,9.5192819454697,
26,26,7.692756756016253,
27,27,7.276654571246026,
28,28,8.451319531043266,
29,29,8.45784441992451,
30,30,7.327643087959092,
31,31,7.962982074612784,
32,32,7.926253892144338,
33,33,8.828354892129108,
34,34,6.884375860071076,
35,35,7.692074849553071,
36,36,5.783670434992527,
37,37,8.386336262153195,
38,38,6.990756077453424,
39,39,7.296611237422515,
40,40,8.166963838192212,
41,41,6.415201016835169,
42,42,7.215067976149431,
43,43,5.889250813198442,
44,44,8.301385138666692,
45,45,10.313726946435548,
46,46,7.59525639261482,
47,47,7.7863537741344135,
48,48,8.213775464345199,
49,49,8.401403345089973,
50,50,9.896839128000007,
51,51,10.145040389027802,
52,52,10.9166605334001,
53,53,7.310785413540079,
54,54,6.85530181943512,
55,55,8.235423207969712,
56,56,2439.096845355696,
57,57,8025.068098673828,
58,58,16237.481257399604,
59,59,21997.292345245376,
60,60,22078.725148194826,
61,61,21689.842072677002,
62,62,21047.814738423498,
63,63,20806.501095024643,
64,64,20700.64323906448,
65,65,20672.09616698016,
66,66,20266.754910968066,
67,67,19850.69245118517,
68,68,19438.769747263133,
69,69,19032.059050704534,
70,70,18635.770202984226,
71,71,18197.570838826337,
72,72,17747.70412889416,
73,73,17306.7377298778,
74,74,16871.938558511705,
75,75,16393.889641412603,
76,76,16008.237953608761,
77,77,15564.633732551425,
78,78,15205.53115436292,
79,79,15154.718758857818,
80,80,14758.904593633408,
81,81,14356.865409582248,
82,82,13918.519860785671,
83,83,13481.750732170061,
84,84,13069.412458533976,
85,85,12205.656017610703,
86,86,12155.93996005127,
87,87,11742.103476793012,
88,88,11304.528906916456,
89,89,10877.887450262766,
90,90,10449.434455933835,
91,91,10042.975452170112,
92,92,9952.310522761876,
93,93,9671.02077054609,
94,94,8965.15275995165,
95,95,8734.90008454166,
96,96,8342.658572238342,
97,97,7909.474456981054,
98,98,7452.264673725351,
99,99,7047.562281983573,
100,100,6601.453496492043,
101,101,6188.1801619420485,
102,102,5683.252959109479,
103,103,5525.442178286051,
104,104,5111.491832944964,
105,105,4698.976715439201,
106,106,4281.291207636342,
107,107,3873.640459366944,
108,108,3303.273048001739,
109,109,2987.7599408777055,
110,110,2552.321572139348,
111,111,2193.6038077692647,
112,112,1897.4881405862563,
113,113,1455.9847049657699,
114,114,1112.1819495978493,
115,115,683.0889372558171,
116,116,141.04442431773356,
117,117,8.022898930104544,
118,118,75.66351856545882,
119,119,5.879801068109912,
