start_rel,start_rel,avg_lat,p99_lat
0,0,210.93839397773397,
1,1,14.276112328215687,
2,2,11.141363420104987,
3,3,10.170794688284463,
4,4,11.45432759972032,
5,5,12.986337940332039,
6,6,16.82030302712443,
7,7,16.815958425746484,
8,8,8.54502211477125,
9,9,14.457239041285508,
10,10,9.824737707094917,
11,11,12.287486038478901,
12,12,12.939893939053059,
13,13,10.182905265305136,
14,14,11.907870276620239,
15,15,10.675399141055179,
16,16,11.212489556277816,
17,17,10.824802423956026,
18,18,12.471382111416682,
19,19,14.873865800849916,
20,20,9.973665328770556,
21,21,8.6662315972125,
22,22,10.465744847512783,
23,23,8.497934747487882,
24,24,9.68650515751848,
25,25,10.981410438162907,
26,26,10.512349745925414,
27,27,10.050543926696287,
28,28,9.497318493377357,
29,29,12.01596817475728,
30,30,9.060477628546572,
31,31,10.18975974811814,
32,32,9.867097774164556,
33,33,10.088496769672414,
34,34,12.854177358029037,
35,35,10.989613883429996,
36,36,10.09591094163246,
37,37,8.389114822169926,
38,38,10.681768984936467,
39,39,9.318597521747803,
40,40,8.50003524875001,
41,41,11.470696947091852,
42,42,8.858226019876072,
43,43,9.276249782455764,
44,44,10.66240080963809,
45,45,10.539202276825414,
46,46,10.384289702217101,
47,47,14.338892078197699,
48,48,17.145857359743836,
49,49,14.845082625519089,
50,50,9.132296006107,
51,51,8.09892697567927,
52,52,11.954237535033888,
53,53,10.784630339796145,
54,54,11.608222533263335,
55,55,17.992226011960206,
56,56,2986.444297554411,
57,57,12079.81539486105,
58,58,21144.05074075709,
59,59,26928.007652628556,
60,60,26951.642422597364,
61,61,26618.45505821949,
62,62,26281.446879509487,
63,63,25903.01281752147,
64,64,25549.253108889247,
65,65,25153.65077522458,
66,66,24801.078784709047,
67,67,24421.417791094795,
68,68,24020.247890297087,
69,69,23672.5192614059,
70,70,23269.32990542007,
71,71,22899.608474707078,
72,72,22522.370447419973,
73,73,22137.09374158334,
74,74,21498.8722754782,
75,75,21790.61677658418,
76,76,21991.559901190933,
77,77,21705.48656224744,
78,78,21374.022830033107,
79,79,20997.84718008118,
80,80,20663.33618352569,
81,81,20297.087138725452,
82,82,19919.732497636247,
83,83,19585.076826105364,
84,84,19234.528624505365,
85,85,18799.835652771082,
86,86,18123.176150766736,
87,87,18130.595864443716,
88,88,17782.656819231168,
89,89,17429.85962854279,
90,90,17107.75658805772,
91,91,17198.471301571906,
92,92,17079.870804346767,
93,93,16714.921253712302,
94,94,16397.31257105667,
95,95,16018.6049367092,
96,96,15692.176618950592,
97,97,15068.622100230985,
98,98,14739.860521336695,
99,99,14535.911930087446,
100,100,14186.979012166306,
101,101,13825.382236288757,
102,102,13492.146991205136,
103,103,13149.089397436655,
104,104,12778.137046373613,
105,105,12616.85013909336,
106,106,12589.24064773138,
107,107,12356.92075505522,
108,108,11542.59049242326,
109,109,11616.167915818138,
110,110,11253.585684495753,
111,111,10841.59910314583,
112,112,10468.744474373527,
113,113,10093.763878749385,
114,114,9738.43290695505,
115,115,9388.228345236032,
116,116,9022.267773051277,
117,117,8679.228846921324,
118,118,7941.908439428622,
119,119,7858.377015531733,
