start_rel,start_rel,avg_lat,p99_lat
0,0,174.27589594295557,
1,1,6.569733831805776,
2,2,7.650473990888934,
3,3,7.0094437270959045,
4,4,7.7967567240421785,
5,5,8.322473887519433,
6,6,10.892393497805497,
7,7,8.247703736821597,
8,8,7.164128307863086,
9,9,6.076976672295043,
10,10,6.696422975842726,
11,11,7.652960178831534,
12,12,7.246040801165086,
13,13,7.966798032492857,
14,14,8.374295875611404,
15,15,7.2673000049930145,
16,16,6.8425279718161205,
17,17,8.98193747299097,
18,18,8.180298704551722,
19,19,5.6247550003333515,
20,20,7.5110159505891545,
21,21,7.777650550260976,
22,22,7.361784780998387,
23,23,8.189947057477587,
24,24,7.59416997579797,
25,25,6.814500516564806,
26,26,9.637556848436015,
27,27,7.25803934187276,
28,28,6.133396539436395,
29,29,8.55616475389654,
30,30,8.999508767162206,
31,31,8.117673651937416,
32,32,9.272464420247978,
33,33,7.736810406432239,
34,34,7.560091340425506,
35,35,8.580563095142963,
36,36,6.710186517425082,
37,37,7.034744549722471,
38,38,7.5576539282735915,
39,39,6.686259703551377,
40,40,7.659926468626714,
41,41,7.816417178353144,
42,42,7.929003236946649,
43,43,12.075123504522162,
44,44,8.443530648654702,
45,45,9.651505991393192,
46,46,7.398398884613245,
47,47,8.80263955265941,
48,48,9.13262228381004,
49,49,7.255619159686754,
50,50,9.291876177833299,
51,51,6.6733663544353075,
52,52,6.521909390520684,
53,53,7.679109945759673,
54,54,7.273928802079242,
55,55,7.3109607916296,
56,56,2612.7532419992135,
57,57,8808.40178849093,
58,58,8969.687332305055,
59,59,8525.09653272413,
60,60,8127.765097025432,
61,61,7722.3269663956635,
62,62,7338.81135934012,
63,63,6900.6518064754855,
64,64,6574.035321543574,
65,65,6282.627100965297,
66,66,5828.190652600945,
67,67,5407.459778018387,
68,68,4966.051452430454,
69,69,4564.316779052969,
70,70,4198.75416799744,
71,71,3784.566874143027,
72,72,3394.778574919792,
73,73,2983.5940187688184,
74,74,2542.2253204982844,
75,75,2208.4254934308774,
76,76,1834.742642167164,
77,77,1574.5926422908303,
78,78,1154.2556294858314,
79,79,758.0994043906442,
80,80,257.34531838749325,
81,81,16.502438797035417,
82,82,7.60953361782022,
83,83,45.656067941091415,
84,84,37.86009178534591,
85,85,5.64848046848953,
86,86,42.144116008049245,
87,87,7.910400369023185,
88,88,5.681462759466993,
89,89,13.913048656147524,
90,90,6.403065523135815,
91,91,19.170425616666606,
92,92,5.7782391346025435,
93,93,10.656191551547561,
94,94,19.808815726255684,
95,95,6.030775055095798,
96,96,14.268355809894372,
97,97,7.461454999445176,
98,98,6.679597604236747,
99,99,11.8022713180189,
100,100,8.657548670445912,
101,101,14.105258288612369,
102,102,8.776412726132289,
103,103,17.382591198586685,
104,104,5.568407002,
105,105,6.274991104570474,
106,106,13.530597208215173,
107,107,6.02740660410063,
108,108,17.208080437951736,
109,109,6.050622952828641,
110,110,5.477593324286805,
111,111,25.676452080093526,
112,112,5.3587288927320245,
113,113,10.868649195440712,
114,114,14.553106624294543,
115,115,5.888607313430339,
116,116,11.825607983488936,
117,117,5.591282451679235,
118,118,5.419829480548349,
119,119,19.497825049689197,
