start_rel,start_rel,avg_lat,p99_lat
0,0,38.4623164329386,
1,1,6.860542466066962,
2,2,5.885152747337634,
3,3,5.678974843649832,
4,4,5.864083361737855,
5,5,6.009997126022621,
6,6,6.413432930083046,
7,7,6.590701791924877,
8,8,5.653819817380505,
9,9,6.390151482709113,
10,10,6.059642649233697,
11,11,5.929520698003714,
12,12,8.348124177875043,
13,13,7.460772016948113,
14,14,5.83422477818023,
15,15,5.725885691932757,
16,16,6.927052634580535,
17,17,6.23488546612554,
18,18,5.891512092160396,
19,19,6.393045823569887,
20,20,6.6040519455624915,
21,21,6.614212155515263,
22,22,5.853283039752478,
23,23,6.1459778139026175,
24,24,6.385178770960875,
25,25,7.228107886155023,
26,26,5.796489643298971,
27,27,5.929429727040031,
28,28,7.017676380147709,
29,29,8.163701356477718,
30,30,5.956517800724374,
31,31,6.885206929205756,
32,32,6.34955414313402,
33,33,6.2206078367704105,
34,34,7.052247874390722,
35,35,5.558131986059919,
36,36,7.171675428580352,
37,37,6.688057639362714,
38,38,6.152297550209323,
39,39,5.201790021872259,
40,40,6.005142744508252,
41,41,7.728635110826711,
42,42,6.163199987137057,
43,43,5.738714379582107,
44,44,5.60608812220902,
45,45,5.96013554301076,
46,46,5.243020926736247,
47,47,5.714014966030694,
48,48,6.5150535007504375,
49,49,6.0158333827646775,
50,50,6.055057345540869,
51,51,6.3752687675219155,
52,52,6.04283322023512,
53,53,6.096993621069069,
54,54,6.543766598037987,
55,55,468.2389819966244,
56,56,3958.445959516607,
57,57,7084.203631341258,
58,58,10172.10918163503,
59,59,13097.797524325748,
60,60,16218.050373115326,
61,61,19489.25029348596,
62,62,22572.370282826356,
63,63,22875.75660134322,
64,64,22404.271693185725,
65,65,21896.881821966253,
66,66,21408.005261726907,
67,67,20994.274587278614,
68,68,20911.73419063439,
69,69,20608.97186067252,
70,70,20171.607333755834,
71,71,19683.461977615985,
72,72,19150.956404902456,
73,73,18686.24844091213,
74,74,18167.692566840557,
75,75,17639.680389694044,
76,76,17092.45759557521,
77,77,16619.657272648103,
78,78,15979.097614410002,
79,79,15622.815125079089,
80,80,15104.855809879511,
81,81,14597.992328024162,
82,82,14069.155829230755,
83,83,13644.195442439672,
84,84,13452.194972339661,
85,85,13024.833336306998,
86,86,12567.059971610726,
87,87,12061.082381946533,
88,88,11622.042038176805,
89,89,10798.670056470475,
90,90,10534.567378675563,
91,91,10042.96552044649,
92,92,9553.348071013479,
93,93,9062.190546962822,
94,94,8520.890194152273,
95,95,8027.146350348986,
96,96,7522.362426666078,
97,97,6744.880998808149,
98,98,6741.125234350554,
99,99,6309.72733691097,
100,100,5827.657154698474,
101,101,5338.146792773676,
102,102,4840.257427649073,
103,103,4381.079145965125,
104,104,3717.2789579194227,
105,105,3357.743661173404,
106,106,2784.623161722875,
107,107,2415.2376185346047,
108,108,1935.3047148643632,
109,109,1545.9554022739121,
110,110,999.9542877688374,
111,111,442.27121493343196,
112,112,7.322463482288132,
113,113,11.875181161881898,
114,114,38.409734345759055,
115,115,4.89682336922688,
116,116,5.6692538639493835,
117,117,5.337331183443789,
118,118,25.833154660794683,
119,119,6.856953857098174,
120,120,17.487717666666665,
