start_rel,start_rel,avg_lat,p99_lat
0,0,128.39122564827,
1,1,7.786783361343487,
2,2,7.506744759854837,
3,3,7.366269615509635,
4,4,6.899743913160379,
5,5,8.529488266329473,
6,6,6.8856050904607535,
7,7,10.619284705701977,
8,8,7.200204718001575,
9,9,7.782731693695411,
10,10,8.463682658233397,
11,11,8.776990103323302,
12,12,8.202765049065574,
13,13,8.523711032576758,
14,14,6.682452529510956,
15,15,8.6671490773411,
16,16,5.37394998013122,
17,17,6.455289599375572,
18,18,7.27633778103511,
19,19,6.26453866983673,
20,20,10.124687571455347,
21,21,7.112941390670945,
22,22,7.2446379662478755,
23,23,8.252713018442126,
24,24,6.250685606484712,
25,25,5.7872499003872235,
26,26,11.694227932583587,
27,27,7.951598219003626,
28,28,7.3042574429841185,
29,29,7.824627611232605,
30,30,7.6056433149247145,
31,31,5.223159789555957,
32,32,7.097493533095617,
33,33,9.780888350281012,
34,34,6.978467228423244,
35,35,7.6483504975329355,
36,36,6.914419545261295,
37,37,5.792428400575258,
38,38,6.755299391616726,
39,39,6.107890354808475,
40,40,7.129566957800118,
41,41,7.298736233780859,
42,42,6.528665575611837,
43,43,5.5275052441511265,
44,44,6.074630235724554,
45,45,7.220699024693671,
46,46,6.663083121522779,
47,47,6.729563229667181,
48,48,5.862478965916209,
49,49,5.477351829250026,
50,50,6.315534473624969,
51,51,7.791951940377862,
52,52,5.983007541304501,
53,53,6.234346437261643,
54,54,6.085834808559826,
55,55,6.361549009878126,
56,56,7.968503666041375,
57,57,8.993553924046688,
58,58,5.134287415612851,
59,59,6.595871244588883,
60,60,8.736134827879038,
61,61,8.820649842793667,
62,62,6.409330098874995,
63,63,5.916859407688003,
64,64,6.771472969913071,
65,65,7.217374313605434,
66,66,7.027066161080521,
67,67,6.742231122540715,
68,68,7.537762531326152,
69,69,7.745245709057924,
70,70,8.365569808065036,
71,71,8.303318456935855,
72,72,5.972123943778105,
73,73,6.669727122545968,
74,74,5.708152495187496,
75,75,8.149145621581118,
76,76,9.045693349931181,
77,77,6.276982223709741,
78,78,6.3110059140698125,
79,79,6.093986612114725,
80,80,5.9864979313982145,
81,81,6.594125246064449,
82,82,6.926862634560002,
83,83,6.3072558831331875,
84,84,8.703535901443628,
85,85,7.305449950724434,
86,86,6.49988756525272,
87,87,6.124140812609327,
88,88,5.942625658997125,
89,89,6.277326116888801,
90,90,38.56551034251621,
91,91,7.715639667520016,
92,92,6.033795188962567,
93,93,6.1188313234302845,
94,94,5.4176553127541265,
95,95,7.216161768245426,
96,96,7.2534311652179335,
97,97,6.581827510452381,
98,98,6.14509744821552,
99,99,5.8747254455340245,
100,100,6.211072558875033,
101,101,6.5717235305905835,
102,102,5.57047634336935,
103,103,6.3605991188706295,
104,104,7.154979037085587,
105,105,6.650778021881879,
106,106,7.255628051743531,
107,107,8.669778449743701,
108,108,6.326754101425728,
109,109,6.397875031790652,
110,110,5.922342976265418,
111,111,7.602017137111362,
112,112,5.962936316873227,
113,113,14.175995231629651,
114,114,6.47272870237352,
115,115,6.452679655605565,
116,116,5.932916543320391,
117,117,6.710673182125176,
118,118,6.492054288203328,
119,119,5.937025988548193,
