start_rel,start_rel,avg_lat,p99_lat
0,0,58.68049363080386,
1,1,7.4667458922957275,
2,2,9.138823692666625,
3,3,7.937715099121645,
4,4,9.147163508606324,
5,5,8.408391589041836,
6,6,9.131053794766405,
7,7,8.019277306990709,
8,8,7.799320326989298,
9,9,9.633730541141178,
10,10,8.658995613458455,
11,11,7.633680028515808,
12,12,8.208684169042977,
13,13,9.004846882630687,
14,14,8.259894835435961,
15,15,7.4906401652796415,
16,16,8.996525263146232,
17,17,8.520667472850562,
18,18,8.571392751347453,
19,19,8.497605237650733,
20,20,7.585362857111126,
21,21,9.027751650947081,
22,22,7.7437818432069845,
23,23,7.926519085078016,
24,24,7.498208193072031,
25,25,7.572878906397605,
26,26,7.221684885931781,
27,27,8.007254159313144,
28,28,7.675732567505999,
29,29,7.752128638105304,
30,30,7.875655145357577,
31,31,11.224210296024866,
32,32,7.307342319045993,
33,33,8.706071059692388,
34,34,8.023010009677472,
35,35,7.937342729062681,
36,36,8.173500709172629,
37,37,8.002907246351038,
38,38,6.683872892465965,
39,39,7.922331662461069,
40,40,6.57170889891074,
41,41,10.61528055139459,
42,42,7.462209516317353,
43,43,8.864921173013887,
44,44,8.219719641384684,
45,45,7.547009547085924,
46,46,8.343441749040744,
47,47,6.861611262795234,
48,48,7.723345361419665,
49,49,7.731948900855377,
50,50,8.157966398166659,
51,51,9.029332393008,
52,52,8.77297045627986,
53,53,7.167173821355134,
54,54,7.5614181110369865,
55,55,7.8417046896532385,
56,56,3162.7322823459103,
57,57,4269.030631365643,
58,58,3882.4866136957176,
59,59,3506.714412445679,
60,60,3127.7598966131245,
61,61,2783.4501044175217,
62,62,2395.9922373355826,
63,63,2065.0886853025777,
64,64,1609.379236251564,
65,65,1266.2893406528142,
66,66,874.4063376974871,
67,67,387.9978180021122,
68,68,38.36754438282586,
69,69,7.235689281321138,
70,70,16.841426725241714,
71,71,5.9860974576534245,
72,72,17.80434429107139,
73,73,5.8966392008454,
74,74,10.749160298282742,
75,75,7.190429233703514,
76,76,13.134633903621912,
77,77,7.663062299800032,
78,78,11.762876895718778,
79,79,7.324480728987044,
80,80,10.08272643328332,
81,81,15.649732029589584,
82,82,6.608948765329947,
83,83,14.470316038406073,
84,84,6.061976232611101,
85,85,10.274556392553492,
86,86,5.2749444588098235,
87,87,18.32364199294724,
88,88,5.881834471127179,
89,89,13.71326645369193,
90,90,5.566042113459821,
91,91,17.19676575201367,
92,92,6.341568288765635,
93,93,15.553147108525497,
94,94,5.264849554277155,
95,95,13.6573173240211,
96,96,6.835760157698713,
97,97,15.716506824714262,
98,98,9.285386644556917,
99,99,25.081819655289234,
100,100,7.1105593148354425,
101,101,10.707899233507334,
102,102,6.3892719673014104,
103,103,17.045858909085936,
104,104,6.550610810010545,
105,105,10.513698799622306,
106,106,5.598910813194748,
107,107,18.53974767927992,
108,108,5.782816024574712,
109,109,11.017591652834147,
110,110,5.974194480075508,
111,111,10.807007986780715,
112,112,10.573237866663012,
113,113,8.09709057874304,
114,114,11.54639040078949,
115,115,6.8168542087985085,
116,116,9.33764746723003,
117,117,7.573671822665855,
118,118,12.999902080526061,
119,119,6.721355431862313,
120,120,5.997604,
