module gitlab.mpi-sws.org/cld/blueprint/blueprint-compiler

go 1.18

require (
	github.com/bradfitz/gomemcache v0.0.0-20190913173617-a41fca850d0b
	github.com/go-redis/redis/v8 v8.11.4
	github.com/go-sql-driver/mysql v1.6.0
	github.com/hashicorp/consul/api v1.24.0
	github.com/otiai10/copy v1.7.0
	github.com/rabbitmq/amqp091-go v1.3.0
	github.com/schollz/progressbar/v3 v3.13.1
	github.com/tracingplane/tracingplane-go v0.0.0-20171025152126-8c4e6f79b148
	gitlab.mpi-sws.org/cld/tracing/tracing-framework-go v0.0.0-20211206181151-6edc754a9f2a
	go.mongodb.org/mongo-driver v1.7.4
	go.opentelemetry.io/otel/exporters/jaeger v1.2.0
	go.opentelemetry.io/otel/exporters/zipkin v1.6.0
	go.opentelemetry.io/otel/sdk v1.6.0
	go.opentelemetry.io/otel/trace v1.6.0
	golang.org/x/exp v0.0.0-20230321023759-10a507213a29
	golang.org/x/mod v0.6.0
	gonum.org/v1/gonum v0.11.0
)

require (
	github.com/armon/go-metrics v0.4.1 // indirect
	github.com/cespare/xxhash/v2 v2.1.2 // indirect
	github.com/dgryski/go-rendezvous v0.0.0-20200823014737-9f7001d12a5f // indirect
	github.com/fatih/color v1.14.1 // indirect
	github.com/go-logr/logr v1.2.3 // indirect
	github.com/go-logr/stdr v1.2.2 // indirect
	github.com/go-stack/stack v1.8.0 // indirect
	github.com/golang/protobuf v1.5.2 // indirect
	github.com/golang/snappy v0.0.4 // indirect
	github.com/hashicorp/go-cleanhttp v0.5.2 // indirect
	github.com/hashicorp/go-hclog v1.5.0 // indirect
	github.com/hashicorp/go-immutable-radix v1.3.1 // indirect
	github.com/hashicorp/go-rootcerts v1.0.2 // indirect
	github.com/hashicorp/golang-lru v0.5.4 // indirect
	github.com/hashicorp/serf v0.10.1 // indirect
	github.com/klauspost/compress v1.13.6 // indirect
	github.com/mattn/go-colorable v0.1.13 // indirect
	github.com/mattn/go-isatty v0.0.17 // indirect
	github.com/mattn/go-runewidth v0.0.14 // indirect
	github.com/mitchellh/colorstring v0.0.0-20190213212951-d06e56a500db // indirect
	github.com/mitchellh/go-homedir v1.1.0 // indirect
	github.com/mitchellh/mapstructure v1.5.0 // indirect
	github.com/openzipkin/zipkin-go v0.4.0 // indirect
	github.com/pkg/errors v0.9.1 // indirect
	github.com/rivo/uniseg v0.4.4 // indirect
	github.com/xdg-go/pbkdf2 v1.0.0 // indirect
	github.com/xdg-go/scram v1.0.2 // indirect
	github.com/xdg-go/stringprep v1.0.2 // indirect
	github.com/youmark/pkcs8 v0.0.0-20181117223130-1be2e3e5546d // indirect
	go.opentelemetry.io/otel v1.6.0 // indirect
	golang.org/x/crypto v0.1.0 // indirect
	golang.org/x/sync v0.2.0 // indirect
	golang.org/x/sys v0.10.0 // indirect
	golang.org/x/term v0.10.0 // indirect
	golang.org/x/text v0.4.0 // indirect
	google.golang.org/protobuf v1.27.1 // indirect
)
